<?xml version="1.0" encoding="utf-8"?>
<!-- Generator: Adobe Illustrator 24.1.2, SVG Export Plug-In . SVG Version: 6.00 Build 0)  -->
<svg version="1.1" id="Layer_1" xmlns="http://www.w3.org/2000/svg" xmlns:xlink="http://www.w3.org/1999/xlink" x="0px" y="0px"
	 viewBox="0 0 814 209.5" style="enable-background:new 0 0 814 209.5;" xml:space="preserve">
<style type="text/css">
	.st0{fill:#293133;}
	.st1{fill:#7F8385;}
	.st2{fill:#CC3333;}
	.st3{fill:#E6E7E8;stroke:#000000;stroke-linecap:round;stroke-miterlimit:10;}
	.st4{fill:#FFFFFF;stroke:#808285;stroke-miterlimit:10;}
</style>
<g>
	<g>
		<path class="st0" d="M296.4,35h-1.3h-21.7l-42,68.8h25.1c0,0,24.8-43.5,28.4-49.8c3.6,6.3,28.6,49.8,28.6,49.8h24.9L296.4,35z"/>
		<polygon class="st1" points="273.3,79.1 296.7,79.1 284.9,96 		"/>
		<path class="st0" d="M388.1,35h-38.7H347v68.8h41.1c39.8,0,48.2-18.7,48.2-34.5C436.3,53.6,428,35,388.1,35z M370,48.5
			c3.2,0,10.6,0,10.6,0c22.1,0.4,31.8,2.4,31.8,20.8c0,18.6-9.2,20.6-31.9,21c0,0-7.4,0-10.6,0C370,86.2,370,52.6,370,48.5z"/>
		<path class="st0" d="M467.5,89.7c0-4.4,0-54.7,0-54.7h-2.4h-20.7v68.8h75.6v-14C519.9,89.7,471.9,89.7,467.5,89.7z"/>
		<polygon class="st0" points="550.4,35 529.7,35 529.7,103.8 552.8,103.8 552.8,35 		"/>
		<polygon class="st0" points="679.7,35 658.8,35 658.8,103.8 682.1,103.8 682.1,35 		"/>
		<path class="st0" d="M626.5,35.2c0,0,0,32.7,0,41.6c-6.7-7-40.1-41.6-40.1-41.6l-1-0.2h-18.5h-2.4v68.8h21.7c0,0,0-33,0-41.9
			c6.7,7,40.3,41.9,40.3,41.9h21.9V35.2H626.5z"/>
		<path class="st0" d="M710.3,63.6c4.2-3,40-28.6,40-28.6h-7.4h-22.2l-37.1,29.6l38.6,39.1H754C754,103.8,714.2,67.2,710.3,63.6z"/>
	</g>
	<g>
		<path class="st2" d="M52.5,176.3c43.2-41.3,95.7-41.3,139,0l-28.6-60.1l-85.9,8.7L52.5,176.3z"/>
		<polygon class="st2" points="81.7,114.8 162.1,114.8 155.9,101.8 83.8,110.6 		"/>
		<polygon class="st2" points="88.7,100 155.1,100 149.1,87.4 90.8,95.8 		"/>
		<polygon class="st2" points="95.8,85.3 148.2,85.3 122,30.4 		"/>
	</g>
	<g>
		<path class="st0" d="M195.4,166.6c0,5.3,4.3,9.7,9.7,9.7c5.3,0,9.7-4.3,9.7-9.7c0-5.3-4.3-9.7-9.7-9.7
			C199.8,157,195.4,161.3,195.4,166.6z M197,166.6c0-4.5,3.7-8.2,8.2-8.2c4.5,0,8.2,3.7,8.2,8.2c0,4.5-3.7,8.2-8.2,8.2
			C200.6,174.8,197,171.1,197,166.6z"/>
		<path class="st0" d="M201.2,171.9v-10.2h4.3c1.1,0,1.9,0.1,2.4,0.3c0.5,0.2,0.9,0.5,1.2,1c0.3,0.5,0.4,1,0.4,1.6
			c0,0.8-0.2,1.4-0.7,1.9c-0.4,0.5-1.1,0.8-2,0.9c0.4,0.3,0.8,0.5,1.1,0.9c0.3,0.3,0.7,0.9,1.2,1.6l1.2,2h-2.5l-1.5-2.2
			c-0.5-0.8-0.9-1.3-1.1-1.5c-0.2-0.2-0.4-0.4-0.6-0.4c-0.2-0.1-0.6-0.1-1-0.1h-0.4v4.2H201.2z M203.2,166h1.5c1,0,1.6,0,1.9-0.1
			c0.2-0.1,0.4-0.2,0.6-0.4c0.1-0.2,0.2-0.5,0.2-0.8c0-0.3-0.1-0.6-0.3-0.8c-0.2-0.2-0.4-0.3-0.8-0.4c-0.2,0-0.7,0-1.5,0h-1.6V166z"
			/>
	</g>
</g>
<g>
	<path class="st1" d="M251.8,174.6v2.5h-16.5V148h2.9v26.6H251.8z"/>
	<path class="st1" d="M254.8,166.2c0-1.9,0.3-3.6,0.8-5c0.5-1.4,1.3-2.6,2.1-3.5c0.9-1,1.9-1.7,3-2.1c1.1-0.5,2.3-0.7,3.5-0.7
		c2.7,0,4.8,0.9,6.4,2.6c1.6,1.7,2.4,4.4,2.4,8c0,0.2,0,0.4,0,0.7c0,0.2,0,0.4-0.1,0.6h-15.2c0.1,2.7,0.7,4.7,2,6.1
		c1.2,1.4,3.2,2.1,5.9,2.1c1.5,0,2.7-0.1,3.5-0.4c0.9-0.3,1.5-0.5,1.9-0.7l0.5,2.4c-0.4,0.2-1.1,0.5-2.2,0.8
		c-1.1,0.3-2.3,0.5-3.8,0.5c-1.9,0-3.5-0.3-4.9-0.8c-1.3-0.6-2.5-1.3-3.3-2.4c-0.9-1-1.5-2.2-1.9-3.6
		C255,169.4,254.8,167.9,254.8,166.2z M270.2,164.5c-0.1-2.3-0.6-4-1.6-5.3c-1-1.3-2.4-1.9-4.3-1.9c-1,0-1.9,0.2-2.6,0.6
		c-0.8,0.4-1.4,0.9-2,1.6c-0.6,0.7-1,1.4-1.3,2.3c-0.3,0.9-0.5,1.8-0.6,2.7H270.2z"/>
	<path class="st1" d="M285.7,154.9c1.4,0,2.6,0.2,3.6,0.6c1,0.4,1.8,1,2.4,1.7c0.6,0.7,1.1,1.6,1.3,2.5c0.3,1,0.4,2,0.4,3.2v13.7
		c-0.3,0.1-0.7,0.2-1.2,0.3c-0.5,0.1-1.1,0.2-1.8,0.3c-0.7,0.1-1.5,0.2-2.3,0.3c-0.9,0.1-1.7,0.1-2.6,0.1c-1.1,0-2.2-0.1-3.2-0.4
		c-1-0.3-1.8-0.7-2.5-1.2c-0.7-0.5-1.3-1.2-1.7-2.1c-0.4-0.9-0.6-1.9-0.6-3.1c0-1.2,0.2-2.2,0.7-3c0.4-0.8,1.1-1.5,1.9-2.1
		c0.8-0.5,1.8-0.9,2.9-1.2c1.1-0.3,2.3-0.4,3.7-0.4c0.4,0,0.8,0,1.2,0.1c0.4,0,0.9,0.1,1.3,0.2c0.4,0.1,0.8,0.1,1.1,0.2
		c0.3,0.1,0.5,0.1,0.6,0.2v-1.3c0-0.8-0.1-1.5-0.2-2.2c-0.1-0.7-0.4-1.4-0.7-1.9c-0.4-0.6-0.9-1-1.6-1.4c-0.7-0.4-1.6-0.5-2.7-0.5
		c-1.6,0-2.8,0.1-3.6,0.3c-0.8,0.2-1.4,0.4-1.7,0.5l-0.4-2.4c0.5-0.2,1.2-0.4,2.2-0.6C283.1,155,284.3,154.9,285.7,154.9z
		 M286,175.1c1.1,0,2,0,2.8-0.1c0.8-0.1,1.5-0.2,2-0.3v-7.6c-0.3-0.1-0.8-0.3-1.5-0.4c-0.7-0.2-1.6-0.2-2.8-0.2
		c-0.7,0-1.4,0-2.1,0.1c-0.7,0.1-1.4,0.3-2,0.6c-0.6,0.3-1.1,0.8-1.5,1.3c-0.4,0.6-0.6,1.3-0.6,2.2c0,0.8,0.1,1.5,0.4,2.1
		c0.3,0.6,0.6,1,1.1,1.3c0.5,0.3,1.1,0.6,1.8,0.7C284.3,175.1,285.1,175.1,286,175.1z"/>
	<path class="st1" d="M317.8,176.4c-0.8,0.3-1.8,0.5-3.1,0.8c-1.3,0.3-2.9,0.4-4.8,0.4c-1.6,0-3-0.3-4.3-0.8
		c-1.3-0.5-2.4-1.3-3.4-2.2c-0.9-1-1.7-2.2-2.2-3.6c-0.5-1.4-0.8-3-0.8-4.7c0-1.7,0.2-3.2,0.7-4.6c0.4-1.4,1.1-2.6,1.9-3.6
		c0.8-1,1.9-1.8,3.1-2.4c1.2-0.6,2.6-0.8,4.2-0.8c1.4,0,2.7,0.2,3.7,0.6c1,0.4,1.8,0.8,2.3,1.2V145l2.7-0.5V176.4z M315.1,159.4
		c-0.3-0.2-0.6-0.4-0.9-0.6c-0.4-0.2-0.8-0.4-1.3-0.6c-0.5-0.2-1-0.4-1.6-0.5c-0.6-0.1-1.2-0.2-1.8-0.2c-1.3,0-2.5,0.2-3.4,0.7
		c-0.9,0.5-1.6,1.1-2.2,1.9c-0.6,0.8-1,1.7-1.2,2.8c-0.3,1.1-0.4,2.2-0.4,3.4c0,2.9,0.7,5,2.1,6.6c1.4,1.5,3.3,2.3,5.7,2.3
		c1.3,0,2.4-0.1,3.3-0.2c0.8-0.1,1.4-0.3,1.9-0.4V159.4z"/>
	<path class="st1" d="M328.4,148.9c0,0.6-0.2,1.2-0.6,1.5s-0.9,0.6-1.4,0.6c-0.6,0-1-0.2-1.4-0.6s-0.6-0.9-0.6-1.5
		c0-0.6,0.2-1.2,0.6-1.5s0.9-0.6,1.4-0.6c0.6,0,1,0.2,1.4,0.6S328.4,148.2,328.4,148.9z M327.7,177.1H325v-21.7h2.7V177.1z"/>
	<path class="st1" d="M335,156.2c0.8-0.2,1.9-0.5,3.3-0.8c1.4-0.3,3.1-0.4,5-0.4c1.7,0,3,0.2,4.1,0.7c1.1,0.5,2,1.2,2.6,2
		c0.7,0.9,1.1,1.9,1.4,3.2c0.3,1.2,0.4,2.6,0.4,4.1v12.1h-2.7v-11.3c0-1.5-0.1-2.8-0.3-3.9c-0.2-1.1-0.6-1.9-1.1-2.6
		c-0.5-0.7-1.1-1.2-1.9-1.4c-0.8-0.3-1.8-0.4-3-0.4c-1.3,0-2.4,0.1-3.3,0.2c-0.9,0.1-1.5,0.3-1.8,0.4v19.1H335V156.2z"/>
	<path class="st1" d="M373,174.6c-0.2,0.1-0.4,0.3-0.8,0.5c-0.3,0.2-0.7,0.4-1.2,0.6c-0.5,0.2-1,0.4-1.7,0.5
		c-0.6,0.1-1.3,0.2-2.1,0.2c-1.3,0-2.5-0.2-3.7-0.6c-1.2-0.4-2.2-1-3.1-1.8c-0.9-0.8-1.6-1.9-2.1-3.3c-0.5-1.3-0.8-2.9-0.8-4.9
		c0-1.5,0.2-3,0.7-4.3c0.5-1.3,1.2-2.5,2-3.4c0.9-1,2-1.7,3.2-2.3c1.3-0.5,2.7-0.8,4.3-0.8c2,0,3.6,0.1,4.9,0.4
		c1.2,0.3,2.2,0.5,3,0.8V176c0,3.2-0.8,5.6-2.5,7c-1.7,1.4-4.2,2.1-7.6,2.1c-1.4,0-2.7-0.1-3.8-0.3c-1.1-0.2-2.1-0.5-2.9-0.7
		l0.5-2.5c0.7,0.3,1.6,0.6,2.8,0.8c1.2,0.2,2.3,0.3,3.5,0.3c2.6,0,4.4-0.5,5.6-1.5c1.2-1,1.7-2.7,1.7-5.1V174.6z M373,158
		c-0.5-0.1-1.1-0.3-1.8-0.4s-1.8-0.2-3.2-0.2c-1.2,0-2.2,0.2-3.1,0.6c-0.9,0.4-1.7,1-2.3,1.7c-0.6,0.7-1.1,1.6-1.5,2.6
		c-0.3,1-0.5,2.1-0.5,3.4c0,1.4,0.2,2.7,0.6,3.7c0.4,1,0.9,1.9,1.5,2.5c0.6,0.6,1.4,1.1,2.2,1.4c0.8,0.3,1.6,0.4,2.5,0.4
		c1.2,0,2.4-0.2,3.4-0.5c1-0.4,1.8-0.8,2.4-1.3V158z"/>
	<path class="st1" d="M392.5,177.1V148h18.7v4.5h-13.4v7.2h11.9v4.4h-11.9v8.5h14.4v4.5H392.5z"/>
	<path class="st1" d="M441.8,162.5c0,2.5-0.4,4.7-1.2,6.6c-0.8,1.9-1.9,3.4-3.3,4.7c-1.4,1.2-3.2,2.2-5.2,2.8
		c-2,0.6-4.3,0.9-6.7,0.9c-1.2,0-2.5,0-4-0.1c-1.5-0.1-2.9-0.3-4.2-0.6v-28.3c1.3-0.3,2.8-0.5,4.3-0.6s2.9-0.1,4-0.1
		c2.4,0,4.7,0.3,6.7,0.9c2,0.6,3.7,1.5,5.2,2.7c1.4,1.2,2.6,2.8,3.3,4.6C441.4,157.7,441.8,160,441.8,162.5z M422.4,172.7
		c0.3,0,0.7,0,1.2,0.1c0.5,0,1.2,0,2.1,0c3.6,0,6.2-0.9,8-2.7c1.7-1.8,2.6-4.3,2.6-7.6c0-3.3-0.9-5.8-2.6-7.6
		c-1.7-1.8-4.4-2.6-7.9-2.6c-1.6,0-2.7,0-3.4,0.1V172.7z"/>
	<path class="st1" d="M461.2,152c-3,0-5.3,0.9-6.9,2.8c-1.6,1.9-2.4,4.4-2.4,7.7c0,1.6,0.2,3,0.6,4.3c0.4,1.3,0.9,2.4,1.7,3.3
		c0.7,0.9,1.7,1.6,2.8,2.2c1.1,0.5,2.4,0.8,3.9,0.8c0.9,0,1.7,0,2.4-0.1c0.7-0.1,1.2-0.2,1.6-0.3v-10.5h5.3v14
		c-0.7,0.3-2,0.6-3.7,0.9s-3.7,0.5-6,0.5c-2.1,0-4-0.3-5.8-1c-1.7-0.7-3.2-1.7-4.4-2.9c-1.2-1.3-2.2-2.9-2.8-4.7c-0.7-1.9-1-4-1-6.5
		c0-2.4,0.4-4.6,1.1-6.5c0.7-1.9,1.8-3.5,3-4.8c1.3-1.3,2.8-2.3,4.5-3s3.6-1,5.5-1c1.3,0,2.5,0.1,3.6,0.3c1.1,0.2,2,0.4,2.7,0.6
		c0.8,0.2,1.4,0.5,1.9,0.7s0.8,0.4,1,0.5l-1.6,4.3c-0.8-0.5-1.9-0.9-3.1-1.3C463.9,152.2,462.6,152,461.2,152z"/>
	<path class="st1" d="M476.3,177.1V148H495v4.5h-13.4v7.2h11.9v4.4h-11.9v8.5H496v4.5H476.3z"/>
	<path class="st1" d="M523.6,177.7c-2.2,0-4.1-0.3-5.9-1c-1.7-0.7-3.2-1.7-4.4-3c-1.2-1.3-2.1-2.9-2.8-4.8c-0.6-1.9-1-4-1-6.5
		c0-2.4,0.4-4.6,1.1-6.5c0.7-1.9,1.8-3.5,3-4.8c1.3-1.3,2.8-2.3,4.5-3s3.6-1,5.6-1c1.2,0,2.3,0.1,3.3,0.3c1,0.2,1.8,0.4,2.6,0.6
		c0.7,0.2,1.3,0.5,1.8,0.7c0.5,0.3,0.8,0.4,1,0.5l-1.6,4.3c-0.7-0.4-1.6-0.8-2.9-1.2s-2.6-0.6-4.1-0.6c-1.3,0-2.4,0.2-3.5,0.7
		c-1.1,0.4-2,1.1-2.8,2c-0.8,0.9-1.4,2-1.9,3.3c-0.4,1.3-0.7,2.8-0.7,4.6c0,1.5,0.2,3,0.5,4.2c0.3,1.3,0.9,2.4,1.6,3.3
		c0.7,0.9,1.7,1.7,2.8,2.2c1.1,0.5,2.5,0.8,4,0.8c1.9,0,3.4-0.2,4.6-0.6s2.1-0.7,2.7-1.1l1.4,4.3c-0.3,0.2-0.8,0.4-1.4,0.7
		c-0.6,0.2-1.3,0.4-2,0.7s-1.7,0.4-2.6,0.5C525.8,177.7,524.7,177.7,523.6,177.7z"/>
	<path class="st1" d="M563.8,162.5c0,2.5-0.4,4.7-1.1,6.6c-0.7,1.9-1.8,3.5-3,4.8c-1.3,1.3-2.8,2.2-4.5,2.9c-1.7,0.6-3.5,1-5.5,1
		c-1.9,0-3.8-0.3-5.5-1c-1.7-0.6-3.2-1.6-4.5-2.9c-1.3-1.3-2.3-2.9-3-4.8c-0.8-1.9-1.1-4.1-1.1-6.6c0-2.5,0.4-4.7,1.1-6.6
		s1.8-3.5,3.1-4.8c1.3-1.3,2.8-2.3,4.5-2.9c1.7-0.6,3.5-1,5.4-1s3.7,0.3,5.4,1c1.7,0.6,3.2,1.6,4.5,2.9c1.3,1.3,2.3,2.9,3,4.8
		C563.4,157.9,563.8,160.1,563.8,162.5z M541.1,162.5c0,1.6,0.2,3,0.6,4.3c0.4,1.3,1,2.4,1.7,3.3c0.7,0.9,1.6,1.6,2.7,2.1
		s2.3,0.8,3.6,0.8c1.3,0,2.5-0.3,3.6-0.8c1.1-0.5,2-1.2,2.7-2.1c0.7-0.9,1.3-2,1.7-3.3c0.4-1.3,0.6-2.8,0.6-4.3c0-1.6-0.2-3-0.6-4.3
		c-0.4-1.3-1-2.4-1.7-3.3c-0.7-0.9-1.6-1.6-2.7-2.1c-1.1-0.5-2.3-0.8-3.6-0.8c-1.3,0-2.5,0.3-3.6,0.8s-2,1.2-2.7,2.1
		c-0.7,0.9-1.3,2-1.7,3.3C541.3,159.5,541.1,160.9,541.1,162.5z"/>
	<path class="st1" d="M575.9,148c0.6,1.1,1.3,2.4,2.1,3.9c0.8,1.5,1.5,3.2,2.3,4.9c0.8,1.7,1.6,3.4,2.3,5.2c0.8,1.8,1.5,3.4,2.1,4.9
		c0.6-1.5,1.3-3.1,2.1-4.9c0.8-1.7,1.5-3.5,2.3-5.2c0.8-1.7,1.6-3.3,2.3-4.9c0.8-1.5,1.4-2.8,2.1-3.9h4.8c0.3,2.1,0.5,4.4,0.7,6.8
		c0.2,2.4,0.4,4.8,0.6,7.4c0.2,2.5,0.4,5,0.5,7.6c0.2,2.5,0.3,5,0.4,7.4h-5.2c-0.1-3.4-0.2-6.9-0.4-10.5c-0.2-3.6-0.4-7.1-0.7-10.4
		c-0.3,0.6-0.7,1.4-1.1,2.3c-0.4,0.9-0.9,1.9-1.3,2.9c-0.5,1-1,2.1-1.4,3.3c-0.5,1.1-1,2.2-1.4,3.3c-0.5,1-0.9,2-1.3,2.9
		c-0.4,0.9-0.7,1.7-1,2.3h-3.9c-0.3-0.6-0.6-1.4-1-2.4c-0.4-0.9-0.8-1.9-1.3-3c-0.5-1.1-0.9-2.1-1.4-3.3c-0.5-1.1-1-2.2-1.4-3.2
		c-0.5-1-0.9-2-1.3-2.9c-0.4-0.9-0.8-1.7-1.1-2.3c-0.3,3.4-0.5,6.8-0.7,10.4c-0.2,3.6-0.3,7.1-0.4,10.5h-5.2
		c0.1-2.4,0.2-4.9,0.4-7.5c0.2-2.6,0.3-5.1,0.5-7.7c0.2-2.5,0.4-5,0.6-7.4c0.2-2.4,0.5-4.6,0.7-6.6H575.9z"/>
	<path class="st1" d="M614.9,147.7c4.2,0,7.5,0.8,9.7,2.3c2.3,1.5,3.4,3.9,3.4,7.2c0,1.7-0.3,3.2-0.9,4.4c-0.6,1.2-1.5,2.2-2.6,3
		c-1.1,0.8-2.5,1.3-4.2,1.7c-1.7,0.4-3.5,0.5-5.7,0.5H612v10.2h-5.3v-28.7c1.2-0.3,2.6-0.5,4.1-0.6
		C612.3,147.8,613.7,147.7,614.9,147.7z M615.3,152.3c-1.3,0-2.5,0-3.3,0.1v9.9h2.6c2.5,0,4.5-0.4,5.9-1.1s2.1-2.1,2.1-4.1
		c0-1-0.2-1.7-0.5-2.4c-0.4-0.6-0.9-1.1-1.5-1.5c-0.6-0.4-1.4-0.6-2.3-0.8C617.3,152.4,616.3,152.3,615.3,152.3z"/>
	<path class="st1" d="M644.1,177.7c-2,0-3.7-0.3-5.1-0.9s-2.6-1.4-3.5-2.4c-0.9-1-1.6-2.3-2.1-3.7c-0.4-1.4-0.7-2.9-0.7-4.6V148h5.3
		v17.7c0,1.3,0.1,2.4,0.4,3.4c0.3,0.9,0.7,1.7,1.3,2.3c0.5,0.6,1.2,1,1.9,1.3c0.7,0.3,1.6,0.4,2.5,0.4s1.8-0.1,2.5-0.4
		c0.8-0.3,1.4-0.7,2-1.3s1-1.4,1.3-2.3c0.3-0.9,0.4-2.1,0.4-3.4V148h5.3v18.2c0,1.7-0.2,3.2-0.7,4.6c-0.5,1.4-1.2,2.6-2.1,3.7
		c-0.9,1-2.1,1.8-3.6,2.4C647.8,177.5,646.1,177.7,644.1,177.7z"/>
	<path class="st1" d="M682.7,148v4.6h-8.9v24.5h-5.3v-24.5h-8.9V148H682.7z"/>
	<path class="st1" d="M686.7,148h5.3v29.1h-5.3V148z"/>
	<path class="st1" d="M718.6,177.1c-1-1.6-2-3.3-3.2-5.1c-1.2-1.8-2.4-3.7-3.7-5.5c-1.3-1.9-2.5-3.7-3.8-5.4
		c-1.3-1.7-2.5-3.3-3.7-4.7v20.8H699V148h4.3c1.1,1.2,2.3,2.6,3.6,4.2c1.3,1.6,2.6,3.3,3.9,5c1.3,1.7,2.6,3.5,3.8,5.2
		c1.2,1.8,2.3,3.4,3.3,4.9V148h5.2v29.1H718.6z"/>
	<path class="st1" d="M743.7,152c-3,0-5.3,0.9-6.9,2.8c-1.6,1.9-2.4,4.4-2.4,7.7c0,1.6,0.2,3,0.6,4.3c0.4,1.3,0.9,2.4,1.7,3.3
		c0.7,0.9,1.7,1.6,2.8,2.2c1.1,0.5,2.4,0.8,3.9,0.8c0.9,0,1.7,0,2.4-0.1c0.7-0.1,1.2-0.2,1.6-0.3v-10.5h5.3v14
		c-0.7,0.3-2,0.6-3.7,0.9s-3.7,0.5-6,0.5c-2.1,0-4-0.3-5.8-1c-1.7-0.7-3.2-1.7-4.4-2.9c-1.2-1.3-2.2-2.9-2.8-4.7c-0.7-1.9-1-4-1-6.5
		c0-2.4,0.4-4.6,1.1-6.5c0.7-1.9,1.8-3.5,3-4.8c1.3-1.3,2.8-2.3,4.5-3s3.6-1,5.5-1c1.3,0,2.5,0.1,3.6,0.3c1.1,0.2,2,0.4,2.7,0.6
		c0.8,0.2,1.4,0.5,1.9,0.7s0.8,0.4,1,0.5l-1.6,4.3c-0.8-0.5-1.9-0.9-3.1-1.3C746.3,152.2,745,152,743.7,152z"/>
</g>
<path class="st3" d="M299.9,336.5"/>
<line class="st4" x1="231.4" y1="130.5" x2="754" y2="130.5"/>
</svg>
