<?xml version="1.0" encoding="utf-8"?>
<!-- Generator: Adobe Illustrator 24.1.2, SVG Export Plug-In . SVG Version: 6.00 Build 0)  -->
<svg version="1.1" id="Calque_1" xmlns="http://www.w3.org/2000/svg" xmlns:xlink="http://www.w3.org/1999/xlink" x="0px" y="0px"
	 viewBox="0 0 870.2 223.9" style="enable-background:new 0 0 870.2 223.9;" xml:space="preserve">
<style type="text/css">
	.st0{clip-path:url(#SVGID_2_);}
	.st1{fill:#44C1C2;}
	.st2{fill:#007C89;}
	.st3{fill:#ABDADC;}
	.st4{fill:#089FB3;}
	.st5{fill:#FDB71A;}
</style>
<g>
	<defs>
		<rect id="SVGID_1_" x="2.8" y="2.8" width="864.6" height="218.3"/>
	</defs>
	<clipPath id="SVGID_2_">
		<use xlink:href="#SVGID_1_"  style="overflow:visible;"/>
	</clipPath>
	<g class="st0">
		<path class="st1" d="M112.2,151.5c-6.5,0-12.7-1.6-18.1-4.4c-1.9-1-4.2-0.6-5.8,0.9l-43,43c-2.2,2.2-1.9,5.7,0.5,7.6
			c18.4,14.1,41.4,22.5,66.4,22.5c9.7,0,19.1-1.3,28.1-3.7c3-0.8,4.6-4,3.4-6.8l-23.3-56.2c-0.8-2-2.9-3.2-5.1-3.1
			C114.3,151.5,113.2,151.5,112.2,151.5"/>
		<path class="st2" d="M350.3,38.1c-43.5,0-76.3,29.9-76.3,69.5c0,39.6,32.8,69.5,76.3,69.5c43.6,0,76.5-29.9,76.5-69.5
			C426.9,68,394,38.1,350.3,38.1 M350.3,148.6c-26.9,0-45-16.5-45-41c0-24.6,18.1-41,45-41c27.1,0,45.3,16.5,45.3,41
			C395.6,132.1,377.4,148.6,350.3,148.6"/>
		<path class="st2" d="M543.8,103.2l-3.1-0.8l2.9-1.3c8.3-2.7,17.2-14.1,17.2-26c0-19.5-18.7-34.2-43.4-34.2h-56.5
			c-3.8,0-6.9,3.1-6.9,6.9v119.6c0,3.8,3.1,6.9,6.9,6.9h56.1c32.4,0,51.7-14.8,51.7-39.5C568.6,121.9,557,106.4,543.8,103.2
			 M485.3,64.1h24.4c11.1,0,19.5,6.6,19.5,15.3c0,8.7-8.4,15.3-19.5,15.3h-24.4V64.1z M513.2,151.1h-27.9v-35.8h27.9
			c13.3,0,22.3,7.2,22.3,17.9C535.5,143.9,526.5,151.1,513.2,151.1"/>
		<path class="st2" d="M597.6,174.3h99.7v-19.5c0-3.8-3.1-6.9-6.9-6.9h-68.4v-29.1H680V94.5h-57.9V67.2h67.1c3.8,0,6.9-3.1,6.9-6.9
			V40.9h-98.4c-3.8,0-6.9,3.1-6.9,6.9v119.6C590.7,171.2,593.8,174.3,597.6,174.3"/>
		<path class="st2" d="M790.9,38.1c-43.5,0-76.3,29.9-76.3,69.5c0,39.6,32.8,69.5,76.3,69.5c43.6,0,76.5-29.9,76.5-69.5
			C867.4,68,834.5,38.1,790.9,38.1 M790.9,148.7c-27,0-45.2-16.6-45.2-41.2c0-24.6,18.2-41.2,45.2-41.2c27.2,0,45.4,16.5,45.4,41.2
			C836.3,132.2,818,148.7,790.9,148.7"/>
		<path class="st3" d="M136.6,147.7l23.3,56.2c1.2,2.8,4.6,3.9,7.2,2.4c28.6-16.6,48.9-45.8,53.5-80.1c0.4-3-1.9-5.8-5-5.8h-60.8
			c-2.1,0-4.1,1.3-4.7,3.4c-2.3,7.1-6.5,13.4-12.1,18.2C136.3,143.5,135.8,145.8,136.6,147.7"/>
		<path class="st2" d="M103.4,69.2V8.4c0-3.1-2.7-5.4-5.7-5C63.5,8,34.2,28.3,17.6,56.9c-1.5,2.6-0.4,6,2.4,7.2l56.2,23.3
			c2,0.8,4.3,0.3,5.7-1.3c4.7-5.6,11-9.8,18.2-12.1C102.1,73.3,103.4,71.3,103.4,69.2"/>
		<path class="st4" d="M72.4,111.8c0-1,0-2.1,0.1-3.1c0.2-2.2-1-4.3-3.1-5.1L13.3,80.3c-2.8-1.2-6,0.4-6.8,3.4
			c-2.4,9-3.7,18.4-3.7,28.1c0,25,8.4,48,22.5,66.4c1.9,2.4,5.4,2.7,7.6,0.5l43-43c1.5-1.5,1.9-3.9,0.9-5.8
			C74,124.5,72.4,118.3,72.4,111.8"/>
		<path class="st5" d="M216.2,97.2h-84.5c-2.7,0-4.9-2.2-4.9-4.9V7.8c0-2.7,2.2-5,4.9-5h84.5c2.7,0,4.9,2.2,4.9,5v84.5
			C221.2,95,218.9,97.2,216.2,97.2"/>
	</g>
</g>
</svg>
