{
  "bomFormat" : "CycloneDX",
  "specVersion" : "1.4",
  "serialNumber" : "urn:uuid:a13b94c1-7647-4891-b2be-23f7394e96ac",
  "version" : 1,
  "metadata" : {
    "timestamp" : "2023-08-28T11:28:57Z",
    "tools" : [
      {
        "vendor" : "OWASP Foundation",
        "name" : "CycloneDX Maven plugin",
        "version" : "2.7.9",
        "hashes" : [
          {
            "alg" : "MD5",
            "content" : "8e595cdb67f17e4b41e046456970591d"
          },
          {
            "alg" : "SHA-1",
            "content" : "69e8ca804520d09ce4657e7235bae84d01cbffa6"
          },
          {
            "alg" : "SHA-256",
            "content" : "aa09074fe5aa403c008cd4fc7ef8ce41cd244489337f16b3e91a3914158a4db8"
          },
          {
            "alg" : "SHA-512",
            "content" : "1488a8112da8e675813d7585f57c5efb178aed32901118186ee12d0e4ae3d19c53774c7f860bf70d17d70f050119b69443a2637cf641675b4b5d9cdcdd69b89b"
          },
          {
            "alg" : "SHA-384",
            "content" : "b097295dfbf10887abc6eec58d4d0822cde5a73d1f5c1cf183a57bf569016ad5ced9d34efae3e574d82bb62837540c6c"
          },
          {
            "alg" : "SHA3-384",
            "content" : "289f9520bd73a2031276248a6ef8f0891c691062c2d1ea86a2bc9ea8db2c52377d92a53be9957179e71aee3deda26a8c"
          },
          {
            "alg" : "SHA3-256",
            "content" : "32b50a7efe5d491a4039c0017eca3cf49d98b55fc66d06b3dd06209487323474"
          },
          {
            "alg" : "SHA3-512",
            "content" : "1daf813da53e5d5cda4d0302ff3a5e388aa45d96ebe6dcbe240f35d33f14b1e6390f6bbe7f21f3ed8cf96ebd9f5516a08b18487b7339715109c81cebfc1563df"
          }
        ]
      }
    ],
    "component" : {
      "publisher" : "Eclipse Foundation",
      "group" : "jakarta.ejb",
      "name" : "jakarta.ejb-api",
      "version" : "4.0.1",
      "description" : "Jakarta Enterprise Beans API",
      "licenses" : [
        {
          "license" : {
            "id" : "EPL-2.0"
          }
        },
        {
          "license" : {
            "id" : "GPL-2.0-with-classpath-exception"
          }
        }
      ],
      "purl" : "pkg:maven/jakarta.ejb/jakarta.ejb-api@4.0.1?type=jar",
      "externalReferences" : [
        {
          "type" : "website",
          "url" : "https://github.com/jakartaee/enterprise-beans"
        },
        {
          "type" : "distribution",
          "url" : "https://jakarta.oss.sonatype.org/service/local/staging/deploy/maven2/"
        },
        {
          "type" : "issue-tracker",
          "url" : "https://github.com/jakartaee/enterprise-beans/issues"
        },
        {
          "type" : "mailing-list",
          "url" : "http://www.eclipse.org/lists/ejb-dev"
        },
        {
          "type" : "vcs",
          "url" : "https://github.com/jakartaee/enterprise-beans"
        }
      ],
      "type" : "library",
      "bom-ref" : "pkg:maven/jakarta.ejb/jakarta.ejb-api@4.0.1?type=jar"
    },
    "properties" : [
      {
        "name" : "maven.goal",
        "value" : "makeAggregateBom"
      },
      {
        "name" : "maven.scopes",
        "value" : "compile,provided,runtime,system,test"
      }
    ]
  },
  "components" : [
    {
      "publisher" : "EE4J Community",
      "group" : "jakarta.transaction",
      "name" : "jakarta.transaction-api",
      "version" : "2.0.0",
      "description" : "Jakarta Transactions",
      "scope" : "required",
      "hashes" : [
        {
          "alg" : "MD5",
          "content" : "8cddb47aba40b4bf3f9eb8bb5c0b3e06"
        },
        {
          "alg" : "SHA-1",
          "content" : "24a0525b4acfbca4086d2f1278be3a084fe1c67d"
        },
        {
          "alg" : "SHA-256",
          "content" : "21474b7ee0ad764c05d5ad0bc430e5e647cdeabc86cb587477a7eca5be6e584b"
        },
        {
          "alg" : "SHA-512",
          "content" : "88c76b2da7a8c725e64074e30d1fa5797e36e9cf5bf67280d10c92d99452db89e0325fcf5bbe20052a96d3f73299f0fea699c850493fe0a64cd0e10dc9ce11b7"
        },
        {
          "alg" : "SHA-384",
          "content" : "cdac48a45cb496e659a2d262e8e36e3b89dcb822de44e84c1ef0a13919870646aa995eed70515986cd1438a09cb0cd3d"
        },
        {
          "alg" : "SHA3-384",
          "content" : "01757bfb62766e984c82e697f682e052ae038419690aa42b3b05ae19a6e8cacebb259b577576f109f8a04ba60e63cfec"
        },
        {
          "alg" : "SHA3-256",
          "content" : "6349e4e76de2d9fbb6523235480a38322292a5f292f6c2ec2125b1803d8833be"
        },
        {
          "alg" : "SHA3-512",
          "content" : "6ab2efa244f09dc552f35f99abe3dd8111a7ddaf62b3268ad5cad9b23c6993691481c6bec6fffc79c7faca9293fac655a6d12a719030837ff9c9e7a7b2738ad9"
        }
      ],
      "licenses" : [
        {
          "license" : {
            "id" : "EPL-2.0"
          }
        },
        {
          "license" : {
            "id" : "GPL-2.0-with-classpath-exception"
          }
        }
      ],
      "purl" : "pkg:maven/jakarta.transaction/jakarta.transaction-api@2.0.0?type=jar",
      "externalReferences" : [
        {
          "type" : "website",
          "url" : "https://projects.eclipse.org/projects/ee4j.jta"
        },
        {
          "type" : "distribution",
          "url" : "https://jakarta.oss.sonatype.org/service/local/staging/deploy/maven2/"
        },
        {
          "type" : "issue-tracker",
          "url" : "https://github.com/eclipse-ee4j/jta-api/issues"
        },
        {
          "type" : "mailing-list",
          "url" : "https://dev.eclipse.org/mhonarc/lists/jta-dev/"
        },
        {
          "type" : "vcs",
          "url" : "https://github.com/eclipse-ee4j/jta-api"
        }
      ],
      "type" : "library",
      "bom-ref" : "pkg:maven/jakarta.transaction/jakarta.transaction-api@2.0.0?type=jar"
    }
  ],
  "dependencies" : [
    {
      "ref" : "pkg:maven/jakarta.ejb/jakarta.ejb-api@4.0.1?type=jar",
      "dependsOn" : [
        "pkg:maven/jakarta.transaction/jakarta.transaction-api@2.0.0?type=jar"
      ]
    },
    {
      "ref" : "pkg:maven/jakarta.transaction/jakarta.transaction-api@2.0.0?type=jar",
      "dependsOn" : [ ]
    }
  ]
}