{
  "bomFormat" : "CycloneDX",
  "specVersion" : "1.4",
  "serialNumber" : "urn:uuid:900644e1-7ff9-40e7-847e-1a3b52a9815a",
  "version" : 1,
  "metadata" : {
    "timestamp" : "2023-08-28T11:32:25Z",
    "tools" : [
      {
        "vendor" : "OWASP Foundation",
        "name" : "CycloneDX Maven plugin",
        "version" : "2.7.9",
        "hashes" : [
          {
            "alg" : "MD5",
            "content" : "8e595cdb67f17e4b41e046456970591d"
          },
          {
            "alg" : "SHA-1",
            "content" : "69e8ca804520d09ce4657e7235bae84d01cbffa6"
          },
          {
            "alg" : "SHA-256",
            "content" : "aa09074fe5aa403c008cd4fc7ef8ce41cd244489337f16b3e91a3914158a4db8"
          },
          {
            "alg" : "SHA-512",
            "content" : "1488a8112da8e675813d7585f57c5efb178aed32901118186ee12d0e4ae3d19c53774c7f860bf70d17d70f050119b69443a2637cf641675b4b5d9cdcdd69b89b"
          },
          {
            "alg" : "SHA-384",
            "content" : "b097295dfbf10887abc6eec58d4d0822cde5a73d1f5c1cf183a57bf569016ad5ced9d34efae3e574d82bb62837540c6c"
          },
          {
            "alg" : "SHA3-384",
            "content" : "289f9520bd73a2031276248a6ef8f0891c691062c2d1ea86a2bc9ea8db2c52377d92a53be9957179e71aee3deda26a8c"
          },
          {
            "alg" : "SHA3-256",
            "content" : "32b50a7efe5d491a4039c0017eca3cf49d98b55fc66d06b3dd06209487323474"
          },
          {
            "alg" : "SHA3-512",
            "content" : "1daf813da53e5d5cda4d0302ff3a5e388aa45d96ebe6dcbe240f35d33f14b1e6390f6bbe7f21f3ed8cf96ebd9f5516a08b18487b7339715109c81cebfc1563df"
          }
        ]
      }
    ],
    "component" : {
      "publisher" : "Eclipse Foundation",
      "group" : "jakarta.mail",
      "name" : "jakarta.mail-api",
      "version" : "2.1.0",
      "description" : "Jakarta Mail API 2.1 Specification API",
      "licenses" : [
        {
          "license" : {
            "id" : "EPL-2.0"
          }
        },
        {
          "license" : {
            "id" : "GPL-2.0-with-classpath-exception"
          }
        },
        {
          "license" : {
            "id" : "BSD-3-Clause"
          }
        }
      ],
      "purl" : "pkg:maven/jakarta.mail/jakarta.mail-api@2.1.0?type=jar",
      "externalReferences" : [
        {
          "type" : "website",
          "url" : "https://projects.eclipse.org/projects/ee4j/jakarta.mail-api"
        },
        {
          "type" : "distribution",
          "url" : "https://jakarta.oss.sonatype.org/service/local/staging/deploy/maven2/"
        },
        {
          "type" : "issue-tracker",
          "url" : "https://github.com/eclipse-ee4j/mail/issues"
        },
        {
          "type" : "mailing-list",
          "url" : "https://dev.eclipse.org/mhonarc/lists/jakarta.ee-community/"
        },
        {
          "type" : "vcs",
          "url" : "https://github.com/eclipse-ee4j/mail"
        }
      ],
      "type" : "library",
      "bom-ref" : "pkg:maven/jakarta.mail/jakarta.mail-api@2.1.0?type=jar"
    },
    "properties" : [
      {
        "name" : "maven.goal",
        "value" : "makeAggregateBom"
      },
      {
        "name" : "maven.scopes",
        "value" : "compile,provided,runtime,system,test"
      }
    ]
  },
  "components" : [
    {
      "publisher" : "Eclipse Foundation",
      "group" : "jakarta.activation",
      "name" : "jakarta.activation-api",
      "version" : "2.1.0",
      "description" : "Jakarta Activation API 2.1 Specification",
      "scope" : "required",
      "hashes" : [
        {
          "alg" : "MD5",
          "content" : "7c79641566f97305e17c5f7b9bb33fc3"
        },
        {
          "alg" : "SHA-1",
          "content" : "a58861b5deac5e151140511cf57d6b80a83f2d20"
        },
        {
          "alg" : "SHA-256",
          "content" : "56e8d994095fe49c28138c60291482f66f18d12ac2b720e938697dce6a3135c7"
        },
        {
          "alg" : "SHA-512",
          "content" : "53026e23571e77b9696cf02d1eeb20295b7199a169c12db9807f2ef2512eff859b37108b96bfdbcd2c9f4a66728d12ad8182b5548146897cdc2ad49e7b2b2ebc"
        },
        {
          "alg" : "SHA-384",
          "content" : "2e835f36fa8c90490cd4f543062f3ce548175fc97b3dfa2ab3c63f2dcd59c57060a196ace53933639399657f6aec9e5c"
        },
        {
          "alg" : "SHA3-384",
          "content" : "bde529fca53e87d22908b4794730a03a2fa29b62ba8cce07edd4e10e34d98cd43a7b0e449241010ce55e962ee4140837"
        },
        {
          "alg" : "SHA3-256",
          "content" : "be51f4c74f02fb8c98fca209dc5d33ed89dfb240c882e790974c06bef563a6ee"
        },
        {
          "alg" : "SHA3-512",
          "content" : "835e222a4ed4e31f570afd5b10b1935ff8fe4453ce79e340cb021229cc186586e9461411ce7749798a97122794bc3a1965ab770f9682bfb68f6b740e41c50943"
        }
      ],
      "licenses" : [
        {
          "license" : {
            "id" : "BSD-3-Clause"
          }
        }
      ],
      "purl" : "pkg:maven/jakarta.activation/jakarta.activation-api@2.1.0?type=jar",
      "externalReferences" : [
        {
          "type" : "website",
          "url" : "https://github.com/eclipse-ee4j/jaf"
        },
        {
          "type" : "distribution",
          "url" : "https://jakarta.oss.sonatype.org/service/local/staging/deploy/maven2/"
        },
        {
          "type" : "issue-tracker",
          "url" : "https://github.com/eclipse-ee4j/jaf/issues/"
        },
        {
          "type" : "mailing-list",
          "url" : "https://dev.eclipse.org/mhonarc/lists/jakarta.ee-community/"
        },
        {
          "type" : "vcs",
          "url" : "https://github.com/eclipse-ee4j/jaf"
        }
      ],
      "type" : "library",
      "bom-ref" : "pkg:maven/jakarta.activation/jakarta.activation-api@2.1.0?type=jar"
    },
    {
      "publisher" : "JUnit",
      "group" : "junit",
      "name" : "junit",
      "version" : "4.13.2",
      "description" : "JUnit is a unit testing framework for Java, created by Erich Gamma and Kent Beck.",
      "scope" : "required",
      "hashes" : [
        {
          "alg" : "MD5",
          "content" : "d98a9a02a99a9acd22d7653cbcc1f31f"
        },
        {
          "alg" : "SHA-1",
          "content" : "8ac9e16d933b6fb43bc7f576336b8f4d7eb5ba12"
        },
        {
          "alg" : "SHA-256",
          "content" : "8e495b634469d64fb8acfa3495a065cbacc8a0fff55ce1e31007be4c16dc57d3"
        },
        {
          "alg" : "SHA-512",
          "content" : "a31b9950f929a7e5a600d89787ef40e42a8a8e2392e210d0c0f45b3572937670a18a524f1815508cd1152cd1eaa7275cb7430ba45c053be365c83c231bccd3f0"
        },
        {
          "alg" : "SHA-384",
          "content" : "9f85c56a77c699eb87630b9e8224068a34c296bcd9aadb52248dd4665036f5bf1048fe75e5cb590b59e7855ca716acae"
        },
        {
          "alg" : "SHA3-384",
          "content" : "590cfd9396424583879ca8ad732870406bab18325ac72fb2bbe188b9611278d6341700badf7cfc32525b8ff42900c905"
        },
        {
          "alg" : "SHA3-256",
          "content" : "a06b3fd2fd1d9f4306b58125484e3605a395afe5ffe2c801e43ae462f366a430"
        },
        {
          "alg" : "SHA3-512",
          "content" : "a6d25ce3c14f9065f06dfd0e68e1dad5c03bd5de0a302c44ca4733d2cb87ec1bc6f0abd36d65aeee8caf328b6881432c4b682fa4b4b1fa931c3c950de5129fb2"
        }
      ],
      "licenses" : [
        {
          "license" : {
            "id" : "EPL-1.0",
            "url" : "http://www.eclipse.org/legal/epl-v10.html"
          }
        }
      ],
      "purl" : "pkg:maven/junit/junit@4.13.2?type=jar",
      "externalReferences" : [
        {
          "type" : "website",
          "url" : "http://junit.org"
        },
        {
          "type" : "build-system",
          "url" : "https://github.com/junit-team/junit4/actions"
        },
        {
          "type" : "distribution",
          "url" : "https://github.com/junit-team/junit4/wiki/Download-and-Install"
        },
        {
          "type" : "issue-tracker",
          "url" : "https://github.com/junit-team/junit4/issues"
        },
        {
          "type" : "vcs",
          "url" : "https://github.com/junit-team/junit4"
        }
      ],
      "type" : "library",
      "bom-ref" : "pkg:maven/junit/junit@4.13.2?type=jar"
    },
    {
      "group" : "org.hamcrest",
      "name" : "hamcrest-core",
      "version" : "1.3",
      "description" : "This is the core API of hamcrest matcher framework to be used by third-party framework providers. This includes the a foundation set of matcher implementations for common operations.",
      "scope" : "required",
      "hashes" : [
        {
          "alg" : "MD5",
          "content" : "6393363b47ddcbba82321110c3e07519"
        },
        {
          "alg" : "SHA-1",
          "content" : "42a25dc3219429f0e5d060061f71acb49bf010a0"
        },
        {
          "alg" : "SHA-256",
          "content" : "66fdef91e9739348df7a096aa384a5685f4e875584cce89386a7a47251c4d8e9"
        },
        {
          "alg" : "SHA-512",
          "content" : "e237ae735aac4fa5a7253ec693191f42ef7ddce384c11d29fbf605981c0be077d086757409acad53cb5b9e53d86a07cc428d459ff0f5b00d32a8cbbca390be49"
        },
        {
          "alg" : "SHA-384",
          "content" : "4b5297d2a12cc32b824153afc83f1ba9f1869ca288330f0a2f759659d09e4c420eb6ba4a1efbfa0657b625edd41293d5"
        },
        {
          "alg" : "SHA3-384",
          "content" : "b14d34985c0a78cf0ba19b5a18bffd403e08adcb2afde228ddef6e16121c7046dbebf58c04d3419311c4496c48aa93be"
        },
        {
          "alg" : "SHA3-256",
          "content" : "f679af77deedf69b3c3066f7916583848c6fd32a950f9c0b0e2ef1da121717ba"
        },
        {
          "alg" : "SHA3-512",
          "content" : "bca821931e438a1977b7b4356b5f8cebf485634f82159d505c48267c34e6a0f4fde9c2917331365f66dc0e52e2ca3a2db5256863584110c27ecebefc28741f63"
        }
      ],
      "licenses" : [
        {
          "license" : {
            "id" : "BSD-3-Clause"
          }
        }
      ],
      "purl" : "pkg:maven/org.hamcrest/hamcrest-core@1.3?type=jar",
      "externalReferences" : [
        {
          "type" : "website",
          "url" : "https://github.com/hamcrest/JavaHamcrest/hamcrest-core"
        },
        {
          "type" : "vcs",
          "url" : "https://github.com/hamcrest/JavaHamcrest/hamcrest-core"
        }
      ],
      "type" : "library",
      "bom-ref" : "pkg:maven/org.hamcrest/hamcrest-core@1.3?type=jar"
    },
    {
      "publisher" : "Eclipse Foundation",
      "group" : "org.eclipse.angus",
      "name" : "angus-activation",
      "version" : "1.0.0-M2",
      "description" : "Angus Activation Registries Implementation",
      "scope" : "required",
      "hashes" : [
        {
          "alg" : "MD5",
          "content" : "198b6a50e9eb009dd99548d4d2939652"
        },
        {
          "alg" : "SHA-1",
          "content" : "aa7b924efd1a60a40b3d1440292aedf0db3ed87c"
        },
        {
          "alg" : "SHA-256",
          "content" : "1c0517412a50a4a3cf8b914240d86ad95a3d46f85ef722e6c31d1ce9fad7042a"
        },
        {
          "alg" : "SHA-512",
          "content" : "840f2b6090704893e2b3a8e67ab745cd3cedbf2369666caaa9e87001a4ecb4cd5f38940a9bf3d06eea7460b00b95b64861bf067f1bf7d0463c946f3e75463fde"
        },
        {
          "alg" : "SHA-384",
          "content" : "5922af7ee71bf88357f4b104d90f6ad47f70887433716620b490efc4c285c5f4ef202504d3979541ff2265dd8b176646"
        },
        {
          "alg" : "SHA3-384",
          "content" : "7bdae5905346d7e81ab643ee30429bdcdb0195ed8255c232de3ddb2d0223ddad084db9509033386f9ca905edcefd3a4a"
        },
        {
          "alg" : "SHA3-256",
          "content" : "9a9be24064e4430d45870a0a339150694c43c6e653c576e19e58307decd21214"
        },
        {
          "alg" : "SHA3-512",
          "content" : "3c6885fc4e7e9ecfcc222f764c2349246321ef498e9b59552b4b015f3572b8861b09d983f3e807e88bf7ff7603afef035e1edd5334c82cd3ee9777abd1e70318"
        }
      ],
      "licenses" : [
        {
          "license" : {
            "id" : "BSD-3-Clause"
          }
        }
      ],
      "purl" : "pkg:maven/org.eclipse.angus/angus-activation@1.0.0-M2?type=jar",
      "externalReferences" : [
        {
          "type" : "website",
          "url" : "https://github.com/eclipse-ee4j/angus-activation/angus-activation"
        },
        {
          "type" : "distribution",
          "url" : "https://jakarta.oss.sonatype.org/service/local/staging/deploy/maven2/"
        },
        {
          "type" : "issue-tracker",
          "url" : "https://github.com/eclipse-ee4j/angus-activation/issues/"
        },
        {
          "type" : "mailing-list",
          "url" : "https://dev.eclipse.org/mhonarc/lists/jakarta.ee-community/"
        },
        {
          "type" : "vcs",
          "url" : "https://github.com/eclipse-ee4j/angus-activation/angus-activation"
        }
      ],
      "type" : "library",
      "bom-ref" : "pkg:maven/org.eclipse.angus/angus-activation@1.0.0-M2?type=jar"
    }
  ],
  "dependencies" : [
    {
      "ref" : "pkg:maven/jakarta.mail/jakarta.mail-api@2.1.0?type=jar",
      "dependsOn" : [
        "pkg:maven/jakarta.activation/jakarta.activation-api@2.1.0?type=jar",
        "pkg:maven/junit/junit@4.13.2?type=jar",
        "pkg:maven/org.eclipse.angus/angus-activation@1.0.0-M2?type=jar"
      ]
    },
    {
      "ref" : "pkg:maven/jakarta.activation/jakarta.activation-api@2.1.0?type=jar",
      "dependsOn" : [ ]
    },
    {
      "ref" : "pkg:maven/junit/junit@4.13.2?type=jar",
      "dependsOn" : [
        "pkg:maven/org.hamcrest/hamcrest-core@1.3?type=jar"
      ]
    },
    {
      "ref" : "pkg:maven/org.hamcrest/hamcrest-core@1.3?type=jar",
      "dependsOn" : [ ]
    },
    {
      "ref" : "pkg:maven/org.eclipse.angus/angus-activation@1.0.0-M2?type=jar",
      "dependsOn" : [
        "pkg:maven/jakarta.activation/jakarta.activation-api@2.1.0?type=jar"
      ]
    }
  ]
}