{
  "bomFormat" : "CycloneDX",
  "specVersion" : "1.4",
  "serialNumber" : "urn:uuid:de840fe9-1dae-4ec7-9c48-a05d54975dbf",
  "version" : 1,
  "metadata" : {
    "timestamp" : "2023-08-28T11:28:26Z",
    "tools" : [
      {
        "vendor" : "OWASP Foundation",
        "name" : "CycloneDX Maven plugin",
        "version" : "2.7.9",
        "hashes" : [
          {
            "alg" : "MD5",
            "content" : "8e595cdb67f17e4b41e046456970591d"
          },
          {
            "alg" : "SHA-1",
            "content" : "69e8ca804520d09ce4657e7235bae84d01cbffa6"
          },
          {
            "alg" : "SHA-256",
            "content" : "aa09074fe5aa403c008cd4fc7ef8ce41cd244489337f16b3e91a3914158a4db8"
          },
          {
            "alg" : "SHA-512",
            "content" : "1488a8112da8e675813d7585f57c5efb178aed32901118186ee12d0e4ae3d19c53774c7f860bf70d17d70f050119b69443a2637cf641675b4b5d9cdcdd69b89b"
          },
          {
            "alg" : "SHA-384",
            "content" : "b097295dfbf10887abc6eec58d4d0822cde5a73d1f5c1cf183a57bf569016ad5ced9d34efae3e574d82bb62837540c6c"
          },
          {
            "alg" : "SHA3-384",
            "content" : "289f9520bd73a2031276248a6ef8f0891c691062c2d1ea86a2bc9ea8db2c52377d92a53be9957179e71aee3deda26a8c"
          },
          {
            "alg" : "SHA3-256",
            "content" : "32b50a7efe5d491a4039c0017eca3cf49d98b55fc66d06b3dd06209487323474"
          },
          {
            "alg" : "SHA3-512",
            "content" : "1daf813da53e5d5cda4d0302ff3a5e388aa45d96ebe6dcbe240f35d33f14b1e6390f6bbe7f21f3ed8cf96ebd9f5516a08b18487b7339715109c81cebfc1563df"
          }
        ]
      }
    ],
    "component" : {
      "publisher" : "Eclipse Foundation",
      "group" : "jakarta.annotation",
      "name" : "jakarta.annotation-api",
      "version" : "2.1.1",
      "description" : "Jakarta Annotations API",
      "licenses" : [
        {
          "license" : {
            "id" : "EPL-2.0"
          }
        },
        {
          "license" : {
            "id" : "GPL-2.0-with-classpath-exception"
          }
        }
      ],
      "purl" : "pkg:maven/jakarta.annotation/jakarta.annotation-api@2.1.1?type=jar",
      "externalReferences" : [
        {
          "type" : "website",
          "url" : "https://projects.eclipse.org/projects/ee4j.ca"
        },
        {
          "type" : "distribution",
          "url" : "https://jakarta.oss.sonatype.org/service/local/staging/deploy/maven2/"
        },
        {
          "type" : "issue-tracker",
          "url" : "https://github.com/eclipse-ee4j/common-annotations-api/issues"
        },
        {
          "type" : "mailing-list",
          "url" : "https://dev.eclipse.org/mhonarc/lists/ca-dev"
        },
        {
          "type" : "vcs",
          "url" : "https://github.com/eclipse-ee4j/common-annotations-api"
        }
      ],
      "type" : "library",
      "bom-ref" : "pkg:maven/jakarta.annotation/jakarta.annotation-api@2.1.1?type=jar"
    },
    "properties" : [
      {
        "name" : "maven.goal",
        "value" : "makeAggregateBom"
      },
      {
        "name" : "maven.scopes",
        "value" : "compile,provided,runtime,system,test"
      }
    ]
  },
  "dependencies" : [
    {
      "ref" : "pkg:maven/jakarta.annotation/jakarta.annotation-api@2.1.1?type=jar",
      "dependsOn" : [ ]
    }
  ]
}