{
  "bomFormat" : "CycloneDX",
  "specVersion" : "1.4",
  "serialNumber" : "urn:uuid:ca9bf5ad-8a2e-477f-9a5e-2563b4c65f6b",
  "version" : 1,
  "metadata" : {
    "timestamp" : "2023-08-25T14:48:02Z",
    "tools" : [
      {
        "vendor" : "OWASP Foundation",
        "name" : "CycloneDX Maven plugin",
        "version" : "2.7.9",
        "hashes" : [
          {
            "alg" : "MD5",
            "content" : "8e595cdb67f17e4b41e046456970591d"
          },
          {
            "alg" : "SHA-1",
            "content" : "69e8ca804520d09ce4657e7235bae84d01cbffa6"
          },
          {
            "alg" : "SHA-256",
            "content" : "aa09074fe5aa403c008cd4fc7ef8ce41cd244489337f16b3e91a3914158a4db8"
          },
          {
            "alg" : "SHA-512",
            "content" : "1488a8112da8e675813d7585f57c5efb178aed32901118186ee12d0e4ae3d19c53774c7f860bf70d17d70f050119b69443a2637cf641675b4b5d9cdcdd69b89b"
          },
          {
            "alg" : "SHA-384",
            "content" : "b097295dfbf10887abc6eec58d4d0822cde5a73d1f5c1cf183a57bf569016ad5ced9d34efae3e574d82bb62837540c6c"
          },
          {
            "alg" : "SHA3-384",
            "content" : "289f9520bd73a2031276248a6ef8f0891c691062c2d1ea86a2bc9ea8db2c52377d92a53be9957179e71aee3deda26a8c"
          },
          {
            "alg" : "SHA3-256",
            "content" : "32b50a7efe5d491a4039c0017eca3cf49d98b55fc66d06b3dd06209487323474"
          },
          {
            "alg" : "SHA3-512",
            "content" : "1daf813da53e5d5cda4d0302ff3a5e388aa45d96ebe6dcbe240f35d33f14b1e6390f6bbe7f21f3ed8cf96ebd9f5516a08b18487b7339715109c81cebfc1563df"
          }
        ]
      }
    ],
    "component" : {
      "publisher" : "Eclipse Foundation",
      "group" : "jakarta.xml.ws",
      "name" : "jakarta.xml.ws-api",
      "version" : "3.0.1",
      "description" : "Jakarta XML Web Services API",
      "licenses" : [
        {
          "license" : {
            "id" : "BSD-3-Clause"
          }
        }
      ],
      "purl" : "pkg:maven/jakarta.xml.ws/jakarta.xml.ws-api@3.0.1?type=jar",
      "externalReferences" : [
        {
          "type" : "website",
          "url" : "https://github.com/eclipse-ee4j/jax-ws-api"
        },
        {
          "type" : "distribution",
          "url" : "https://jakarta.oss.sonatype.org/service/local/staging/deploy/maven2/"
        },
        {
          "type" : "issue-tracker",
          "url" : "https://github.com/eclipse-ee4j/jax-ws-api/issues"
        },
        {
          "type" : "mailing-list",
          "url" : "https://dev.eclipse.org/mhonarc/lists/jaxws-dev/"
        },
        {
          "type" : "vcs",
          "url" : "https://github.com/eclipse-ee4j/jax-ws-api"
        }
      ],
      "type" : "library",
      "bom-ref" : "pkg:maven/jakarta.xml.ws/jakarta.xml.ws-api@3.0.1?type=jar"
    },
    "properties" : [
      {
        "name" : "maven.goal",
        "value" : "makeAggregateBom"
      },
      {
        "name" : "maven.scopes",
        "value" : "compile,provided,runtime,system,test"
      }
    ]
  },
  "components" : [
    {
      "publisher" : "Eclipse Foundation",
      "group" : "jakarta.xml.bind",
      "name" : "jakarta.xml.bind-api",
      "version" : "3.0.1",
      "description" : "Jakarta XML Binding API",
      "scope" : "required",
      "hashes" : [
        {
          "alg" : "MD5",
          "content" : "ce443876615a903fdff9e0d5d13cb8d4"
        },
        {
          "alg" : "SHA-1",
          "content" : "5257932df36ff3e4e6de50429dde946490a6a800"
        },
        {
          "alg" : "SHA-256",
          "content" : "b8fb4bee3ff5b5c1ef77144d8411316018d7bbd41fcf1ede0646f7978546b867"
        },
        {
          "alg" : "SHA-512",
          "content" : "7c74cedf7c0baaa5166311a4c4300a72eb09ae280ec3376553dd8651e6e3d5f100794421ba647b328195dfcf98a6cf7623169a0b87de3f13984dd7436c284807"
        },
        {
          "alg" : "SHA-384",
          "content" : "9e3e8b7b86884751280e71e3888d1ff3f4f0c9d6446ed8e32cd61f030532b455b7401d1495dc0da72cd3f6300c68f482"
        },
        {
          "alg" : "SHA3-384",
          "content" : "47bfcb7a14b57aaa6c813a54702af321dd488cd1697a52476bb46fb9e6162cd46b62faa876a77752b4a7271241924b38"
        },
        {
          "alg" : "SHA3-256",
          "content" : "91d3e457af90b684e246e02808fb8ededfef65f602717e3815417cb63f22c6b6"
        },
        {
          "alg" : "SHA3-512",
          "content" : "3c72bb852c244bfb7da0f382fda743c0f8522f56fa77337b203f5027ba8b32d12cd6d0d6ffadfea65552b508be9b40601d876b398a8fca8f4ae9ecd979154a93"
        }
      ],
      "licenses" : [
        {
          "license" : {
            "id" : "BSD-3-Clause"
          }
        }
      ],
      "purl" : "pkg:maven/jakarta.xml.bind/jakarta.xml.bind-api@3.0.1?type=jar",
      "externalReferences" : [
        {
          "type" : "website",
          "url" : "https://github.com/eclipse-ee4j/jaxb-api/jakarta.xml.bind-api"
        },
        {
          "type" : "distribution",
          "url" : "https://jakarta.oss.sonatype.org/service/local/staging/deploy/maven2/"
        },
        {
          "type" : "issue-tracker",
          "url" : "https://github.com/eclipse-ee4j/jaxb-api/issues"
        },
        {
          "type" : "mailing-list",
          "url" : "https://dev.eclipse.org/mhonarc/lists/jaxb-dev"
        },
        {
          "type" : "vcs",
          "url" : "https://github.com/eclipse-ee4j/jaxb-api.git/jakarta.xml.bind-api"
        }
      ],
      "type" : "library",
      "bom-ref" : "pkg:maven/jakarta.xml.bind/jakarta.xml.bind-api@3.0.1?type=jar"
    },
    {
      "publisher" : "Eclipse Foundation",
      "group" : "com.sun.activation",
      "name" : "jakarta.activation",
      "version" : "2.0.1",
      "description" : "Jakarta Activation",
      "scope" : "required",
      "hashes" : [
        {
          "alg" : "MD5",
          "content" : "39228ac67f033514a0ccb3360ac461f3"
        },
        {
          "alg" : "SHA-1",
          "content" : "828b80e886a52bb09fe41ff410b10b342f533ce1"
        },
        {
          "alg" : "SHA-256",
          "content" : "b9e24b7dd6e07495562ea96531be3130c96dba4d78e1dfd88adbbdebf4332871"
        },
        {
          "alg" : "SHA-512",
          "content" : "d1c214d2d6ecc61bba396d913c66c977418e74dfe96e5558951ccf99a60cfca6adfea3fc64b6e2d15f698e30dac870b8f6e8d7a22e0dff975f8dd83864714fc5"
        },
        {
          "alg" : "SHA-384",
          "content" : "7481f94524b06ba81d12f5d9427dcd389d2c9130176567ff3e11c82fcfe605bf654116463b23d259573f3222b3414bcd"
        },
        {
          "alg" : "SHA3-384",
          "content" : "0bcd7603bc9ff7cae8fb9d7c6547c012d88a5d6374a71670d58086dc597cd592f6686abccc63d095cb17cdafe4dba762"
        },
        {
          "alg" : "SHA3-256",
          "content" : "47760a6311d1023c1384ebaea0c2eb35c8ecbb06e424fdefe935693088e2f88e"
        },
        {
          "alg" : "SHA3-512",
          "content" : "f5d531480ed1cc9323281d1ca402d21ec71a7ad267372c95a8c8dcf0f1e6919d545085fe5c7b154c5594f26538873ee75459795e826c6acb3fa6c4629a7f983a"
        }
      ],
      "licenses" : [
        {
          "license" : {
            "id" : "BSD-3-Clause"
          }
        }
      ],
      "purl" : "pkg:maven/com.sun.activation/jakarta.activation@2.0.1?type=jar",
      "externalReferences" : [
        {
          "type" : "website",
          "url" : "https://github.com/eclipse-ee4j/jaf/jakarta.activation"
        },
        {
          "type" : "distribution",
          "url" : "https://jakarta.oss.sonatype.org/service/local/staging/deploy/maven2/"
        },
        {
          "type" : "issue-tracker",
          "url" : "https://github.com/eclipse-ee4j/jaf/issues/"
        },
        {
          "type" : "mailing-list",
          "url" : "https://dev.eclipse.org/mhonarc/lists/jakarta.ee-community/"
        },
        {
          "type" : "vcs",
          "url" : "https://github.com/eclipse-ee4j/jaf/jakarta.activation"
        }
      ],
      "type" : "library",
      "bom-ref" : "pkg:maven/com.sun.activation/jakarta.activation@2.0.1?type=jar"
    },
    {
      "publisher" : "Eclipse Foundation",
      "group" : "jakarta.xml.soap",
      "name" : "jakarta.xml.soap-api",
      "version" : "2.0.1",
      "description" : "Provides the API for creating and building SOAP messages.",
      "scope" : "required",
      "hashes" : [
        {
          "alg" : "MD5",
          "content" : "e60e6994c5a73b4b7cbe484a7182a752"
        },
        {
          "alg" : "SHA-1",
          "content" : "e4843dad5b0092da339dc983167d51d159b52d42"
        },
        {
          "alg" : "SHA-256",
          "content" : "41ca32993e4381a36ac4d23058c3946130127e48404d3a6f20c301c6a461c083"
        },
        {
          "alg" : "SHA-512",
          "content" : "993a62a2b3f7bbf897d0e982484d172f32d0a6704ca54a1574d074a1fd09430d53e77872edcee865f447a0345f6cde0d711b06002a9450ee03de0b9d7db7f45c"
        },
        {
          "alg" : "SHA-384",
          "content" : "2cbc0a3763c5123ff7d8336ace1a21a0f3ae7f0d6d5b20e15c1e5bd55f31c742919d4d535e51e86f47849762a938a289"
        },
        {
          "alg" : "SHA3-384",
          "content" : "614c828f2a3187771b3c349a60d382be584985640f5f49a90d4951585346fd18fc83cca15af5343b4bebdc16d5b92a7b"
        },
        {
          "alg" : "SHA3-256",
          "content" : "e7ea477a0397b65d17398cb359f73b9de32dda3fd5254ea6e83bb2ac06126ac5"
        },
        {
          "alg" : "SHA3-512",
          "content" : "6f2abafe4d6d3ac9f6bb954f1e459c888ab16873558e0f1a56bd53e694b232c3c49dc0875869c988729f6e7dd06b20a697c4e216ac3411cfb466018c537c2dca"
        }
      ],
      "licenses" : [
        {
          "license" : {
            "id" : "BSD-3-Clause"
          }
        }
      ],
      "purl" : "pkg:maven/jakarta.xml.soap/jakarta.xml.soap-api@2.0.1?type=jar",
      "externalReferences" : [
        {
          "type" : "website",
          "url" : "https://github.com/eclipse-ee4j/saaj-api"
        },
        {
          "type" : "distribution",
          "url" : "https://jakarta.oss.sonatype.org/service/local/staging/deploy/maven2/"
        },
        {
          "type" : "issue-tracker",
          "url" : "https://github.com/eclipse-ee4j/saaj-api/issues"
        },
        {
          "type" : "mailing-list",
          "url" : "https://dev.eclipse.org/mhonarc/lists/jaxws-dev"
        },
        {
          "type" : "vcs",
          "url" : "https://github.com/eclipse-ee4j/saaj-api"
        }
      ],
      "type" : "library",
      "bom-ref" : "pkg:maven/jakarta.xml.soap/jakarta.xml.soap-api@2.0.1?type=jar"
    },
    {
      "publisher" : "Eclipse Foundation",
      "group" : "jakarta.jws",
      "name" : "jakarta.jws-api",
      "version" : "3.0.0",
      "description" : "Jakarta Web Services Metadata API",
      "scope" : "required",
      "hashes" : [
        {
          "alg" : "MD5",
          "content" : "40d2c030ca6afa636a6178eb3eee6a56"
        },
        {
          "alg" : "SHA-1",
          "content" : "af8955221689acfde96fbd4b2c1c270589bc6903"
        },
        {
          "alg" : "SHA-256",
          "content" : "722a8ac1afe01d70f1f2c7a8289db3f764206c9c2f52a82b045e513be4cacbd7"
        },
        {
          "alg" : "SHA-512",
          "content" : "e1530b1c684deec4a20f7b05e5023fa05ff4d16b3a39cdf9c6dc9d8d4907569bab64425760436141a1a66ab2d6b3acc2822dc1176b38a6c2f624e6849ee7e9ed"
        },
        {
          "alg" : "SHA-384",
          "content" : "4bbbb8a8e9dc1859af9a659523972ae2e12e79c448f4c61dc0b019f3fc6fcd3e082747d87513ad2813d99fd35b260043"
        },
        {
          "alg" : "SHA3-384",
          "content" : "8deb764037ed361243202b58856876464c9a3c0c26c601e73d14e19f145ef7cc79cfaa18e76ae3fe34c3e1ea3180902e"
        },
        {
          "alg" : "SHA3-256",
          "content" : "e49a0a55aa7d81859f0fb9e104d7a3dcd7bbf7e55e12d05347f81bf4068d2ec4"
        },
        {
          "alg" : "SHA3-512",
          "content" : "0f9fb3321dd9867d360e02dd96d8fd4bac2e028435bcf6b87963d32a569a276dbb3385e86fe4b72334d0111b4d6d67d8706dd27d9de2c10da168c9116fa1875c"
        }
      ],
      "licenses" : [
        {
          "license" : {
            "id" : "BSD-3-Clause"
          }
        }
      ],
      "purl" : "pkg:maven/jakarta.jws/jakarta.jws-api@3.0.0?type=jar",
      "externalReferences" : [
        {
          "type" : "website",
          "url" : "https://github.com/eclipse-ee4j/jws-api"
        },
        {
          "type" : "distribution",
          "url" : "https://jakarta.oss.sonatype.org/service/local/staging/deploy/maven2/"
        },
        {
          "type" : "issue-tracker",
          "url" : "https://github.com/eclipse-ee4j/jws-api/issues"
        },
        {
          "type" : "mailing-list",
          "url" : "https://dev.eclipse.org/mhonarc/lists/jaxws-dev/"
        },
        {
          "type" : "vcs",
          "url" : "https://github.com/eclipse-ee4j/jws-api"
        }
      ],
      "type" : "library",
      "bom-ref" : "pkg:maven/jakarta.jws/jakarta.jws-api@3.0.0?type=jar"
    }
  ],
  "dependencies" : [
    {
      "ref" : "pkg:maven/jakarta.xml.ws/jakarta.xml.ws-api@3.0.1?type=jar",
      "dependsOn" : [
        "pkg:maven/jakarta.xml.bind/jakarta.xml.bind-api@3.0.1?type=jar",
        "pkg:maven/jakarta.xml.soap/jakarta.xml.soap-api@2.0.1?type=jar",
        "pkg:maven/jakarta.jws/jakarta.jws-api@3.0.0?type=jar"
      ]
    },
    {
      "ref" : "pkg:maven/jakarta.xml.bind/jakarta.xml.bind-api@3.0.1?type=jar",
      "dependsOn" : [
        "pkg:maven/com.sun.activation/jakarta.activation@2.0.1?type=jar"
      ]
    },
    {
      "ref" : "pkg:maven/com.sun.activation/jakarta.activation@2.0.1?type=jar",
      "dependsOn" : [ ]
    },
    {
      "ref" : "pkg:maven/jakarta.xml.soap/jakarta.xml.soap-api@2.0.1?type=jar",
      "dependsOn" : [
        "pkg:maven/com.sun.activation/jakarta.activation@2.0.1?type=jar"
      ]
    },
    {
      "ref" : "pkg:maven/jakarta.jws/jakarta.jws-api@3.0.0?type=jar",
      "dependsOn" : [ ]
    }
  ]
}