{
  "bomFormat" : "CycloneDX",
  "specVersion" : "1.4",
  "serialNumber" : "urn:uuid:17949be6-a4a3-4733-8104-e02857ffd384",
  "version" : 1,
  "metadata" : {
    "timestamp" : "2023-08-28T11:31:40Z",
    "tools" : [
      {
        "vendor" : "OWASP Foundation",
        "name" : "CycloneDX Maven plugin",
        "version" : "2.7.9",
        "hashes" : [
          {
            "alg" : "MD5",
            "content" : "8e595cdb67f17e4b41e046456970591d"
          },
          {
            "alg" : "SHA-1",
            "content" : "69e8ca804520d09ce4657e7235bae84d01cbffa6"
          },
          {
            "alg" : "SHA-256",
            "content" : "aa09074fe5aa403c008cd4fc7ef8ce41cd244489337f16b3e91a3914158a4db8"
          },
          {
            "alg" : "SHA-512",
            "content" : "1488a8112da8e675813d7585f57c5efb178aed32901118186ee12d0e4ae3d19c53774c7f860bf70d17d70f050119b69443a2637cf641675b4b5d9cdcdd69b89b"
          },
          {
            "alg" : "SHA-384",
            "content" : "b097295dfbf10887abc6eec58d4d0822cde5a73d1f5c1cf183a57bf569016ad5ced9d34efae3e574d82bb62837540c6c"
          },
          {
            "alg" : "SHA3-384",
            "content" : "289f9520bd73a2031276248a6ef8f0891c691062c2d1ea86a2bc9ea8db2c52377d92a53be9957179e71aee3deda26a8c"
          },
          {
            "alg" : "SHA3-256",
            "content" : "32b50a7efe5d491a4039c0017eca3cf49d98b55fc66d06b3dd06209487323474"
          },
          {
            "alg" : "SHA3-512",
            "content" : "1daf813da53e5d5cda4d0302ff3a5e388aa45d96ebe6dcbe240f35d33f14b1e6390f6bbe7f21f3ed8cf96ebd9f5516a08b18487b7339715109c81cebfc1563df"
          }
        ]
      }
    ],
    "component" : {
      "publisher" : "Eclipse Foundation",
      "group" : "jakarta.platform",
      "name" : "jakarta.jakartaee-web-api",
      "version" : "10.0.0",
      "description" : "Jakarta EE Web Profile API",
      "licenses" : [
        {
          "license" : {
            "id" : "EPL-2.0"
          }
        },
        {
          "license" : {
            "name" : "GNU General Public License, version 2 with the GNU Classpath Exception",
            "url" : "https://www.gnu.org/software/classpath/license.html"
          }
        }
      ],
      "purl" : "pkg:maven/jakarta.platform/jakarta.jakartaee-web-api@10.0.0?type=jar",
      "externalReferences" : [
        {
          "type" : "website",
          "url" : "https://projects.eclipse.org/projects/ee4j/jakartaee-api-parent/jakarta.jakartaee-web-api"
        },
        {
          "type" : "distribution",
          "url" : "https://jakarta.oss.sonatype.org/service/local/staging/deploy/maven2/"
        },
        {
          "type" : "issue-tracker",
          "url" : "https://github.com/eclipse-ee4j/ee4j/issues"
        },
        {
          "type" : "mailing-list",
          "url" : "https://dev.eclipse.org/mhonarc/lists/jakarta.ee-community/"
        },
        {
          "type" : "vcs",
          "url" : "https://github.com/eclipse-ee4j/ee4j/jakartaee-api-parent/jakarta.jakartaee-web-api"
        }
      ],
      "type" : "library",
      "bom-ref" : "pkg:maven/jakarta.platform/jakarta.jakartaee-web-api@10.0.0?type=jar"
    },
    "properties" : [
      {
        "name" : "maven.goal",
        "value" : "makeAggregateBom"
      },
      {
        "name" : "maven.scopes",
        "value" : "compile,provided,runtime,system,test"
      }
    ]
  },
  "components" : [
    {
      "publisher" : "Eclipse Foundation",
      "group" : "jakarta.servlet",
      "name" : "jakarta.servlet-api",
      "version" : "6.0.0",
      "description" : "Eclipse Enterprise for Java (EE4J) is an open source initiative to create standard APIs, implementations of those APIs, and technology compatibility kits for Java runtimes that enable development, deployment, and management of server-side and cloud-native applications.",
      "scope" : "required",
      "hashes" : [
        {
          "alg" : "MD5",
          "content" : "4bcb3175ed9b7aa3f038d082879ec2a8"
        },
        {
          "alg" : "SHA-1",
          "content" : "abecc699286e65035ebba9844c03931357a6a963"
        },
        {
          "alg" : "SHA-256",
          "content" : "c034eb1afb158987dbb53a5fea0cadf611c8dae8daadd59c44d9d5ab70129cef"
        },
        {
          "alg" : "SHA-512",
          "content" : "b810ce040ed0671a3161fb197845f3ae750cd38c474ef54c351b7b127ff3b4d624a26c33450c62474f42c1cde21c65324cda63b1b3ea0515a286e0bcb0c0c9d5"
        },
        {
          "alg" : "SHA-384",
          "content" : "2f02e56f5b0a3a7191b6cea6e3b872d8d29503299751c6dabfdf4d61b1ae2b431be9c13801083cd6e516b8f52ab38a95"
        },
        {
          "alg" : "SHA3-384",
          "content" : "373855d3aef3be1d54046c33d76daa0a3db62b04e0bfa5957670f17ede4f74426b9d858159e67eb6abc723278f272c23"
        },
        {
          "alg" : "SHA3-256",
          "content" : "cb8c3221eb78148915a75489df9d25665cd41b8949ede82c5ee7a792b1b32fe0"
        },
        {
          "alg" : "SHA3-512",
          "content" : "689137c5de2c0972392e181a4f03e5a1b3f839238839a28442da9aa91f4e5c2980eb48a0107c0fbcd2d35a44ab8a4d698fa197e0dadf264f3e547043fc15dba3"
        }
      ],
      "licenses" : [
        {
          "license" : {
            "id" : "EPL-2.0"
          }
        },
        {
          "license" : {
            "id" : "GPL-2.0-with-classpath-exception"
          }
        }
      ],
      "purl" : "pkg:maven/jakarta.servlet/jakarta.servlet-api@6.0.0?type=jar",
      "externalReferences" : [
        {
          "type" : "website",
          "url" : "https://projects.eclipse.org/projects/ee4j.servlet"
        },
        {
          "type" : "distribution",
          "url" : "https://jakarta.oss.sonatype.org/service/local/staging/deploy/maven2/"
        },
        {
          "type" : "issue-tracker",
          "url" : "https://github.com/eclipse-ee4j/servlet-api/issues"
        },
        {
          "type" : "mailing-list",
          "url" : "https://dev.eclipse.org/mhonarc/lists/servlet-dev"
        },
        {
          "type" : "vcs",
          "url" : "https://github.com/eclipse-ee4j/servlet-api"
        }
      ],
      "type" : "library",
      "bom-ref" : "pkg:maven/jakarta.servlet/jakarta.servlet-api@6.0.0?type=jar"
    },
    {
      "publisher" : "Eclipse Foundation",
      "group" : "jakarta.servlet.jsp",
      "name" : "jakarta.servlet.jsp-api",
      "version" : "3.1.0",
      "description" : "Jakarta Server Pages API",
      "scope" : "required",
      "hashes" : [
        {
          "alg" : "MD5",
          "content" : "35639b39bddce662412f7eec420bbd67"
        },
        {
          "alg" : "SHA-1",
          "content" : "ea5fe947c87c9603db997f708587270593164a1e"
        },
        {
          "alg" : "SHA-256",
          "content" : "e957621ce4ea693a441fc8cebddc82239167afaaafa64d0d759bd78eb01237a9"
        },
        {
          "alg" : "SHA-512",
          "content" : "6a089fa799b0c2d13fb3ffebdf30105fc13b0b4d2f7899f526872789e150828f756235aebdb35b3b6040bc873ca9661aa305bacb2bd15c43e53321fe92abf9e9"
        },
        {
          "alg" : "SHA-384",
          "content" : "8cab5fe1d1014730c4a5d9ec561611b3f1deea057b6bfc2cee3d410c341ea10e5759ee5f08dfdf4ec14d34d19533cba0"
        },
        {
          "alg" : "SHA3-384",
          "content" : "a6540735a67a92ad15f5294146c9419355dce254235004c23ac3d7ce2cc20d01fac7446d7220061d6aa5fe0b6855819d"
        },
        {
          "alg" : "SHA3-256",
          "content" : "b9d9cbea0a432f4ea51db8201bd9a660ef3fefb87467a2baa66157ae69eac596"
        },
        {
          "alg" : "SHA3-512",
          "content" : "156e3810c32c85d9cbf9791d9219ee5ac9e2906eed952f99f05ec60f485021cd2fcebf0f9952ba8c21c1d08c2b06f2c99535145a912316bd7dc6c1b4525bfd11"
        }
      ],
      "licenses" : [
        {
          "license" : {
            "id" : "EPL-2.0"
          }
        },
        {
          "license" : {
            "name" : "GNU General Public License, version 2 with the GNU Classpath Exception",
            "url" : "https://www.gnu.org/software/classpath/license.html"
          }
        }
      ],
      "purl" : "pkg:maven/jakarta.servlet.jsp/jakarta.servlet.jsp-api@3.1.0?type=jar",
      "externalReferences" : [
        {
          "type" : "website",
          "url" : "https://projects.eclipse.org/projects/ee4j.jsp"
        },
        {
          "type" : "distribution",
          "url" : "https://jakarta.oss.sonatype.org/service/local/staging/deploy/maven2/"
        },
        {
          "type" : "issue-tracker",
          "url" : "https://github.com/eclipse-ee4j/jsp-api/issues"
        },
        {
          "type" : "mailing-list",
          "url" : "https://dev.eclipse.org/mhonarc/lists/jsp-dev"
        },
        {
          "type" : "vcs",
          "url" : "https://github.com/eclipse-ee4j/jsp-api"
        }
      ],
      "type" : "library",
      "bom-ref" : "pkg:maven/jakarta.servlet.jsp/jakarta.servlet.jsp-api@3.1.0?type=jar"
    },
    {
      "publisher" : "Eclipse Foundation",
      "group" : "jakarta.el",
      "name" : "jakarta.el-api",
      "version" : "5.0.1",
      "description" : "Jakarta Expression Language defines an expression language for Java applications",
      "scope" : "required",
      "hashes" : [
        {
          "alg" : "MD5",
          "content" : "fcc2c22f90c0d8d80ca73b171d695539"
        },
        {
          "alg" : "SHA-1",
          "content" : "6f46fb9143b18b7956806a657275fc41376d1a50"
        },
        {
          "alg" : "SHA-256",
          "content" : "90432d18281717b363b819978c6a172433a2654b77eb87c863c22fc19c20eced"
        },
        {
          "alg" : "SHA-512",
          "content" : "3246917cd93b5d115a4af7acc815f645670abf70e08d2d1790feb983ed844bae78035168ec578c3cfc1bed463695db8539ed2e8288fff4aef64fb0429624620c"
        },
        {
          "alg" : "SHA-384",
          "content" : "05c51f4b57bdd4f56a1f0cfa5ce7927a40d960b3f6e0cb588e410a029e47ef23f9bf208441ddccaab7a08e1d68e121e0"
        },
        {
          "alg" : "SHA3-384",
          "content" : "cfbd7724885c804d11760498ea02c2739d2995cbd9b78743daf5a0abe441952bf022e7f84168cd1065d16cec93912d43"
        },
        {
          "alg" : "SHA3-256",
          "content" : "deacf23b56f75b78bd7ed36eca74e3ea66008b0d4f6b235bb8bbe980e415624b"
        },
        {
          "alg" : "SHA3-512",
          "content" : "bfd7d0d080bc261a836e70a8eb53cfdeb24d9d76a8b88470f96ddb30ce90ef2660cff190371049f0d74f9d137d11a99e609956ffc0524a6636fe3f800705ab6b"
        }
      ],
      "licenses" : [
        {
          "license" : {
            "id" : "EPL-2.0"
          }
        },
        {
          "license" : {
            "name" : "GNU General Public License, version 2 with the GNU Classpath Exception",
            "url" : "https://www.gnu.org/software/classpath/license.html"
          }
        }
      ],
      "purl" : "pkg:maven/jakarta.el/jakarta.el-api@5.0.1?type=jar",
      "externalReferences" : [
        {
          "type" : "website",
          "url" : "https://projects.eclipse.org/projects/ee4j.el"
        },
        {
          "type" : "distribution",
          "url" : "https://jakarta.oss.sonatype.org/service/local/staging/deploy/maven2/"
        },
        {
          "type" : "issue-tracker",
          "url" : "https://github.com/eclipse-ee4j/el-ri/issues"
        },
        {
          "type" : "mailing-list",
          "url" : "https://dev.eclipse.org/mhonarc/lists/el-dev"
        },
        {
          "type" : "vcs",
          "url" : "https://github.com/eclipse-ee4j/el-ri"
        }
      ],
      "type" : "library",
      "bom-ref" : "pkg:maven/jakarta.el/jakarta.el-api@5.0.1?type=jar"
    },
    {
      "publisher" : "Eclipse Foundation",
      "group" : "jakarta.servlet.jsp.jstl",
      "name" : "jakarta.servlet.jsp.jstl-api",
      "version" : "3.0.0",
      "description" : "Jakarta Standard Tag Library API",
      "scope" : "required",
      "hashes" : [
        {
          "alg" : "MD5",
          "content" : "ad1701f9eab91908e8344b8d5afda34b"
        },
        {
          "alg" : "SHA-1",
          "content" : "8ace30b09ce88dc6f19d4f59251cc83a23cc180a"
        },
        {
          "alg" : "SHA-256",
          "content" : "f244245440772c1502b09d6511c0e15e53d42f21a3a9dccdf96a955a758a92bd"
        },
        {
          "alg" : "SHA-512",
          "content" : "6ce614ad1892b80444cb7567f78344a0dfaa87d75f01f92806413b326aa16c61f812cf8d4b7642df1728f0f6e1c0a57c3c493e030409e413dc30a0a9bdf172d9"
        },
        {
          "alg" : "SHA-384",
          "content" : "07150c5d698f9a6c60a421866df2d8907e85a9af8b22681276c4f3d4e30a1bd428def8cdc73446befecaa656e31e59d3"
        },
        {
          "alg" : "SHA3-384",
          "content" : "b7c943073313ea0593f7c94f0736e2b96bfdb493d447a86a7d9801fcda87a5bddca05820ecad38eb08851ede6c763dba"
        },
        {
          "alg" : "SHA3-256",
          "content" : "71bb618cbe3aa7cd735dd6609c484ad38ae93742a2dcba329143ee8732aa26f4"
        },
        {
          "alg" : "SHA3-512",
          "content" : "173c93c953bb3f62032748b617169db9c5dfe3a9a986967be39fa96d0ded0799ab1e5fdf76199cf2ae0654ef2f1ef348743dc0bec33ce57f5672fc4b547d35bd"
        }
      ],
      "licenses" : [
        {
          "license" : {
            "id" : "EPL-2.0"
          }
        },
        {
          "license" : {
            "id" : "GPL-2.0-with-classpath-exception"
          }
        }
      ],
      "purl" : "pkg:maven/jakarta.servlet.jsp.jstl/jakarta.servlet.jsp.jstl-api@3.0.0?type=jar",
      "externalReferences" : [
        {
          "type" : "website",
          "url" : "https://projects.eclipse.org/projects/ee4j.jstl"
        },
        {
          "type" : "distribution",
          "url" : "https://jakarta.oss.sonatype.org/service/local/staging/deploy/maven2/"
        },
        {
          "type" : "issue-tracker",
          "url" : "https://github.com/eclipse-ee4j/jstl-api/issues"
        },
        {
          "type" : "mailing-list",
          "url" : "https://dev.eclipse.org/mhonarc/lists/jstl-dev"
        },
        {
          "type" : "vcs",
          "url" : "https://github.com/eclipse-ee4j/jstl-api"
        }
      ],
      "type" : "library",
      "bom-ref" : "pkg:maven/jakarta.servlet.jsp.jstl/jakarta.servlet.jsp.jstl-api@3.0.0?type=jar"
    },
    {
      "group" : "jakarta.faces",
      "name" : "jakarta.faces-api",
      "version" : "4.0.1",
      "description" : "Jakarta Faces defines an MVC framework for building user interfaces for web applications, including UI components, state management, event handing, input validation, page navigation, and support for internationalization and accessibility.",
      "scope" : "required",
      "hashes" : [
        {
          "alg" : "MD5",
          "content" : "c1f727e6229c71e0f931d31326d77321"
        },
        {
          "alg" : "SHA-1",
          "content" : "c000786f025a6c09b26dbb8288a4c73452a679ac"
        },
        {
          "alg" : "SHA-256",
          "content" : "8b657d23c741d08cd9ea175b985b4de45cc5021e540a74a9c3377dca21f2e627"
        },
        {
          "alg" : "SHA-512",
          "content" : "85d93cf6be7d61a3bcdb7572f9ec28a0729d6645f6a4d1ab13a81a76e83f9055da95d009c815ade21cc3879d98205bb006e8d8eee1a008abf65f65d25b49dbdc"
        },
        {
          "alg" : "SHA-384",
          "content" : "62b46475404672d52cc48c098094c63f16857570ddbb6eaf9bf55c5e86b37cad90b5499a16366d1ab064f3e00a9c721b"
        },
        {
          "alg" : "SHA3-384",
          "content" : "317abb29a419ab9d84340b55d63ec8fb1c1851e02485f9eb2f91d310145fbf00a674cd50d39f204fbf94efde58dc7fcc"
        },
        {
          "alg" : "SHA3-256",
          "content" : "9b190ff27992da5e08090f8847d0932ef3fa3f44ed5f74caf3a3b689d01be9e7"
        },
        {
          "alg" : "SHA3-512",
          "content" : "08f28537fda47b80416c1b92a0d13ff59e72a9037dc5108bcaeda30da7eebb8247675dcf8710ec48f0c02641e2abb55389c141b5dbc09b80db2bd2b1612b37c0"
        }
      ],
      "licenses" : [
        {
          "license" : {
            "id" : "EPL-2.0"
          }
        },
        {
          "license" : {
            "id" : "GPL-2.0-with-classpath-exception"
          }
        }
      ],
      "purl" : "pkg:maven/jakarta.faces/jakarta.faces-api@4.0.1?type=jar",
      "externalReferences" : [
        {
          "type" : "website",
          "url" : "https://github.com/eclipse-ee4j/faces-api"
        },
        {
          "type" : "vcs",
          "url" : "https://github.com/eclipse-ee4j/ee4j/jakarta.faces-api"
        }
      ],
      "type" : "library",
      "bom-ref" : "pkg:maven/jakarta.faces/jakarta.faces-api@4.0.1?type=jar"
    },
    {
      "publisher" : "Eclipse Foundation",
      "group" : "jakarta.ws.rs",
      "name" : "jakarta.ws.rs-api",
      "version" : "3.1.0",
      "description" : "Jakarta RESTful Web Services",
      "scope" : "required",
      "hashes" : [
        {
          "alg" : "MD5",
          "content" : "6ce4c6749e048456b2c452c1091689ca"
        },
        {
          "alg" : "SHA-1",
          "content" : "15ce10d249a38865b58fc39521f10f29ab0e3363"
        },
        {
          "alg" : "SHA-256",
          "content" : "6b3b3628b8b4aedda0d24c3354335e985497d8ef3c510b8f3028e920d5b8663d"
        },
        {
          "alg" : "SHA-512",
          "content" : "55c245378d7529503c934d2132cfc3bcc638f6297eae6687ae419a5b57aa4646f771cf054295fb6cda1f6d89134942c2a2c39f47380be839e26b44884e4bb75c"
        },
        {
          "alg" : "SHA-384",
          "content" : "aa6baaa80978a53fdb4af8e07559a955c9828266ec9b41562b7a2583a1d8d760726d66c13d61f0ec0282220d65d4c1b9"
        },
        {
          "alg" : "SHA3-384",
          "content" : "76ae6e43291bef5f40196d2063886d4d73b71401918c002cd2e54d260a9171287d12a61a19ab950a512aebfc53a42b31"
        },
        {
          "alg" : "SHA3-256",
          "content" : "2594beb0318ed800cf3e6de629ac40d2900b2fe25cdbc4982de00ade189b6100"
        },
        {
          "alg" : "SHA3-512",
          "content" : "40e976ea3f3d1b9a568231cf156f388be585d6afcf30ade6abb9841969cb86a2e537db87678a03e3ea04049114879db8f897fe0a6f9f815df31a1cc3d0c9e089"
        }
      ],
      "licenses" : [
        {
          "license" : {
            "id" : "EPL-2.0",
            "url" : "https://www.eclipse.org/legal/epl-2.0"
          }
        },
        {
          "license" : {
            "id" : "GPL-2.0-with-classpath-exception",
            "url" : "https://www.gnu.org/software/classpath/license.html"
          }
        }
      ],
      "purl" : "pkg:maven/jakarta.ws.rs/jakarta.ws.rs-api@3.1.0?type=jar",
      "externalReferences" : [
        {
          "type" : "website",
          "url" : "https://github.com/eclipse-ee4j/jaxrs-api"
        },
        {
          "type" : "distribution",
          "url" : "https://jakarta.oss.sonatype.org/service/local/staging/deploy/maven2/"
        },
        {
          "type" : "issue-tracker",
          "url" : "https://github.com/eclipse-ee4j/jaxrs-api/issues"
        },
        {
          "type" : "mailing-list",
          "url" : "jaxrs-dev@eclipse.org"
        },
        {
          "type" : "vcs",
          "url" : "https://github.com/eclipse-ee4j/jaxrs-api"
        }
      ],
      "type" : "library",
      "bom-ref" : "pkg:maven/jakarta.ws.rs/jakarta.ws.rs-api@3.1.0?type=jar"
    },
    {
      "publisher" : "Eclipse Foundation",
      "group" : "jakarta.websocket",
      "name" : "jakarta.websocket-api",
      "version" : "2.1.0",
      "description" : "Jakarta WebSocket - Server API",
      "scope" : "required",
      "hashes" : [
        {
          "alg" : "MD5",
          "content" : "05cdae5acc6e53e596faa14176fff107"
        },
        {
          "alg" : "SHA-1",
          "content" : "9b2b5363ead21c4480e37ec15378583e11d3a823"
        },
        {
          "alg" : "SHA-256",
          "content" : "2f0603daaed334389906ef585003fd877221413a7e55a47771588a50bb4ef01a"
        },
        {
          "alg" : "SHA-512",
          "content" : "2666f0a42536f65bec00d4dcb044ad0be7bc09ef1ee1070b7aca5809d2af1fcc1ec44c4f23ce93badf40897cf38505e5424af86d42c0a55418ea7f41aa96de9e"
        },
        {
          "alg" : "SHA-384",
          "content" : "418bc9a2a92c1cfa95befbc857a270de8509b31e6a9905f0b9b61ca412415839ad54618bbeee61c782260b21dc9ee152"
        },
        {
          "alg" : "SHA3-384",
          "content" : "a8f1c8de08f5778e1743d91135946233e493554af8d4b7ec6786fa6a7f8abf09c41707868fb8d8f8298363e3e7b2ad72"
        },
        {
          "alg" : "SHA3-256",
          "content" : "03585eeed9f0e80e26edbd2bf48950125020b609c455222a1825e7ab0ade7b9f"
        },
        {
          "alg" : "SHA3-512",
          "content" : "1b64f0a1623d6fa5ac9a604753817a0bff786e9c589c94e6cc337e3e68eb2df153d3c8a0586059311259d710f34fc1b8f59ddb709833bd35e2892b4cd53a57e6"
        }
      ],
      "licenses" : [
        {
          "license" : {
            "id" : "EPL-2.0"
          }
        },
        {
          "license" : {
            "name" : "GNU General Public License, version 2 with the GNU Classpath Exception",
            "url" : "https://www.gnu.org/software/classpath/license.html"
          }
        }
      ],
      "purl" : "pkg:maven/jakarta.websocket/jakarta.websocket-api@2.1.0?type=jar",
      "externalReferences" : [
        {
          "type" : "website",
          "url" : "https://projects.eclipse.org/projects/ee4j.websocket"
        },
        {
          "type" : "distribution",
          "url" : "https://jakarta.oss.sonatype.org/service/local/staging/deploy/maven2/"
        },
        {
          "type" : "issue-tracker",
          "url" : "https://github.com/eclipse-ee4j/websocket-api/issues"
        },
        {
          "type" : "mailing-list",
          "url" : "https://dev.eclipse.org/mhonarc/lists/websocket-dev"
        },
        {
          "type" : "vcs",
          "url" : "https://github.com/eclipse-ee4j/websocket-api/jakarta.websocket-api"
        }
      ],
      "type" : "library",
      "bom-ref" : "pkg:maven/jakarta.websocket/jakarta.websocket-api@2.1.0?type=jar"
    },
    {
      "publisher" : "Eclipse Foundation",
      "group" : "jakarta.websocket",
      "name" : "jakarta.websocket-client-api",
      "version" : "2.1.0",
      "description" : "Jakarta WebSocket - Client API",
      "scope" : "required",
      "hashes" : [
        {
          "alg" : "MD5",
          "content" : "0ff98843ff4a6b9af51cac2d32719ffb"
        },
        {
          "alg" : "SHA-1",
          "content" : "ac185d7945d4c0a501b79ae003d9f8d9a1ae7eff"
        },
        {
          "alg" : "SHA-256",
          "content" : "853b5b5c7544c5289c5db038873da9be5970eef8ec9445bf66c00a09693cda89"
        },
        {
          "alg" : "SHA-512",
          "content" : "cf9934f7163f0b8736b7bbe4aee31ba210e03b50308db2e39258dd1db5112c89d9eb116fbde958334bdfb0c02343291bd37e0e0e907690073f68fad516179a68"
        },
        {
          "alg" : "SHA-384",
          "content" : "d6965d2b803c1cd4f2a03e9965338640e3af51c01a2597b48e1f9c4a7a45d47cffd50c3ab6d9d29e77f82e8a783de047"
        },
        {
          "alg" : "SHA3-384",
          "content" : "4199fb1d245cf413d11c240066db6877d839eec6eb4edffc16f8985ab6c703cc9a51b6a4dfb6c43e7e2cfcafd5d4425e"
        },
        {
          "alg" : "SHA3-256",
          "content" : "98177271b337c82473a3f5d119f24e478e08fa26d049a039f760a9cb6cb45683"
        },
        {
          "alg" : "SHA3-512",
          "content" : "4328303fb9327a0ad8892003db77b00035e0e95f835cb96a044144d5f5123389685793b7c89191ee349072135a87d6511b6cf580c7d2650ea37fe80d8edf4905"
        }
      ],
      "licenses" : [
        {
          "license" : {
            "id" : "EPL-2.0"
          }
        },
        {
          "license" : {
            "name" : "GNU General Public License, version 2 with the GNU Classpath Exception",
            "url" : "https://www.gnu.org/software/classpath/license.html"
          }
        }
      ],
      "purl" : "pkg:maven/jakarta.websocket/jakarta.websocket-client-api@2.1.0?type=jar",
      "externalReferences" : [
        {
          "type" : "website",
          "url" : "https://projects.eclipse.org/projects/ee4j.websocket"
        },
        {
          "type" : "distribution",
          "url" : "https://jakarta.oss.sonatype.org/service/local/staging/deploy/maven2/"
        },
        {
          "type" : "issue-tracker",
          "url" : "https://github.com/eclipse-ee4j/websocket-api/issues"
        },
        {
          "type" : "mailing-list",
          "url" : "https://dev.eclipse.org/mhonarc/lists/websocket-dev"
        },
        {
          "type" : "vcs",
          "url" : "https://github.com/eclipse-ee4j/websocket-api/jakarta.websocket-client-api"
        }
      ],
      "type" : "library",
      "bom-ref" : "pkg:maven/jakarta.websocket/jakarta.websocket-client-api@2.1.0?type=jar"
    },
    {
      "publisher" : "Eclipse Foundation",
      "group" : "jakarta.json",
      "name" : "jakarta.json-api",
      "version" : "2.1.0",
      "description" : "Jakarta JSON Processing defines a Java(R) based framework for parsing, generating, transforming, and querying JSON documents.",
      "scope" : "required",
      "hashes" : [
        {
          "alg" : "MD5",
          "content" : "1279d8783f4a03345baf05cca23a298a"
        },
        {
          "alg" : "SHA-1",
          "content" : "1e713a9cd9ea9bd4dc6ec263d47e1b7f1cf18082"
        },
        {
          "alg" : "SHA-256",
          "content" : "01663e555ab3d0a5d082c9763e3ef739ca48dae3a40bc8bf526b0725b7213257"
        },
        {
          "alg" : "SHA-512",
          "content" : "dce971d9bae9e5a20a4865ceec866ef93742524b48dbd3a0b8d259bb18ceef03ad25f621c9b03a51ee74eca119f4a962d77c475143b7b8a1026973e2d9abbfbe"
        },
        {
          "alg" : "SHA-384",
          "content" : "17a8512e6c78112c8db8e1817fd787b8f48f4938febca8b3757696e8ab2a7959572ce3e286933bb6ec602b983ad1dce7"
        },
        {
          "alg" : "SHA3-384",
          "content" : "01137d2b0c3f880d9d77f175f0cca6198ea8ab9549f0b7c50cb275a07ef57514018b6c474e7e2cc12afc486cc7273917"
        },
        {
          "alg" : "SHA3-256",
          "content" : "2970f253fd2182f2581fa8f09350def7d5ad7bbda5a6b093b0f235c4ae9ba69b"
        },
        {
          "alg" : "SHA3-512",
          "content" : "b6d0a39a339ff363a0643f48945217945c7eab3b6275e31739cdf4623fc90c9aacf428384e71365031f9d7d10a30da01d2b33466ab067d7b6640b447c72b532b"
        }
      ],
      "licenses" : [
        {
          "license" : {
            "id" : "EPL-2.0",
            "url" : "https://www.eclipse.org/legal/epl-2.0"
          }
        },
        {
          "license" : {
            "name" : "GNU General Public License, version 2 with the GNU Classpath Exception",
            "url" : "https://projects.eclipse.org/license/secondary-gpl-2.0-cp"
          }
        }
      ],
      "purl" : "pkg:maven/jakarta.json/jakarta.json-api@2.1.0?type=jar",
      "externalReferences" : [
        {
          "type" : "website",
          "url" : "https://github.com/eclipse-ee4j/jsonp"
        },
        {
          "type" : "distribution",
          "url" : "https://jakarta.oss.sonatype.org/service/local/staging/deploy/maven2/"
        },
        {
          "type" : "issue-tracker",
          "url" : "https://github.com/eclipse-ee4j/ee4j/issues"
        },
        {
          "type" : "mailing-list",
          "url" : "https://dev.eclipse.org/mhonarc/lists/jakarta.ee-community/"
        },
        {
          "type" : "vcs",
          "url" : "https://github.com/eclipse-ee4j/jsonp"
        }
      ],
      "type" : "library",
      "bom-ref" : "pkg:maven/jakarta.json/jakarta.json-api@2.1.0?type=jar"
    },
    {
      "publisher" : "Eclipse Foundation",
      "group" : "jakarta.json.bind",
      "name" : "jakarta.json.bind-api",
      "version" : "3.0.0",
      "description" : "Jakarta JSON Binding is a standard binding layer for converting Java objects to/from JSON documents.",
      "scope" : "required",
      "hashes" : [
        {
          "alg" : "MD5",
          "content" : "e109d36b85d6398df559fe3166846029"
        },
        {
          "alg" : "SHA-1",
          "content" : "9dab3b7d91ed6b22f7c76cc3674805482247af32"
        },
        {
          "alg" : "SHA-256",
          "content" : "da50834db61a045cee742b8828cbb2c4073b65debe74db47d2855391d2ca9553"
        },
        {
          "alg" : "SHA-512",
          "content" : "f47e71f1b105bba96030abb625f98ed1c5d0aa2a8ab8c187741fabc2f8b4870dd260d6aa79f6db8f27de3ce99ef27436a897e0d5704e43e73794479e7c0989d6"
        },
        {
          "alg" : "SHA-384",
          "content" : "b82d93f0a6292e29720d370030c83c3303824c3515ab1017e7039a6e0ae7333e18f55d1c1e80b212294edc10fdcaac5f"
        },
        {
          "alg" : "SHA3-384",
          "content" : "e82aaa5d4e6e5c01ea79ec7f4f07d31044348af8721be5efb1d28d6c0a0da84d0e983a6c91e73e58ab104a5dee58f565"
        },
        {
          "alg" : "SHA3-256",
          "content" : "ee623c6450f0f24b09086efac03674769b2f7c03254cbd7a3f8849c8e63f02c1"
        },
        {
          "alg" : "SHA3-512",
          "content" : "ce77e4e1e464be544f531289e1e601c1e9b48e10472ac60d388a2500d423c62d7703325c2fd2792ae9308b0cf33d3255d60300848b5aaf1bdb9345e3b516cfdc"
        }
      ],
      "licenses" : [
        {
          "license" : {
            "id" : "EPL-2.0",
            "url" : "https://www.eclipse.org/legal/epl-2.0"
          }
        },
        {
          "license" : {
            "name" : "GNU General Public License, version 2 with the GNU Classpath Exception",
            "url" : "https://projects.eclipse.org/license/secondary-gpl-2.0-cp"
          }
        }
      ],
      "purl" : "pkg:maven/jakarta.json.bind/jakarta.json.bind-api@3.0.0?type=jar",
      "externalReferences" : [
        {
          "type" : "website",
          "url" : "https://eclipse-ee4j.github.io/jsonb-api"
        },
        {
          "type" : "distribution",
          "url" : "https://jakarta.oss.sonatype.org/service/local/staging/deploy/maven2/"
        },
        {
          "type" : "issue-tracker",
          "url" : "https://github.com/eclipse-ee4j/jsonb-api/issues"
        },
        {
          "type" : "mailing-list",
          "url" : "jsonb-dev@eclipse.org"
        },
        {
          "type" : "vcs",
          "url" : "https://github.com/eclipse-ee4j/jsonb-api"
        }
      ],
      "type" : "library",
      "bom-ref" : "pkg:maven/jakarta.json.bind/jakarta.json.bind-api@3.0.0?type=jar"
    },
    {
      "publisher" : "Eclipse Foundation",
      "group" : "jakarta.annotation",
      "name" : "jakarta.annotation-api",
      "version" : "2.1.1",
      "description" : "Jakarta Annotations API",
      "scope" : "required",
      "hashes" : [
        {
          "alg" : "MD5",
          "content" : "5dac2f68e8288d0add4dc92cb161711d"
        },
        {
          "alg" : "SHA-1",
          "content" : "48b9bda22b091b1f48b13af03fe36db3be6e1ae3"
        },
        {
          "alg" : "SHA-256",
          "content" : "5f65fdaf424eee2b55e1d882ba9bb376be93fb09b37b808be6e22e8851c909fe"
        },
        {
          "alg" : "SHA-512",
          "content" : "eabe8b855b735663684052ec4cc357cc737936fa57cebf144eb09f70b3b6c600db7fa6f1c93a4f36c5994b1b37dad2dfcec87a41448872e69552accfd7f52af6"
        },
        {
          "alg" : "SHA-384",
          "content" : "798597a6b80b423844d70609c54b00d725a357031888da7e5c3efd3914d1770be69aa7135de13ddb89a4420a5550e35b"
        },
        {
          "alg" : "SHA3-384",
          "content" : "9629b8ca82f61674f5573723bbb3c137060e1442062eb52fa9c90fc8f57ea7d836eb2fb765d160ec8bf300bcb6b820be"
        },
        {
          "alg" : "SHA3-256",
          "content" : "f71ffc2a2c2bd1a00dfc00c4be67dbe5f374078bd50d5b24c0b29fbcc6634ecb"
        },
        {
          "alg" : "SHA3-512",
          "content" : "aa4e29025a55878db6edb0d984bd3a0633f3af03fa69e1d26c97c87c6d29339714003c96e29ff0a977132ce9c2729d0e27e36e9e245a7488266138239bdba15e"
        }
      ],
      "licenses" : [
        {
          "license" : {
            "id" : "EPL-2.0"
          }
        },
        {
          "license" : {
            "id" : "GPL-2.0-with-classpath-exception"
          }
        }
      ],
      "purl" : "pkg:maven/jakarta.annotation/jakarta.annotation-api@2.1.1?type=jar",
      "externalReferences" : [
        {
          "type" : "website",
          "url" : "https://projects.eclipse.org/projects/ee4j.ca"
        },
        {
          "type" : "distribution",
          "url" : "https://jakarta.oss.sonatype.org/service/local/staging/deploy/maven2/"
        },
        {
          "type" : "issue-tracker",
          "url" : "https://github.com/eclipse-ee4j/common-annotations-api/issues"
        },
        {
          "type" : "mailing-list",
          "url" : "https://dev.eclipse.org/mhonarc/lists/ca-dev"
        },
        {
          "type" : "vcs",
          "url" : "https://github.com/eclipse-ee4j/common-annotations-api"
        }
      ],
      "type" : "library",
      "bom-ref" : "pkg:maven/jakarta.annotation/jakarta.annotation-api@2.1.1?type=jar"
    },
    {
      "publisher" : "Eclipse Foundation",
      "group" : "jakarta.ejb",
      "name" : "jakarta.ejb-api",
      "version" : "4.0.1",
      "description" : "Jakarta Enterprise Beans API",
      "scope" : "required",
      "hashes" : [
        {
          "alg" : "MD5",
          "content" : "1e506e2052807570f819df6ff3f69fef"
        },
        {
          "alg" : "SHA-1",
          "content" : "70f6c55dad415f58b8428ae4bb215484368b8764"
        },
        {
          "alg" : "SHA-256",
          "content" : "46ca52e9a1df47012ebcccb5319b5709f5b0c7214f954f3337e6edd2dfe6cb15"
        },
        {
          "alg" : "SHA-512",
          "content" : "a7c262fb3021a1e576dd712c1a4992dd46baa305f36994aefd752900cb39103d794c3846bff224325d2e12e3173cc1f9c7a8f6c82d3e9b987db1b9d849631432"
        },
        {
          "alg" : "SHA-384",
          "content" : "93758f01dc9348734183b4cc4554770d291f5af6c495355a397d0318b30dc9c82ec071f60d96ede596c7c6697b3775c1"
        },
        {
          "alg" : "SHA3-384",
          "content" : "23d6dd4e2a2809c0be12b3c172e3ffbded40b7d9855e9262fda278a0b574b8a2936dcf0019bc33cd3cac7ca0cffc7316"
        },
        {
          "alg" : "SHA3-256",
          "content" : "f914c1686e5a501b179ebf49da900661454e08a69fe73dbca1ba71bcef7e6612"
        },
        {
          "alg" : "SHA3-512",
          "content" : "8095d021ee374ea61f6e8600d529c099466a7f1b6328ca5906d3b5ebe1cd0c21a953ec3b760d5810e43206f59794a0af0d4f99d33c9f9288a9f379a1cdd4d049"
        }
      ],
      "licenses" : [
        {
          "license" : {
            "id" : "EPL-2.0"
          }
        },
        {
          "license" : {
            "id" : "GPL-2.0-with-classpath-exception"
          }
        }
      ],
      "purl" : "pkg:maven/jakarta.ejb/jakarta.ejb-api@4.0.1?type=jar",
      "externalReferences" : [
        {
          "type" : "website",
          "url" : "https://github.com/jakartaee/enterprise-beans"
        },
        {
          "type" : "distribution",
          "url" : "https://jakarta.oss.sonatype.org/service/local/staging/deploy/maven2/"
        },
        {
          "type" : "issue-tracker",
          "url" : "https://github.com/jakartaee/enterprise-beans/issues"
        },
        {
          "type" : "mailing-list",
          "url" : "http://www.eclipse.org/lists/ejb-dev"
        },
        {
          "type" : "vcs",
          "url" : "https://github.com/jakartaee/enterprise-beans"
        }
      ],
      "type" : "library",
      "bom-ref" : "pkg:maven/jakarta.ejb/jakarta.ejb-api@4.0.1?type=jar"
    },
    {
      "publisher" : "EE4J Community",
      "group" : "jakarta.transaction",
      "name" : "jakarta.transaction-api",
      "version" : "2.0.1",
      "description" : "Jakarta Transactions",
      "scope" : "required",
      "hashes" : [
        {
          "alg" : "MD5",
          "content" : "5315974a3935e342b40849478e1c9966"
        },
        {
          "alg" : "SHA-1",
          "content" : "51a520e3fae406abb84e2e1148e6746ce3f80a1a"
        },
        {
          "alg" : "SHA-256",
          "content" : "50c0a7c760c13ae6c042acf182b28f0047413db95b4636fb8879bcffab5ba875"
        },
        {
          "alg" : "SHA-512",
          "content" : "13c1a21af3c8030794155a62b4cdc70ba1d951fbfc0aead9e89f3f529e7bb4473a070bd4a6c593ce1c0cfb781332bd62d21cf0b34e3751f99b0de463f566ec61"
        },
        {
          "alg" : "SHA-384",
          "content" : "9484a0adc05a5ea5377f6037ac2d1efa1d59d172ac03b683580f7d3e542d6e26779128dd1a7fab41f7061156f66c3b44"
        },
        {
          "alg" : "SHA3-384",
          "content" : "064434509905dcaaeebd4e1eaeb26446cb911ff74f30d49e1b0c7f29a0e62fd9f5b84114129ec845eb99cc37cc4b5048"
        },
        {
          "alg" : "SHA3-256",
          "content" : "7d865d16dc3e2a2b7e097a305a33f7fd419ec4dcea2df1e278b66a74e59325bd"
        },
        {
          "alg" : "SHA3-512",
          "content" : "efe99bb4d2397b5d004b7aac679ec2ea0c13ce6c06fdcaec56b12f07d5938ac5f07df2937478b551955382612e2544819ea7f5827e0f6ea2726bbc1643dfdab3"
        }
      ],
      "licenses" : [
        {
          "license" : {
            "id" : "EPL-2.0"
          }
        },
        {
          "license" : {
            "id" : "GPL-2.0-with-classpath-exception"
          }
        }
      ],
      "purl" : "pkg:maven/jakarta.transaction/jakarta.transaction-api@2.0.1?type=jar",
      "externalReferences" : [
        {
          "type" : "website",
          "url" : "https://projects.eclipse.org/projects/ee4j.jta"
        },
        {
          "type" : "distribution",
          "url" : "https://jakarta.oss.sonatype.org/service/local/staging/deploy/maven2/"
        },
        {
          "type" : "issue-tracker",
          "url" : "https://github.com/eclipse-ee4j/jta-api/issues"
        },
        {
          "type" : "mailing-list",
          "url" : "https://dev.eclipse.org/mhonarc/lists/jta-dev/"
        },
        {
          "type" : "vcs",
          "url" : "https://github.com/eclipse-ee4j/jta-api"
        }
      ],
      "type" : "library",
      "bom-ref" : "pkg:maven/jakarta.transaction/jakarta.transaction-api@2.0.1?type=jar"
    },
    {
      "publisher" : "Eclipse Foundation",
      "group" : "jakarta.persistence",
      "name" : "jakarta.persistence-api",
      "version" : "3.1.0",
      "description" : "Eclipse Enterprise for Java (EE4J) is an open source initiative to create standard APIs, implementations of those APIs, and technology compatibility kits for Java runtimes that enable development, deployment, and management of server-side and cloud-native applications.",
      "scope" : "required",
      "hashes" : [
        {
          "alg" : "MD5",
          "content" : "35a1b7dfb38cf44ff795be607b0e6b5b"
        },
        {
          "alg" : "SHA-1",
          "content" : "66901fa1c373c6aff65c13791cc11da72060a8d6"
        },
        {
          "alg" : "SHA-256",
          "content" : "475389446d35c6f46c565728b756dc508c284644ea2690644e0d8e7e339d42fd"
        },
        {
          "alg" : "SHA-512",
          "content" : "5ff83c6ade13eff5ca9daf7cf13bbba46a2c8aec3cc6ae4eea884026a081698d0425d18804147a075459c02480d25c88528a942bee3f6778a1e903a6a1fc8263"
        },
        {
          "alg" : "SHA-384",
          "content" : "4cb763868a36715a04572b9c6d2244edd8c25c11ceda62230f03e3d76e79c138cdeaa7bedc82b157f1dec59e20986e4c"
        },
        {
          "alg" : "SHA3-384",
          "content" : "ab5f8ae2862eaf372ea0f5f0d5ffc4a7849710e7344e1d8c4b8809ef68b929fae6d2334ed9086d56e52f536094c8c929"
        },
        {
          "alg" : "SHA3-256",
          "content" : "5f446cb10eabaa42f6b778b9204171afda6ddb8a0f5ce1d73fca12ff8a30f22e"
        },
        {
          "alg" : "SHA3-512",
          "content" : "b9a03156e740c39dc49f8dbe35c12ff723d2e2a84a99ca79cd0b24f97ec8d99ada2b7d02dc7108a8381e449f7726fb0d186535bd4c0874ef4f8036ef05f075cd"
        }
      ],
      "licenses" : [
        {
          "license" : {
            "id" : "EPL-2.0"
          }
        },
        {
          "license" : {
            "id" : "BSD-3-Clause"
          }
        }
      ],
      "purl" : "pkg:maven/jakarta.persistence/jakarta.persistence-api@3.1.0?type=jar",
      "externalReferences" : [
        {
          "type" : "website",
          "url" : "https://github.com/eclipse-ee4j/jpa-api"
        },
        {
          "type" : "distribution",
          "url" : "https://jakarta.oss.sonatype.org/service/local/staging/deploy/maven2/"
        },
        {
          "type" : "issue-tracker",
          "url" : "https://github.com/eclipse-ee4j/jpa-api/issues"
        },
        {
          "type" : "mailing-list",
          "url" : "https://dev.eclipse.org/mhonarc/lists/jpa-dev/"
        },
        {
          "type" : "vcs",
          "url" : "https://github.com/eclipse-ee4j/jpa-api.git"
        }
      ],
      "type" : "library",
      "bom-ref" : "pkg:maven/jakarta.persistence/jakarta.persistence-api@3.1.0?type=jar"
    },
    {
      "publisher" : "Eclipse Foundation",
      "group" : "jakarta.validation",
      "name" : "jakarta.validation-api",
      "version" : "3.0.2",
      "description" : "Jakarta Bean Validation API",
      "scope" : "required",
      "hashes" : [
        {
          "alg" : "MD5",
          "content" : "3a1ee6efca3e41e3320599790f54c5eb"
        },
        {
          "alg" : "SHA-1",
          "content" : "92b6631659ba35ca09e44874d3eb936edfeee532"
        },
        {
          "alg" : "SHA-256",
          "content" : "291c25e6910cc6a7ebd96d4c6baebf6d7c37676c5482c2d96146e901b62c1fc9"
        },
        {
          "alg" : "SHA-512",
          "content" : "8ff9a450e13dad49ac8268ab8c591e045e5056f9459efa09fbb3561b5c879526b344e2648602bf65d387620064cf0c3a00e1243c6422c85a21b53dbab8749a40"
        },
        {
          "alg" : "SHA-384",
          "content" : "ab594665f5416edc8b42687e4ca17583fdcf886725ed98a88beb42bb5980d3672a5a5b7dd93b73c2282393ef1814d21d"
        },
        {
          "alg" : "SHA3-384",
          "content" : "bd43bd51ad4b56fe5bed62d478554a0e2a183b8ce38ed8606adb52d219eefe2efedafdd3d530b1f680824f54a680ab4b"
        },
        {
          "alg" : "SHA3-256",
          "content" : "48b53a0b142c3b314427ea2133e54151ed8263c1627527b8bc824784596840d7"
        },
        {
          "alg" : "SHA3-512",
          "content" : "3b6ec58f766f0958be2529b66d12bf492dfb78c49bfd41be87d9102e0885144156a693828f201a2a7019774c02824dfcaf717394a8858779fc9b2cd44b74b453"
        }
      ],
      "licenses" : [
        {
          "license" : {
            "id" : "Apache-2.0",
            "url" : "https://www.apache.org/licenses/LICENSE-2.0"
          }
        }
      ],
      "purl" : "pkg:maven/jakarta.validation/jakarta.validation-api@3.0.2?type=jar",
      "externalReferences" : [
        {
          "type" : "website",
          "url" : "https://beanvalidation.org"
        },
        {
          "type" : "distribution",
          "url" : "https://jakarta.oss.sonatype.org/service/local/staging/deploy/maven2/"
        },
        {
          "type" : "issue-tracker",
          "url" : "https://hibernate.atlassian.net/projects/BVAL/"
        },
        {
          "type" : "mailing-list",
          "url" : "https://dev.eclipse.org/mhonarc/lists/jakarta.ee-community/"
        },
        {
          "type" : "vcs",
          "url" : "https://github.com/eclipse-ee4j/beanvalidation-api"
        }
      ],
      "type" : "library",
      "bom-ref" : "pkg:maven/jakarta.validation/jakarta.validation-api@3.0.2?type=jar"
    },
    {
      "publisher" : "Eclipse Foundation",
      "group" : "jakarta.interceptor",
      "name" : "jakarta.interceptor-api",
      "version" : "2.1.0",
      "description" : "Jakarta Interceptors defines a means of interposing on business method invocations and specific events—such as lifecycle events and timeout events—that occur on instances of Jakarta EE components and other managed classes.",
      "scope" : "required",
      "hashes" : [
        {
          "alg" : "MD5",
          "content" : "c68f893a96a6ddbcd08c09d508ae0040"
        },
        {
          "alg" : "SHA-1",
          "content" : "1d06a662708601400af4556577ee514c4ad01549"
        },
        {
          "alg" : "SHA-256",
          "content" : "ef787d3f713fc6ff4f02cd4b0dbed08f93d8af3400c90cbb43fb4b5c0583710b"
        },
        {
          "alg" : "SHA-512",
          "content" : "d4d297f7239852f764bd211413898784bfdb18f76c2715ceb6e7be24237aee05affba392b70aa612212292106516de71a0b8967aaa75296873fa175ff5ef53df"
        },
        {
          "alg" : "SHA-384",
          "content" : "2a6eadc9b5031c42e80712df5c3c3cd74b813f5818494ccdd972b99134d1a3950607f793a134f255bb3f186f915cbc48"
        },
        {
          "alg" : "SHA3-384",
          "content" : "f2c86958aa33597f31062ba549f29f6ee0b4b5af468c5bdae1c50db90bf41ffcf0441eee319023ff6a6f8a185fb9c610"
        },
        {
          "alg" : "SHA3-256",
          "content" : "dcb7b537ebaa9bdc1499fcd810494a4ea2d5d175f8318fbb47aa32dddf198434"
        },
        {
          "alg" : "SHA3-512",
          "content" : "f2b850e87a2315afa022997c79494e0f81e7e30c562f4f9998896d2e88d00ac5fe097bb492f44f475ac3b4fb0f5d2649fa2124a817409df3db2a67c7ab541b01"
        }
      ],
      "licenses" : [
        {
          "license" : {
            "id" : "EPL-2.0"
          }
        },
        {
          "license" : {
            "id" : "GPL-2.0-with-classpath-exception"
          }
        }
      ],
      "purl" : "pkg:maven/jakarta.interceptor/jakarta.interceptor-api@2.1.0?type=jar",
      "externalReferences" : [
        {
          "type" : "website",
          "url" : "https://github.com/eclipse-ee4j/interceptor-api"
        },
        {
          "type" : "distribution",
          "url" : "https://jakarta.oss.sonatype.org/service/local/staging/deploy/maven2/"
        },
        {
          "type" : "issue-tracker",
          "url" : "https://github.com/eclipse-ee4j/interceptor-api/issues"
        },
        {
          "type" : "mailing-list",
          "url" : "https://dev.eclipse.org/mhonarc/lists/jakarta.ee-community/"
        },
        {
          "type" : "vcs",
          "url" : "https://github.com/eclipse-ee4j/interceptor-api"
        }
      ],
      "type" : "library",
      "bom-ref" : "pkg:maven/jakarta.interceptor/jakarta.interceptor-api@2.1.0?type=jar"
    },
    {
      "publisher" : "JBoss by Red Hat, Inc.",
      "group" : "jakarta.enterprise",
      "name" : "jakarta.enterprise.cdi-api",
      "version" : "4.0.1",
      "description" : "APIs for CDI (Contexts and Dependency Injection for Java)",
      "scope" : "required",
      "hashes" : [
        {
          "alg" : "MD5",
          "content" : "4ddecd5a6280ef5f222e693ce9d29898"
        },
        {
          "alg" : "SHA-1",
          "content" : "2012f388c6de83e29101cbf82c3ed2bd37931c64"
        },
        {
          "alg" : "SHA-256",
          "content" : "beaf74c4f2618189309e3f4a09c43effab633dd96aa1f6dc58a6ba7ee0042717"
        },
        {
          "alg" : "SHA-512",
          "content" : "f8e7a532dd0a842b931371810437866fb04c2d3cc121c6ce471b5a082d654e651b0ec8f98e31bf76a5071b2317f18d97de35c4d15a6405818ccc90d80ec9e7af"
        },
        {
          "alg" : "SHA-384",
          "content" : "ae83b0403f27477ac4900b7e0f455e33cdc6cc1e645575f879c269aeb1aa804ec1a8ff2df9ec91980d7fbf66738d76c3"
        },
        {
          "alg" : "SHA3-384",
          "content" : "a8d626f42dbd2f0b7fbcb6f0eec2d9c7ed6f3b9a754d46463328a33fb3fa43607c1b2e2b7a70bea596666bb5fb9915d8"
        },
        {
          "alg" : "SHA3-256",
          "content" : "cfefcd757cc70a8a6f727020830e0680f84f4baaba17af02b82198bbbdc7e16d"
        },
        {
          "alg" : "SHA3-512",
          "content" : "b4cb84e2b7e664648d9590bc188abe43a3e3b74452d0a9183437ac7ff57e7e8c0603750998161bb96268b66d48ad2fe3977eefa7061cc3d9294bece629b40b23"
        }
      ],
      "licenses" : [
        {
          "license" : {
            "id" : "Apache-2.0",
            "url" : "https://www.apache.org/licenses/LICENSE-2.0"
          }
        }
      ],
      "purl" : "pkg:maven/jakarta.enterprise/jakarta.enterprise.cdi-api@4.0.1?type=jar",
      "externalReferences" : [
        {
          "type" : "website",
          "url" : "http://cdi-spec.org"
        },
        {
          "type" : "distribution",
          "url" : "https://jakarta.oss.sonatype.org/service/local/staging/deploy/maven2/"
        },
        {
          "type" : "issue-tracker",
          "url" : "https://github.com/eclipse-ee4j/cdi/issues"
        },
        {
          "type" : "mailing-list",
          "url" : "https://dev.eclipse.org/mhonarc/lists/jakarta.ee-community/"
        },
        {
          "type" : "vcs",
          "url" : "scm:git:git@github.com:cdi-spec/cdi.git"
        }
      ],
      "type" : "library",
      "bom-ref" : "pkg:maven/jakarta.enterprise/jakarta.enterprise.cdi-api@4.0.1?type=jar"
    },
    {
      "publisher" : "Eclipse Foundation",
      "group" : "jakarta.enterprise",
      "name" : "jakarta.enterprise.lang-model",
      "version" : "4.0.1",
      "description" : "Build Compatible (Reflection-Free) Java Language Model for CDI",
      "scope" : "required",
      "hashes" : [
        {
          "alg" : "MD5",
          "content" : "fe02deb673794ba67c5e423bcca3d229"
        },
        {
          "alg" : "SHA-1",
          "content" : "2b195781faad31c1724d8122136909c34c3ae79e"
        },
        {
          "alg" : "SHA-256",
          "content" : "53acafe65b6ef0195fa1b8a0ef2650e5aa024c32cb4059c4df372d6b32089cd3"
        },
        {
          "alg" : "SHA-512",
          "content" : "bc8a5fa72b9db31e0f34bcfa18e3b094ecebe074dabf6e2534665a8efd691b1c725dd5481897adf1795228ec9f5f3cacf0b1ce25636972c9c62e1fb2d74da6cc"
        },
        {
          "alg" : "SHA-384",
          "content" : "de22bbfb3e9e196783c5697f00ea0e6ba700264332402ad1f1b5ca1e7190f13b02685ccfb441c6d8d02e52835ff91042"
        },
        {
          "alg" : "SHA3-384",
          "content" : "c09f1ccca901b719fcff02b743b033270335e8dabeb1130626350b8ccbf8799ba5677af9d6ec5ad0989ae6fdfbdce1b9"
        },
        {
          "alg" : "SHA3-256",
          "content" : "ae301007d79d3cf7a1f5d44d3246ef63ee23b8c81c6f159d3eeb1ea1cc839805"
        },
        {
          "alg" : "SHA3-512",
          "content" : "82be8799015bbfa9178a31f253b65893c0b39a5fca9bb153958d1427fec11fbe439f8544bd137b6979fff6aa09fb0154d08518d53dd33500f2c1497a869d1287"
        }
      ],
      "licenses" : [
        {
          "license" : {
            "id" : "Apache-2.0",
            "url" : "https://www.apache.org/licenses/LICENSE-2.0"
          }
        }
      ],
      "purl" : "pkg:maven/jakarta.enterprise/jakarta.enterprise.lang-model@4.0.1?type=jar",
      "externalReferences" : [
        {
          "type" : "website",
          "url" : "https://projects.eclipse.org/projects/ee4j/jakarta.enterprise.cdi-parent/jakarta.enterprise.lang-model"
        },
        {
          "type" : "distribution",
          "url" : "https://jakarta.oss.sonatype.org/service/local/staging/deploy/maven2/"
        },
        {
          "type" : "issue-tracker",
          "url" : "https://github.com/eclipse-ee4j/ee4j/issues"
        },
        {
          "type" : "mailing-list",
          "url" : "https://dev.eclipse.org/mhonarc/lists/jakarta.ee-community/"
        },
        {
          "type" : "vcs",
          "url" : "https://github.com/eclipse-ee4j/cdi/jakarta.enterprise.lang-model"
        }
      ],
      "type" : "library",
      "bom-ref" : "pkg:maven/jakarta.enterprise/jakarta.enterprise.lang-model@4.0.1?type=jar"
    },
    {
      "publisher" : "Eclipse Foundation",
      "group" : "jakarta.inject",
      "name" : "jakarta.inject-api",
      "version" : "2.0.1",
      "description" : "Jakarta Dependency Injection",
      "scope" : "required",
      "hashes" : [
        {
          "alg" : "MD5",
          "content" : "72003bf6efcc8455d414bbd7da86c11c"
        },
        {
          "alg" : "SHA-1",
          "content" : "4c28afe1991a941d7702fe1362c365f0a8641d1e"
        },
        {
          "alg" : "SHA-256",
          "content" : "f7dc98062fccf14126abb751b64fab12c312566e8cbdc8483598bffcea93af7c"
        },
        {
          "alg" : "SHA-512",
          "content" : "f186b2ada470abba1cc3b4f8c4373d940fb7c71a051b2c26f7c204ad4dfb69235fbf3f9c33da36d744cb90f52d921c51d76c0ff263bacb35eafb66cab83dc47d"
        },
        {
          "alg" : "SHA-384",
          "content" : "405bd297a73901f013d48a0da028d04d400f3e61f4997c0e7297eb08120670a0e242e0002db8f130c33ab16cb02feb2d"
        },
        {
          "alg" : "SHA3-384",
          "content" : "4db7e54434d0a208c876868f5595b808f2728c0455feaa752ab7b569a2186fc37cb891c9aa0076de3d08f6da6ff06eba"
        },
        {
          "alg" : "SHA3-256",
          "content" : "3a5aba9f1ff1a130b76af886123eb375fa578498490df3dc60bb7ce7d59e9404"
        },
        {
          "alg" : "SHA3-512",
          "content" : "00bba8efc2d6e7f0a509b321868d75f1aaf0681a750d089d913bde8424ab7bb88aadf49de6e291e352523e4f8c117b1b48033ff31d4d665dcc43c4c6ea000ba9"
        }
      ],
      "licenses" : [
        {
          "license" : {
            "id" : "Apache-2.0"
          }
        }
      ],
      "purl" : "pkg:maven/jakarta.inject/jakarta.inject-api@2.0.1?type=jar",
      "externalReferences" : [
        {
          "type" : "website",
          "url" : "https://github.com/eclipse-ee4j/injection-api"
        },
        {
          "type" : "distribution",
          "url" : "https://jakarta.oss.sonatype.org/service/local/staging/deploy/maven2/"
        },
        {
          "type" : "issue-tracker",
          "url" : "https://github.com/eclipse-ee4j/ee4j/issues"
        },
        {
          "type" : "mailing-list",
          "url" : "https://dev.eclipse.org/mhonarc/lists/jakarta.ee-community/"
        },
        {
          "type" : "vcs",
          "url" : "https://github.com/eclipse-ee4j/injection-api"
        }
      ],
      "type" : "library",
      "bom-ref" : "pkg:maven/jakarta.inject/jakarta.inject-api@2.0.1?type=jar"
    },
    {
      "publisher" : "Jakarta Authentication",
      "group" : "jakarta.authentication",
      "name" : "jakarta.authentication-api",
      "version" : "3.0.0",
      "description" : "Jakarta Authentication defines a general low-level SPI for authentication mechanisms, which are controllers that interact with a caller and a container's environment to obtain the caller's credentials, validate these, and pass an authenticated identity (such as name and groups) to the container. Jakarta Authentication consists of several profiles, with each profile telling how a specific container (such as Jakarta Servlet) can integrate with- and adapt to this SPI.",
      "scope" : "required",
      "hashes" : [
        {
          "alg" : "MD5",
          "content" : "3d6e2720e38c807fa0570f73552d28cd"
        },
        {
          "alg" : "SHA-1",
          "content" : "e1e3503070dcddcc9e24a062f734069446a99bc3"
        },
        {
          "alg" : "SHA-256",
          "content" : "8619fcbd4559f935e9331468aed461cbae0c614c1bc7d93912fddc6e6ca909b3"
        },
        {
          "alg" : "SHA-512",
          "content" : "65f97b8df7f3e2e42a18c20804133a195d1c2f52d6893e2ca0bc07d5eea044c9dd1fc8afa24d8f000b8330b25f5e377b8d8b38a6229fc611cd5f280b1d126326"
        },
        {
          "alg" : "SHA-384",
          "content" : "b13837c166c9ecda7eae09cee36465fa91dd04c180ee553676f2031931b58c424e8bc1ba9105626246c8db5363940fe3"
        },
        {
          "alg" : "SHA3-384",
          "content" : "331a67750bae28c75cee87ee26e82bce1965a79ce8871a2c3cebed9354cab76ebea6f0b90ceff70ecd10502d2ff1f0c6"
        },
        {
          "alg" : "SHA3-256",
          "content" : "87c6d4a325ee7e0c835ae0829aec56478a9ec58bd93fca5fd7bc92cce6d0b8fa"
        },
        {
          "alg" : "SHA3-512",
          "content" : "97c3c1597204b2b7642e35cf50354880ecc10e447a7c49a5499d4bd0b8bed161a0633028d5c878c2900e4b6fe4a2ec68d3ee7d6496055923572248aa512ee7be"
        }
      ],
      "licenses" : [
        {
          "license" : {
            "id" : "EPL-2.0"
          }
        },
        {
          "license" : {
            "id" : "GPL-2.0-with-classpath-exception"
          }
        }
      ],
      "purl" : "pkg:maven/jakarta.authentication/jakarta.authentication-api@3.0.0?type=jar",
      "externalReferences" : [
        {
          "type" : "website",
          "url" : "https://github.com/eclipse-ee4j/authentication"
        },
        {
          "type" : "distribution",
          "url" : "https://jakarta.oss.sonatype.org/service/local/staging/deploy/maven2/"
        },
        {
          "type" : "issue-tracker",
          "url" : "https://github.com/eclipse-ee4j/authentication/issues"
        },
        {
          "type" : "mailing-list",
          "url" : "https://dev.eclipse.org/mhonarc/lists/jakarta.ee-community/"
        },
        {
          "type" : "vcs",
          "url" : "https://github.com/eclipse-ee4j/authentication"
        }
      ],
      "type" : "library",
      "bom-ref" : "pkg:maven/jakarta.authentication/jakarta.authentication-api@3.0.0?type=jar"
    },
    {
      "publisher" : "Eclipse Foundation",
      "group" : "jakarta.security.enterprise",
      "name" : "jakarta.security.enterprise-api",
      "version" : "3.0.0",
      "description" : "Jakarta Security defines a standard for creating secure Jakarta EE applications in modern application paradigms. It defines an overarching (end-user targeted) Security API for Jakarta EE Applications.",
      "scope" : "required",
      "hashes" : [
        {
          "alg" : "MD5",
          "content" : "3283529cb7e6756b9f53c3bf1bc1f424"
        },
        {
          "alg" : "SHA-1",
          "content" : "ca9d8039c16db579b7d45813015c8d677105bc0f"
        },
        {
          "alg" : "SHA-256",
          "content" : "81c0d29cc28b57ee6c254c5609b8f7c15c2dcdc299174fac4e1bad123225e6d5"
        },
        {
          "alg" : "SHA-512",
          "content" : "de87bcde9ac27167f84c134adc4c17a87738d0f34440152a3d9b3ee7766343220d9a7f81fb759f2ac1acd16e8f8fc45bef2867bd2c98fdc31f64c9c6f05a7d47"
        },
        {
          "alg" : "SHA-384",
          "content" : "45dbe76100ce8381be8f02d26995e32380def8f9ed5adc8350e4814d86aa5cceec52993e0ce2072d35d46908622150c5"
        },
        {
          "alg" : "SHA3-384",
          "content" : "8aa81c87f98c2be56a14a1b0421f1533e1607730533c60bab7288a46b307676283cf166e01eeaeea7c5e771c2d346020"
        },
        {
          "alg" : "SHA3-256",
          "content" : "0abf608f86ccdc071abe209fc2c6f38e28210f802932f43799e4f368c3aa4221"
        },
        {
          "alg" : "SHA3-512",
          "content" : "01394c26818724a26cab1ad4629ffc4c575ccacca6bdd437a691adfb4cdd93fdb92110ab7aac4a4ff202a2b8b608e29eeb7ef0500b7e175387a656a47e26af9d"
        }
      ],
      "licenses" : [
        {
          "license" : {
            "id" : "EPL-2.0"
          }
        },
        {
          "license" : {
            "id" : "GPL-2.0-with-classpath-exception"
          }
        }
      ],
      "purl" : "pkg:maven/jakarta.security.enterprise/jakarta.security.enterprise-api@3.0.0?type=jar",
      "externalReferences" : [
        {
          "type" : "website",
          "url" : "https://projects.eclipse.org/projects/ee4j/jakarta.security.enterprise-api"
        },
        {
          "type" : "distribution",
          "url" : "https://jakarta.oss.sonatype.org/service/local/staging/deploy/maven2/"
        },
        {
          "type" : "issue-tracker",
          "url" : "https://github.com/eclipse-ee4j/ee4j/issues"
        },
        {
          "type" : "mailing-list",
          "url" : "https://dev.eclipse.org/mhonarc/lists/jakarta.ee-community/"
        },
        {
          "type" : "vcs",
          "url" : "https://github.com/eclipse-ee4j/security-api"
        }
      ],
      "type" : "library",
      "bom-ref" : "pkg:maven/jakarta.security.enterprise/jakarta.security.enterprise-api@3.0.0?type=jar"
    },
    {
      "group" : "jakarta.enterprise.concurrent",
      "name" : "jakarta.enterprise.concurrent-api",
      "version" : "3.0.1",
      "description" : "Jakarta Concurrency provides a specification for using concurrency from application components without compromising container integrity while still preserving the Jakarta EE platform’s fundamental benefits.",
      "scope" : "optional",
      "hashes" : [
        {
          "alg" : "MD5",
          "content" : "dc613b11e62003a4d3307a93a136e5ec"
        },
        {
          "alg" : "SHA-1",
          "content" : "8f22f554bd172359b9b44e796273926135f79067"
        },
        {
          "alg" : "SHA-256",
          "content" : "71d58e66a7036aff011dd67b65e618e917ec5f0cbd510be916b94380280c15c7"
        },
        {
          "alg" : "SHA-512",
          "content" : "316b1b58ee208e81f62ae329f8a942a78ce1b368c3661e76d4ec67072b0f38b57dc6eb7627a9883b642a8bcc15a316796d1568c0bf902dfb055b10b3a5c01845"
        },
        {
          "alg" : "SHA-384",
          "content" : "11a92a9ff9335002b451c8d6a2c6dfd918a0e3a2233bfc47e6938a8638cf2538c9fc71c2247341a7b444db5636f8d5eb"
        },
        {
          "alg" : "SHA3-384",
          "content" : "6abda40f04466b9b1c2ce30070809394a0bfd239e1d291125643c2a126260c2944dc1c6dbfe6bd87b024fd2f6ee5070d"
        },
        {
          "alg" : "SHA3-256",
          "content" : "f38cebb0ca822c90de7afc20073fe3be43f71111c6a11d170abb57d52b3d8a5d"
        },
        {
          "alg" : "SHA3-512",
          "content" : "ddd8aa6f39ea590756a540b9eea0a890b721830b5344619780eb94f15c6820d8a461ac6c9a83e879a585f8c403a43bf070285f30f057cfe171bc3077bd932cb5"
        }
      ],
      "licenses" : [
        {
          "license" : {
            "id" : "EPL-2.0"
          }
        },
        {
          "license" : {
            "id" : "GPL-2.0-with-classpath-exception"
          }
        }
      ],
      "purl" : "pkg:maven/jakarta.enterprise.concurrent/jakarta.enterprise.concurrent-api@3.0.1?type=jar",
      "externalReferences" : [
        {
          "type" : "website",
          "url" : "https://github.com/jakartaee/concurrency"
        },
        {
          "type" : "vcs",
          "url" : "https://github.com/jakartaee/concurrency"
        }
      ],
      "type" : "library",
      "bom-ref" : "pkg:maven/jakarta.enterprise.concurrent/jakarta.enterprise.concurrent-api@3.0.1?type=jar"
    },
    {
      "publisher" : "Eclipse Foundation",
      "group" : "jakarta.xml.bind",
      "name" : "jakarta.xml.bind-api",
      "version" : "4.0.0",
      "description" : "Jakarta XML Binding API",
      "scope" : "optional",
      "hashes" : [
        {
          "alg" : "MD5",
          "content" : "b5132a66e2d3a60904f8035a1f8a34a8"
        },
        {
          "alg" : "SHA-1",
          "content" : "bbb399208d288b15ec101fa4fcfc4bd77cedc97a"
        },
        {
          "alg" : "SHA-256",
          "content" : "57e3796ad5753640088f5f9d3c53c183f2c250b7dad90529ea3e19a5515aa122"
        },
        {
          "alg" : "SHA-512",
          "content" : "3628ea2ce89380f3d1c09aba611d5b1cf0b53e2a2f87689112e8153b9409995ebc9c6ab1e0e7cfcee194c8233604473bcd8e7b6c4b2aba4e0ef220332208ce70"
        },
        {
          "alg" : "SHA-384",
          "content" : "92170801cbeef42dfe5f14f008422fec5e17e4ef172eb2fdfd6d9f70bf269a0609b39187bf0c0f0cd6aae11502d28d37"
        },
        {
          "alg" : "SHA3-384",
          "content" : "559bc1752bcb888736fd48354363715676bff1f8b541239308d5510a19572430a5ba553cf7b9460149e9460b54486485"
        },
        {
          "alg" : "SHA3-256",
          "content" : "040475238bcea57cc293d184c25af8f88e058285e66be3e48469561fa820914b"
        },
        {
          "alg" : "SHA3-512",
          "content" : "49e69f0794ef9d4f37a11a847cb76f196b03ceb02858904bcfabd4832f2d0f51d21b1361325fd75b07f2195f83994e3f3bc519ffb4f9e227618a8a299f942d7a"
        }
      ],
      "licenses" : [
        {
          "license" : {
            "id" : "BSD-3-Clause"
          }
        }
      ],
      "purl" : "pkg:maven/jakarta.xml.bind/jakarta.xml.bind-api@4.0.0?type=jar",
      "externalReferences" : [
        {
          "type" : "website",
          "url" : "https://github.com/eclipse-ee4j/jaxb-api/jakarta.xml.bind-api"
        },
        {
          "type" : "distribution",
          "url" : "https://jakarta.oss.sonatype.org/service/local/staging/deploy/maven2/"
        },
        {
          "type" : "issue-tracker",
          "url" : "https://github.com/eclipse-ee4j/jaxb-api/issues"
        },
        {
          "type" : "mailing-list",
          "url" : "https://dev.eclipse.org/mhonarc/lists/jaxb-dev"
        },
        {
          "type" : "vcs",
          "url" : "https://github.com/eclipse-ee4j/jaxb-api.git/jakarta.xml.bind-api"
        }
      ],
      "type" : "library",
      "bom-ref" : "pkg:maven/jakarta.xml.bind/jakarta.xml.bind-api@4.0.0?type=jar"
    },
    {
      "publisher" : "Eclipse Foundation",
      "group" : "jakarta.activation",
      "name" : "jakarta.activation-api",
      "version" : "2.1.0",
      "description" : "Jakarta Activation API 2.1 Specification",
      "scope" : "optional",
      "hashes" : [
        {
          "alg" : "MD5",
          "content" : "7c79641566f97305e17c5f7b9bb33fc3"
        },
        {
          "alg" : "SHA-1",
          "content" : "a58861b5deac5e151140511cf57d6b80a83f2d20"
        },
        {
          "alg" : "SHA-256",
          "content" : "56e8d994095fe49c28138c60291482f66f18d12ac2b720e938697dce6a3135c7"
        },
        {
          "alg" : "SHA-512",
          "content" : "53026e23571e77b9696cf02d1eeb20295b7199a169c12db9807f2ef2512eff859b37108b96bfdbcd2c9f4a66728d12ad8182b5548146897cdc2ad49e7b2b2ebc"
        },
        {
          "alg" : "SHA-384",
          "content" : "2e835f36fa8c90490cd4f543062f3ce548175fc97b3dfa2ab3c63f2dcd59c57060a196ace53933639399657f6aec9e5c"
        },
        {
          "alg" : "SHA3-384",
          "content" : "bde529fca53e87d22908b4794730a03a2fa29b62ba8cce07edd4e10e34d98cd43a7b0e449241010ce55e962ee4140837"
        },
        {
          "alg" : "SHA3-256",
          "content" : "be51f4c74f02fb8c98fca209dc5d33ed89dfb240c882e790974c06bef563a6ee"
        },
        {
          "alg" : "SHA3-512",
          "content" : "835e222a4ed4e31f570afd5b10b1935ff8fe4453ce79e340cb021229cc186586e9461411ce7749798a97122794bc3a1965ab770f9682bfb68f6b740e41c50943"
        }
      ],
      "licenses" : [
        {
          "license" : {
            "id" : "BSD-3-Clause"
          }
        }
      ],
      "purl" : "pkg:maven/jakarta.activation/jakarta.activation-api@2.1.0?type=jar",
      "externalReferences" : [
        {
          "type" : "website",
          "url" : "https://github.com/eclipse-ee4j/jaf"
        },
        {
          "type" : "distribution",
          "url" : "https://jakarta.oss.sonatype.org/service/local/staging/deploy/maven2/"
        },
        {
          "type" : "issue-tracker",
          "url" : "https://github.com/eclipse-ee4j/jaf/issues/"
        },
        {
          "type" : "mailing-list",
          "url" : "https://dev.eclipse.org/mhonarc/lists/jakarta.ee-community/"
        },
        {
          "type" : "vcs",
          "url" : "https://github.com/eclipse-ee4j/jaf"
        }
      ],
      "type" : "library",
      "bom-ref" : "pkg:maven/jakarta.activation/jakarta.activation-api@2.1.0?type=jar"
    },
    {
      "publisher" : "Eclipse Foundation",
      "group" : "org.glassfish",
      "name" : "jakarta.faces",
      "version" : "4.0.0",
      "description" : "EE4J Compatible Implementation for Jakarta Faces API",
      "scope" : "optional",
      "hashes" : [
        {
          "alg" : "MD5",
          "content" : "cdf7b2a9a38925ce7083c353de8c259d"
        },
        {
          "alg" : "SHA-1",
          "content" : "e44f0df9bdc4a445318769e5bcd1466780cc391a"
        },
        {
          "alg" : "SHA-256",
          "content" : "5d9962fc04c3bfc20fcd01fcfbf7bb264229eba84ad6117e9be3232978bdd1b8"
        },
        {
          "alg" : "SHA-512",
          "content" : "33c03ace786e073b9179733ac0fad01e2d4688f024b39b935b16122f3b3e4c675496fcc491e9f9eaa98513bc53681d8161357f7ca067a4fae51c8c824c50fff6"
        },
        {
          "alg" : "SHA-384",
          "content" : "74f02bbe89d2dee35eafdf4648697eabdd46b32bd3e76843dd75caf29b6e7ca8e3eae2e29054ec96bf7ca5d659286f03"
        },
        {
          "alg" : "SHA3-384",
          "content" : "2d6657083e750d194c7612c8a49c9f767614cde0045066c2ae02dfa2fe16c7da2d35dbc6b3647737257577f3e8f19509"
        },
        {
          "alg" : "SHA3-256",
          "content" : "387ddc58a73534ea06f4b63b9a4ab79af50706c6f4e4740e24fcc5846da51545"
        },
        {
          "alg" : "SHA3-512",
          "content" : "15c8741606143ff8cdcc6869fb0d896e2bf08c4a7ed5ee36cc2c39633d88ef66a441f84365df1f1ed2e3c5fd39a50741767b959ced516a473a2147101113935c"
        }
      ],
      "licenses" : [
        {
          "license" : {
            "id" : "EPL-2.0"
          }
        },
        {
          "license" : {
            "id" : "GPL-2.0-with-classpath-exception"
          }
        }
      ],
      "purl" : "pkg:maven/org.glassfish/jakarta.faces@4.0.0?type=jar",
      "externalReferences" : [
        {
          "type" : "website",
          "url" : "https://projects.eclipse.org/projects/ee4j/mojarra-parent/jakarta.faces"
        },
        {
          "type" : "distribution",
          "url" : "https://jakarta.oss.sonatype.org/service/local/staging/deploy/maven2/"
        },
        {
          "type" : "issue-tracker",
          "url" : "https://github.com/eclipse-ee4j/ee4j/issues"
        },
        {
          "type" : "mailing-list",
          "url" : "https://dev.eclipse.org/mhonarc/lists/jakarta.ee-community/"
        },
        {
          "type" : "vcs",
          "url" : "https://github.com/eclipse-ee4j/ee4j/mojarra-parent/jakarta.faces"
        }
      ],
      "type" : "library",
      "bom-ref" : "pkg:maven/org.glassfish/jakarta.faces@4.0.0?type=jar"
    }
  ],
  "dependencies" : [
    {
      "ref" : "pkg:maven/jakarta.platform/jakarta.jakartaee-web-api@10.0.0?type=jar",
      "dependsOn" : [
        "pkg:maven/jakarta.servlet/jakarta.servlet-api@6.0.0?type=jar",
        "pkg:maven/jakarta.servlet.jsp/jakarta.servlet.jsp-api@3.1.0?type=jar",
        "pkg:maven/jakarta.el/jakarta.el-api@5.0.1?type=jar",
        "pkg:maven/jakarta.servlet.jsp.jstl/jakarta.servlet.jsp.jstl-api@3.0.0?type=jar",
        "pkg:maven/jakarta.faces/jakarta.faces-api@4.0.1?type=jar",
        "pkg:maven/jakarta.ws.rs/jakarta.ws.rs-api@3.1.0?type=jar",
        "pkg:maven/jakarta.websocket/jakarta.websocket-api@2.1.0?type=jar",
        "pkg:maven/jakarta.websocket/jakarta.websocket-client-api@2.1.0?type=jar",
        "pkg:maven/jakarta.json/jakarta.json-api@2.1.0?type=jar",
        "pkg:maven/jakarta.json.bind/jakarta.json.bind-api@3.0.0?type=jar",
        "pkg:maven/jakarta.annotation/jakarta.annotation-api@2.1.1?type=jar",
        "pkg:maven/jakarta.ejb/jakarta.ejb-api@4.0.1?type=jar",
        "pkg:maven/jakarta.transaction/jakarta.transaction-api@2.0.1?type=jar",
        "pkg:maven/jakarta.persistence/jakarta.persistence-api@3.1.0?type=jar",
        "pkg:maven/jakarta.validation/jakarta.validation-api@3.0.2?type=jar",
        "pkg:maven/jakarta.interceptor/jakarta.interceptor-api@2.1.0?type=jar",
        "pkg:maven/jakarta.enterprise/jakarta.enterprise.cdi-api@4.0.1?type=jar",
        "pkg:maven/jakarta.enterprise/jakarta.enterprise.lang-model@4.0.1?type=jar",
        "pkg:maven/jakarta.inject/jakarta.inject-api@2.0.1?type=jar",
        "pkg:maven/jakarta.authentication/jakarta.authentication-api@3.0.0?type=jar",
        "pkg:maven/jakarta.security.enterprise/jakarta.security.enterprise-api@3.0.0?type=jar",
        "pkg:maven/jakarta.enterprise.concurrent/jakarta.enterprise.concurrent-api@3.0.1?type=jar",
        "pkg:maven/jakarta.xml.bind/jakarta.xml.bind-api@4.0.0?type=jar",
        "pkg:maven/jakarta.activation/jakarta.activation-api@2.1.0?type=jar",
        "pkg:maven/org.glassfish/jakarta.faces@4.0.0?type=jar"
      ]
    },
    {
      "ref" : "pkg:maven/jakarta.servlet/jakarta.servlet-api@6.0.0?type=jar",
      "dependsOn" : [ ]
    },
    {
      "ref" : "pkg:maven/jakarta.servlet.jsp/jakarta.servlet.jsp-api@3.1.0?type=jar",
      "dependsOn" : [ ]
    },
    {
      "ref" : "pkg:maven/jakarta.el/jakarta.el-api@5.0.1?type=jar",
      "dependsOn" : [ ]
    },
    {
      "ref" : "pkg:maven/jakarta.servlet.jsp.jstl/jakarta.servlet.jsp.jstl-api@3.0.0?type=jar",
      "dependsOn" : [ ]
    },
    {
      "ref" : "pkg:maven/jakarta.faces/jakarta.faces-api@4.0.1?type=jar",
      "dependsOn" : [ ]
    },
    {
      "ref" : "pkg:maven/jakarta.ws.rs/jakarta.ws.rs-api@3.1.0?type=jar",
      "dependsOn" : [ ]
    },
    {
      "ref" : "pkg:maven/jakarta.websocket/jakarta.websocket-api@2.1.0?type=jar",
      "dependsOn" : [ ]
    },
    {
      "ref" : "pkg:maven/jakarta.websocket/jakarta.websocket-client-api@2.1.0?type=jar",
      "dependsOn" : [ ]
    },
    {
      "ref" : "pkg:maven/jakarta.json/jakarta.json-api@2.1.0?type=jar",
      "dependsOn" : [ ]
    },
    {
      "ref" : "pkg:maven/jakarta.json.bind/jakarta.json.bind-api@3.0.0?type=jar",
      "dependsOn" : [ ]
    },
    {
      "ref" : "pkg:maven/jakarta.annotation/jakarta.annotation-api@2.1.1?type=jar",
      "dependsOn" : [ ]
    },
    {
      "ref" : "pkg:maven/jakarta.ejb/jakarta.ejb-api@4.0.1?type=jar",
      "dependsOn" : [ ]
    },
    {
      "ref" : "pkg:maven/jakarta.transaction/jakarta.transaction-api@2.0.1?type=jar",
      "dependsOn" : [ ]
    },
    {
      "ref" : "pkg:maven/jakarta.persistence/jakarta.persistence-api@3.1.0?type=jar",
      "dependsOn" : [ ]
    },
    {
      "ref" : "pkg:maven/jakarta.validation/jakarta.validation-api@3.0.2?type=jar",
      "dependsOn" : [ ]
    },
    {
      "ref" : "pkg:maven/jakarta.interceptor/jakarta.interceptor-api@2.1.0?type=jar",
      "dependsOn" : [ ]
    },
    {
      "ref" : "pkg:maven/jakarta.enterprise/jakarta.enterprise.cdi-api@4.0.1?type=jar",
      "dependsOn" : [ ]
    },
    {
      "ref" : "pkg:maven/jakarta.enterprise/jakarta.enterprise.lang-model@4.0.1?type=jar",
      "dependsOn" : [ ]
    },
    {
      "ref" : "pkg:maven/jakarta.inject/jakarta.inject-api@2.0.1?type=jar",
      "dependsOn" : [ ]
    },
    {
      "ref" : "pkg:maven/jakarta.authentication/jakarta.authentication-api@3.0.0?type=jar",
      "dependsOn" : [ ]
    },
    {
      "ref" : "pkg:maven/jakarta.security.enterprise/jakarta.security.enterprise-api@3.0.0?type=jar",
      "dependsOn" : [ ]
    },
    {
      "ref" : "pkg:maven/jakarta.enterprise.concurrent/jakarta.enterprise.concurrent-api@3.0.1?type=jar",
      "dependsOn" : [ ]
    },
    {
      "ref" : "pkg:maven/jakarta.xml.bind/jakarta.xml.bind-api@4.0.0?type=jar",
      "dependsOn" : [ ]
    },
    {
      "ref" : "pkg:maven/jakarta.activation/jakarta.activation-api@2.1.0?type=jar",
      "dependsOn" : [ ]
    },
    {
      "ref" : "pkg:maven/org.glassfish/jakarta.faces@4.0.0?type=jar",
      "dependsOn" : [ ]
    }
  ]
}