<?xml version="1.0" encoding="utf-8"?>
<!-- Generator: Adobe Illustrator 25.4.1, SVG Export Plug-In . SVG Version: 6.00 Build 0)  -->
<svg version="1.1" id="Layer_1" xmlns="http://www.w3.org/2000/svg" xmlns:xlink="http://www.w3.org/1999/xlink" x="0px" y="0px"
	 viewBox="0 0 300 50.3" style="enable-background:new 0 0 300 50.3;" xml:space="preserve">
<style type="text/css">
	.st0{fill:#D6006E;}
	.st1{fill:#929497;}
	.st2{font-family:'MyriadPro-Regular';}
	.st3{font-size:12px;}
</style>
<g>
	<polygon class="st0" points="166.9,31.4 153.3,12.5 148.5,12.5 148.5,38.6 153.1,38.6 153.1,19.8 166.8,38.6 171.5,38.6 
		171.5,12.5 166.9,12.5 	"/>
	<path class="st0" d="M186.6,12.5L176,38.6h5l2.5-6.5h10.7l2.5,6.5h5l-10.6-26.1H186.6L186.6,12.5z M192.8,28.3h-8l4-10.5
		L192.8,28.3z"/>
	<polygon class="st0" points="200.9,16.3 209.6,16.3 209.6,38.6 214.3,38.6 214.3,16.3 223,16.3 223,12.5 200.9,12.5 	"/>
	<rect x="228.4" y="12.5" class="st0" width="4.6" height="26.1"/>
	<polygon class="st0" points="249.9,33.2 242.6,12.5 237.6,12.5 247.3,38.6 252.4,38.6 262.1,12.5 257.1,12.5 	"/>
	<polygon class="st0" points="271.3,34.9 271.3,27 285.4,27 285.4,23.2 271.3,23.2 271.3,16.3 286.9,16.3 286.9,12.5 266.7,12.5 
		266.7,38.6 287.3,38.6 287.3,34.9 	"/>
</g>
<g>
	<rect x="133.4" y="10.2" class="st1" width="1.5" height="30.7"/>
</g>
<g>
	<path class="st0" d="M32.5,22.8v4.8H19.7v5.9h14.9v5.1h-21V12.4h20.6v5.1H19.7v5.3H32.5z"/>
</g>
<g>
	<path class="st0" d="M93.5,24.4v14.2h-4.6v-2.8h-0.1c-1.8,2.7-4.3,3.5-7.9,3.5C69.6,39.3,68,30.4,68,25.4c0-5.3,2.1-13.7,13.8-13.7
		c7.6,0,10.8,4.8,11.4,9.2h-6.4c-0.1-1-0.7-4.1-5-4.1c-7.2,0-7.1,7.4-7.1,8.8c0,1.6,0.2,8.6,6.9,8.6c2.7,0,5.7-1.5,6-5.1h-5.2v-4.7
		C82.4,24.4,93.5,24.4,93.5,24.4z"/>
</g>
<g>
	<path class="st0" d="M117.6,22.8v4.8h-12.8v5.9h14.8v5.1h-21V12.4h20.6v5.1h-14.5v5.3H117.6z"/>
</g>
<path class="st0" d="M60.2,19.2c-1.3,0-2.6,0.5-3.5,1.3L49,16c0-0.1,0-0.1,0-0.2c0-3-2.4-5.4-5.4-5.4s-5.4,2.4-5.4,5.4
	c0,2.1,1.2,3.9,2.9,4.8v9.9c-1.7,0.9-2.9,2.7-2.9,4.8c0,3,2.4,5.4,5.4,5.4s5.4-2.4,5.4-5.4c0-0.4,0-0.8-0.1-1.2l8-5.4
	c0.9,0.8,2.1,1.3,3.4,1.3c3,0,5.4-2.4,5.4-5.4S63.2,19.2,60.2,19.2z M44.1,29.9v-8.7c1.6-0.1,3.1-1,3.9-2.3l7.1,4.1
	c-0.2,0.5-0.2,1-0.2,1.6s0.1,1.2,0.3,1.7l-7.7,5.2C46.6,30.6,45.4,30,44.1,29.9z"/>
<text transform="matrix(1 0 0 1 285.2725 15.1414)" class="st0 st2 st3">™</text>
</svg>
