{
    "/js/solstice.js": "/js/solstice.js",
    "/js/App.js": "/js/App.js",
    "/css/styles.css": "/css/styles.css",
    "/css/2024-adoptium-summit.css": "/css/2024-adoptium-summit.css",
    "/css/2023-osc.css": "/css/2023-osc.css"
}
