<?xml version="1.0" encoding="UTF-8"?>
<svg width="413px" height="205px" viewBox="0 0 413 205" version="1.1" xmlns="http://www.w3.org/2000/svg" xmlns:xlink="http://www.w3.org/1999/xlink" xmlns:sketch="http://www.bohemiancoding.com/sketch/ns">
    <!-- Generator: Sketch 3.3.3 (12072) - http://www.bohemiancoding.com/sketch -->
    <title>sap</title>
    <desc>Created with Sketch.</desc>
    <defs>
        <linearGradient x1="49.9985447%" y1="-0.0196078431%" x2="49.9985447%" y2="99.9803922%" id="linearGradient-1">
            <stop stop-color="#00B9F2" offset="0%"></stop>
            <stop stop-color="#00A0DF" offset="21.32%"></stop>
            <stop stop-color="#008BCF" offset="44.62%"></stop>
            <stop stop-color="#007DC4" offset="66.25%"></stop>
            <stop stop-color="#0074BE" offset="85.38%"></stop>
            <stop stop-color="#0072BC" offset="100%"></stop>
        </linearGradient>
    </defs>
    <g id="Page-1" stroke="none" stroke-width="1" fill="none" fill-rule="evenodd" sketch:type="MSPage">
        <g id="sap" sketch:type="MSLayerGroup">
            <g id="Group" sketch:type="MSShapeGroup">
                <g id="Shape">
                    <path d="M0,204.5 L208.4,204.5 L412.3,0.5 L0,0.5 L0,204.5" fill="url(#linearGradient-1)"></path>
                    <path d="M244.7,38.8 L204.1,38.8 L204.1,135.3 L168.6,38.8 L133.4,38.8 L103.1,119.5 C99.9,99.1 78.8,92.1 62.3,86.9 C51.4,83.4 39.8,78.2 39.9,72.5 C40,67.8 46.1,63.5 58.3,64.1 C66.5,64.5 73.7,65.2 88,72.1 L102.1,47.5 C89,40.8 70.9,36.6 56.1,36.6 L56,36.6 C38.7,36.6 24.3,42.2 15.4,51.4 C9.2,57.8 5.8,66 5.7,75.1 C5.5,87.6 10,96.4 19.6,103.4 C27.7,109.3 38.1,113.2 47.2,116 C58.5,119.5 67.7,122.5 67.6,129 C67.5,131.4 66.6,133.6 64.9,135.3 C62.1,138.2 57.8,139.3 51.8,139.4 C40.3,139.6 31.8,137.8 18.2,129.8 L5.7,154.7 C19.2,162.4 35.3,166.9 51.7,166.9 L53.8,166.9 C68,166.6 79.5,162.6 88.7,155.2 C89.2,154.8 89.7,154.4 90.2,153.9 L86.1,164.8 L123,164.8 L129.2,146 C135.7,148.2 143,149.4 150.9,149.4 C158.5,149.4 165.7,148.2 172.1,146.1 L178.1,164.7 L238.2,164.7 L238.2,125.7 L251.3,125.7 C283,125.7 301.8,109.6 301.8,82.5 C301.7,52.6 283.5,38.8 244.7,38.8 L244.7,38.8 Z M150.9,121.4 C146.2,121.4 141.7,120.6 137.9,119.1 L150.8,78.5 L151,78.5 L163.6,119.2 C159.8,120.6 155.5,121.4 150.9,121.4 L150.9,121.4 Z M247.1,98.1 L238.2,98.1 L238.2,65.4 L247.1,65.4 C259,65.4 268.5,69.4 268.5,81.5 C268.5,94.1 259,98.1 247.1,98.1 L247.1,98.1 Z" fill="#FFFFFF"></path>
                </g>
                <path d="M257.8,191 C257.8,184.8 262.5,180 268.5,180 C274.5,180 279.2,184.7 279.2,191 C279.2,197.4 274.5,202 268.5,202 C262.5,202.1 257.8,197.4 257.8,191 L257.8,191 Z M268.5,204.3 C275.7,204.3 281.8,198.7 281.8,191.1 C281.8,183.5 275.7,177.9 268.5,177.9 C261.2,177.9 255.1,183.5 255.1,191.1 C255.1,198.7 261.3,204.3 268.5,204.3 L268.5,204.3 Z M265.8,192.1 L268.5,192.1 L272.5,198.7 L275.1,198.7 L270.7,192 C273,191.7 274.7,190.5 274.7,187.8 C274.7,184.8 272.9,183.5 269.3,183.5 L263.5,183.5 L263.5,198.7 L265.8,198.7 L265.8,192.1 L265.8,192.1 Z M265.8,190.1 L265.8,185.4 L268.9,185.4 C270.5,185.4 272.2,185.7 272.2,187.6 C272.2,190 270.5,190.1 268.5,190.1 L265.8,190.1 L265.8,190.1 Z" id="Shape" fill="#0072BC"></path>
            </g>
        </g>
    </g>
</svg>