<!DOCTYPE TITAN_GUI_project_file>
<Project>
    <General>
        <Project_Name>SDP</Project_Name>
        <Executable_Path>../bin/SDP</Executable_Path>
        <Working_Dir>../bin</Working_Dir>
        <Build_Host>alpha</Build_Host>
        <Execution_Mode>Parallel</Execution_Mode>
        <Log_Format>yes</Log_Format>
        <GNU_Make>no</GNU_Make>
        <Update_Symlinks>yes</Update_Symlinks>
        <Update_Makefile>yes</Update_Makefile>
        <Localhost_Execute>yes</Localhost_Execute>
        <Execute_Command>rsh %host &quot;cd %project_working_dir ; &quot;%executable&quot; %localhost %mctr_port&quot;</Execute_Command>
        <Execute_Hosts>alfa, beta, gamma</Execute_Hosts>
        <UnUsed_List>../../../../../../home/ethecs/SDP_new/MIME_Types.ttcn,../../../../../../home/ethecs/SDP_new/proba.ttcn,../../../../../../home/ethecs/SDP_new/EncText.cc</UnUsed_List>
    </General>
    <Modules>
        <Module>../src/SDP_Types.ttcn</Module>
        <Module>SDP_Templates.ttcn</Module>
        <Module>SDP_test.ttcn</Module>
    </Modules>
    <Other_Sources>
        <Other_Source>../src/SDP_EncDec.cc</Other_Source>
    </Other_Sources>
    <Test_Cases>
        <Test_Case>SDP_test.tc_BasicTest</Test_Case>
    </Test_Cases>
    <Others>
        <Other>../bin/Makefile</Other>
    </Others>
</Project>
