{
    "ViewmodelEditors": [
        {
            "pos": {
                "top": 144,
                "left": 272
            },
            "visible": false
        },
        {
            "pos": {
                "top": 268,
                "left": 270
            },
            "visible": false
        }
    ],
    "ViewEditors": [
        {
            "pos": {
                "top": 32,
                "left": 637.0000610351562
            },
            "visible": true
        },
        {
            "pos": {
                "top": 158,
                "left": 640.0000610351562
            },
            "visible": true
        },
        {
            "pos": {
                "top": 286,
                "left": 647.0000610351562
            },
            "visible": true
        }
    ],
    "HtmlEditor": {
        "pos": {
            "top": 198,
            "left": 1099.0000610351562
        },
        "visible": true
    },
    "RequestEditor": {}
}