[
    {
        "class": "CViewModel_FlexAligner",
        "customData": {},
        "dataPathStrList": [],
        "dataPathList": [],
        "selectionToControlPathStrList": [],
        "selectionToControlPathList": []
    },
    {
        "class": "CViewModel_DynamicTable",
        "customData": {
            "header": [
                "StatHandler Component",
                "Reset"
            ]
        },
        "dataPathStrList": [
            "PTCs",
            "PTCs.ResetComponent"
        ],
        "dataPathList": [
            [
                0
            ],
            [
                0,
                0
            ]
        ],
        "selectionToControlPathStrList": [],
        "selectionToControlPathList": []
    },
    {
        "class": "CViewModel_ElementRelay",
        "customData": {},
        "dataPathStrList": [
            "PTCs.ResetAll",
            "PTCs.ResetAll"
        ],
        "dataPathList": [
            [
                1,
                0
            ],
            [
                1,
                0
            ]
        ],
        "selectionToControlPathStrList": [],
        "selectionToControlPathList": []
    }
]