[
    {
        "getData": {
            "source": "ExecCtrl",
            "element": "Start"
        }
    },
    {
        "getData": {
            "source": "ExecCtrl",
            "element": "Stop"
        }
    },
    {
        "getData": {
            "source": "ExecCtrl",
            "element": "Exit",
            "selection": [
                0
            ]
        }
    }
]