{
    "ViewmodelEditors": [
        {
            "pos": {
                "top": 0,
                "left": 250
            },
            "visible": true
        },
        {
            "pos": {
                "top": 115,
                "left": 249
            },
            "visible": true
        },
        {
            "pos": {
                "top": 233,
                "left": 247
            },
            "visible": true
        }
    ],
    "ViewEditors": [
        {
            "pos": {
                "top": 0,
                "left": 610
            },
            "visible": true
        },
        {
            "pos": {
                "top": 139,
                "left": 611
            },
            "visible": true
        },
        {
            "pos": {
                "top": 277,
                "left": 615
            },
            "visible": true
        },
        {
            "pos": {
                "top": 118,
                "left": 816.0000610351562
            },
            "visible": true
        }
    ],
    "HtmlEditor": {
        "pos": {
            "top": 149,
            "left": 1040.0000610351562
        },
        "visible": true
    },
    "RequestEditor": {}
}