///////////////////////////////////////////////////////////////////////////////
// Copyright (c) 2000-2023 Ericsson Telecom AB                               //
//                                                                           //
// All rights reserved. This program and the accompanying materials          //
// are made available under the terms of the Eclipse Public License v2.0     //
// which accompanies this distribution, and is available at                  //
// https://www.eclipse.org/org/documents/epl-2.0/EPL-2.0.html                                 //
///////////////////////////////////////////////////////////////////////////////
LGenBase Demo ReRegisterMsg
From: $(phonePrefix)$(fromNr)
To: $(phonePrefixTo)$(toNr)
UserData: $(eIdx):$(fIdx);