[
    {
        "setupName": "EPTF_CLL_ExecCtrl_CommonControls",
        "parentID": "EPTF_CLL_ExecCtrl_CommonControls"
    },
    {
        "setupName": "EPTF_CLL_ExecCtrl_Status",
        "parentID": "EPTF_CLL_ExecCtrl_EntityGroups_CView_Aligner_2"
    },
    {
        "setupName": "EPTF_CLL_SetupTabs",
        "parentID": "EPTF_CLL_ExecCtrl_EntityGroups_CView_Aligner_0"
    }
]