[
    {
        "class": "CViewModel_ElementRelay",
        "customData": {},
        "dataPathStrList": [
            "Start"
        ],
        "dataPathList": [
            [
                0
            ]
        ],
        "selectionToControlPathStrList": [],
        "selectionToControlPathList": []
    },
    {
        "class": "CViewModel_FlexAligner",
        "customData": {},
        "dataPathStrList": [],
        "dataPathList": [],
        "selectionToControlPathStrList": [],
        "selectionToControlPathList": []
    }
]