[
    {
        "setupName": "EPTF_CLL_ExecCtrl_CommonControls",
        "parentID": "EPTF_CLL_ExecCtrl_CommonControls"
    },
    {
        "setupName": "EPTF_CLL_SetupTabs",
        "parentID": "EPTF_CLL_ExecCtrl_Stathandler_CView_Aligner_0"
    }
]