[
    {
        "getData": {
            "source": "ExecCtrl",
            "element": "EntityGroups",
            "selection": [
                0
            ],
            "children": [
                {
                    "getData": {
                        "source": "ExecCtrl",
                        "element": "Scenarios",
                        "params": [
                            {
                                "paramName": "EntityGroup",
                                "paramValue": "%Parent0%"
                            }
                        ],
                        "selection": [
                            0
                        ],
                        "children": [
                            {
                                "getData": {
                                    "source": "ExecCtrl",
                                    "element": "ScStartButton",
                                    "params": [
                                        {
                                            "paramName": "EntityGroup",
                                            "paramValue": "%Parent0%"
                                        },
                                        {
                                            "paramName": "Scenario",
                                            "paramValue": "%Parent1%"
                                        }
                                    ]
                                }
                            },
                            {
                                "getData": {
                                    "source": "ExecCtrl",
                                    "element": "ScStatus",
                                    "params": [
                                        {
                                            "paramName": "EntityGroup",
                                            "paramValue": "%Parent0%"
                                        },
                                        {
                                            "paramName": "Scenario",
                                            "paramValue": "%Parent1%"
                                        }
                                    ]
                                }
                            }
                        ]
                    }
                }
            ]
        }
    }
]