{
    "ViewmodelEditors": [
        {
            "pos": {
                "top": 124,
                "left": 677
            },
            "visible": false
        },
        {
            "pos": {
                "top": 55,
                "left": 482
            },
            "visible": false
        },
        {
            "pos": {
                "top": 184,
                "left": 501
            },
            "visible": false
        }
    ],
    "ViewEditors": [
        {
            "pos": {
                "top": 85,
                "left": 917
            },
            "visible": false
        },
        {
            "pos": {
                "top": 205,
                "left": 1169
            },
            "visible": false
        },
        {
            "pos": {
                "top": 155,
                "left": 925
            },
            "visible": false
        }
    ],
    "HtmlEditor": {
        "pos": {
            "top": 225,
            "left": 1323
        },
        "visible": false
    },
    "RequestEditor": {},
    "Imports": [
        {
            "pos": {
                "top": 291,
                "left": 928
            },
            "visible": false
        },
        {
            "pos": {
                "top": 271,
                "left": 981
            },
            "visible": false
        },
        {
            "pos": {
                "top": 58,
                "left": 1007
            },
            "visible": false
        }
    ]
}