digraph configuration {
    size="7.5,10";
    rankdir=LR;
    ranksep=".50 equally";
    concentrate=true;
    compound=true;
    label="\nConfiguration for cfgsite/prog.x64P"
  node [font=Helvetica, fontsize=14, fontcolor=black];  subgraph cluster0 {label=""; __cfg [label="D:/work/tutorial/isqrt-prog/prog.cfg", color=white, fontcolor=blue];
    node [font=Helvetica, fontsize=10];    subgraph cluster1 {
        label="";
        xdc__top [shape=box,label="xdc\n1, 1, 1, 0", color=white];
    }
    subgraph cluster2 {
        label="";
        xdc_corevers__top [shape=box,label="xdc.corevers\n16, 0, 1, 0", color=white];
    }
    subgraph cluster3 {
        label="";
        xdc_services_global__top [shape=box,label="xdc.services.global\n1, 0, 1", color=white];
        xdc_services_global__bot [shape=point,label="", style=invis];
        xdc_services_global_Clock [style=filled,fillcolor=lightgray, label="Clock"];
        xdc_services_global__top -> xdc_services_global_Clock[style=invis];
        xdc_services_global_Clock -> xdc_services_global__bot[style=invis];
    }
    subgraph cluster4 {
        label="";
        xdc_shelf__top [shape=box,label="xdc.shelf\n1, 0, 0, 0", color=white];
    }
    subgraph cluster5 {
        label="";
        xdc_services_spec__top [shape=box,label="xdc.services.spec\n1, 0, 0, 0", color=white];
    }
    subgraph cluster6 {
        label="";
        xdc_services_intern_xsr__top [shape=box,label="xdc.services.intern.xsr\n1, 0, 0", color=white];
    }
    subgraph cluster7 {
        label="";
        xdc_services_intern_gen__top [shape=box,label="xdc.services.intern.gen\n1, 0, 0, 0", color=white];
    }
    subgraph cluster8 {
        label="";
        xdc_services_intern_cmd__top [shape=box,label="xdc.services.intern.cmd\n1, 0, 0, 0", color=white];
    }
    subgraph cluster9 {
        label="";
        xdc_rov__top [shape=box,label="xdc.rov\n1, 0, 0", color=white];
        xdc_rov__bot [shape=point,label="", style=invis];
    }
    subgraph cluster10 {
        label="";
        charlie_sqrtlib__top [shape=box,label="charlie.sqrtlib\n1, 0, 2, 6", color=white];
        charlie_sqrtlib__bot [shape=point,label="", style=invis];
        charlie_sqrtlib_Settings [style=filled,fillcolor=lightgray, label="Settings"];
        charlie_sqrtlib__top -> charlie_sqrtlib_Settings[style=invis];
        charlie_sqrtlib_Settings -> charlie_sqrtlib__bot[style=invis];
    }
    subgraph cluster11 {
        label="";
        ti_catalog_c6000__top [shape=box,label="ti.catalog.c6000\n1, 0, 0, 0", color=white];
        ti_catalog_c6000__bot [shape=point,label="", style=invis];
        ti_catalog_c6000_TMS320CTCI6482 [style=filled,fillcolor=lightgray, label="TMS320CTCI6482"];
        ti_catalog_c6000__top -> ti_catalog_c6000_TMS320CTCI6482[style=invis];
        ti_catalog_c6000_TMS320CTCI6482 -> ti_catalog_c6000__bot[style=invis];
    }
    subgraph cluster12 {
        label="";
        xdc_platform__top [shape=box,label="xdc.platform\n1, 0, 1, 0", color=white];
        xdc_platform__bot [shape=point,label="", style=invis];
        xdc_platform_ExeContext [style=filled,fillcolor=lightgray, label="ExeContext"];
        xdc_platform__top -> xdc_platform_ExeContext[style=invis];
        xdc_platform_ExeContext -> xdc_platform__bot[style=invis];
        xdc_platform_Utils [style=filled,fillcolor=lightgray, label="Utils"];
        xdc_platform__top -> xdc_platform_Utils[style=invis];
        xdc_platform_Utils -> xdc_platform__bot[style=invis];
    }
    subgraph cluster13 {
        label="";
        xdc_cfg__top [shape=box,label="xdc.cfg\n1, 0, 2, 0", color=white];
        xdc_cfg__bot [shape=point,label="", style=invis];
        xdc_cfg_Program [style=filled,fillcolor=lightgray, label="Program"];
        xdc_cfg__top -> xdc_cfg_Program[style=invis];
        xdc_cfg_Program -> xdc_cfg__bot[style=invis];
        xdc_cfg_Main [style=filled,fillcolor=lightgray, label="Main"];
        xdc_cfg__top -> xdc_cfg_Main[style=invis];
        xdc_cfg_Main -> xdc_cfg__bot[style=invis];
    }
    subgraph cluster14 {
        label="";
        ti_platforms_sim64Pxx__top [shape=box,label="ti.platforms.sim64Pxx\n1, 0, 0", color=white];
        ti_platforms_sim64Pxx__bot [shape=point,label="", style=invis];
        ti_platforms_sim64Pxx_Platform [style=filled,fillcolor=lightgray, label="Platform"];
        ti_platforms_sim64Pxx__top -> ti_platforms_sim64Pxx_Platform[style=invis];
        ti_platforms_sim64Pxx_Platform -> ti_platforms_sim64Pxx__bot[style=invis];
    }
    subgraph cluster15 {
        label="";
        xdc_runtime__top [shape=box,label="xdc.runtime\n2, 0, 0, 0", color=white];
        xdc_runtime__bot [shape=point,label="", style=invis];
        xdc_runtime_Assert [style=filled,fillcolor=lightgray, label="Assert"];
        xdc_runtime__top -> xdc_runtime_Assert[style=invis];
        xdc_runtime_Assert -> xdc_runtime__bot[style=invis];
        xdc_runtime_Core [style=filled,fillcolor=lightgray, label="Core"];
        xdc_runtime__top -> xdc_runtime_Core[style=invis];
        xdc_runtime_Core -> xdc_runtime__bot[style=invis];
        xdc_runtime_Defaults [style=filled,fillcolor=lightgray, label="Defaults"];
        xdc_runtime__top -> xdc_runtime_Defaults[style=invis];
        xdc_runtime_Defaults -> xdc_runtime__bot[style=invis];
        xdc_runtime_Diags [style=filled,fillcolor=lightgray, label="Diags"];
        xdc_runtime__top -> xdc_runtime_Diags[style=invis];
        xdc_runtime_Diags -> xdc_runtime__bot[style=invis];
        xdc_runtime_Error [style=filled,fillcolor=lightgray, label="Error"];
        xdc_runtime__top -> xdc_runtime_Error[style=invis];
        xdc_runtime_Error -> xdc_runtime__bot[style=invis];
        xdc_runtime_Gate [style=filled,fillcolor=lightgray, label="Gate"];
        xdc_runtime__top -> xdc_runtime_Gate[style=invis];
        xdc_runtime_Gate -> xdc_runtime__bot[style=invis];
        xdc_runtime_GateNull [style=filled,fillcolor=lightgray, label="GateNull"];
        xdc_runtime__top -> xdc_runtime_GateNull[style=invis];
        xdc_runtime_GateNull -> xdc_runtime__bot[style=invis];
        xdc_runtime_Log [style=filled,fillcolor=lightgray, label="Log"];
        xdc_runtime__top -> xdc_runtime_Log[style=invis];
        xdc_runtime_Log -> xdc_runtime__bot[style=invis];
        xdc_runtime_Main [style=filled,fillcolor=lightgray, label="Main"];
        xdc_runtime__top -> xdc_runtime_Main[style=invis];
        xdc_runtime_Main -> xdc_runtime__bot[style=invis];
        xdc_runtime_Memory [style=filled,fillcolor=lightgray, label="Memory"];
        xdc_runtime__top -> xdc_runtime_Memory[style=invis];
        xdc_runtime_Memory -> xdc_runtime__bot[style=invis];
        xdc_runtime_HeapStd [style=filled,fillcolor=lightgray, label="HeapStd"];
        xdc_runtime__top -> xdc_runtime_HeapStd[style=invis];
        xdc_runtime_HeapStd -> xdc_runtime__bot[style=invis];
        xdc_runtime_Startup [style=filled,fillcolor=lightgray, label="Startup"];
        xdc_runtime__top -> xdc_runtime_Startup[style=invis];
        xdc_runtime_Startup -> xdc_runtime__bot[style=invis];
        xdc_runtime_System [style=filled,fillcolor=lightgray, label="System"];
        xdc_runtime__top -> xdc_runtime_System[style=invis];
        xdc_runtime_System -> xdc_runtime__bot[style=invis];
        xdc_runtime_SysMin [style=filled,fillcolor=lightgray, label="SysMin"];
        xdc_runtime__top -> xdc_runtime_SysMin[style=invis];
        xdc_runtime_SysMin -> xdc_runtime__bot[style=invis];
        xdc_runtime_Text [style=filled,fillcolor=lightgray, label="Text"];
        xdc_runtime__top -> xdc_runtime_Text[style=invis];
        xdc_runtime_Text -> xdc_runtime__bot[style=invis];
        xdc_runtime_Main_Module_GateProxy [style=filled,fillcolor=lightgray, label="Main_Module_GateProxy"];
        xdc_runtime__top -> xdc_runtime_Main_Module_GateProxy[style=invis];
        xdc_runtime_Main_Module_GateProxy -> xdc_runtime__bot[style=invis];
        xdc_runtime_Memory_HeapProxy [style=filled,fillcolor=lightgray, label="Memory_HeapProxy"];
        xdc_runtime__top -> xdc_runtime_Memory_HeapProxy[style=invis];
        xdc_runtime_Memory_HeapProxy -> xdc_runtime__bot[style=invis];
        xdc_runtime_System_SupportProxy [style=filled,fillcolor=lightgray, label="System_SupportProxy"];
        xdc_runtime__top -> xdc_runtime_System_SupportProxy[style=invis];
        xdc_runtime_System_SupportProxy -> xdc_runtime__bot[style=invis];
        xdc_runtime_System_Module_GateProxy [style=filled,fillcolor=lightgray, label="System_Module_GateProxy"];
        xdc_runtime__top -> xdc_runtime_System_Module_GateProxy[style=invis];
        xdc_runtime_System_Module_GateProxy -> xdc_runtime__bot[style=invis];
    }
    subgraph cluster16 {
        label="";
        ti_targets_rts6000__top [shape=box,label="ti.targets.rts6000\n1, 0, 0, 0", color=white];
    }
    subgraph cluster17 {
        label="";
        acme_utils_clocks__top [shape=box,label="acme.utils.clocks\n", color=white];
        acme_utils_clocks__bot [shape=point,label="", style=invis];
        acme_utils_clocks_ClockStd [style=filled,fillcolor=lightgray, label="ClockStd"];
        acme_utils_clocks__top -> acme_utils_clocks_ClockStd[style=invis];
        acme_utils_clocks_ClockStd -> acme_utils_clocks__bot[style=invis];
    }
    subgraph cluster18 {
        label="";
        acme_utils__top [shape=box,label="acme.utils\n", color=white];
        acme_utils__bot [shape=point,label="", style=invis];
        acme_utils_Bench [style=filled,fillcolor=lightgray, label="Bench"];
        acme_utils__top -> acme_utils_Bench[style=invis];
        acme_utils_Bench -> acme_utils__bot[style=invis];
        acme_utils_Bench_PClock [style=filled,fillcolor=lightgray, label="Bench_PClock"];
        acme_utils__top -> acme_utils_Bench_PClock[style=invis];
        acme_utils_Bench_PClock -> acme_utils__bot[style=invis];
    }
    subgraph cluster19 {
        label="";
        cfgsite__top [shape=box,label="cfgsite\n", color=white];
    }
  }
  node [font=Helvetica, fontsize=10];
    ti_targets_C64P__1_0_6__1_5 [shape=record,label="ti.targets.C64P|1,0,6.1,5",style=filled, fillcolor=lightgrey];
    charlie_sqrtlib__bot -> ti_targets_C64P__1_0_6__1_5 [ltail=cluster10];
    ti_targets_C64P__1_0_6__0_16 [shape=record,label="ti.targets.C64P|1,0,6.0,16",style=filled, fillcolor=lightgrey];
    ti_targets_rts6000__top -> ti_targets_C64P__1_0_6__0_16 [ltail=cluster16];
    ti_targets_C64P__1_0_6__1_5 [shape=record,label="ti.targets.C64P|1,0,6.1,5",style=filled, fillcolor=lightgrey];
    acme_utils_clocks__bot -> ti_targets_C64P__1_0_6__1_5 [ltail=cluster17];
    ti_targets_C64P__1_0_6__1_5 [shape=record,label="ti.targets.C64P|1,0,6.1,5",style=filled, fillcolor=lightgrey];
    acme_utils__bot -> ti_targets_C64P__1_0_6__1_5 [ltail=cluster18];
    ti_targets_C64P__1_0_6__1_5 [shape=record,label="ti.targets.C64P|1,0,6.1,5",style=filled, fillcolor=lightgrey];
    cfgsite__top -> ti_targets_C64P__1_0_6__1_5 [ltail=cluster19];
}
