[comment encoding = UTF-8 /]
[module GenerateSystemModel('http://designer.papyrus.eclipse.org/realtime/pycpa/0.1')]

[import org::eclipse::papyrus::designer::realtime::pycpa::m2t::utils::UtilityTemplates /]

[template public generatePyCpaSystemModel(s : System)]
from pycpa import schedulers
from pycpa import model
from pycpa import junctions

def [s.name/]():
	# create system
	[s.generateSystem()/]

	# create resources
	[s.generateResources()/]

	[for (r : Resource | s.resources)][r.generateTasks(s.genVarName())/][/for]
	[s.generateJunctions()/]

	# create tasks' input event models
	[for (r : Resource | s.resources)][r.generateInEvtModels()/][/for]

	# specify paths (register tasks' precedence constraints (task links) automatically)
	[for (p : Path | s.paths)]
	[p.generatePath(s.genVarName())/]
	[/for]

	[for (e : EffectChain | s.effectchains)]
	[e.generateEffectChainDependency()/]
	[/for]

	[for (e : EffectChain | s.effectchains) before ('\t# define effect chain\n\tchains = [\n') separator(',') after ('\t]')]
		[e.generateEffectChain()/]
	[/for]

	return [s.genVarName()/][comment: using s.generateReturnStatement() apparently causes problems if then one gets only the 1st arg /]
[/template]

[template public generateSystem(s:System) post(trim())]
[s.genVarName()/] = model.System()
[/template]

[template public generateResources(s:System) post(trim())]
[for (r : Resource | s.resources)]
[r.generateResource(s.genVarName())/]
[/for]
[/template]

[template public generateResource(r:Resource, sn:String) post(trim())]
[r.genVarName()/] = [sn/].bind_resource(model.Resource("[r.name/]", schedulers.SPPSchedulerActivationOffsets()))
[/template]

[template public generateTasks(r:Resource, systemName:String)]
# create and bind tasks to [r.name/]
[for (t : Task | r.tasks)]
[t.generateTask(r.genVarName(), systemName)/]
[/for]

[/template]

[template public generateTask(t:Task, rn:String, systemName:String) post(trim())]
[t.genVarName()/] = [rn/].bind_task(model.[if (t.oclIsTypeOf(Fork))]Fork[else]Task[/if]("[t.name/]", wcet=[t.wcet/], bcet=[t.bcet/], scheduling_parameter=[t.scheduling_parameter/], system=[systemName/][t.generateAdditionalParameters()/]))
[systemName/].constraints.add_wcrt_constraint([t.genVarName()/], [t.deadline/])
[/template]

[template public generateAdditionalParameters(t:Task) post(trim())]
[comment: Empty stub/]
[/template]

[template public generateAdditionalParameters(f:Fork) post(trim())]
, strategy=[f.strategy/]
[/template]

[template public generateJunctions(s:System) ?(not s.junctions->isEmpty())]
# create junctions
[for (j : Junction | s.junctions)]
[j.generateJunction(s.genVarName())/]
[/for]
[/template]

[template public generateJunction(j:Junction, sn:String) post(trim())]
[j.genVarName()/] = [sn/].bind_junction(model.Junction(name="[j.name/]", strategy=junctions.[j.strategy.generateJunctionStrategyKind()/]))
[/template]

[template public generateJunctionStrategyKind(jsk:JunctionStrategyKind) post(trim())]
[if (jsk=JunctionStrategyKind::AND)]ANDJoin()[elseif(jsk=JunctionStrategyKind::OR)]ORJoin()[/if]
[/template]

[template public generateInEvtModels(r:Resource)]
[for (t : Task | r.tasks->select(k | not k.in_eventmodel->isEmpty()))]
[t.in_eventmodel.generateInEvtModel(t.genVarName())/]
[/for]
[/template]

[template public generateInEvtModel(e:EventModel, tn:String) post(trim())]
[comment: Empty stub/]
[/template]

[template public generateInEvtModel(p:PJdEventModel, tn:String) post(trim())]
[tn/].in_event_model = model.PJdEventModel(P=[p.period/], J=[p.jitter/], d_min=[p.min_distance/], phi=[p.offset/])
[/template]

[template public generatePath(p:Path, sn:String) post(trim())]
[p.genVarName()/] = [sn/].bind_path(model.Path("[p.name/]", ['['/][p.generateConnectablesList()/][']'/]))
[/template]

[template public generateEffectChain(e:EffectChain)]
model.EffectChain(name='[e.name/]', tasks=['['/][e.generateConnectablesList()/][']'/])
[/template]

[template public generateEffectChainDependency(e:EffectChain)]
[e.generateLinkDependentTaskCalls()/]
[/template]

[template public generateConnectablesList(l:ConnectablesOrderedSet)]
[for (e : ConnectableElement | l.elements->subOrderedSet(1, l.elements->size()-1))][e.genVarName()/], [/for][l.elements->last().genVarName()/]
[/template]

[template public generateLinkDependentTaskCalls(l:ConnectablesOrderedSet)]
[l.elements->first().genVarName()/].link_dependent_task([for (e : ConnectableElement | l.elements->subOrderedSet(2, l.elements->size() - 1))][e.genVarName()/]).link_dependent_task([/for][l.elements->last().genVarName()/])
[/template]

[template public generateReturnStatement(s:System)]
[s.genVarName()/][if (not s.resources->isEmpty())][s.generateResAndTskRetSt()/][/if][if (not s.paths->isEmpty())][s.generatePathRetSt()/][/if], chains
[/template]

[template public generateResAndTskRetSt(s:System)]
[for (r : Resource | s.resources)], [r.genVarName()/][if (not r.tasks->isEmpty())][r.generateTskRetSt()/][/if][/for]
[/template]

[template public generateTskRetSt(r:Resource)]
[for (t : Task | r.tasks)], [t.genVarName()/][/for]
[/template]

[template public generatePathRetSt(s:System)]
, ['['/][for (p : Path | s.paths->subOrderedSet(1, s.paths->size()-1))][p.genVarName()/], [/for][s.paths->last().genVarName()/][']'/]
[/template]