[comment encoding = UTF-8 /]
[module GeneratePythonAnalysis('http://designer.papyrus.eclipse.org/realtime/pycpa/0.1')]

[import org::eclipse::papyrus::designer::realtime::pycpa::m2t::utils::UtilityTemplates /]

[template public generatePythonAnalysis(s : System)]
import pycpa_analysis as analysis # import the CEA's analysis (and visualization) module for pyCPA
import [s.name/] as model # import the generated module which contains the API calls to build the system model
import json
import inspect, os

analysis.parse_options() # parse command line options
system = model.[s.name/]() # build the model

try:
	analysis.analyze_system(system) # analyze the system's real time metrics
except:
	pass

result = {
    "task":['['/][']'/],
    "sharedResource":['['/][']'/],
    "resource":['['/][']'/]
}

for resource in system.resources:
    load = resource.load()
    result['['/]"resource"[']'/].append({"name":resource.name, "load":load})
    for task in resource.tasks:
        result['['/]"task"[']'/].append({"name":task.name, "wcrt":task.analysis_results.wcrt, "bcrt":task.analysis_results.bcrt})

scriptFolderPath = os.path.dirname(os.path.abspath(inspect.getfile(inspect.currentframe())))
resultPath = os.path.join(scriptFolderPath, '%s_result.json' % "[s.name/]")

with open(resultPath, 'w') as outfile:
    json.dump(result, outfile)
[/template]