<?xml version="1.0" encoding="UTF-8"?>
<svg xmlns="http://www.w3.org/2000/svg" xmlns:xlink="http://www.w3.org/1999/xlink" stroke-dasharray="none" shape-rendering="auto" font-family="'Dialog'" width="120" text-rendering="auto" fill-opacity="1" contentScriptType="text/ecmascript" color-interpolation="auto" color-rendering="auto" preserveAspectRatio="xMidYMid meet" font-size="12" viewBox="0 0 120 300" fill="black" stroke="black" image-rendering="auto" stroke-miterlimit="10" zoomAndPan="magnify" version="1.0" stroke-linecap="square" stroke-linejoin="miter" contentStyleType="text/css" font-style="normal" height="300" stroke-width="1" stroke-dashoffset="0" font-weight="normal" stroke-opacity="1">
<!--Generated by the Batik Graphics2D SVG Generator-->
<defs id="genericDefs"/>
<g>
<defs id="defs1">
<clipPath clipPathUnits="userSpaceOnUse" id="clipPath1">
<path d="M9 9 L111 9 L111 111 L9 111 L9 9 Z"/>
</clipPath>
<clipPath clipPathUnits="userSpaceOnUse" id="clipPath2">
<path d="M12 12 L111 12 L111 28 L12 28 L12 12 Z"/>
</clipPath>
<clipPath clipPathUnits="userSpaceOnUse" id="clipPath3">
<path d="M24 27 L101 27 L101 43 L24 43 L24 27 Z"/>
</clipPath>
<clipPath clipPathUnits="userSpaceOnUse" id="clipPath4">
<path d="M14 44 L73 44 L73 60 L14 60 L14 44 Z"/>
</clipPath>
<clipPath clipPathUnits="userSpaceOnUse" id="clipPath5">
<path d="M14 58 L68 58 L68 74 L14 74 L14 58 Z"/>
</clipPath>
<clipPath clipPathUnits="userSpaceOnUse" id="clipPath6">
<path d="M14 72 L74 72 L74 88 L14 88 L14 72 Z"/>
</clipPath>
<clipPath clipPathUnits="userSpaceOnUse" id="clipPath7">
<path d="M9 42 L111 42 L111 111 L9 111 L9 42 Z"/>
</clipPath>
<clipPath clipPathUnits="userSpaceOnUse" id="clipPath8">
<path d="M9 171 L111 171 L111 291 L9 291 L9 171 Z"/>
</clipPath>
<clipPath clipPathUnits="userSpaceOnUse" id="clipPath9">
<path d="M12 174 L111 174 L111 190 L12 190 L12 174 Z"/>
</clipPath>
<clipPath clipPathUnits="userSpaceOnUse" id="clipPath10">
<path d="M31 189 L95 189 L95 205 L31 205 L31 189 Z"/>
</clipPath>
<clipPath clipPathUnits="userSpaceOnUse" id="clipPath11">
<path d="M14 206 L41 206 L41 222 L14 222 L14 206 Z"/>
</clipPath>
<clipPath clipPathUnits="userSpaceOnUse" id="clipPath12">
<path d="M14 220 L41 220 L41 236 L14 236 L14 220 Z"/>
</clipPath>
<clipPath clipPathUnits="userSpaceOnUse" id="clipPath13">
<path d="M14 234 L41 234 L41 250 L14 250 L14 234 Z"/>
</clipPath>
<clipPath clipPathUnits="userSpaceOnUse" id="clipPath14">
<path d="M14 248 L41 248 L41 264 L14 264 L14 248 Z"/>
</clipPath>
<clipPath clipPathUnits="userSpaceOnUse" id="clipPath15">
<path d="M14 262 L41 262 L41 278 L14 278 L14 262 Z"/>
</clipPath>
<clipPath clipPathUnits="userSpaceOnUse" id="clipPath16">
<path d="M9 204 L111 204 L111 291 L9 291 L9 204 Z"/>
</clipPath>
</defs>
<g font-size="18" fill="white" stroke-linejoin="round" stroke="white" stroke-width="0" stroke-miterlimit="0">
<rect x="11" y="11" clip-path="url(#clipPath1)" width="98" height="98" stroke="none"/>
<rect x="10" y="10" clip-path="url(#clipPath1)" width="100" height="100" stroke="none"/>
<text x="20" y="31" clip-path="url(#clipPath2)" fill="black" stroke="none" xml:space="preserve">«Enumeration»</text>
<text x="25" y="46" clip-path="url(#clipPath3)" fill="black" stroke="none" xml:space="preserve">Classification</text>
<text x="15" y="63" clip-path="url(#clipPath4)" fill="black" stroke="none" xml:space="preserve">Creational</text>
<text x="15" y="77" clip-path="url(#clipPath5)" fill="black" stroke="none" xml:space="preserve">Structural</text>
<text x="15" y="91" clip-path="url(#clipPath6)" fill="black" stroke="none" xml:space="preserve">Behavioral</text>
</g>
<g stroke-width="1.1" font-size="18" stroke-linecap="butt">
<line clip-path="url(#clipPath7)" fill="none" x1="10" x2="110" y1="43" y2="43"/>
<rect x="10" y="10" clip-path="url(#clipPath1)" fill="none" width="99" height="99"/>
<rect x="11" y="173" clip-path="url(#clipPath8)" fill="white" width="98" height="116" stroke="none"/>
<rect x="10" y="172" clip-path="url(#clipPath8)" fill="white" width="100" height="118" stroke="none"/>
<text xml:space="preserve" x="20" y="193" clip-path="url(#clipPath9)" stroke="none">«Enumeration»</text>
<text xml:space="preserve" x="32" y="208" clip-path="url(#clipPath10)" stroke="none">SafetyLevel</text>
<text xml:space="preserve" x="15" y="225" clip-path="url(#clipPath11)" stroke="none">SIL0</text>
<text xml:space="preserve" x="15" y="239" clip-path="url(#clipPath12)" stroke="none">SIL1</text>
<text xml:space="preserve" x="15" y="253" clip-path="url(#clipPath13)" stroke="none">SIL2</text>
<text xml:space="preserve" x="15" y="267" clip-path="url(#clipPath14)" stroke="none">SIL3</text>
<text xml:space="preserve" x="15" y="281" clip-path="url(#clipPath15)" stroke="none">SIL4</text>
<line clip-path="url(#clipPath16)" fill="none" x1="10" x2="110" y1="205" y2="205"/>
<rect x="10" y="172" clip-path="url(#clipPath8)" fill="none" width="99" height="117"/>
</g>
</g>
</svg>
