@startuml

package MyApp <<Node>> {
}

note left of MyApp: This is an application that uses\nthe RoadLogicSuite as a library.

class RoadLogicSuite {
+ void LoadFile(string file)
+ optional<OpenDriveReferenceLinePosition> ConvertInertialToReferenceLineCoordinates(Vec3<meter_t> query)
+ optional<Vec3<meter_t>> ConvertReferenceLineToInertialCoordinates(OpenDriveReferenceLinePosition query)
+ optional<LanePosition> ConvertInertialToLaneCoordinates(Vec3<meter_t> query)
+ optional<Vec3<meter_t>> ConvertLaneToInertialCoordinates(LanePosition query)
+ IMap ConvertMap()
+ IMap ConvertMap(MapConverterConfig config)
+ ValidationRunner GetMapValidator()
}

class ValidationRunner {
+ vector<MapError> Validate()
+ void SetConfiguration(unique_ptr<AbstractValidationConfig> config)
}

abstract class AbstractValidationConfig {
unique ptrs to each validator implementation
}

struct MapError {
+ string error_message
}

struct MapConverterConfig {
+ meter_t sampling_distance
}

struct LanePosition {
+ string road_id
+ int64_t lane_id
+ meter_t s_offset, t_offset
}

struct OpenDriveReferenceLinePosition {
+ string road_id
+ meter_t s_offset, t_offset
}

struct Vec3<T> {
+ T x, y, z
}

MyApp -> RoadLogicSuite

RoadLogicSuite -- ValidationRunner
RoadLogicSuite -- MapConverterConfig
RoadLogicSuite -- LanePosition
RoadLogicSuite -- OpenDriveReferenceLinePosition
RoadLogicSuite -- Vec3

ValidationRunner -- MapError
ValidationRunner -- AbstractValidationConfig

@enduml
