@startuml
'https://plantuml.com/sequence-diagram

ExternalApplication -> RoadLogicSuite: Load_Map(path)
RoadLogicSuite -> ExternalApplication: Return_Success

ExternalApplication -> RoadLogicSuite : Convert(opt. Config)
RoadLogicSuite -> IMapConverter ** : Create
RoadLogicSuite -> IMapConverter : Setup + Convert
IMapConverter -> RoadLogicSuite : Return Map
RoadLogicSuite -> ExternalApplication : Return Map

@enduml
