<?xml version="1.0" encoding="UTF-8" standalone="no"?>
<!-- Created with Inkscape (http://www.inkscape.org/) -->

<svg
   width="210mm"
   height="140.03429mm"
   viewBox="0 0 210 140.03429"
   version="1.1"
   id="svg12177"
   sodipodi:docname="WorldCoordinateSystem.svg"
   inkscape:version="1.2.2 (732a01da63, 2022-12-09)"
   inkscape:export-filename="distance.png"
   inkscape:export-xdpi="600"
   inkscape:export-ydpi="600"
   xmlns:inkscape="http://www.inkscape.org/namespaces/inkscape"
   xmlns:sodipodi="http://sodipodi.sourceforge.net/DTD/sodipodi-0.dtd"
   xmlns:xlink="http://www.w3.org/1999/xlink"
   xmlns="http://www.w3.org/2000/svg"
   xmlns:svg="http://www.w3.org/2000/svg"
   xmlns:rdf="http://www.w3.org/1999/02/22-rdf-syntax-ns#"
   xmlns:cc="http://creativecommons.org/ns#"
   xmlns:dc="http://purl.org/dc/elements/1.1/">
  <title
     id="title524">WorldCoordinateSystem</title>
  <sodipodi:namedview
     id="namedview525"
     pagecolor="#505050"
     bordercolor="#eeeeee"
     borderopacity="1"
     inkscape:showpageshadow="0"
     inkscape:pageopacity="0"
     inkscape:pagecheckerboard="0"
     inkscape:deskcolor="#505050"
     inkscape:document-units="mm"
     showgrid="false"
     inkscape:zoom="1.20625"
     inkscape:cx="453.057"
     inkscape:cy="330.7772"
     inkscape:window-width="1920"
     inkscape:window-height="1017"
     inkscape:window-x="1912"
     inkscape:window-y="-8"
     inkscape:window-maximized="1"
     inkscape:current-layer="layer5" />
  <style
     type="text/css"
     id="style515">
      .line1{stroke:#000000;stroke-width:0.299655;stroke-miterlimit:4;stroke-dasharray:0.299655;stroke-dashoffset:0}
   </style>
  <defs
     id="defs12174">
    <marker
       style="overflow:visible"
       id="TriangleStart"
       refX="3.5"
       refY="0"
       orient="auto-start-reverse"
       inkscape:stockid="TriangleStart"
       markerWidth="5.3244081"
       markerHeight="6.155385"
       viewBox="0 0 5.3244081 6.1553851"
       inkscape:isstock="true"
       inkscape:collect="always"
       preserveAspectRatio="xMidYMid">
      <path
         transform="scale(0.5)"
         style="fill:context-stroke;fill-rule:evenodd;stroke:context-stroke;stroke-width:1pt"
         d="M 5.77,0 -2.88,5 V -5 Z"
         id="path135" />
    </marker>
    <inkscape:path-effect
       effect="offset"
       id="path-effect38844"
       is_visible="true"
       lpeversion="1.2"
       linejoin_type="miter"
       unit="mm"
       offset="6.4"
       miter_limit="4"
       attempt_force_join="false"
       update_on_knot_move="true" />
    <inkscape:path-effect
       effect="tiling"
       id="path-effect38774"
       is_visible="true"
       lpeversion="1"
       unit="px"
       seed="1;1"
       lpesatellites=""
       num_rows="3"
       num_cols="3"
       gapx="0"
       gapy="0"
       offset="0"
       offset_type="false"
       scale="0"
       rotate="0"
       mirrorrowsx="false"
       mirrorrowsy="false"
       mirrorcolsx="false"
       mirrorcolsy="false"
       mirrortrans="false"
       shrink_interp="false"
       split_items="false"
       link_styles="false"
       interpolate_scalex="false"
       interpolate_scaley="true"
       interpolate_rotatex="false"
       interpolate_rotatey="true"
       random_scale="false"
       random_rotate="false"
       random_gap_y="false"
       random_gap_x="false"
       transformorigin="" />
    <inkscape:path-effect
       effect="offset"
       id="path-effect38772"
       is_visible="true"
       lpeversion="1.2"
       linejoin_type="miter"
       unit="mm"
       offset="0"
       miter_limit="4"
       attempt_force_join="false"
       update_on_knot_move="true" />
    <inkscape:path-effect
       effect="fillet_chamfer"
       id="path-effect38550"
       is_visible="true"
       lpeversion="1"
       nodesatellites_param="F,0,0,1,0,0.26458333,0,1 @ F,0,0,1,0,0.26458333,0,1 @ F,0,0,1,0,0.26458333,0,1 @ F,0,0,1,0,0.26458333,0,1"
       unit="px"
       method="auto"
       mode="F"
       radius="1"
       chamfer_steps="1"
       flexible="false"
       use_knot_distance="true"
       apply_no_radius="true"
       apply_with_radius="true"
       only_selected="false"
       hide_knots="false" />
    <inkscape:path-effect
       effect="fillet_chamfer"
       id="path-effect38546"
       is_visible="true"
       lpeversion="1"
       nodesatellites_param="F,0,0,1,0,0.26458333,0,1 @ F,0,0,1,0,0.26458333,0,1 @ F,0,0,1,0,0.26458333,0,1 @ F,0,0,1,0,0.26458333,0,1"
       unit="px"
       method="auto"
       mode="F"
       radius="1"
       chamfer_steps="1"
       flexible="false"
       use_knot_distance="true"
       apply_no_radius="true"
       apply_with_radius="true"
       only_selected="false"
       hide_knots="false" />
    <inkscape:path-effect
       effect="fillet_chamfer"
       id="path-effect38542"
       is_visible="true"
       lpeversion="1"
       nodesatellites_param="F,0,0,1,0,0.26458333,0,1 @ F,0,0,1,0,0.26458333,0,1 @ F,0,0,1,0,0.26458333,0,1 @ F,0,0,1,0,0.26458333,0,1"
       unit="px"
       method="auto"
       mode="F"
       radius="1"
       chamfer_steps="1"
       flexible="false"
       use_knot_distance="true"
       apply_no_radius="true"
       apply_with_radius="true"
       only_selected="false"
       hide_knots="false" />
    <inkscape:path-effect
       effect="fillet_chamfer"
       id="path-effect38538"
       is_visible="true"
       lpeversion="1"
       nodesatellites_param="F,0,0,1,0,0.26458333,0,1 @ F,0,0,1,0,0.26458333,0,1 @ F,0,0,1,0,0.26458333,0,1 @ F,0,0,1,0,0.26458333,0,1"
       unit="px"
       method="auto"
       mode="F"
       radius="1"
       chamfer_steps="1"
       flexible="false"
       use_knot_distance="true"
       apply_no_radius="true"
       apply_with_radius="true"
       only_selected="false"
       hide_knots="false" />
    <inkscape:path-effect
       effect="fillet_chamfer"
       id="path-effect32727"
       is_visible="true"
       lpeversion="1"
       nodesatellites_param="F,0,0,1,0,0.26458333,0,1 @ F,0,0,1,0,0.26458333,0,1 @ F,0,0,1,0,0.26458333,0,1 @ F,0,0,1,0,0.26458333,0,1"
       unit="px"
       method="auto"
       mode="F"
       radius="1"
       chamfer_steps="1"
       flexible="false"
       use_knot_distance="true"
       apply_no_radius="true"
       apply_with_radius="true"
       only_selected="false"
       hide_knots="false" />
    <inkscape:path-effect
       effect="fillet_chamfer"
       id="path-effect32707"
       is_visible="true"
       lpeversion="1"
       nodesatellites_param="F,0,0,1,0,0.26458333,0,1 @ F,0,0,1,0,0.26458333,0,1 @ F,0,0,1,0,0.26458333,0,1 @ F,0,0,1,0,0.26458333,0,1"
       unit="px"
       method="auto"
       mode="F"
       radius="1"
       chamfer_steps="1"
       flexible="false"
       use_knot_distance="true"
       apply_no_radius="true"
       apply_with_radius="true"
       only_selected="false"
       hide_knots="false" />
    <inkscape:path-effect
       effect="fillet_chamfer"
       id="path-effect32687"
       is_visible="true"
       lpeversion="1"
       nodesatellites_param="F,0,0,1,0,0.26458333,0,1 @ F,0,0,1,0,0.26458333,0,1 @ F,0,0,1,0,0.26458333,0,1 @ F,0,0,1,0,0.26458333,0,1"
       unit="px"
       method="auto"
       mode="F"
       radius="1"
       chamfer_steps="1"
       flexible="false"
       use_knot_distance="true"
       apply_no_radius="true"
       apply_with_radius="true"
       only_selected="false"
       hide_knots="false" />
    <inkscape:path-effect
       effect="fillet_chamfer"
       id="path-effect32667"
       is_visible="true"
       lpeversion="1"
       nodesatellites_param="F,0,0,1,0,0.26458333,0,1 @ F,0,0,1,0,0.26458333,0,1 @ F,0,0,1,0,0.26458333,0,1 @ F,0,0,1,0,0.26458333,0,1"
       unit="px"
       method="auto"
       mode="F"
       radius="1"
       chamfer_steps="1"
       flexible="false"
       use_knot_distance="true"
       apply_no_radius="true"
       apply_with_radius="true"
       only_selected="false"
       hide_knots="false" />
    <linearGradient
       inkscape:collect="always"
       id="linearGradient30868">
      <stop
         style="stop-color:#333333;stop-opacity:1;"
         offset="0"
         id="stop30858" />
      <stop
         style="stop-color:#000000;stop-opacity:1;"
         offset="0.1"
         id="stop30860" />
      <stop
         style="stop-color:#20ff00;stop-opacity:1;"
         offset="0.5"
         id="stop30862" />
      <stop
         style="stop-color:#000000;stop-opacity:1;"
         offset="0.89999998"
         id="stop30864" />
      <stop
         style="stop-color:#333333;stop-opacity:1;"
         offset="1"
         id="stop30866" />
    </linearGradient>
    <linearGradient
       inkscape:collect="always"
       id="linearGradient27324">
      <stop
         style="stop-color:#333333;stop-opacity:1;"
         offset="0"
         id="stop27314" />
      <stop
         style="stop-color:#000000;stop-opacity:1;"
         offset="0.1"
         id="stop27316" />
      <stop
         style="stop-color:#808080;stop-opacity:1;"
         offset="0.5"
         id="stop27318" />
      <stop
         style="stop-color:#000000;stop-opacity:1;"
         offset="0.89999998"
         id="stop27320" />
      <stop
         style="stop-color:#333333;stop-opacity:1;"
         offset="1"
         id="stop27322" />
    </linearGradient>
    <linearGradient
       id="linearGradient13254">
      <stop
         style="stop-color:#ffffff;stop-opacity:0.50193125"
         offset="0"
         id="stop13250" />
      <stop
         style="stop-color:#ffffff;stop-opacity:0"
         offset="1"
         id="stop13252" />
    </linearGradient>
    <radialGradient
       xlink:href="#linearGradient13254"
       id="radialGradient17053"
       cx="88.337814"
       cy="74.649353"
       fx="88.337814"
       fy="74.649353"
       r="49.89299"
       gradientTransform="matrix(0.99769605,0,0,0.99999285,-87.912228,-39.371667)"
       gradientUnits="userSpaceOnUse" />
    <filter
       inkscape:collect="always"
       style="color-interpolation-filters:sRGB"
       id="filter18222-0"
       x="-0.033541095"
       y="-0.018109434"
       width="1.0670822"
       height="1.0362189">
      <feGaussianBlur
         inkscape:collect="always"
         stdDeviation="0.40870019"
         id="feGaussianBlur18224-1" />
    </filter>
    <filter
       inkscape:collect="always"
       style="color-interpolation-filters:sRGB"
       id="filter18230-3"
       x="-0.033975737"
       y="-0.01798521"
       width="1.0679515"
       height="1.0359704">
      <feGaussianBlur
         inkscape:collect="always"
         stdDeviation="0.33132421"
         id="feGaussianBlur18232-0" />
    </filter>
    <filter
       inkscape:collect="always"
       style="color-interpolation-filters:sRGB"
       id="filter18226-1"
       x="-0.012851508"
       y="-0.13846328"
       width="1.025703"
       height="1.2769266">
      <feGaussianBlur
         inkscape:collect="always"
         stdDeviation="0.10292743"
         id="feGaussianBlur18228-7" />
    </filter>
    <filter
       inkscape:collect="always"
       style="color-interpolation-filters:sRGB"
       id="filter19744"
       x="-0.16377558"
       y="-0.11438444"
       width="1.3275512"
       height="1.2287689">
      <feGaussianBlur
         inkscape:collect="always"
         stdDeviation="0.095859125"
         id="feGaussianBlur19746" />
    </filter>
    <filter
       inkscape:collect="always"
       style="color-interpolation-filters:sRGB"
       id="filter18242-0"
       x="-0.079568165"
       y="-0.013799525"
       width="1.1591363"
       height="1.027599">
      <feGaussianBlur
         inkscape:collect="always"
         stdDeviation="0.13980316"
         id="feGaussianBlur18244-1" />
    </filter>
    <filter
       inkscape:collect="always"
       style="color-interpolation-filters:sRGB"
       id="filter18234-5"
       x="-0.019646573"
       y="-0.049054145"
       width="1.0499933"
       height="1.0801728">
      <feGaussianBlur
         inkscape:collect="always"
         stdDeviation="0.092708589"
         id="feGaussianBlur18236-7" />
    </filter>
    <filter
       inkscape:collect="always"
       style="color-interpolation-filters:sRGB"
       id="filter18226-1-8"
       x="-0.012851508"
       y="-0.13846328"
       width="1.025703"
       height="1.2769266">
      <feGaussianBlur
         inkscape:collect="always"
         stdDeviation="0.10292743"
         id="feGaussianBlur18228-7-5" />
    </filter>
    <filter
       inkscape:collect="always"
       style="color-interpolation-filters:sRGB"
       id="filter19748"
       x="-0.16377558"
       y="-0.11438501"
       width="1.3275512"
       height="1.22877">
      <feGaussianBlur
         inkscape:collect="always"
         stdDeviation="0.095859125"
         id="feGaussianBlur19750" />
    </filter>
    <filter
       inkscape:collect="always"
       style="color-interpolation-filters:sRGB"
       id="filter18234-5-9"
       x="-0.019646573"
       y="-0.049054159"
       width="1.0499933"
       height="1.0801729">
      <feGaussianBlur
         inkscape:collect="always"
         stdDeviation="0.092708589"
         id="feGaussianBlur18236-7-1" />
    </filter>
    <linearGradient
       inkscape:collect="always"
       xlink:href="#linearGradient27324"
       id="linearGradient21572"
       x1="51.148811"
       y1="27.62191"
       x2="59.238785"
       y2="27.62191"
       gradientUnits="userSpaceOnUse"
       gradientTransform="translate(-64.153518,0.48952984)" />
    <filter
       inkscape:collect="always"
       style="color-interpolation-filters:sRGB"
       id="filter24160"
       x="-0.0121263"
       y="-0.053139146"
       width="1.0242526"
       height="1.1062783">
      <feGaussianBlur
         inkscape:collect="always"
         stdDeviation="0.018318553"
         id="feGaussianBlur24162" />
    </filter>
    <filter
       inkscape:collect="always"
       style="color-interpolation-filters:sRGB"
       id="filter24160-2"
       x="-0.013209493"
       y="-0.057885848"
       width="1.026419"
       height="1.1157717">
      <feGaussianBlur
         inkscape:collect="always"
         stdDeviation="0.018318553"
         id="feGaussianBlur24162-8" />
    </filter>
    <linearGradient
       inkscape:collect="always"
       xlink:href="#linearGradient27324"
       id="linearGradient30536"
       gradientUnits="userSpaceOnUse"
       gradientTransform="translate(-64.153518,0.48952984)"
       x1="51.148811"
       y1="27.62191"
       x2="59.238785"
       y2="27.62191" />
    <linearGradient
       inkscape:collect="always"
       xlink:href="#linearGradient27324"
       id="linearGradient30628"
       gradientUnits="userSpaceOnUse"
       gradientTransform="translate(-64.153518,0.48952984)"
       x1="51.148811"
       y1="27.62191"
       x2="59.238785"
       y2="27.62191" />
    <filter
       inkscape:collect="always"
       style="color-interpolation-filters:sRGB"
       id="filter24160-2-0"
       x="-0.013209493"
       y="-0.057885848"
       width="1.026419"
       height="1.1157717">
      <feGaussianBlur
         inkscape:collect="always"
         stdDeviation="0.018318553"
         id="feGaussianBlur24162-8-3" />
    </filter>
    <filter
       inkscape:collect="always"
       style="color-interpolation-filters:sRGB"
       id="filter24160-7"
       x="-0.0121263"
       y="-0.053139146"
       width="1.0242526"
       height="1.1062783">
      <feGaussianBlur
         inkscape:collect="always"
         stdDeviation="0.018318553"
         id="feGaussianBlur24162-5" />
    </filter>
    <linearGradient
       inkscape:collect="always"
       xlink:href="#linearGradient27324"
       id="linearGradient30782"
       gradientUnits="userSpaceOnUse"
       gradientTransform="translate(-64.153518,0.48952984)"
       x1="51.148811"
       y1="27.62191"
       x2="59.238785"
       y2="27.62191" />
    <linearGradient
       inkscape:collect="always"
       xlink:href="#linearGradient27324"
       id="linearGradient30784"
       gradientUnits="userSpaceOnUse"
       gradientTransform="translate(-64.153518,0.48952984)"
       x1="51.148811"
       y1="27.62191"
       x2="59.238785"
       y2="27.62191" />
    <linearGradient
       inkscape:collect="always"
       xlink:href="#linearGradient27324"
       id="linearGradient30786"
       gradientUnits="userSpaceOnUse"
       gradientTransform="translate(-64.153518,0.48952984)"
       x1="51.148811"
       y1="27.62191"
       x2="59.238785"
       y2="27.62191" />
    <radialGradient
       inkscape:collect="always"
       xlink:href="#linearGradient30868"
       id="radialGradient30820"
       cx="-9.1586399"
       cy="32.64447"
       fx="-9.1586399"
       fy="32.64447"
       r="0.83166844"
       gradientUnits="userSpaceOnUse"
       gradientTransform="matrix(1.5708027,0,0,1.5708027,57.093948,42.136035)" />
    <radialGradient
       inkscape:collect="always"
       xlink:href="#linearGradient30868"
       id="radialGradient38552"
       gradientUnits="userSpaceOnUse"
       cx="-9.1586399"
       cy="32.64447"
       fx="-9.1586399"
       fy="32.64447"
       r="0.83166844"
       gradientTransform="matrix(1.5708027,1.5712352e-8,-1.5712352e-8,1.5708027,129.93814,67.699851)" />
    <linearGradient
       inkscape:collect="always"
       xlink:href="#linearGradient27324"
       id="linearGradient38554"
       gradientUnits="userSpaceOnUse"
       gradientTransform="translate(-64.153518,0.48952984)"
       x1="51.148811"
       y1="27.62191"
       x2="59.238785"
       y2="27.62191" />
    <linearGradient
       inkscape:collect="always"
       xlink:href="#linearGradient27324"
       id="linearGradient38556"
       gradientUnits="userSpaceOnUse"
       gradientTransform="translate(-64.153518,0.48952984)"
       x1="51.148811"
       y1="27.62191"
       x2="59.238785"
       y2="27.62191" />
    <linearGradient
       inkscape:collect="always"
       xlink:href="#linearGradient27324"
       id="linearGradient38558"
       gradientUnits="userSpaceOnUse"
       gradientTransform="translate(-64.153518,0.48952984)"
       x1="51.148811"
       y1="27.62191"
       x2="59.238785"
       y2="27.62191" />
    <linearGradient
       inkscape:collect="always"
       xlink:href="#linearGradient27324"
       id="linearGradient38560"
       gradientUnits="userSpaceOnUse"
       gradientTransform="translate(-64.153518,0.48952984)"
       x1="51.148811"
       y1="27.62191"
       x2="59.238785"
       y2="27.62191" />
    <linearGradient
       inkscape:collect="always"
       xlink:href="#linearGradient27324"
       id="linearGradient38562"
       gradientUnits="userSpaceOnUse"
       gradientTransform="translate(-64.153518,0.48952984)"
       x1="51.148811"
       y1="27.62191"
       x2="59.238785"
       y2="27.62191" />
    <linearGradient
       inkscape:collect="always"
       xlink:href="#linearGradient27324"
       id="linearGradient38564"
       gradientUnits="userSpaceOnUse"
       gradientTransform="translate(-64.153518,0.48952984)"
       x1="51.148811"
       y1="27.62191"
       x2="59.238785"
       y2="27.62191" />
    <inkscape:path-effect
       effect="offset"
       id="path-effect38844-6"
       is_visible="true"
       lpeversion="1.2"
       linejoin_type="miter"
       unit="mm"
       offset="6.4"
       miter_limit="4"
       attempt_force_join="false"
       update_on_knot_move="true" />
    <filter
       inkscape:collect="always"
       style="color-interpolation-filters:sRGB"
       id="filter35050"
       x="-0.0032797319"
       y="-0.0025765463"
       width="1.0065595"
       height="1.0051531">
      <feGaussianBlur
         inkscape:collect="always"
         stdDeviation="0.056059462"
         id="feGaussianBlur35052" />
    </filter>
    <filter
       inkscape:collect="always"
       style="color-interpolation-filters:sRGB"
       id="filter35054"
       x="-0.0017818477"
       y="-0.0043163549"
       width="1.0035637"
       height="1.0086327">
      <feGaussianBlur
         inkscape:collect="always"
         stdDeviation="0.057750982"
         id="feGaussianBlur35056" />
    </filter>
    <filter
       inkscape:collect="always"
       style="color-interpolation-filters:sRGB"
       id="filter42326"
       x="-0.0089477618"
       y="-0.017004163"
       width="1.0178955"
       height="1.0340083">
      <feGaussianBlur
         inkscape:collect="always"
         stdDeviation="0.57135656"
         id="feGaussianBlur42328" />
    </filter>
    <filter
       inkscape:collect="always"
       style="color-interpolation-filters:sRGB"
       id="filter42722"
       x="-0.002434917"
       y="-0.0039295726"
       width="1.0048698"
       height="1.0078591">
      <feGaussianBlur
         inkscape:collect="always"
         stdDeviation="0.1160647"
         id="feGaussianBlur42724" />
    </filter>
    <marker
       style="overflow:visible"
       id="Arrow3"
       refX="0"
       refY="0"
       orient="auto-start-reverse"
       inkscape:stockid="Arrow3"
       markerWidth="4.2071066"
       markerHeight="7"
       viewBox="0 0 4.2071068 7"
       inkscape:isstock="true"
       inkscape:collect="always"
       preserveAspectRatio="xMidYMid">
      <path
         style="fill:none;stroke:context-stroke;stroke-width:1;stroke-linecap:round"
         d="M 3,-3 0,0 3,3"
         id="arrow3"
         transform="rotate(180,0.125,0)"
         sodipodi:nodetypes="ccc" />
    </marker>
  </defs>
  <g
     inkscape:groupmode="layer"
     id="layer7"
     inkscape:label="Background"
     transform="matrix(0.76003563,0,0,0.90146085,8.9307867,6.9345448)"
     style="display:inline;opacity:1;fill:#00ff00;stroke:#000000;stroke-opacity:1">
    <rect
       style="display:inline;fill:#ffffff;fill-opacity:1;stroke:none;stroke-width:0.334608;stroke-linecap:round;stroke-linejoin:round;stroke-dasharray:0.776767, 0.388386;stroke-dashoffset:0;stroke-opacity:1"
       id="rect11660-6"
       width="275.37769"
       height="154.81673"
       x="-11.284421"
       y="-7.4510469" />
    <rect
       style="mix-blend-mode:normal;fill:#008000;fill-opacity:1;stroke:none;stroke-width:0.211395;stroke-linecap:round;stroke-linejoin:round;stroke-dasharray:0.490735, 0.245369;stroke-dashoffset:0;stroke-opacity:1;filter:url(#filter42326)"
       id="rect11660"
       width="153.25125"
       height="80.642349"
       x="3.2264147"
       y="-3.626586"
       transform="matrix(1.5708027,0,0,1.5708027,6.7072075,4.3909358)" />
  </g>
  <g
     inkscape:groupmode="layer"
     id="layer10"
     inkscape:label="Raster"
     style="display:inline">
    <g
       id="g35048"
       style="stroke:#aaaaff;stroke-width:0.764143;stroke-opacity:1;filter:url(#filter35054)"
       transform="matrix(2.6901212,0,0,1.5708027,58.3471,88.376405)">
      <path
         style="display:inline;fill:none;stroke:#aaaaff;stroke-width:0.0581343;stroke-linecap:butt;stroke-linejoin:miter;stroke-dasharray:0.581343, 0.581343;stroke-dashoffset:0;stroke-opacity:1"
         d="M 56.235405,-11.699799 H -21.550344"
         id="path34917" />
      <path
         style="display:inline;fill:none;stroke:#aaaaff;stroke-width:0.0581343;stroke-linecap:butt;stroke-linejoin:miter;stroke-dasharray:0.581343, 0.581343;stroke-dashoffset:0;stroke-opacity:1"
         d="M 56.235405,-6.1504898 H -21.550344"
         id="path34919" />
      <path
         style="display:inline;fill:none;stroke:#aaaaff;stroke-width:0.0581343;stroke-linecap:butt;stroke-linejoin:miter;stroke-dasharray:0.581343, 0.581343;stroke-dashoffset:0;stroke-opacity:1"
         d="M 56.235405,-0.601181 H -21.550344"
         id="path34921" />
      <path
         style="display:inline;fill:none;stroke:#aaaaff;stroke-width:0.0581343;stroke-linecap:butt;stroke-linejoin:miter;stroke-dasharray:0.581343, 0.581343;stroke-dashoffset:0;stroke-opacity:1"
         d="M 56.235405,4.9481278 H -21.550344"
         id="path34923" />
      <path
         style="display:inline;fill:none;stroke:#aaaaff;stroke-width:0.0581343;stroke-linecap:butt;stroke-linejoin:miter;stroke-dasharray:0.581343, 0.581343;stroke-dashoffset:0;stroke-opacity:1"
         d="M 56.235405,10.497437 H -21.550344"
         id="path34925" />
      <path
         style="display:inline;fill:none;stroke:#aaaaff;stroke-width:0.0581343;stroke-linecap:butt;stroke-linejoin:miter;stroke-dasharray:0.581343, 0.581343;stroke-dashoffset:0;stroke-opacity:1"
         d="M 56.235405,16.046745 H -21.550344"
         id="path34927" />
      <path
         style="display:inline;fill:none;stroke:#aaaaff;stroke-width:0.0581343;stroke-linecap:butt;stroke-linejoin:miter;stroke-dasharray:0.581343, 0.581343;stroke-dashoffset:0;stroke-opacity:1"
         d="M 56.235405,21.596054 H -21.550344"
         id="path34929" />
      <path
         style="display:inline;fill:none;stroke:#aaaaff;stroke-width:0.0581343;stroke-linecap:butt;stroke-linejoin:miter;stroke-dasharray:0.581343, 0.581343;stroke-dashoffset:0;stroke-opacity:1"
         d="M 56.235405,32.694672 H -21.550344"
         id="path34931" />
      <path
         style="display:inline;fill:none;stroke:#aaaaff;stroke-width:0.0581343;stroke-linecap:butt;stroke-linejoin:miter;stroke-dasharray:0.581343, 0.581343;stroke-dashoffset:0;stroke-opacity:1"
         d="M 56.235405,27.145363 H -21.550344"
         id="path34933" />
    </g>
    <g
       id="g42268"
       transform="matrix(1.5708027,0,0,1.5988891,42.502097,60.789076)"
       style="stroke-width:0.991178">
      <g
         id="g34915"
         transform="matrix(1,0,0,1.6561847,-5.3478445,-21.991099)"
         style="stroke:#aaaaff;stroke-width:0.770189;stroke-opacity:1;filter:url(#filter35050)">
        <path
           style="display:inline;fill:none;stroke:#aaaaff;stroke-width:0.0585941;stroke-linecap:butt;stroke-linejoin:miter;stroke-dasharray:0.585941, 0.585941;stroke-dashoffset:0;stroke-opacity:1"
           d="M -10.356301,-9.2853008 V 42.932937"
           id="path34560" />
        <path
           style="display:inline;fill:none;stroke:#aaaaff;stroke-width:0.0585941;stroke-linecap:butt;stroke-linejoin:miter;stroke-dasharray:0.585941, 0.585941;stroke-dashoffset:0;stroke-opacity:1"
           d="M -4.8069918,-9.2853008 V 42.932937"
           id="path34560-2" />
        <path
           style="display:inline;fill:none;stroke:#aaaaff;stroke-width:0.0585941;stroke-linecap:butt;stroke-linejoin:miter;stroke-dasharray:0.585941, 0.585941;stroke-dashoffset:0;stroke-opacity:1"
           d="M 0.742317,-9.2853008 V 42.932937"
           id="path34560-2-5" />
        <path
           style="display:inline;fill:none;stroke:#aaaaff;stroke-width:0.0585941;stroke-linecap:butt;stroke-linejoin:miter;stroke-dasharray:0.585941, 0.585941;stroke-dashoffset:0;stroke-opacity:1"
           d="M 6.2916258,-9.2853008 V 42.932937"
           id="path34608" />
        <path
           style="display:inline;fill:none;stroke:#aaaaff;stroke-width:0.0585941;stroke-linecap:butt;stroke-linejoin:miter;stroke-dasharray:0.585941, 0.585941;stroke-dashoffset:0;stroke-opacity:1"
           d="M 11.840935,-9.285301 V 42.932937"
           id="path34560-9" />
        <path
           style="display:inline;fill:none;stroke:#aaaaff;stroke-width:0.0585941;stroke-linecap:butt;stroke-linejoin:miter;stroke-dasharray:0.585941, 0.585941;stroke-dashoffset:0;stroke-opacity:1"
           d="M 17.390243,-9.285301 V 42.932937"
           id="path34560-2-7" />
        <path
           style="display:inline;fill:none;stroke:#aaaaff;stroke-width:0.0585941;stroke-linecap:butt;stroke-linejoin:miter;stroke-dasharray:0.585941, 0.585941;stroke-dashoffset:0;stroke-opacity:1"
           d="M 22.939552,-9.285301 V 42.932937"
           id="path34560-2-5-5" />
        <path
           style="display:inline;fill:none;stroke:#aaaaff;stroke-width:0.0585941;stroke-linecap:butt;stroke-linejoin:miter;stroke-dasharray:0.585941, 0.585941;stroke-dashoffset:0;stroke-opacity:1"
           d="M 34.03817,-9.285301 V 42.932937"
           id="path34562-5" />
        <path
           style="display:inline;fill:none;stroke:#aaaaff;stroke-width:0.0585941;stroke-linecap:butt;stroke-linejoin:miter;stroke-dasharray:0.585941, 0.585941;stroke-dashoffset:0;stroke-opacity:1"
           d="M 28.488861,-9.285301 V 42.932937"
           id="path34608-6" />
        <path
           style="display:inline;fill:none;stroke:#aaaaff;stroke-width:0.0585941;stroke-linecap:butt;stroke-linejoin:miter;stroke-dasharray:0.585941, 0.585941;stroke-dashoffset:0;stroke-opacity:1"
           d="M 39.587479,-9.285301 V 42.932937"
           id="path34666" />
        <path
           style="display:inline;fill:none;stroke:#aaaaff;stroke-width:0.0585941;stroke-linecap:butt;stroke-linejoin:miter;stroke-dasharray:0.585941, 0.585941;stroke-dashoffset:0;stroke-opacity:1"
           d="M 45.136787,-9.285301 V 42.932937"
           id="path34668" />
        <path
           style="display:inline;fill:none;stroke:#aaaaff;stroke-width:0.0585941;stroke-linecap:butt;stroke-linejoin:miter;stroke-dasharray:0.585941, 0.585941;stroke-dashoffset:0;stroke-opacity:1"
           d="M 56.235405,-9.285301 V 42.932937"
           id="path34670" />
        <path
           style="display:inline;fill:none;stroke:#aaaaff;stroke-width:0.0585941;stroke-linecap:butt;stroke-linejoin:miter;stroke-dasharray:0.585941, 0.585941;stroke-dashoffset:0;stroke-opacity:1"
           d="M 50.686096,-9.285301 V 42.932937"
           id="path34672" />
        <path
           style="display:inline;fill:none;stroke:#aaaaff;stroke-width:0.0585941;stroke-linecap:butt;stroke-linejoin:miter;stroke-dasharray:0.585941, 0.585941;stroke-dashoffset:0;stroke-opacity:1"
           d="M -21.454918,-9.285301 V 42.932937"
           id="path34678" />
        <path
           style="display:inline;fill:none;stroke:#aaaaff;stroke-width:0.0585941;stroke-linecap:butt;stroke-linejoin:miter;stroke-dasharray:0.585941, 0.585941;stroke-dashoffset:0;stroke-opacity:1"
           d="M -15.905609,-9.285301 V 42.932937"
           id="path34682" />
      </g>
      <g
         id="g41858"
         transform="matrix(1,0,0,1.6604409,72.342479,-22.174406)"
         style="stroke:#aaaaff;stroke-width:0.769201;stroke-opacity:1;filter:url(#filter35050)">
        <path
           style="display:inline;fill:none;stroke:#aaaaff;stroke-width:0.058519;stroke-linecap:butt;stroke-linejoin:miter;stroke-dasharray:0.58519, 0.58519;stroke-dashoffset:0;stroke-opacity:1"
           d="M -10.356301,-9.2853008 V 42.932937"
           id="path41828" />
        <path
           style="display:inline;fill:none;stroke:#aaaaff;stroke-width:0.058519;stroke-linecap:butt;stroke-linejoin:miter;stroke-dasharray:0.58519, 0.58519;stroke-dashoffset:0;stroke-opacity:1"
           d="M -4.8069918,-9.2853008 V 42.932937"
           id="path41830" />
        <path
           style="display:inline;fill:none;stroke:#aaaaff;stroke-width:0.058519;stroke-linecap:butt;stroke-linejoin:miter;stroke-dasharray:0.58519, 0.58519;stroke-dashoffset:0;stroke-opacity:1"
           d="M 0.742317,-9.2853008 V 42.932937"
           id="path41832" />
        <path
           style="display:inline;fill:none;stroke:#aaaaff;stroke-width:0.058519;stroke-linecap:butt;stroke-linejoin:miter;stroke-dasharray:0.58519, 0.58519;stroke-dashoffset:0;stroke-opacity:1"
           d="M 6.2916258,-9.2853008 V 42.932937"
           id="path41834" />
        <path
           style="display:inline;fill:none;stroke:#aaaaff;stroke-width:0.058519;stroke-linecap:butt;stroke-linejoin:miter;stroke-dasharray:0.58519, 0.58519;stroke-dashoffset:0;stroke-opacity:1"
           d="M 11.840935,-9.285301 V 42.932937"
           id="path41836" />
        <path
           style="display:inline;fill:none;stroke:#aaaaff;stroke-width:0.058519;stroke-linecap:butt;stroke-linejoin:miter;stroke-dasharray:0.58519, 0.58519;stroke-dashoffset:0;stroke-opacity:1"
           d="M 17.390243,-9.285301 V 42.932937"
           id="path41838" />
        <path
           style="display:inline;fill:none;stroke:#aaaaff;stroke-width:0.058519;stroke-linecap:butt;stroke-linejoin:miter;stroke-dasharray:0.58519, 0.58519;stroke-dashoffset:0;stroke-opacity:1"
           d="M 22.939552,-9.285301 V 42.932937"
           id="path41840" />
        <path
           style="display:inline;fill:none;stroke:#aaaaff;stroke-width:0.058519;stroke-linecap:butt;stroke-linejoin:miter;stroke-dasharray:0.58519, 0.58519;stroke-dashoffset:0;stroke-opacity:1"
           d="M 34.03817,-9.285301 V 42.932937"
           id="path41842" />
        <path
           style="display:inline;fill:none;stroke:#aaaaff;stroke-width:0.058519;stroke-linecap:butt;stroke-linejoin:miter;stroke-dasharray:0.58519, 0.58519;stroke-dashoffset:0;stroke-opacity:1"
           d="M 28.488861,-9.285301 V 42.932937"
           id="path41844" />
        <path
           style="display:inline;fill:none;stroke:#aaaaff;stroke-width:0.058519;stroke-linecap:butt;stroke-linejoin:miter;stroke-dasharray:0.58519, 0.58519;stroke-dashoffset:0;stroke-opacity:1"
           d="M -15.905609,-9.285301 V 42.932937"
           id="path41856" />
      </g>
    </g>
    <g
       id="g42298"
       style="stroke:#aaaaff;stroke-width:0.764143;stroke-opacity:1;filter:url(#filter35054)"
       transform="matrix(2.6901212,0,0,1.5708027,58.3471,1.2077124)">
      <path
         style="display:inline;fill:none;stroke:#aaaaff;stroke-width:0.0581343;stroke-linecap:butt;stroke-linejoin:miter;stroke-dasharray:0.581343, 0.581343;stroke-dashoffset:0;stroke-opacity:1"
         d="M 56.235405,-0.601181 H -21.550344"
         id="path42280" />
      <path
         style="display:inline;fill:none;stroke:#aaaaff;stroke-width:0.0581343;stroke-linecap:butt;stroke-linejoin:miter;stroke-dasharray:0.581343, 0.581343;stroke-dashoffset:0;stroke-opacity:1"
         d="M 56.235405,4.9481278 H -21.550344"
         id="path42282" />
      <path
         style="display:inline;fill:none;stroke:#aaaaff;stroke-width:0.0581343;stroke-linecap:butt;stroke-linejoin:miter;stroke-dasharray:0.581343, 0.581343;stroke-dashoffset:0;stroke-opacity:1"
         d="M 56.235405,10.497437 H -21.550344"
         id="path42284" />
      <path
         style="display:inline;fill:none;stroke:#aaaaff;stroke-width:0.0581343;stroke-linecap:butt;stroke-linejoin:miter;stroke-dasharray:0.581343, 0.581343;stroke-dashoffset:0;stroke-opacity:1"
         d="M 56.235405,16.046745 H -21.550344"
         id="path42286" />
      <path
         style="display:inline;fill:none;stroke:#aaaaff;stroke-width:0.0581343;stroke-linecap:butt;stroke-linejoin:miter;stroke-dasharray:0.581343, 0.581343;stroke-dashoffset:0;stroke-opacity:1"
         d="M 56.235405,21.596054 H -21.550344"
         id="path42288" />
      <path
         style="display:inline;fill:none;stroke:#aaaaff;stroke-width:0.0581343;stroke-linecap:butt;stroke-linejoin:miter;stroke-dasharray:0.581343, 0.581343;stroke-dashoffset:0;stroke-opacity:1"
         d="M 56.235405,32.694672 H -21.550344"
         id="path42290" />
      <path
         style="display:inline;fill:none;stroke:#aaaaff;stroke-width:0.0581343;stroke-linecap:butt;stroke-linejoin:miter;stroke-dasharray:0.581343, 0.581343;stroke-dashoffset:0;stroke-opacity:1"
         d="M 56.235405,27.145363 H -21.550344"
         id="path42292" />
      <path
         style="display:inline;fill:none;stroke:#aaaaff;stroke-width:0.0581343;stroke-linecap:butt;stroke-linejoin:miter;stroke-dasharray:0.581343, 0.581343;stroke-dashoffset:0;stroke-opacity:1"
         d="M 56.235405,38.243981 H -21.550344"
         id="path42294" />
    </g>
  </g>
  <g
     inkscape:groupmode="layer"
     id="layer5"
     inkscape:label="Road"
     style="display:inline">
    <g
       id="g42304"
       transform="matrix(1.6005473,0,0,1.5708027,52.181751,45.048603)"
       style="stroke-width:0.990665">
      <path
         id="path39516"
         style="color:#000000;opacity:1;fill:#808080;fill-opacity:1;stroke:none;stroke-width:0.990665;stroke-opacity:1;-inkscape-stroke:none;filter:url(#filter42722)"
         d="M 92.907256,-25.137274 C 63.764604,-4.8227696 24.24101,-3.3459035 -21.493059,-5.2482334 V 45.003144 C 16.014542,46.664281 56.00228,46.813766 92.907256,31.616668 v -56.753942"
         sodipodi:nodetypes="ccccc" />
      <path
         id="path38770"
         style="color:#000000;opacity:1;fill:none;fill-opacity:1;stroke:#ffffff;stroke-width:0.990665;stroke-linecap:butt;stroke-miterlimit:4;stroke-opacity:1;-inkscape-stroke:none"
         d="m -21.469878,45.003144 c 37.5,1.661137 77.479636,1.810622 114.377134,-13.386476 m 0,-56.753942 C 63.770509,-4.8227696 24.254924,-3.3459035 -21.469878,-5.2482334"
         sodipodi:nodetypes="cccc" />
      <path
         style="color:#000000;opacity:0.8;fill:none;stroke:#ffffff;stroke-width:0.990661;stroke-dasharray:7.92531, 3.96265;stroke-dashoffset:0;stroke-opacity:1;-inkscape-stroke:none"
         d="M 92.681715,4.8312351 C 58.389096,22.201911 19.190365,21.691556 -21.492559,19.877455"
         id="path38842"
         sodipodi:nodetypes="cc" />
    </g>
  </g>
  <g
     inkscape:groupmode="layer"
     id="layer2"
     inkscape:label="Cars"
     style="display:inline">
    <g
       id="g38512"
       inkscape:label="Red Car"
       style="display:inline;opacity:0.5"
       transform="matrix(1.3947257,-0.72260734,0.72260734,1.3947257,147.81363,-0.63551804)">
      <g
         id="g38510"
         transform="matrix(0.17960963,0,0,0.17960963,-17.34453,26.451478)">
        <path
           id="path38490"
           style="fill:#ff0000;fill-opacity:1;stroke:#000000;stroke-width:0.660026;stroke-linecap:round;stroke-miterlimit:4;stroke-dasharray:none"
           d="M 111.64432,2.0438227 C 105.04229,2.0523434 98.237005,2.1331568 90.758177,2.2169563 68.478685,2.4667353 41.869774,2.8505737 30.297465,3.4078715 23.230107,3.6384901 14.684348,2.8709548 9.3789488,7.2023519 2.0152129,13.214203 2.4599894,25.811026 2.4600716,35.566974 c 8.62e-5,9.755983 -0.4448587,22.350682 6.9188772,28.362514 5.3053992,4.331416 13.8511582,3.563881 20.9185162,3.794495 11.572309,0.55731 38.18122,0.94324 60.460712,1.193033 19.943523,0.22363 35.097833,0.411016 54.377613,-0.665139 13.73019,-0.865401 18.17953,0.501523 21.27874,-4.567317 5.08975,-8.603198 6.55453,-18.471425 6.55461,-28.117586 7e-5,-9.646154 -1.46486,-19.516463 -6.55461,-28.1196843 C 163.31532,2.3784606 158.86598,3.7474951 145.13579,2.8821032 133.08592,2.2094824 122.64768,2.0289899 111.64432,2.0438106 Z"
           sodipodi:nodetypes="sscszscscczccs" />
        <path
           id="path38492"
           style="fill:#000000;fill-opacity:1;stroke-width:3.26929;stroke-linecap:round;filter:url(#filter18222-0)"
           d="m 179.92578,278.80469 c -8.3074,2.61456 0.001,-10e-4 -21.16406,6.57617 2.41461,6.36953 2.70871,14.02215 2.58789,20.50586 -0.12082,6.48371 -0.13018,14.58793 -2.58789,20.5039 21.1653,6.57727 12.85666,3.96357 21.16406,6.57813 7.92037,-3.87861 8.08005,-21.27699 8.08008,-27.08203 3e-5,-5.80504 -0.15921,-23.20318 -8.08008,-27.08203 z"
           transform="matrix(1.036111,0,0,1.0811201,-64.646328,-295.13328)"
           sodipodi:nodetypes="cczcczc" />
        <path
           id="path38494"
           style="fill:#000000;fill-opacity:1;stroke-width:2.64998;stroke-linecap:round;filter:url(#filter18230-3)"
           d="m 84.568359,283.7793 c -4.873618,6.66755 -5.189458,17.65863 -5.189453,22.10742 5e-6,4.44879 0.315887,15.43799 5.189453,22.10547 l 18.214841,-2.34766 c -2.861983,-6.16343 -3.308769,-13.64671 -3.224099,-19.75781 0.0847,-6.1111 0.421501,-14.2142 3.224099,-19.75977 z"
           transform="matrix(1.036111,0,0,1.0811201,-64.646328,-295.13328)"
           sodipodi:nodetypes="czcczcc" />
        <path
           id="path38496"
           style="fill:#000000;fill-opacity:1;stroke-width:0.865;stroke-linecap:round;filter:url(#filter18226-1)"
           d="m 10.450971,2.232998 c 10.925005,-0.04102 15.686682,-0.182423 17.55118,-0.240478 1.17779,-0.03667 1.055942,-0.0049 1.055942,-0.0049 0,0 -4.06942,1.500063 -4.952975,1.60637 -1.521174,0.183024 -2.059657,0.131203 -4.505694,0.150817 -2.329844,0.01868 -5.473135,0.03909 -6.95085,-0.08392 C 9.7616799,3.420568 9.2382709,2.704488 10.450971,2.233002 Z"
           sodipodi:nodetypes="cscssscc"
           transform="matrix(3.9160101,0,0,4.086123,2.1315657,-2.4723443)" />
        <path
           id="path38498"
           style="fill-opacity:0.92268;stroke-width:0.865;stroke-linecap:round;filter:url(#filter19744)"
           d="m 27.698733,0.23010595 c 0.778394,0.03326 1.35936,1.75751405 1.35936,1.75751405 l -0.707949,0.253746 c 0,0 -0.906933,-2.02217705 -0.651411,-2.01126005 z"
           sodipodi:nodetypes="sccs"
           transform="matrix(3.9160101,0,0,4.086123,2.1315657,-2.4723443)" />
        <path
           id="path38500"
           style="fill:#000000;fill-opacity:0.5;stroke-width:3.26929;stroke-linecap:round;filter:url(#filter18242-0)"
           d="m 191.18359,293.72852 -0.125,12.08789 h -0.002 v 0.0703 0.0703 h 0.002 l 0.125,12.08594 c 0,0 3.74641,-0.39654 3.87891,-2.23438 0.1854,-2.57154 0.20967,-9.43993 0.21094,-9.85156 2e-5,-0.006 -1e-5,-0.0671 0,-0.0703 -1e-5,-0.003 2e-5,-0.0641 0,-0.0703 -0.001,-0.411 -0.0255,-7.27989 -0.21094,-9.85157 -0.1325,-1.83783 -3.87891,-2.23632 -3.87891,-2.23632 z"
           transform="matrix(1.036111,0,0,1.0811201,-64.646328,-295.13328)" />
        <path
           style="fill:none;stroke:#000000;stroke-width:0.264583px;stroke-linecap:butt;stroke-linejoin:miter;stroke-opacity:1;filter:url(#filter18234-5)"
           d="m 31.289163,2.121441 c 0,0 7.578859,0.412884 10.642205,2.922704 1.11139,0.910576 1.0486,4.305966 1.0486,4.305966"
           id="path38502"
           sodipodi:nodetypes="csc"
           transform="matrix(3.9160101,0,0,4.086123,2.1315657,-2.4723443)" />
        <path
           id="path38504"
           style="fill:#000000;fill-opacity:1;stroke-width:0.865;stroke-linecap:round;filter:url(#filter18226-1-8)"
           d="m 46.021383,84.029808 c 10.925005,-0.04102 15.686682,-0.182423 17.55118,-0.240478 1.17779,-0.03667 1.055942,-0.0049 1.055942,-0.0049 0,0 -4.06942,1.500063 -4.952975,1.60637 -1.521174,0.183024 -2.059657,0.131203 -4.505694,0.150817 -2.329844,0.01868 -5.473135,0.03909 -6.95085,-0.08392 -2.886894,-0.240319 -3.410303,-0.956399 -2.197603,-1.427885 z"
           sodipodi:nodetypes="cscssscc"
           transform="matrix(3.9160101,0,0,-4.086123,-137.16253,407.8369)" />
        <path
           id="path38506"
           style="fill-opacity:0.92268;stroke-width:0.865;stroke-linecap:round;filter:url(#filter19748)"
           d="m 27.698733,18.388361 c 0.778394,-0.0332 1.35936,-1.75751 1.35936,-1.75751 l -0.707949,-0.25374 c 0,0 -0.906933,2.02217 -0.651411,2.01125 z"
           sodipodi:nodetypes="sccs"
           transform="matrix(3.9160101,0,0,4.086123,2.1315657,-2.4723443)" />
        <path
           style="fill:none;stroke:#000000;stroke-width:0.264583px;stroke-linecap:butt;stroke-linejoin:miter;stroke-opacity:1;filter:url(#filter18234-5-9)"
           d="m 66.859575,83.918251 c 0,0 7.578859,0.412884 10.642202,2.922704 1.111396,0.910576 1.048603,4.305964 1.048603,4.305964"
           id="path38508"
           sodipodi:nodetypes="csc"
           transform="matrix(3.9160101,0,0,-4.086123,-137.16253,407.8369)" />
      </g>
    </g>
  </g>
  <g
     inkscape:groupmode="layer"
     id="layer9"
     inkscape:label="Axles">
    <g
       id="g38522"
       transform="matrix(1.3947257,-0.72260734,0.72260734,1.3947257,146.30687,0.12682538)"
       style="display:inline;opacity:0.75"
       inkscape:label="Rear">
      <g
         id="g38520"
         style="display:inline;opacity:0.8"
         transform="translate(1.0557002)"
         inkscape:label="Axle">
        <rect
           style="font-variation-settings:normal;display:inline;mix-blend-mode:normal;fill:url(#linearGradient38560);fill-opacity:1;stroke:#000000;stroke-width:0.111839;stroke-linecap:round;stroke-linejoin:round;stroke-miterlimit:4;stroke-dasharray:none;stroke-dashoffset:0;stroke-opacity:1;filter:url(#filter24160-2-0);stop-color:#000000"
           id="rect38514"
           width="7.5615335"
           height="1.7255344"
           x="-12.599893"
           y="27.248672"
           transform="matrix(0.09187356,0,0,5.0365735,-9.404096,-108.94087)" />
        <path
           style="font-variation-settings:normal;mix-blend-mode:normal;fill:url(#linearGradient38562);fill-opacity:1;stroke:#000000;stroke-width:0.0954578;stroke-linecap:round;stroke-linejoin:round;stroke-miterlimit:4;stroke-dasharray:none;stroke-dashoffset:0;stroke-opacity:1;filter:url(#filter24160-7);stop-color:#000000"
           id="rect38516"
           width="7.5615335"
           height="1.7255344"
           x="-12.599893"
           y="27.248672"
           transform="matrix(0.63517057,0,0,1,-4.6126919,2.3622238e-7)"
           inkscape:path-effect="#path-effect38538"
           d="m -12.335309,27.248672 h 7.0323665 a 0.26458333,0.26458333 45 0 1 0.2645833,0.264584 v 1.196368 a 0.26458333,0.26458333 135 0 1 -0.2645833,0.264583 h -7.0323665 a 0.26458333,0.26458333 45 0 1 -0.264584,-0.264583 v -1.196368 a 0.26458333,0.26458333 135 0 1 0.264584,-0.264584 z"
           sodipodi:type="rect" />
        <path
           style="font-variation-settings:normal;opacity:1;vector-effect:none;fill:url(#linearGradient38564);fill-opacity:1;stroke:#000000;stroke-width:0.0954578;stroke-linecap:round;stroke-linejoin:round;stroke-miterlimit:4;stroke-dasharray:none;stroke-dashoffset:0;stroke-opacity:1;-inkscape-stroke:none;filter:url(#filter24160-7);stop-color:#000000;stop-opacity:1"
           id="rect38518"
           width="7.5615335"
           height="1.7255344"
           x="-12.599893"
           y="36.173225"
           transform="matrix(0.63517057,0,0,1,-4.6126919,0.53164657)"
           inkscape:path-effect="#path-effect38542"
           d="m -12.335309,36.173225 h 7.0323665 a 0.26458333,0.26458333 45 0 1 0.2645833,0.264584 v 1.196368 a 0.26458333,0.26458333 135 0 1 -0.2645833,0.264583 h -7.0323665 a 0.26458333,0.26458333 45 0 1 -0.264584,-0.264583 v -1.196368 a 0.26458333,0.26458333 135 0 1 0.264584,-0.264584 z"
           sodipodi:type="rect" />
      </g>
    </g>
    <g
       id="g38532"
       style="display:inline;opacity:0.25"
       transform="matrix(1.3947257,-0.72260734,0.72260734,1.3947257,173.79084,-14.112619)"
       inkscape:label="Front">
      <g
         id="g38530"
         inkscape:label="Axle">
        <rect
           style="font-variation-settings:normal;display:inline;mix-blend-mode:normal;fill:url(#linearGradient38554);fill-opacity:1;stroke:#000000;stroke-width:0.111839;stroke-linecap:round;stroke-linejoin:round;stroke-miterlimit:4;stroke-dasharray:none;stroke-dashoffset:0;stroke-opacity:1;filter:url(#filter24160-2);stop-color:#000000"
           id="rect38524"
           width="7.5615335"
           height="1.7255344"
           x="-12.599893"
           y="27.248672"
           transform="matrix(0.09187356,0,0,5.0365735,-9.404096,-108.94087)" />
        <path
           style="font-variation-settings:normal;mix-blend-mode:normal;fill:url(#linearGradient38556);fill-opacity:1;stroke:#000000;stroke-width:0.0954578;stroke-linecap:round;stroke-linejoin:round;stroke-miterlimit:4;stroke-dasharray:none;stroke-dashoffset:0;stroke-opacity:1;filter:url(#filter24160);stop-color:#000000"
           id="rect38526"
           width="7.5615335"
           height="1.7255344"
           x="-12.599893"
           y="27.248672"
           transform="matrix(0.63517057,0,0,1,-4.6126919,2.3622238e-7)"
           d="m -12.335309,27.248672 h 7.0323665 a 0.26458333,0.26458333 45 0 1 0.2645833,0.264584 v 1.196368 a 0.26458333,0.26458333 135 0 1 -0.2645833,0.264583 h -7.0323665 a 0.26458333,0.26458333 45 0 1 -0.264584,-0.264583 v -1.196368 a 0.26458333,0.26458333 135 0 1 0.264584,-0.264584 z"
           inkscape:path-effect="#path-effect38546"
           sodipodi:type="rect" />
        <path
           style="font-variation-settings:normal;opacity:1;vector-effect:none;fill:url(#linearGradient38558);fill-opacity:1;stroke:#000000;stroke-width:0.0954578;stroke-linecap:round;stroke-linejoin:round;stroke-miterlimit:4;stroke-dasharray:none;stroke-dashoffset:0;stroke-opacity:1;-inkscape-stroke:none;filter:url(#filter24160);stop-color:#000000;stop-opacity:1"
           id="rect38528"
           width="7.5615335"
           height="1.7255344"
           x="-12.599893"
           y="36.173225"
           transform="matrix(0.63517057,0,0,1,-4.6126919,0.53164657)"
           d="m -12.335309,36.173225 h 7.0323665 a 0.26458333,0.26458333 45 0 1 0.2645833,0.264584 v 1.196368 a 0.26458333,0.26458333 135 0 1 -0.2645833,0.264583 h -7.0323665 a 0.26458333,0.26458333 45 0 1 -0.264584,-0.264583 v -1.196368 a 0.26458333,0.26458333 135 0 1 0.264584,-0.264584 z"
           inkscape:path-effect="#path-effect38550"
           sodipodi:type="rect" />
      </g>
    </g>
  </g>
  <g
     inkscape:groupmode="layer"
     id="layer8"
     inkscape:label="CoorindateSystem">
    <g
       id="g39799"
       inkscape:transform-center-x="-13.674347"
       inkscape:transform-center-y="1.5346636"
       transform="matrix(1.5664723,0.11655783,-0.11655783,1.5664723,55.71723,46.398316)">
      <g
         id="g10990"
         inkscape:label="Green Car"
         style="display:inline;opacity:0.5">
        <g
           id="g3439"
           transform="matrix(0.17960963,0,0,0.17960963,-17.34453,26.451478)">
          <path
             id="rect5329-3"
             style="fill:#008080;fill-opacity:1;stroke:#000000;stroke-width:0.660026;stroke-linecap:round;stroke-miterlimit:4;stroke-dasharray:none"
             d="M 111.64432,2.0438227 C 105.04229,2.0523434 98.237005,2.1331568 90.758177,2.2169563 68.478685,2.4667353 41.869774,2.8505737 30.297465,3.4078715 23.230107,3.6384901 14.684348,2.8709548 9.3789488,7.2023519 2.0152129,13.214203 2.4599894,25.811026 2.4600716,35.566974 c 8.62e-5,9.755983 -0.4448587,22.350682 6.9188772,28.362514 5.3053992,4.331416 13.8511582,3.563881 20.9185162,3.794495 11.572309,0.55731 38.18122,0.94324 60.460712,1.193033 19.943523,0.22363 35.097833,0.411016 54.377613,-0.665139 13.73019,-0.865401 18.17953,0.501523 21.27874,-4.567317 5.08975,-8.603198 6.55453,-18.471425 6.55461,-28.117586 7e-5,-9.646154 -1.46486,-19.516463 -6.55461,-28.1196843 C 163.31532,2.3784606 158.86598,3.7474951 145.13579,2.8821032 133.08592,2.2094824 122.64768,2.0289899 111.64432,2.0438106 Z"
             sodipodi:nodetypes="sscszscscczccs" />
          <path
             id="rect9419-4"
             style="fill:#000000;fill-opacity:1;stroke-width:3.26929;stroke-linecap:round;filter:url(#filter18222-0)"
             d="m 179.92578,278.80469 c -8.3074,2.61456 0.001,-10e-4 -21.16406,6.57617 2.41461,6.36953 2.70871,14.02215 2.58789,20.50586 -0.12082,6.48371 -0.13018,14.58793 -2.58789,20.5039 21.1653,6.57727 12.85666,3.96357 21.16406,6.57813 7.92037,-3.87861 8.08005,-21.27699 8.08008,-27.08203 3e-5,-5.80504 -0.15921,-23.20318 -8.08008,-27.08203 z"
             transform="matrix(1.036111,0,0,1.0811201,-64.646328,-295.13328)"
             sodipodi:nodetypes="cczcczc" />
          <path
             id="rect9419-9-6"
             style="fill:#000000;fill-opacity:1;stroke-width:2.64998;stroke-linecap:round;filter:url(#filter18230-3)"
             d="m 84.568359,283.7793 c -4.873618,6.66755 -5.189458,17.65863 -5.189453,22.10742 5e-6,4.44879 0.315887,15.43799 5.189453,22.10547 l 18.214841,-2.34766 c -2.861983,-6.16343 -3.308769,-13.64671 -3.224099,-19.75781 0.0847,-6.1111 0.421501,-14.2142 3.224099,-19.75977 z"
             transform="matrix(1.036111,0,0,1.0811201,-64.646328,-295.13328)"
             sodipodi:nodetypes="czcczcc" />
          <path
             id="rect11566-1"
             style="fill:#000000;fill-opacity:1;stroke-width:0.865;stroke-linecap:round;filter:url(#filter18226-1)"
             d="m 10.450971,2.232998 c 10.925005,-0.04102 15.686682,-0.182423 17.55118,-0.240478 1.17779,-0.03667 1.055942,-0.0049 1.055942,-0.0049 0,0 -4.06942,1.500063 -4.952975,1.60637 -1.521174,0.183024 -2.059657,0.131203 -4.505694,0.150817 -2.329844,0.01868 -5.473135,0.03909 -6.95085,-0.08392 C 9.7616799,3.420568 9.2382709,2.704488 10.450971,2.233002 Z"
             sodipodi:nodetypes="cscssscc"
             transform="matrix(3.9160101,0,0,4.086123,2.1315657,-2.4723443)" />
          <path
             id="rect13708-8"
             style="fill-opacity:0.92268;stroke-width:0.865;stroke-linecap:round;filter:url(#filter19744)"
             d="m 27.698733,0.23010595 c 0.778394,0.03326 1.35936,1.75751405 1.35936,1.75751405 l -0.707949,0.253746 c 0,0 -0.906933,-2.02217705 -0.651411,-2.01126005 z"
             sodipodi:nodetypes="sccs"
             transform="matrix(3.9160101,0,0,4.086123,2.1315657,-2.4723443)" />
          <path
             id="rect15650-6"
             style="fill:#000000;fill-opacity:0.5;stroke-width:3.26929;stroke-linecap:round;filter:url(#filter18242-0)"
             d="m 191.18359,293.72852 -0.125,12.08789 h -0.002 v 0.0703 0.0703 h 0.002 l 0.125,12.08594 c 0,0 3.74641,-0.39654 3.87891,-2.23438 0.1854,-2.57154 0.20967,-9.43993 0.21094,-9.85156 2e-5,-0.006 -1e-5,-0.0671 0,-0.0703 -1e-5,-0.003 2e-5,-0.0641 0,-0.0703 -0.001,-0.411 -0.0255,-7.27989 -0.21094,-9.85157 -0.1325,-1.83783 -3.87891,-2.23632 -3.87891,-2.23632 z"
             transform="matrix(1.036111,0,0,1.0811201,-64.646328,-295.13328)" />
          <path
             style="fill:none;stroke:#000000;stroke-width:0.264583px;stroke-linecap:butt;stroke-linejoin:miter;stroke-opacity:1;filter:url(#filter18234-5)"
             d="m 31.289163,2.121441 c 0,0 7.578859,0.412884 10.642205,2.922704 1.11139,0.910576 1.0486,4.305966 1.0486,4.305966"
             id="path16032-9"
             sodipodi:nodetypes="csc"
             transform="matrix(3.9160101,0,0,4.086123,2.1315657,-2.4723443)" />
          <path
             id="rect11566-1-1"
             style="fill:#000000;fill-opacity:1;stroke-width:0.865;stroke-linecap:round;filter:url(#filter18226-1-8)"
             d="m 46.021383,84.029808 c 10.925005,-0.04102 15.686682,-0.182423 17.55118,-0.240478 1.17779,-0.03667 1.055942,-0.0049 1.055942,-0.0049 0,0 -4.06942,1.500063 -4.952975,1.60637 -1.521174,0.183024 -2.059657,0.131203 -4.505694,0.150817 -2.329844,0.01868 -5.473135,0.03909 -6.95085,-0.08392 -2.886894,-0.240319 -3.410303,-0.956399 -2.197603,-1.427885 z"
             sodipodi:nodetypes="cscssscc"
             transform="matrix(3.9160101,0,0,-4.086123,-137.16253,407.8369)" />
          <path
             id="rect13708-8-4"
             style="fill-opacity:0.92268;stroke-width:0.865;stroke-linecap:round;filter:url(#filter19748)"
             d="m 27.698733,18.388361 c 0.778394,-0.0332 1.35936,-1.75751 1.35936,-1.75751 l -0.707949,-0.25374 c 0,0 -0.906933,2.02217 -0.651411,2.01125 z"
             sodipodi:nodetypes="sccs"
             transform="matrix(3.9160101,0,0,4.086123,2.1315657,-2.4723443)" />
          <path
             style="fill:none;stroke:#000000;stroke-width:0.264583px;stroke-linecap:butt;stroke-linejoin:miter;stroke-opacity:1;filter:url(#filter18234-5-9)"
             d="m 66.859575,83.918251 c 0,0 7.578859,0.412884 10.642202,2.922704 1.111396,0.910576 1.048603,4.305964 1.048603,4.305964"
             id="path16032-9-5"
             sodipodi:nodetypes="csc"
             transform="matrix(3.9160101,0,0,-4.086123,-137.16253,407.8369)" />
        </g>
      </g>
      <g
         id="g32615"
         transform="translate(-1.2175706)"
         style="display:inline;opacity:0.75"
         inkscape:label="Rear">
        <g
           id="g30620-9"
           style="display:inline;opacity:0.8"
           transform="translate(1.0557002)"
           inkscape:label="Axle">
          <rect
             style="font-variation-settings:normal;display:inline;mix-blend-mode:normal;fill:url(#linearGradient30782);fill-opacity:1;stroke:#000000;stroke-width:0.111839;stroke-linecap:round;stroke-linejoin:round;stroke-miterlimit:4;stroke-dasharray:none;stroke-dashoffset:0;stroke-opacity:1;filter:url(#filter24160-2-0);stop-color:#000000"
             id="rect21541-05-0"
             width="7.5615335"
             height="1.7255344"
             x="-12.599893"
             y="27.248672"
             transform="matrix(0.09187356,0,0,5.0365735,-9.404096,-108.94087)" />
          <path
             style="font-variation-settings:normal;mix-blend-mode:normal;fill:url(#linearGradient30784);fill-opacity:1;stroke:#000000;stroke-width:0.0954578;stroke-linecap:round;stroke-linejoin:round;stroke-miterlimit:4;stroke-dasharray:none;stroke-dashoffset:0;stroke-opacity:1;filter:url(#filter24160-7);stop-color:#000000"
             id="rect21541-06"
             width="7.5615335"
             height="1.7255344"
             x="-12.599893"
             y="27.248672"
             transform="matrix(0.63517057,0,0,1,-4.6126919,2.3622238e-7)"
             inkscape:path-effect="#path-effect32667"
             d="m -12.335309,27.248672 h 7.0323665 a 0.26458333,0.26458333 45 0 1 0.2645833,0.264584 v 1.196368 a 0.26458333,0.26458333 135 0 1 -0.2645833,0.264583 h -7.0323665 a 0.26458333,0.26458333 45 0 1 -0.264584,-0.264583 v -1.196368 a 0.26458333,0.26458333 135 0 1 0.264584,-0.264584 z"
             sodipodi:type="rect" />
          <path
             style="font-variation-settings:normal;opacity:1;vector-effect:none;fill:url(#linearGradient30786);fill-opacity:1;stroke:#000000;stroke-width:0.0954578;stroke-linecap:round;stroke-linejoin:round;stroke-miterlimit:4;stroke-dasharray:none;stroke-dashoffset:0;stroke-opacity:1;-inkscape-stroke:none;filter:url(#filter24160-7);stop-color:#000000;stop-opacity:1"
             id="rect21541-0-1"
             width="7.5615335"
             height="1.7255344"
             x="-12.599893"
             y="36.173225"
             transform="matrix(0.63517057,0,0,1,-4.6126919,0.53164657)"
             inkscape:path-effect="#path-effect32727"
             d="m -12.335309,36.173225 h 7.0323665 a 0.26458333,0.26458333 45 0 1 0.2645833,0.264584 v 1.196368 a 0.26458333,0.26458333 135 0 1 -0.2645833,0.264583 h -7.0323665 a 0.26458333,0.26458333 45 0 1 -0.264584,-0.264583 v -1.196368 a 0.26458333,0.26458333 135 0 1 0.264584,-0.264584 z"
             sodipodi:type="rect" />
        </g>
      </g>
      <g
         id="g30620"
         style="display:inline;opacity:0.25"
         transform="translate(18.488077)"
         inkscape:label="Front">
        <g
           id="g32809"
           inkscape:label="Axle">
          <rect
             style="font-variation-settings:normal;display:inline;mix-blend-mode:normal;fill:url(#linearGradient30536);fill-opacity:1;stroke:#000000;stroke-width:0.111839;stroke-linecap:round;stroke-linejoin:round;stroke-miterlimit:4;stroke-dasharray:none;stroke-dashoffset:0;stroke-opacity:1;filter:url(#filter24160-2);stop-color:#000000"
             id="rect21541-05"
             width="7.5615335"
             height="1.7255344"
             x="-12.599893"
             y="27.248672"
             transform="matrix(0.09187356,0,0,5.0365735,-9.404096,-108.94087)" />
          <path
             style="font-variation-settings:normal;mix-blend-mode:normal;fill:url(#linearGradient30628);fill-opacity:1;stroke:#000000;stroke-width:0.0954578;stroke-linecap:round;stroke-linejoin:round;stroke-miterlimit:4;stroke-dasharray:none;stroke-dashoffset:0;stroke-opacity:1;filter:url(#filter24160);stop-color:#000000"
             id="rect21541"
             width="7.5615335"
             height="1.7255344"
             x="-12.599893"
             y="27.248672"
             transform="matrix(0.63517057,0,0,1,-4.6126919,2.3622238e-7)"
             d="m -12.335309,27.248672 h 7.0323665 a 0.26458333,0.26458333 45 0 1 0.2645833,0.264584 v 1.196368 a 0.26458333,0.26458333 135 0 1 -0.2645833,0.264583 h -7.0323665 a 0.26458333,0.26458333 45 0 1 -0.264584,-0.264583 v -1.196368 a 0.26458333,0.26458333 135 0 1 0.264584,-0.264584 z"
             inkscape:path-effect="#path-effect32687"
             sodipodi:type="rect" />
          <path
             style="font-variation-settings:normal;opacity:1;vector-effect:none;fill:url(#linearGradient21572);fill-opacity:1;stroke:#000000;stroke-width:0.0954578;stroke-linecap:round;stroke-linejoin:round;stroke-miterlimit:4;stroke-dasharray:none;stroke-dashoffset:0;stroke-opacity:1;-inkscape-stroke:none;filter:url(#filter24160);stop-color:#000000;stop-opacity:1"
             id="rect21541-0"
             width="7.5615335"
             height="1.7255344"
             x="-12.599893"
             y="36.173225"
             transform="matrix(0.63517057,0,0,1,-4.6126919,0.53164657)"
             d="m -12.335309,36.173225 h 7.0323665 a 0.26458333,0.26458333 45 0 1 0.2645833,0.264584 v 1.196368 a 0.26458333,0.26458333 135 0 1 -0.2645833,0.264583 h -7.0323665 a 0.26458333,0.26458333 45 0 1 -0.264584,-0.264583 v -1.196368 a 0.26458333,0.26458333 135 0 1 0.264584,-0.264584 z"
             inkscape:path-effect="#path-effect32707"
             sodipodi:type="rect" />
        </g>
      </g>
    </g>
    <path
       style="display:inline;fill:none;stroke:#000000;stroke-width:0.985897;stroke-linecap:butt;stroke-linejoin:miter;stroke-dasharray:none;stroke-opacity:1;marker-end:url(#TriangleStart)"
       d="M 35.99169,96.117888 157.2873,52.467532"
       id="path39646"
       sodipodi:nodetypes="cc" />
    <circle
       style="font-variation-settings:normal;display:inline;opacity:0.8;vector-effect:none;fill:url(#radialGradient30820);fill-opacity:1;stroke:#000000;stroke-width:0.119503;stroke-linecap:round;stroke-linejoin:round;stroke-miterlimit:4;stroke-dasharray:none;stroke-dashoffset:0;stroke-opacity:1;-inkscape-stroke:none;stop-color:#000000;stop-opacity:1"
       id="path30810"
       cx="42.707527"
       cy="93.414055"
       inkscape:label="Reference Point"
       transform="rotate(4.2554137)"
       r="1.2466356" />
    <text
       xml:space="preserve"
       style="font-size:3.45723px;line-height:1.25;font-family:sans-serif;display:inline;stroke-width:1.58092"
       x="-19.734196"
       y="5.960669"
       id="text34235"
       transform="rotate(-90)"><tspan
         sodipodi:role="line"
         style="stroke-width:1.58092"
         x="-19.734196"
         y="5.960669"
         id="tspan34237">y (m)</tspan></text>
    <text
       xml:space="preserve"
       style="font-size:3.08528px;line-height:1.25;font-family:sans-serif;display:inline;stroke-width:1.58092"
       x="192.92442"
       y="136.52086"
       id="text34235-7"><tspan
         sodipodi:role="line"
         style="stroke-width:1.58092"
         x="192.92442"
         y="136.52086"
         id="tspan34237-0">x(m)</tspan></text>
    <text
       xml:space="preserve"
       style="font-size:3.08528px;line-height:1.25;font-family:sans-serif;display:inline;stroke-width:1.58092"
       x="34.395687"
       y="135.06419"
       id="text34235-7-9"><tspan
         sodipodi:role="line"
         style="stroke-width:1.58092"
         x="34.395687"
         y="135.06419"
         id="tspan34237-0-4">3</tspan></text>
    <text
       xml:space="preserve"
       style="font-size:3.08528px;line-height:1.25;font-family:sans-serif;display:inline;stroke-width:1.58092"
       x="155.30316"
       y="135.06419"
       id="text34235-7-9-2"><tspan
         sodipodi:role="line"
         style="stroke-width:1.58092"
         x="155.30316"
         y="135.06419"
         id="tspan34237-0-4-4">17</tspan></text>
    <text
       xml:space="preserve"
       style="font-size:3.08528px;line-height:1.25;font-family:sans-serif;display:inline;stroke-width:1.58092"
       x="5.7083039"
       y="97.315834"
       id="text34235-7-9-3"><tspan
         sodipodi:role="line"
         style="stroke-width:1.58092"
         x="5.7083039"
         y="97.315834"
         id="tspan34237-0-4-7">4</tspan></text>
    <path
       style="display:inline;fill:none;stroke:#000000;stroke-width:0.478011;stroke-linecap:butt;stroke-linejoin:miter;stroke-dasharray:none;stroke-opacity:1;marker-end:url(#Arrow3)"
       d="M 9.1171131,131.01642 H 199.90616"
       id="path32829"
       inkscape:label="Longitudinal" />
    <path
       style="display:inline;fill:none;stroke:#000000;stroke-width:0.478011;stroke-linecap:butt;stroke-linejoin:miter;stroke-dasharray:none;stroke-opacity:1;marker-end:url(#Arrow3)"
       d="M 9.1171115,131.01642 V 10.649022"
       id="path32831"
       inkscape:label="Longitudinal" />
    <path
       style="fill:none;stroke:#000000;stroke-width:0.388384;stroke-linecap:butt;stroke-linejoin:miter;stroke-dasharray:0.776768, 0.388384;stroke-dashoffset:0;stroke-opacity:1"
       d="M 9.11711,96.148946 H 35.597705 L 35.267722,131.01641"
       id="path44745" />
    <path
       style="fill:none;stroke:#000000;stroke-width:0.388384;stroke-linecap:butt;stroke-linejoin:miter;stroke-dasharray:0.776767, 0.388384;stroke-dashoffset:0;stroke-opacity:1"
       d="M 9.0120688,52.630151 157.32553,52.490412 157.29035,130.92329"
       id="path44745-2"
       sodipodi:nodetypes="ccc" />
    <circle
       style="font-variation-settings:normal;display:inline;opacity:0.8;vector-effect:none;fill:url(#radialGradient38552);fill-opacity:1;stroke:#000000;stroke-width:0.119503;stroke-linecap:round;stroke-linejoin:round;stroke-miterlimit:4;stroke-dasharray:none;stroke-dashoffset:0;stroke-opacity:1;-inkscape-stroke:none;stop-color:#000000;stop-opacity:1"
       id="circle38534"
       cx="115.55173"
       cy="118.97787"
       inkscape:label="Reference Point"
       transform="rotate(-27.388673)"
       r="1.2466356" />
    <text
       xml:space="preserve"
       style="font-size:3.08528px;line-height:1.25;font-family:sans-serif;display:inline;stroke-width:1.58092"
       x="5.7083039"
       y="53.746609"
       id="text48156"><tspan
         sodipodi:role="line"
         style="stroke-width:1.58092"
         x="5.7083039"
         y="53.746609"
         id="tspan48154">9</tspan></text>
  </g>
  <metadata
     id="metadata448">
    <rdf:RDF>
      <cc:Work
         rdf:about="">
        <cc:license
           rdf:resource="https://www.eclipse.org/legal/epl-2.0/" />
        <dc:creator>
          <cc:Agent>
            <dc:title>René Paris</dc:title>
          </cc:Agent>
        </dc:creator>
        <dc:rights>
          <cc:Agent>
            <dc:title>2023 - Bayerische Motoren Werke Aktiengesellschaft (BMW AG)</dc:title>
          </cc:Agent>
        </dc:rights>
        <dc:title>WorldCoordinateSystem</dc:title>
      </cc:Work>
    </rdf:RDF>
  </metadata>
</svg>
