{
    "configurations": [
        {
            "name": "openpass",
            "cStandard": "c99",
            "cppStandard": "c++17",
            "configurationProvider": "ms-vscode.cmake-tools",
            "compileCommands": "${workspaceFolder}/build/compile_commands.json",
            "intelliSenseMode": "linux-gcc-x64"
        }
    ],
    "version": 4
}
