<?xml version="1.0" encoding="UTF-8" standalone="no"?>
<!-- Created with Inkscape (http://www.inkscape.org/) -->

<svg
   width="210mm"
   height="131mm"
   viewBox="1 0 208 129.75238"
   version="1.1"
   id="svg12177"
   sodipodi:docname="obstruction.svg"
   inkscape:version="1.2.2 (732a01da63, 2022-12-09)"
   inkscape:export-filename="obstruction.png"
   inkscape:export-xdpi="72"
   inkscape:export-ydpi="72"
   xmlns:inkscape="http://www.inkscape.org/namespaces/inkscape"
   xmlns:sodipodi="http://sodipodi.sourceforge.net/DTD/sodipodi-0.dtd"
   xmlns:xlink="http://www.w3.org/1999/xlink"
   xmlns="http://www.w3.org/2000/svg"
   xmlns:svg="http://www.w3.org/2000/svg"
   xmlns:rdf="http://www.w3.org/1999/02/22-rdf-syntax-ns#"
   xmlns:cc="http://creativecommons.org/ns#"
   xmlns:dc="http://purl.org/dc/elements/1.1/">
  <title
     id="title4545">Obstruction</title>
  <sodipodi:namedview
     id="namedview525"
     pagecolor="#505050"
     bordercolor="#eeeeee"
     borderopacity="1"
     inkscape:showpageshadow="false"
     inkscape:pageopacity="0"
     inkscape:pagecheckerboard="true"
     inkscape:deskcolor="#505050"
     inkscape:document-units="mm"
     showgrid="false"
     inkscape:zoom="4.6077266"
     inkscape:cx="347.24282"
     inkscape:cy="250.88294"
     inkscape:window-width="1920"
     inkscape:window-height="1017"
     inkscape:window-x="-8"
     inkscape:window-y="-8"
     inkscape:window-maximized="1"
     inkscape:current-layer="layer5"
     showguides="true" />
  <style
     type="text/css"
     id="style515">
      .line1{stroke:#000000;stroke-width:0.299655;stroke-miterlimit:4;stroke-dasharray:0.299655;stroke-dashoffset:0}
   </style>
  <defs
     id="defs12174">
    <linearGradient
       id="linearGradient10589"
       inkscape:swatch="solid">
      <stop
         style="stop-color:#a0a0a0;stop-opacity:1;"
         offset="0"
         id="stop10587" />
    </linearGradient>
    <marker
       style="overflow:visible"
       id="TriangleStart"
       refX="3"
       refY="0"
       orient="auto-start-reverse"
       inkscape:stockid="TriangleStart"
       markerWidth="5.3244081"
       markerHeight="6.155385"
       viewBox="0 0 5.3244081 6.1553851"
       inkscape:isstock="true"
       inkscape:collect="always"
       preserveAspectRatio="xMidYMid">
      <path
         transform="scale(0.5)"
         style="fill:context-stroke;fill-rule:evenodd;stroke:context-stroke;stroke-width:1pt"
         d="M 5.77,0 -2.88,5 V -5 Z"
         id="path135" />
    </marker>
    <inkscape:path-effect
       effect="offset"
       id="path-effect38844"
       is_visible="true"
       lpeversion="1.2"
       linejoin_type="miter"
       unit="mm"
       offset="6.4"
       miter_limit="4"
       attempt_force_join="false"
       update_on_knot_move="true" />
    <inkscape:path-effect
       effect="tiling"
       id="path-effect38774"
       is_visible="true"
       lpeversion="1"
       unit="px"
       seed="1;1"
       lpesatellites=""
       num_rows="3"
       num_cols="3"
       gapx="0"
       gapy="0"
       offset="0"
       offset_type="false"
       scale="0"
       rotate="0"
       mirrorrowsx="false"
       mirrorrowsy="false"
       mirrorcolsx="false"
       mirrorcolsy="false"
       mirrortrans="false"
       shrink_interp="false"
       split_items="false"
       link_styles="false"
       interpolate_scalex="false"
       interpolate_scaley="true"
       interpolate_rotatex="false"
       interpolate_rotatey="true"
       random_scale="false"
       random_rotate="false"
       random_gap_y="false"
       random_gap_x="false"
       transformorigin="" />
    <inkscape:path-effect
       effect="offset"
       id="path-effect38772"
       is_visible="true"
       lpeversion="1.2"
       linejoin_type="miter"
       unit="mm"
       offset="0"
       miter_limit="4"
       attempt_force_join="false"
       update_on_knot_move="true" />
    <inkscape:path-effect
       effect="fillet_chamfer"
       id="path-effect38550"
       is_visible="true"
       lpeversion="1"
       nodesatellites_param="F,0,0,1,0,0.26458333,0,1 @ F,0,0,1,0,0.26458333,0,1 @ F,0,0,1,0,0.26458333,0,1 @ F,0,0,1,0,0.26458333,0,1"
       unit="px"
       method="auto"
       mode="F"
       radius="1"
       chamfer_steps="1"
       flexible="false"
       use_knot_distance="true"
       apply_no_radius="true"
       apply_with_radius="true"
       only_selected="false"
       hide_knots="false" />
    <inkscape:path-effect
       effect="fillet_chamfer"
       id="path-effect38546"
       is_visible="true"
       lpeversion="1"
       nodesatellites_param="F,0,0,1,0,0.26458333,0,1 @ F,0,0,1,0,0.26458333,0,1 @ F,0,0,1,0,0.26458333,0,1 @ F,0,0,1,0,0.26458333,0,1"
       unit="px"
       method="auto"
       mode="F"
       radius="1"
       chamfer_steps="1"
       flexible="false"
       use_knot_distance="true"
       apply_no_radius="true"
       apply_with_radius="true"
       only_selected="false"
       hide_knots="false" />
    <inkscape:path-effect
       effect="fillet_chamfer"
       id="path-effect38542"
       is_visible="true"
       lpeversion="1"
       nodesatellites_param="F,0,0,1,0,0.26458333,0,1 @ F,0,0,1,0,0.26458333,0,1 @ F,0,0,1,0,0.26458333,0,1 @ F,0,0,1,0,0.26458333,0,1"
       unit="px"
       method="auto"
       mode="F"
       radius="1"
       chamfer_steps="1"
       flexible="false"
       use_knot_distance="true"
       apply_no_radius="true"
       apply_with_radius="true"
       only_selected="false"
       hide_knots="false" />
    <inkscape:path-effect
       effect="fillet_chamfer"
       id="path-effect38538"
       is_visible="true"
       lpeversion="1"
       nodesatellites_param="F,0,0,1,0,0.26458333,0,1 @ F,0,0,1,0,0.26458333,0,1 @ F,0,0,1,0,0.26458333,0,1 @ F,0,0,1,0,0.26458333,0,1"
       unit="px"
       method="auto"
       mode="F"
       radius="1"
       chamfer_steps="1"
       flexible="false"
       use_knot_distance="true"
       apply_no_radius="true"
       apply_with_radius="true"
       only_selected="false"
       hide_knots="false" />
    <inkscape:path-effect
       effect="fillet_chamfer"
       id="path-effect32727"
       is_visible="true"
       lpeversion="1"
       nodesatellites_param="F,0,0,1,0,0.26458333,0,1 @ F,0,0,1,0,0.26458333,0,1 @ F,0,0,1,0,0.26458333,0,1 @ F,0,0,1,0,0.26458333,0,1"
       unit="px"
       method="auto"
       mode="F"
       radius="1"
       chamfer_steps="1"
       flexible="false"
       use_knot_distance="true"
       apply_no_radius="true"
       apply_with_radius="true"
       only_selected="false"
       hide_knots="false" />
    <inkscape:path-effect
       effect="fillet_chamfer"
       id="path-effect32707"
       is_visible="true"
       lpeversion="1"
       nodesatellites_param="F,0,0,1,0,0.26458333,0,1 @ F,0,0,1,0,0.26458333,0,1 @ F,0,0,1,0,0.26458333,0,1 @ F,0,0,1,0,0.26458333,0,1"
       unit="px"
       method="auto"
       mode="F"
       radius="1"
       chamfer_steps="1"
       flexible="false"
       use_knot_distance="true"
       apply_no_radius="true"
       apply_with_radius="true"
       only_selected="false"
       hide_knots="false" />
    <inkscape:path-effect
       effect="fillet_chamfer"
       id="path-effect32687"
       is_visible="true"
       lpeversion="1"
       nodesatellites_param="F,0,0,1,0,0.26458333,0,1 @ F,0,0,1,0,0.26458333,0,1 @ F,0,0,1,0,0.26458333,0,1 @ F,0,0,1,0,0.26458333,0,1"
       unit="px"
       method="auto"
       mode="F"
       radius="1"
       chamfer_steps="1"
       flexible="false"
       use_knot_distance="true"
       apply_no_radius="true"
       apply_with_radius="true"
       only_selected="false"
       hide_knots="false" />
    <inkscape:path-effect
       effect="fillet_chamfer"
       id="path-effect32667"
       is_visible="true"
       lpeversion="1"
       nodesatellites_param="F,0,0,1,0,0.26458333,0,1 @ F,0,0,1,0,0.26458333,0,1 @ F,0,0,1,0,0.26458333,0,1 @ F,0,0,1,0,0.26458333,0,1"
       unit="px"
       method="auto"
       mode="F"
       radius="1"
       chamfer_steps="1"
       flexible="false"
       use_knot_distance="true"
       apply_no_radius="true"
       apply_with_radius="true"
       only_selected="false"
       hide_knots="false" />
    <linearGradient
       inkscape:collect="always"
       id="linearGradient30868">
      <stop
         style="stop-color:#333333;stop-opacity:1;"
         offset="0"
         id="stop30858" />
      <stop
         style="stop-color:#000000;stop-opacity:1;"
         offset="0.1"
         id="stop30860" />
      <stop
         style="stop-color:#20ff00;stop-opacity:1;"
         offset="0.5"
         id="stop30862" />
      <stop
         style="stop-color:#000000;stop-opacity:1;"
         offset="0.89999998"
         id="stop30864" />
      <stop
         style="stop-color:#333333;stop-opacity:1;"
         offset="1"
         id="stop30866" />
    </linearGradient>
    <linearGradient
       id="linearGradient13254">
      <stop
         style="stop-color:#ffffff;stop-opacity:0.50193125"
         offset="0"
         id="stop13250" />
      <stop
         style="stop-color:#ffffff;stop-opacity:0"
         offset="1"
         id="stop13252" />
    </linearGradient>
    <radialGradient
       xlink:href="#linearGradient13254"
       id="radialGradient17053"
       cx="88.337814"
       cy="74.649353"
       fx="88.337814"
       fy="74.649353"
       r="49.89299"
       gradientTransform="matrix(0.99769605,0,0,0.99999285,-87.912228,-39.371667)"
       gradientUnits="userSpaceOnUse" />
    <filter
       inkscape:collect="always"
       style="color-interpolation-filters:sRGB"
       id="filter18222-0"
       x="-0.033541095"
       y="-0.018109434"
       width="1.0670822"
       height="1.0362189">
      <feGaussianBlur
         inkscape:collect="always"
         stdDeviation="0.40870019"
         id="feGaussianBlur18224-1" />
    </filter>
    <filter
       inkscape:collect="always"
       style="color-interpolation-filters:sRGB"
       id="filter18230-3"
       x="-0.033975737"
       y="-0.01798521"
       width="1.0679515"
       height="1.0359704">
      <feGaussianBlur
         inkscape:collect="always"
         stdDeviation="0.33132421"
         id="feGaussianBlur18232-0" />
    </filter>
    <filter
       inkscape:collect="always"
       style="color-interpolation-filters:sRGB"
       id="filter18226-1"
       x="-0.012851508"
       y="-0.13846328"
       width="1.025703"
       height="1.2769266">
      <feGaussianBlur
         inkscape:collect="always"
         stdDeviation="0.10292743"
         id="feGaussianBlur18228-7" />
    </filter>
    <filter
       inkscape:collect="always"
       style="color-interpolation-filters:sRGB"
       id="filter19744"
       x="-0.16377558"
       y="-0.11438444"
       width="1.3275512"
       height="1.2287689">
      <feGaussianBlur
         inkscape:collect="always"
         stdDeviation="0.095859125"
         id="feGaussianBlur19746" />
    </filter>
    <filter
       inkscape:collect="always"
       style="color-interpolation-filters:sRGB"
       id="filter18242-0"
       x="-0.079568165"
       y="-0.013799525"
       width="1.1591363"
       height="1.027599">
      <feGaussianBlur
         inkscape:collect="always"
         stdDeviation="0.13980316"
         id="feGaussianBlur18244-1" />
    </filter>
    <filter
       inkscape:collect="always"
       style="color-interpolation-filters:sRGB"
       id="filter18234-5"
       x="-0.019646573"
       y="-0.049054145"
       width="1.0499933"
       height="1.0801728">
      <feGaussianBlur
         inkscape:collect="always"
         stdDeviation="0.092708589"
         id="feGaussianBlur18236-7" />
    </filter>
    <filter
       inkscape:collect="always"
       style="color-interpolation-filters:sRGB"
       id="filter18226-1-8"
       x="-0.012851508"
       y="-0.13846328"
       width="1.025703"
       height="1.2769266">
      <feGaussianBlur
         inkscape:collect="always"
         stdDeviation="0.10292743"
         id="feGaussianBlur18228-7-5" />
    </filter>
    <filter
       inkscape:collect="always"
       style="color-interpolation-filters:sRGB"
       id="filter19748"
       x="-0.16377558"
       y="-0.11438501"
       width="1.3275512"
       height="1.22877">
      <feGaussianBlur
         inkscape:collect="always"
         stdDeviation="0.095859125"
         id="feGaussianBlur19750" />
    </filter>
    <filter
       inkscape:collect="always"
       style="color-interpolation-filters:sRGB"
       id="filter18234-5-9"
       x="-0.019646573"
       y="-0.049054159"
       width="1.0499933"
       height="1.0801729">
      <feGaussianBlur
         inkscape:collect="always"
         stdDeviation="0.092708589"
         id="feGaussianBlur18236-7-1" />
    </filter>
    <radialGradient
       inkscape:collect="always"
       xlink:href="#linearGradient30868"
       id="radialGradient30820"
       cx="-9.1586399"
       cy="32.64447"
       fx="-9.1586399"
       fy="32.64447"
       r="0.83166844"
       gradientUnits="userSpaceOnUse"
       gradientTransform="matrix(1.7927408,2.1927797e-8,-2.1927797e-8,1.7927408,85.66174,19.804089)" />
    <inkscape:path-effect
       effect="offset"
       id="path-effect38844-6"
       is_visible="true"
       lpeversion="1.2"
       linejoin_type="miter"
       unit="mm"
       offset="6.4"
       miter_limit="4"
       attempt_force_join="false"
       update_on_knot_move="true" />
    <filter
       inkscape:collect="always"
       style="color-interpolation-filters:sRGB"
       id="filter42722"
       x="-0.002434917"
       y="-0.0039295726"
       width="1.0048698"
       height="1.0078591">
      <feGaussianBlur
         inkscape:collect="always"
         stdDeviation="0.1160647"
         id="feGaussianBlur42724" />
    </filter>
    <radialGradient
       inkscape:collect="always"
       xlink:href="#linearGradient30868"
       id="radialGradient30820-6"
       cx="-9.1586399"
       cy="32.64447"
       fx="-9.1586399"
       fy="32.64447"
       r="0.83166844"
       gradientUnits="userSpaceOnUse"
       gradientTransform="matrix(1.7927407,1.6724812e-8,-1.6724812e-8,1.7927407,130.47592,36.479931)" />
    <radialGradient
       inkscape:collect="always"
       xlink:href="#linearGradient30868"
       id="radialGradient64572"
       gradientUnits="userSpaceOnUse"
       gradientTransform="matrix(1.7927407,1.6724812e-8,-1.6724812e-8,1.7927407,191.10991,30.209754)"
       cx="-9.1586399"
       cy="32.64447"
       fx="-9.1586399"
       fy="32.64447"
       r="0.83166844" />
  </defs>
  <g
     inkscape:groupmode="layer"
     id="layer7"
     inkscape:label="Background"
     transform="matrix(0.76003563,0,0,0.90146085,6.9809906,6.734537)"
     style="display:inline;opacity:1;fill:#00ff00;stroke:#000000;stroke-opacity:1">
    <rect
       style="mix-blend-mode:normal;fill:#008000;fill-opacity:1;stroke:none;stroke-width:0.379958;stroke-linecap:round;stroke-linejoin:round;stroke-dasharray:0.882038, 0.441021;stroke-dashoffset:0;stroke-opacity:1"
       id="rect11660"
       width="274.94946"
       height="145.31967"
       x="-8.5125656"
       y="-7.4706922"
       inkscape:label="Greenfield" />
  </g>
  <g
     inkscape:groupmode="layer"
     id="layer5"
     inkscape:label="Road"
     style="display:inline"
     transform="translate(-1.9497955,-0.20000441)">
    <g
       id="g42304"
       transform="matrix(1.826688,0,0,1.7927408,41.719742,45.993054)"
       style="stroke-width:0.990665">
      <path
         id="path39516"
         style="color:#000000;opacity:1;fill:#808080;fill-opacity:1;stroke:none;stroke-width:0.990665;stroke-opacity:1;-inkscape-stroke:none;filter:url(#filter42722)"
         d="M 92.907256,-25.137274 C 63.764604,-4.8227696 24.24101,-3.3459035 -21.493059,-5.2482334 V 45.003144 C 16.014542,46.664281 56.00228,46.813766 92.907256,31.616668 v -56.753942"
         sodipodi:nodetypes="ccccc"
         inkscape:label="Asphalt" />
      <path
         id="path38770"
         style="color:#000000;opacity:1;fill:none;fill-opacity:1;stroke:#ffffff;stroke-width:0.990665;stroke-linecap:butt;stroke-miterlimit:4;stroke-opacity:1;-inkscape-stroke:none"
         d="m -21.469878,45.003144 c 37.5,1.661137 77.479636,1.810622 114.377134,-13.386476 m 0,-56.753942 C 63.770509,-4.8227696 24.254924,-3.3459035 -21.469878,-5.2482334"
         sodipodi:nodetypes="cccc"
         inkscape:label="BoundaryMarkings" />
    </g>
  </g>
  <g
     inkscape:groupmode="layer"
     id="layer2"
     inkscape:label="Cars"
     style="display:inline"
     transform="translate(-1.9497955,-0.20000441)">
    <g
       id="g38512"
       inkscape:label="Front Car"
       style="display:inline;opacity:0.5"
       transform="matrix(1.3936411,-1.1276896,1.1276896,1.3936411,118.69977,18.780462)">
      <path
         id="path38490"
         style="display:inline;opacity:1;fill:#ff0000;fill-opacity:1;stroke:#000000;stroke-width:0.660026;stroke-linecap:round;stroke-miterlimit:4;stroke-dasharray:none"
         d="M 111.64432,2.0438227 C 105.04229,2.0523434 98.237005,2.1331568 90.758177,2.2169563 68.478685,2.4667353 41.869774,2.8505737 30.297465,3.4078715 23.230107,3.6384901 14.684348,2.8709548 9.3789488,7.2023519 2.0152129,13.214203 2.4599894,25.811026 2.4600716,35.566974 c 8.62e-5,9.755983 -0.4448587,22.350682 6.9188772,28.362514 5.3053992,4.331416 13.8511582,3.563881 20.9185162,3.794495 11.572309,0.55731 38.18122,0.94324 60.460712,1.193033 19.943523,0.22363 35.097833,0.411016 54.377613,-0.665139 13.73019,-0.865401 18.17953,0.501523 21.27874,-4.567317 5.08975,-8.603198 6.55453,-18.471425 6.55461,-28.117586 7e-5,-9.646154 -1.46486,-19.516463 -6.55461,-28.1196843 C 163.31532,2.3784606 158.86598,3.7474951 145.13579,2.8821032 133.08592,2.2094824 122.64768,2.0289899 111.64432,2.0438106 Z"
         sodipodi:nodetypes="sscszscscczccs"
         inkscape:label="Chassis"
         transform="matrix(0.17960964,0,0,0.17960964,-17.34453,26.451478)" />
      <g
         id="g38510"
         transform="matrix(0.17960963,0,0,0.17960963,-17.34453,26.451478)"
         inkscape:label="Paths">
        <path
           id="path38492"
           style="fill:#000000;fill-opacity:1;stroke-width:3.26929;stroke-linecap:round;filter:url(#filter18222-0)"
           d="m 179.92578,278.80469 c -8.3074,2.61456 0.001,-10e-4 -21.16406,6.57617 2.41461,6.36953 2.70871,14.02215 2.58789,20.50586 -0.12082,6.48371 -0.13018,14.58793 -2.58789,20.5039 21.1653,6.57727 12.85666,3.96357 21.16406,6.57813 7.92037,-3.87861 8.08005,-21.27699 8.08008,-27.08203 3e-5,-5.80504 -0.15921,-23.20318 -8.08008,-27.08203 z"
           transform="matrix(1.036111,0,0,1.0811201,-64.646328,-295.13328)"
           sodipodi:nodetypes="cczcczc" />
        <path
           id="path38494"
           style="fill:#000000;fill-opacity:1;stroke-width:2.64998;stroke-linecap:round;filter:url(#filter18230-3)"
           d="m 84.568359,283.7793 c -4.873618,6.66755 -5.189458,17.65863 -5.189453,22.10742 5e-6,4.44879 0.315887,15.43799 5.189453,22.10547 l 18.214841,-2.34766 c -2.861983,-6.16343 -3.308769,-13.64671 -3.224099,-19.75781 0.0847,-6.1111 0.421501,-14.2142 3.224099,-19.75977 z"
           transform="matrix(1.036111,0,0,1.0811201,-64.646328,-295.13328)"
           sodipodi:nodetypes="czcczcc" />
        <path
           id="path38496"
           style="fill:#000000;fill-opacity:1;stroke-width:0.865;stroke-linecap:round;filter:url(#filter18226-1)"
           d="m 10.450971,2.232998 c 10.925005,-0.04102 15.686682,-0.182423 17.55118,-0.240478 1.17779,-0.03667 1.055942,-0.0049 1.055942,-0.0049 0,0 -4.06942,1.500063 -4.952975,1.60637 -1.521174,0.183024 -2.059657,0.131203 -4.505694,0.150817 -2.329844,0.01868 -5.473135,0.03909 -6.95085,-0.08392 C 9.7616799,3.420568 9.2382709,2.704488 10.450971,2.233002 Z"
           sodipodi:nodetypes="cscssscc"
           transform="matrix(3.9160101,0,0,4.086123,2.1315657,-2.4723443)" />
        <path
           id="path38498"
           style="fill-opacity:0.92268;stroke-width:0.865;stroke-linecap:round;filter:url(#filter19744)"
           d="m 27.698733,0.23010595 c 0.778394,0.03326 1.35936,1.75751405 1.35936,1.75751405 l -0.707949,0.253746 c 0,0 -0.906933,-2.02217705 -0.651411,-2.01126005 z"
           sodipodi:nodetypes="sccs"
           transform="matrix(3.9160101,0,0,4.086123,2.1315657,-2.4723443)" />
        <path
           id="path38500"
           style="fill:#000000;fill-opacity:0.5;stroke-width:3.26929;stroke-linecap:round;filter:url(#filter18242-0)"
           d="m 191.18359,293.72852 -0.125,12.08789 h -0.002 v 0.0703 0.0703 h 0.002 l 0.125,12.08594 c 0,0 3.74641,-0.39654 3.87891,-2.23438 0.1854,-2.57154 0.20967,-9.43993 0.21094,-9.85156 2e-5,-0.006 -1e-5,-0.0671 0,-0.0703 -1e-5,-0.003 2e-5,-0.0641 0,-0.0703 -0.001,-0.411 -0.0255,-7.27989 -0.21094,-9.85157 -0.1325,-1.83783 -3.87891,-2.23632 -3.87891,-2.23632 z"
           transform="matrix(1.036111,0,0,1.0811201,-64.646328,-295.13328)" />
        <path
           style="fill:none;stroke:#000000;stroke-width:0.264583px;stroke-linecap:butt;stroke-linejoin:miter;stroke-opacity:1;filter:url(#filter18234-5)"
           d="m 31.289163,2.121441 c 0,0 7.578859,0.412884 10.642205,2.922704 1.11139,0.910576 1.0486,4.305966 1.0486,4.305966"
           id="path38502"
           sodipodi:nodetypes="csc"
           transform="matrix(3.9160101,0,0,4.086123,2.1315657,-2.4723443)" />
        <path
           id="path38504"
           style="fill:#000000;fill-opacity:1;stroke-width:0.865;stroke-linecap:round;filter:url(#filter18226-1-8)"
           d="m 46.021383,84.029808 c 10.925005,-0.04102 15.686682,-0.182423 17.55118,-0.240478 1.17779,-0.03667 1.055942,-0.0049 1.055942,-0.0049 0,0 -4.06942,1.500063 -4.952975,1.60637 -1.521174,0.183024 -2.059657,0.131203 -4.505694,0.150817 -2.329844,0.01868 -5.473135,0.03909 -6.95085,-0.08392 -2.886894,-0.240319 -3.410303,-0.956399 -2.197603,-1.427885 z"
           sodipodi:nodetypes="cscssscc"
           transform="matrix(3.9160101,0,0,-4.086123,-137.16253,407.8369)" />
        <path
           id="path38506"
           style="fill-opacity:0.92268;stroke-width:0.865;stroke-linecap:round;filter:url(#filter19748)"
           d="m 27.698733,18.388361 c 0.778394,-0.0332 1.35936,-1.75751 1.35936,-1.75751 l -0.707949,-0.25374 c 0,0 -0.906933,2.02217 -0.651411,2.01125 z"
           sodipodi:nodetypes="sccs"
           transform="matrix(3.9160101,0,0,4.086123,2.1315657,-2.4723443)" />
        <path
           style="fill:none;stroke:#000000;stroke-width:0.264583px;stroke-linecap:butt;stroke-linejoin:miter;stroke-opacity:1;filter:url(#filter18234-5-9)"
           d="m 66.859575,83.918251 c 0,0 7.578859,0.412884 10.642202,2.922704 1.111396,0.910576 1.048603,4.305964 1.048603,4.305964"
           id="path38508"
           sodipodi:nodetypes="csc"
           transform="matrix(3.9160101,0,0,-4.086123,-137.16253,407.8369)" />
      </g>
      <rect
         style="font-variation-settings:normal;display:inline;opacity:1;vector-effect:none;fill:none;fill-opacity:1;stroke:#ffffff;stroke-width:0.247252;stroke-linecap:butt;stroke-linejoin:miter;stroke-miterlimit:4;stroke-dasharray:none;stroke-dashoffset:0;stroke-opacity:1;-inkscape-stroke:none;marker-end:url(#Arrow3-3);paint-order:stroke fill markers;stop-color:#000000;stop-opacity:1"
         id="rect64258"
         width="30.949926"
         height="12.919933"
         x="25.934574"
         y="41.703167"
         transform="rotate(-0.04174798,-21022.64,59063.494)"
         inkscape:label="Bounding Box" />
    </g>
    <g
       id="g10990"
       inkscape:label="Rear Car"
       style="display:inline;opacity:1"
       transform="matrix(1.7877985,0.13302624,-0.13302624,1.7877985,43.062484,22.391669)">
      <path
         id="rect5329-3"
         style="display:inline;opacity:1;fill:#008080;fill-opacity:1;stroke:#000000;stroke-width:0.660026;stroke-linecap:round;stroke-miterlimit:4;stroke-dasharray:none"
         d="M 111.64432,2.0438227 C 105.04229,2.0523434 98.237005,2.1331568 90.758177,2.2169563 68.478685,2.4667353 41.869774,2.8505737 30.297465,3.4078715 23.230107,3.6384901 14.684348,2.8709548 9.3789488,7.2023519 2.0152129,13.214203 2.4599894,25.811026 2.4600716,35.566974 c 8.62e-5,9.755983 -0.4448587,22.350682 6.9188772,28.362514 5.3053992,4.331416 13.8511582,3.563881 20.9185162,3.794495 11.572309,0.55731 38.18122,0.94324 60.460712,1.193033 19.943523,0.22363 35.097833,0.411016 54.377613,-0.665139 13.73019,-0.865401 18.17953,0.501523 21.27874,-4.567317 5.08975,-8.603198 6.55453,-18.471425 6.55461,-28.117586 7e-5,-9.646154 -1.46486,-19.516463 -6.55461,-28.1196843 C 163.31532,2.3784606 158.86598,3.7474951 145.13579,2.8821032 133.08592,2.2094824 122.64768,2.0289899 111.64432,2.0438106 Z"
         sodipodi:nodetypes="sscszscscczccs"
         transform="matrix(0.17960963,0,0,0.17960963,-17.34453,26.451478)"
         inkscape:label="Chassis" />
      <g
         id="g3439"
         transform="matrix(0.17960963,0,0,0.17960963,-17.34453,26.451478)"
         inkscape:label="Paths">
        <path
           id="rect9419-4"
           style="fill:#000000;fill-opacity:1;stroke-width:3.26929;stroke-linecap:round;filter:url(#filter18222-0)"
           d="m 179.92578,278.80469 c -8.3074,2.61456 0.001,-10e-4 -21.16406,6.57617 2.41461,6.36953 2.70871,14.02215 2.58789,20.50586 -0.12082,6.48371 -0.13018,14.58793 -2.58789,20.5039 21.1653,6.57727 12.85666,3.96357 21.16406,6.57813 7.92037,-3.87861 8.08005,-21.27699 8.08008,-27.08203 3e-5,-5.80504 -0.15921,-23.20318 -8.08008,-27.08203 z"
           transform="matrix(1.036111,0,0,1.0811201,-64.646328,-295.13328)"
           sodipodi:nodetypes="cczcczc" />
        <path
           id="rect9419-9-6"
           style="fill:#000000;fill-opacity:1;stroke-width:2.64998;stroke-linecap:round;filter:url(#filter18230-3)"
           d="m 84.568359,283.7793 c -4.873618,6.66755 -5.189458,17.65863 -5.189453,22.10742 5e-6,4.44879 0.315887,15.43799 5.189453,22.10547 l 18.214841,-2.34766 c -2.861983,-6.16343 -3.308769,-13.64671 -3.224099,-19.75781 0.0847,-6.1111 0.421501,-14.2142 3.224099,-19.75977 z"
           transform="matrix(1.036111,0,0,1.0811201,-64.646328,-295.13328)"
           sodipodi:nodetypes="czcczcc" />
        <path
           id="rect11566-1"
           style="fill:#000000;fill-opacity:1;stroke-width:0.865;stroke-linecap:round;filter:url(#filter18226-1)"
           d="m 10.450971,2.232998 c 10.925005,-0.04102 15.686682,-0.182423 17.55118,-0.240478 1.17779,-0.03667 1.055942,-0.0049 1.055942,-0.0049 0,0 -4.06942,1.500063 -4.952975,1.60637 -1.521174,0.183024 -2.059657,0.131203 -4.505694,0.150817 -2.329844,0.01868 -5.473135,0.03909 -6.95085,-0.08392 C 9.7616799,3.420568 9.2382709,2.704488 10.450971,2.233002 Z"
           sodipodi:nodetypes="cscssscc"
           transform="matrix(3.9160101,0,0,4.086123,2.1315657,-2.4723443)" />
        <path
           id="rect13708-8"
           style="fill-opacity:0.92268;stroke-width:0.865;stroke-linecap:round;filter:url(#filter19744)"
           d="m 27.698733,0.23010595 c 0.778394,0.03326 1.35936,1.75751405 1.35936,1.75751405 l -0.707949,0.253746 c 0,0 -0.906933,-2.02217705 -0.651411,-2.01126005 z"
           sodipodi:nodetypes="sccs"
           transform="matrix(3.9160101,0,0,4.086123,2.1315657,-2.4723443)" />
        <path
           id="rect15650-6"
           style="fill:#000000;fill-opacity:0.5;stroke-width:3.26929;stroke-linecap:round;filter:url(#filter18242-0)"
           d="m 191.18359,293.72852 -0.125,12.08789 h -0.002 v 0.0703 0.0703 h 0.002 l 0.125,12.08594 c 0,0 3.74641,-0.39654 3.87891,-2.23438 0.1854,-2.57154 0.20967,-9.43993 0.21094,-9.85156 2e-5,-0.006 -1e-5,-0.0671 0,-0.0703 -1e-5,-0.003 2e-5,-0.0641 0,-0.0703 -0.001,-0.411 -0.0255,-7.27989 -0.21094,-9.85157 -0.1325,-1.83783 -3.87891,-2.23632 -3.87891,-2.23632 z"
           transform="matrix(1.036111,0,0,1.0811201,-64.646328,-295.13328)" />
        <path
           style="fill:none;stroke:#000000;stroke-width:0.264583px;stroke-linecap:butt;stroke-linejoin:miter;stroke-opacity:1;filter:url(#filter18234-5)"
           d="m 31.289163,2.121441 c 0,0 7.578859,0.412884 10.642205,2.922704 1.11139,0.910576 1.0486,4.305966 1.0486,4.305966"
           id="path16032-9"
           sodipodi:nodetypes="csc"
           transform="matrix(3.9160101,0,0,4.086123,2.1315657,-2.4723443)" />
        <path
           id="rect11566-1-1"
           style="fill:#000000;fill-opacity:1;stroke-width:0.865;stroke-linecap:round;filter:url(#filter18226-1-8)"
           d="m 46.021383,84.029808 c 10.925005,-0.04102 15.686682,-0.182423 17.55118,-0.240478 1.17779,-0.03667 1.055942,-0.0049 1.055942,-0.0049 0,0 -4.06942,1.500063 -4.952975,1.60637 -1.521174,0.183024 -2.059657,0.131203 -4.505694,0.150817 -2.329844,0.01868 -5.473135,0.03909 -6.95085,-0.08392 -2.886894,-0.240319 -3.410303,-0.956399 -2.197603,-1.427885 z"
           sodipodi:nodetypes="cscssscc"
           transform="matrix(3.9160101,0,0,-4.086123,-137.16253,407.8369)" />
        <path
           id="rect13708-8-4"
           style="fill-opacity:0.92268;stroke-width:0.865;stroke-linecap:round;filter:url(#filter19748)"
           d="m 27.698733,18.388361 c 0.778394,-0.0332 1.35936,-1.75751 1.35936,-1.75751 l -0.707949,-0.25374 c 0,0 -0.906933,2.02217 -0.651411,2.01125 z"
           sodipodi:nodetypes="sccs"
           transform="matrix(3.9160101,0,0,4.086123,2.1315657,-2.4723443)" />
        <path
           style="fill:none;stroke:#000000;stroke-width:0.264583px;stroke-linecap:butt;stroke-linejoin:miter;stroke-opacity:1;filter:url(#filter18234-5-9)"
           d="m 66.859575,83.918251 c 0,0 7.578859,0.412884 10.642202,2.922704 1.111396,0.910576 1.048603,4.305964 1.048603,4.305964"
           id="path16032-9-5"
           sodipodi:nodetypes="csc"
           transform="matrix(3.9160101,0,0,-4.086123,-137.16253,407.8369)" />
      </g>
    </g>
  </g>
  <g
     inkscape:groupmode="layer"
     id="layer9"
     inkscape:label="Axles"
     transform="translate(-1.9497955,-0.20000441)" />
  <g
     inkscape:groupmode="layer"
     id="layer8"
     inkscape:label="CoorindateSystem"
     transform="translate(-1.9497955,-0.20000441)">
    <path
       style="color:#000000;font-variation-settings:normal;display:inline;opacity:1;vector-effect:none;fill:none;fill-opacity:1;stroke:#000000;stroke-width:0.545549;stroke-linecap:butt;stroke-linejoin:miter;stroke-miterlimit:4;stroke-dasharray:1.0911, 0.545549;stroke-dashoffset:0;stroke-opacity:1;-inkscape-stroke:none;stop-color:#000000;stop-opacity:1"
       d="m 101.36787,82.216712 c -13.288168,0.96048 -26.081443,1.187892 -38.145361,0.945419"
       id="path2805" />
    <path
       style="color:#000000;font-variation-settings:normal;display:inline;opacity:1;vector-effect:none;fill:none;fill-opacity:1;stroke:#000000;stroke-width:0.545549;stroke-linecap:butt;stroke-linejoin:miter;stroke-miterlimit:4;stroke-dasharray:1.0911, 0.545549;stroke-dashoffset:0;stroke-opacity:1;-inkscape-stroke:none;stop-color:#000000;stop-opacity:1"
       d="m 211.61885,54.915652 c -8.95377,3.624151 -18.01402,7.728141 -27.1443,10.750532 -25.46221,8.428735 -51.21755,13.568824 -74.79189,15.857382"
       id="path54407"
       sodipodi:nodetypes="csc" />
    <circle
       style="font-variation-settings:normal;display:inline;opacity:0.8;vector-effect:none;fill:url(#radialGradient30820);fill-opacity:1;stroke:#000000;stroke-width:0.136387;stroke-linecap:round;stroke-linejoin:round;stroke-miterlimit:4;stroke-dasharray:none;stroke-dashoffset:0;stroke-opacity:1;-inkscape-stroke:none;stop-color:#000000;stop-opacity:1"
       id="path30810"
       cx="69.242676"
       cy="78.327164"
       r="1.422772"
       inkscape:label="Reference Point"
       transform="rotate(4.2554137)" />
    <path
       style="font-variation-settings:normal;opacity:1;vector-effect:none;fill:none;fill-opacity:1;stroke:#000000;stroke-width:0.545548;stroke-linecap:butt;stroke-linejoin:miter;stroke-miterlimit:4;stroke-dasharray:none;stroke-dashoffset:0;stroke-opacity:1;-inkscape-stroke:none;stop-color:#000000;stop-opacity:1"
       d="m 118.92698,33.607757 12.47024,89.750923"
       id="path64674" />
    <path
       style="font-variation-settings:normal;opacity:1;vector-effect:none;fill:none;fill-opacity:1;stroke:#000000;stroke-width:0.545546;stroke-linecap:butt;stroke-linejoin:miter;stroke-miterlimit:4;stroke-dasharray:none;stroke-dashoffset:0;stroke-opacity:1;-inkscape-stroke:none;stop-color:#000000;stop-opacity:1"
       d="m 125.15627,79.786874 59.3183,-14.12069"
       id="path64678"
       sodipodi:nodetypes="cc" />
    <path
       style="font-variation-settings:normal;opacity:1;vector-effect:none;fill:none;fill-opacity:1;stroke:#000000;stroke-width:0.545546;stroke-linecap:butt;stroke-linejoin:miter;stroke-miterlimit:4;stroke-dasharray:none;stroke-dashoffset:0;stroke-opacity:1;-inkscape-stroke:none;stop-color:#000000;stop-opacity:1"
       d="m 172.23673,20.862058 24.04874,86.844712"
       id="path64737" />
    <circle
       style="font-variation-settings:normal;display:inline;opacity:0.8;vector-effect:none;fill:url(#radialGradient64572);fill-opacity:1;stroke:#000000;stroke-width:0.136387;stroke-linecap:round;stroke-linejoin:round;stroke-miterlimit:4;stroke-dasharray:none;stroke-dashoffset:0;stroke-opacity:1;-inkscape-stroke:none;stop-color:#000000"
       id="circle64570"
       cx="174.69084"
       cy="88.732834"
       r="1.422772"
       inkscape:label="Reference Point"
       transform="rotate(-7.3345871)" />
    <circle
       style="font-variation-settings:normal;display:inline;opacity:0.8;vector-effect:none;fill:url(#radialGradient30820-6);fill-opacity:1;stroke:#000000;stroke-width:0.136387;stroke-linecap:round;stroke-linejoin:round;stroke-miterlimit:4;stroke-dasharray:none;stroke-dashoffset:0;stroke-opacity:1;-inkscape-stroke:none;stop-color:#000000"
       id="path30810-1"
       cx="114.05687"
       cy="95.002998"
       r="1.422772"
       inkscape:label="Reference Point"
       transform="rotate(-7.3345871)" />
    <path
       style="font-variation-settings:normal;opacity:1;vector-effect:none;fill:none;fill-opacity:1;stroke:#000000;stroke-width:0.545546;stroke-linecap:butt;stroke-linejoin:miter;stroke-miterlimit:4;stroke-dasharray:none;stroke-dashoffset:0;stroke-opacity:1;-inkscape-stroke:none;stop-color:#000000;stop-opacity:1"
       d="M 127.53825,95.584813 139.23391,92.80067"
       id="path64878"
       sodipodi:nodetypes="cc" />
    <path
       style="font-variation-settings:normal;opacity:1;vector-effect:none;fill:none;fill-opacity:1;stroke:#000000;stroke-width:0.545546;stroke-linecap:butt;stroke-linejoin:miter;stroke-miterlimit:4;stroke-dasharray:none;stroke-dashoffset:0;stroke-opacity:1;-inkscape-stroke:none;stop-color:#000000;stop-opacity:1"
       d="M 121.26404,50.824459 167.5443,39.80746"
       id="path64880"
       sodipodi:nodetypes="cc" />
    <path
       style="font-variation-settings:normal;opacity:1;vector-effect:none;fill:none;fill-opacity:1;stroke:#000000;stroke-width:0.545546;stroke-linecap:butt;stroke-linejoin:miter;stroke-miterlimit:4;stroke-dasharray:none;stroke-dashoffset:0;stroke-opacity:1;-inkscape-stroke:none;stop-color:#000000;stop-opacity:1"
       d="M 99.811694,55.931181 121.08738,50.866518"
       id="path64882"
       sodipodi:nodetypes="cc" />
    <path
       style="font-variation-settings:normal;opacity:1;vector-effect:none;fill:none;fill-opacity:1;stroke:#000000;stroke-width:0.545546;stroke-linecap:butt;stroke-linejoin:miter;stroke-miterlimit:4;stroke-dasharray:none;stroke-dashoffset:0;stroke-opacity:1;-inkscape-stroke:none;stop-color:#000000;stop-opacity:1"
       d="m 110.37406,99.670745 17.16419,-4.085932"
       id="path64884"
       sodipodi:nodetypes="cc" />
    <path
       style="font-variation-settings:normal;opacity:1;vector-effect:none;fill:none;fill-opacity:1;stroke:#000000;stroke-width:0.545546;stroke-linecap:butt;stroke-linejoin:miter;stroke-miterlimit:4;stroke-dasharray:none;stroke-dashoffset:0;stroke-opacity:1;-inkscape-stroke:none;stop-color:#000000;stop-opacity:1"
       d="m 106.6873,84.183407 18.64995,-4.439613"
       id="path64886"
       sodipodi:nodetypes="cc" />
    <path
       style="font-variation-settings:normal;display:inline;opacity:1;vector-effect:none;fill:none;fill-opacity:1;stroke:#000000;stroke-width:0.545546;stroke-linecap:butt;stroke-linejoin:miter;stroke-miterlimit:4;stroke-dasharray:none;stroke-dashoffset:0;stroke-opacity:1;-inkscape-stroke:none;marker-start:url(#TriangleStart);marker-end:url(#TriangleStart);stop-color:#000000;stop-opacity:1"
       d="m 106.6873,84.183407 3.68676,15.487338"
       id="path64993"
       sodipodi:nodetypes="cc" />
    <path
       style="font-variation-settings:normal;display:inline;opacity:1;vector-effect:none;fill:none;fill-opacity:1;stroke:#000000;stroke-width:0.545546;stroke-linecap:butt;stroke-linejoin:miter;stroke-miterlimit:4;stroke-dasharray:none;stroke-dashoffset:0;stroke-opacity:1;-inkscape-stroke:none;marker-start:url(#TriangleStart);marker-end:url(#TriangleStart);stop-color:#000000;stop-opacity:1"
       d="M 99.896216,55.911055 106.6873,84.183407"
       id="path64888" />
    <text
       xml:space="preserve"
       style="font-size:3.60857px;line-height:1.25;font-family:sans-serif;stroke-width:1.80429"
       x="88.804375"
       y="-86.478142"
       id="text2966"
       transform="rotate(76.96401)"><tspan
         sodipodi:role="line"
         id="tspan2964"
         style="font-size:3.60857px;stroke-width:1.80429"
         x="88.804375"
         y="-86.478142">left</tspan></text>
    <text
       xml:space="preserve"
       style="font-size:3.60857px;line-height:1.25;font-family:sans-serif;stroke-width:1.80429"
       x="109.92478"
       y="-86.25737"
       id="text2970"
       transform="rotate(76.71919)"><tspan
         sodipodi:role="line"
         id="tspan2968"
         style="font-size:3.60857px;stroke-width:1.80429"
         x="109.92478"
         y="-86.25737">right</tspan></text>
  </g>
  <metadata
     id="metadata4531">
    <rdf:RDF>
      <cc:Work
         rdf:about="">
        <cc:license
           rdf:resource="https://www.eclipse.org/legal/epl-2.0/" />
        <dc:title>Obstruction</dc:title>
        <dc:rights>
          <cc:Agent>
            <dc:title>2023 - Bayerische Motoren Werke Aktiengesellschaft (BMW AG)</dc:title>
          </cc:Agent>
        </dc:rights>
        <dc:creator>
          <cc:Agent>
            <dc:title>René Paris</dc:title>
          </cc:Agent>
        </dc:creator>
      </cc:Work>
    </rdf:RDF>
  </metadata>
</svg>
