<?xml version="1.0" encoding="UTF-8" standalone="no"?>
<!-- Created with Inkscape (http://www.inkscape.org/) -->

<svg
   width="210mm"
   height="99.376884mm"
   viewBox="1 0.5 208 98.430438"
   version="1.1"
   id="svg297"
   xml:space="preserve"
   inkscape:version="1.2.2 (732a01da63, 2022-12-09)"
   sodipodi:docname="localization_with_bus_step0.svg"
   xmlns:inkscape="http://www.inkscape.org/namespaces/inkscape"
   xmlns:sodipodi="http://sodipodi.sourceforge.net/DTD/sodipodi-0.dtd"
   xmlns:xlink="http://www.w3.org/1999/xlink"
   xmlns="http://www.w3.org/2000/svg"
   xmlns:svg="http://www.w3.org/2000/svg"
   xmlns:rdf="http://www.w3.org/1999/02/22-rdf-syntax-ns#"
   xmlns:cc="http://creativecommons.org/ns#"
   xmlns:dc="http://purl.org/dc/elements/1.1/"><title
     id="title795">Localization</title><sodipodi:namedview
     id="namedview299"
     pagecolor="#505050"
     bordercolor="#eeeeee"
     borderopacity="1"
     inkscape:showpageshadow="0"
     inkscape:pageopacity="0"
     inkscape:pagecheckerboard="0"
     inkscape:deskcolor="#505050"
     inkscape:document-units="mm"
     showgrid="false"
     inkscape:zoom="1.4142136"
     inkscape:cx="358.14958"
     inkscape:cy="267.28636"
     inkscape:window-width="1920"
     inkscape:window-height="1017"
     inkscape:window-x="-8"
     inkscape:window-y="-8"
     inkscape:window-maximized="1"
     inkscape:current-layer="layer7" /><defs
     id="defs294"><linearGradient
       inkscape:collect="always"
       id="linearGradient4195"><stop
         style="stop-color:#000000;stop-opacity:1;"
         offset="0"
         id="stop4191" /><stop
         style="stop-color:#404040;stop-opacity:1;"
         offset="1"
         id="stop4193" /></linearGradient><inkscape:path-effect
       effect="fillet_chamfer"
       id="path-effect3774"
       is_visible="true"
       lpeversion="1"
       nodesatellites_param="F,0,0,1,0,0,0,1 @ F,0,0,1,0,0,0,1 @ F,0,1,1,0,0.52916667,0,1 @ F,0,1,1,0,0.52916667,0,1"
       unit="px"
       method="auto"
       mode="F"
       radius="2"
       chamfer_steps="1"
       flexible="false"
       use_knot_distance="true"
       apply_no_radius="true"
       apply_with_radius="true"
       only_selected="true"
       hide_knots="false" /><inkscape:path-effect
       effect="fillet_chamfer"
       id="path-effect3770"
       is_visible="true"
       lpeversion="1"
       nodesatellites_param="F,0,0,1,0,0,0,1 @ F,0,0,1,0,0,0,1 @ F,0,1,1,0,0.52916667,0,1 @ F,0,1,1,0,0.52916667,0,1"
       unit="px"
       method="auto"
       mode="F"
       radius="2"
       chamfer_steps="1"
       flexible="false"
       use_knot_distance="true"
       apply_no_radius="true"
       apply_with_radius="true"
       only_selected="true"
       hide_knots="false" /><inkscape:path-effect
       effect="fillet_chamfer"
       id="path-effect3766"
       is_visible="true"
       lpeversion="1"
       nodesatellites_param="F,0,0,1,0,0,0,1 @ F,0,0,1,0,0,0,1 @ F,0,1,1,0,0.52916667,0,1 @ F,0,1,1,0,0.52916667,0,1"
       unit="px"
       method="auto"
       mode="F"
       radius="2"
       chamfer_steps="1"
       flexible="false"
       use_knot_distance="true"
       apply_no_radius="true"
       apply_with_radius="true"
       only_selected="true"
       hide_knots="false" /><inkscape:path-effect
       effect="fillet_chamfer"
       id="path-effect3762"
       is_visible="true"
       lpeversion="1"
       nodesatellites_param="F,0,0,1,0,0,0,1 @ F,0,0,1,0,0,0,1 @ F,0,1,1,0,0.52916667,0,1 @ F,0,1,1,0,0.52916667,0,1"
       unit="px"
       method="auto"
       mode="F"
       radius="2"
       chamfer_steps="1"
       flexible="false"
       use_knot_distance="true"
       apply_no_radius="true"
       apply_with_radius="true"
       only_selected="true"
       hide_knots="false" /><inkscape:path-effect
       effect="fillet_chamfer"
       id="path-effect3758"
       is_visible="true"
       lpeversion="1"
       nodesatellites_param="F,0,0,1,0,0,0,1 @ F,0,0,1,0,0,0,1 @ F,0,1,1,0,0.52916667,0,1 @ F,0,1,1,0,0.52916667,0,1"
       unit="px"
       method="auto"
       mode="F"
       radius="2"
       chamfer_steps="1"
       flexible="false"
       use_knot_distance="true"
       apply_no_radius="true"
       apply_with_radius="true"
       only_selected="true"
       hide_knots="false" /><inkscape:path-effect
       effect="fillet_chamfer"
       id="path-effect3735"
       is_visible="true"
       lpeversion="1"
       nodesatellites_param="F,0,0,1,0,0,0,1 @ F,0,0,1,0,0,0,1 @ F,0,1,1,0,0.52916667,0,1 @ F,0,1,1,0,0.52916667,0,1"
       unit="px"
       method="auto"
       mode="F"
       radius="2"
       chamfer_steps="1"
       flexible="false"
       use_knot_distance="true"
       apply_no_radius="true"
       apply_with_radius="true"
       only_selected="true"
       hide_knots="false" /><inkscape:path-effect
       effect="fillet_chamfer"
       id="path-effect3729"
       is_visible="true"
       lpeversion="1"
       nodesatellites_param="F,0,0,1,0,0,0,1 @ F,0,0,1,0,0,0,1 @ F,0,1,1,0,0.52916667,0,1 @ F,0,1,1,0,0.52916667,0,1"
       unit="px"
       method="auto"
       mode="F"
       radius="2"
       chamfer_steps="1"
       flexible="false"
       use_knot_distance="true"
       apply_no_radius="true"
       apply_with_radius="true"
       only_selected="true"
       hide_knots="false" /><inkscape:path-effect
       effect="fillet_chamfer"
       id="path-effect3723"
       is_visible="true"
       lpeversion="1"
       nodesatellites_param="F,0,0,1,0,0,0,1 @ F,0,0,1,0,0,0,1 @ F,0,1,1,0,0.52916667,0,1 @ F,0,1,1,0,0.52916667,0,1"
       unit="px"
       method="auto"
       mode="F"
       radius="2"
       chamfer_steps="1"
       flexible="false"
       use_knot_distance="true"
       apply_no_radius="true"
       apply_with_radius="true"
       only_selected="true"
       hide_knots="false" /><inkscape:path-effect
       effect="fillet_chamfer"
       id="path-effect3717"
       is_visible="true"
       lpeversion="1"
       nodesatellites_param="F,0,0,1,0,0,0,1 @ F,0,0,1,0,0,0,1 @ F,0,1,1,0,0.52916667,0,1 @ F,0,1,1,0,0.52916667,0,1"
       unit="px"
       method="auto"
       mode="F"
       radius="2"
       chamfer_steps="1"
       flexible="false"
       use_knot_distance="true"
       apply_no_radius="true"
       apply_with_radius="true"
       only_selected="true"
       hide_knots="false" /><inkscape:path-effect
       effect="fillet_chamfer"
       id="path-effect3711"
       is_visible="true"
       lpeversion="1"
       nodesatellites_param="F,0,0,1,0,0,0,1 @ F,0,0,1,0,0,0,1 @ F,0,1,1,0,0.52916667,0,1 @ F,0,1,1,0,0.52916667,0,1"
       unit="px"
       method="auto"
       mode="F"
       radius="2"
       chamfer_steps="1"
       flexible="false"
       use_knot_distance="true"
       apply_no_radius="true"
       apply_with_radius="true"
       only_selected="true"
       hide_knots="false" /><filter
       inkscape:collect="always"
       style="color-interpolation-filters:sRGB"
       id="filter4160"
       x="-0.007103069"
       y="-0.2978693"
       width="1.0142061"
       height="1.5957386"><feGaussianBlur
         inkscape:collect="always"
         stdDeviation="0.097700015"
         id="feGaussianBlur4162" /></filter><filter
       inkscape:collect="always"
       style="color-interpolation-filters:sRGB"
       id="filter4164"
       x="-0.007103069"
       y="-0.2978693"
       width="1.0142061"
       height="1.5957386"><feGaussianBlur
         inkscape:collect="always"
         stdDeviation="0.097700015"
         id="feGaussianBlur4166" /></filter><linearGradient
       inkscape:collect="always"
       xlink:href="#linearGradient4195"
       id="linearGradient4197"
       x1="87.013039"
       y1="40.983868"
       x2="88.879921"
       y2="40.983868"
       gradientUnits="userSpaceOnUse" /></defs><rect
     style="font-variation-settings:normal;display:inline;vector-effect:none;fill:#008000;fill-opacity:1;stroke:none;stroke-width:0.693291;stroke-linecap:butt;stroke-linejoin:miter;stroke-miterlimit:4;stroke-dasharray:none;stroke-dashoffset:0;stroke-opacity:1;-inkscape-stroke:none;paint-order:stroke fill markers;stop-color:#000000"
     id="rect51006"
     width="209.41541"
     height="98.979736"
     x="0.11753607"
     y="0"
     inkscape:label="Background" /><g
     inkscape:groupmode="layer"
     id="layer4"
     inkscape:label="Road"
     style="display:inline"><path
       id="path9093"
       style="fill:#808080;stroke:none;stroke-width:0.388179px;stroke-linecap:butt;stroke-linejoin:miter;stroke-opacity:1"
       d="M 209.53295,98.979749 H 133.89762 C 125.55121,87.990292 115.01163,78.071967 97.53503,69.160579 72.081706,56.181838 36.586237,56.576481 0.01866037,57.458419 L 0.12215197,3.7037819 C 40.831749,3.401259 76.804855,3.8117043 115.67686,12.562308 c 38.87202,8.750596 78.05941,40.664861 93.85609,64.379658 z"
       sodipodi:nodetypes="ccsccscc"
       inkscape:label="Road" /><path
       style="font-variation-settings:normal;display:inline;opacity:1;vector-effect:none;fill:none;fill-opacity:1;stroke:#ffffff;stroke-width:1.12236;stroke-linecap:butt;stroke-linejoin:miter;stroke-miterlimit:4;stroke-dasharray:none;stroke-dashoffset:0;stroke-opacity:1;-inkscape-stroke:none;stop-color:#000000;stop-opacity:1"
       d="M 0.01866037,57.458419 C 36.586237,56.576481 72.081706,56.181838 97.53503,69.160579 c 17.4766,8.911388 28.01618,18.829713 36.36259,29.81917"
       id="path7339"
       sodipodi:nodetypes="csc"
       inkscape:label="Right Lane Marking" /><path
       style="font-variation-settings:normal;opacity:1;vector-effect:none;fill:none;fill-opacity:1;stroke:#ffffff;stroke-width:1.26907;stroke-linecap:butt;stroke-linejoin:miter;stroke-miterlimit:4;stroke-dasharray:10.1526, 1.26907;stroke-dashoffset:0;stroke-opacity:1;-inkscape-stroke:none;stop-color:#000000;stop-opacity:1"
       d="m 102.13944,37.994908 c 11.37856,4.457223 34.80599,20.480688 44.06322,30.300555 9.25723,9.819867 22.58881,30.393118 22.58881,30.393118"
       id="path7525"
       sodipodi:nodetypes="czc"
       inkscape:label="Right Lane Left Boudnary Marking" /><path
       style="display:inline;fill:none;stroke:#ffffff;stroke-width:1.26907;stroke-linecap:butt;stroke-linejoin:miter;stroke-dasharray:10.1526, 1.26907;stroke-dashoffset:0;stroke-opacity:1"
       d="M 0.01857674,30.122358 C 58.039953,28.420795 72.35031,30.880502 110.66003,37.524041 c 37.2424,6.458448 65.44977,30.530429 78.8974,47.997656 0.26118,0.339256 6.61369,8.244939 10.79382,13.458052"
       id="path6399"
       sodipodi:nodetypes="cssc"
       inkscape:label="Left Lane Right Boundary Marking" /><path
       style="fill:none;stroke:#ffffff;stroke-width:1.12236;stroke-linecap:butt;stroke-linejoin:miter;stroke-dasharray:none;stroke-opacity:1"
       d="M 0.1221461,3.7037819 C 40.83174,3.401259 76.804846,3.8117043 115.67686,12.562308 c 38.87202,8.750596 78.05941,40.664861 93.85609,64.379658"
       id="path6401"
       sodipodi:nodetypes="czc"
       inkscape:label="Left Lane Marking" /><path
       style="fill:none;stroke:#000000;stroke-width:0.388179px;stroke-linecap:butt;stroke-linejoin:miter;stroke-opacity:1"
       d="M 145.76624,72.7546 145.521,73.367143"
       id="path16788" /></g><metadata
     id="metadata972"><rdf:RDF><cc:Work
         rdf:about=""><dc:creator><cc:Agent><dc:title>René Paris</dc:title></cc:Agent></dc:creator><cc:license
           rdf:resource="https://www.eclipse.org/legal/epl-2.0/" /><dc:title>Localization</dc:title><dc:rights><cc:Agent><dc:title>2023 Bayerische Motoren Werke Aktiengesellschaft (BMW AG)</dc:title></cc:Agent></dc:rights></cc:Work></rdf:RDF></metadata><g
     inkscape:groupmode="layer"
     id="layer5"
     inkscape:label="R-Tree Objects"
     style="display:none"><rect
       style="font-variation-settings:normal;display:inline;opacity:0.75;fill:#ffffff;fill-opacity:0.25;stroke:#ffffff;stroke-width:0.488554;stroke-linecap:butt;stroke-linejoin:miter;stroke-miterlimit:4;stroke-dasharray:none;stroke-dashoffset:0;stroke-opacity:1;paint-order:stroke fill markers;stop-color:#000000;stop-opacity:1"
       id="rect11550"
       width="82.437019"
       height="32.24387"
       x="22.910805"
       y="3.3456895"
       rx="0.036079962"
       ry="2.0597696" /><rect
       style="font-variation-settings:normal;display:inline;opacity:0.75;fill:#ffffff;fill-opacity:0.25;stroke:#ffffff;stroke-width:0.488554;stroke-linecap:butt;stroke-linejoin:miter;stroke-miterlimit:4;stroke-dasharray:none;stroke-dashoffset:0;stroke-opacity:1;paint-order:stroke fill markers;stop-color:#000000;stop-opacity:1"
       id="rect12281"
       width="76.165298"
       height="31.102114"
       x="23.298027"
       y="35.589558"
       rx="0.033335041"
       ry="1.9868332" /><rect
       style="font-variation-settings:normal;opacity:0.75;fill:#ffffff;fill-opacity:0.25;stroke:#ffffff;stroke-width:0.488554;stroke-linecap:butt;stroke-linejoin:miter;stroke-miterlimit:4;stroke-dasharray:none;stroke-dashoffset:0;stroke-opacity:1;paint-order:stroke fill markers;stop-color:#000000;stop-opacity:1"
       id="rect12283"
       width="59.138081"
       height="39.661373"
       x="99.548042"
       y="10.442811"
       rx="0.03371926"
       ry="1.9158162" /><rect
       style="font-variation-settings:normal;opacity:0.75;fill:#ffffff;fill-opacity:0.25;stroke:#ffffff;stroke-width:0.488554;stroke-linecap:butt;stroke-linejoin:miter;stroke-miterlimit:4;stroke-dasharray:none;stroke-dashoffset:0;stroke-opacity:1;paint-order:stroke fill markers;stop-color:#000000;stop-opacity:1"
       id="rect12285"
       width="59.138081"
       height="39.661373"
       x="99.548042"
       y="10.442811"
       rx="0.03371926"
       ry="1.9158162" /><rect
       style="font-variation-settings:normal;opacity:0.75;fill:#ffffff;fill-opacity:0.25;stroke:#ffffff;stroke-width:0.488554;stroke-linecap:butt;stroke-linejoin:miter;stroke-miterlimit:4;stroke-dasharray:none;stroke-dashoffset:0;stroke-opacity:1;paint-order:stroke fill markers;stop-color:#000000;stop-opacity:1"
       id="rect12300"
       width="47.335266"
       height="51.565762"
       x="91.999733"
       y="35.593773"
       rx="0.026989549"
       ry="2.4908497" /><rect
       style="font-variation-settings:normal;opacity:0.75;fill:#ffffff;fill-opacity:0.25;stroke:#ffffff;stroke-width:0.488554;stroke-linecap:butt;stroke-linejoin:miter;stroke-miterlimit:4;stroke-dasharray:none;stroke-dashoffset:0;stroke-opacity:1;paint-order:stroke fill markers;stop-color:#000000;stop-opacity:1"
       id="rect12302"
       width="47.141182"
       height="26.431166"
       x="99.569237"
       y="35.593773"
       rx="0.026878884"
       ry="1.2767398" /><rect
       style="font-variation-settings:normal;opacity:0.75;fill:#ffb380;fill-opacity:0.25;stroke:#ffb380;stroke-width:0.488554;stroke-linecap:butt;stroke-linejoin:miter;stroke-miterlimit:4;stroke-dasharray:none;stroke-dashoffset:0;stroke-opacity:1;paint-order:stroke fill markers;stop-color:#000000;stop-opacity:1"
       id="rect12304"
       width="44.326191"
       height="37.685013"
       x="-191.07913"
       y="30.858921"
       rx="0.025273839"
       ry="1.8203492"
       transform="scale(-1,1)" /><rect
       style="font-variation-settings:normal;opacity:0.75;fill:#ffffff;fill-opacity:0.25;stroke:#ffffff;stroke-width:0.488554;stroke-linecap:butt;stroke-linejoin:miter;stroke-miterlimit:4;stroke-dasharray:none;stroke-dashoffset:0;stroke-opacity:1;paint-order:stroke fill markers;stop-color:#000000;stop-opacity:1"
       id="rect12306"
       width="34.101662"
       height="30.822912"
       x="-173.51215"
       y="50.141434"
       rx="0.019444034"
       ry="1.4888799"
       transform="scale(-1,1)" /><rect
       style="font-variation-settings:normal;opacity:0.75;fill:#ffffff;fill-opacity:0.25;stroke:#ffffff;stroke-width:0.488554;stroke-linecap:butt;stroke-linejoin:miter;stroke-miterlimit:4;stroke-dasharray:none;stroke-dashoffset:0;stroke-opacity:1;paint-order:stroke fill markers;stop-color:#000000;stop-opacity:1"
       id="rect12308"
       width="32.866482"
       height="36.518456"
       x="-156.63138"
       y="62.012878"
       rx="0.01873976"
       ry="1.7639993"
       transform="scale(-1,1)" /></g><g
     inkscape:groupmode="layer"
     id="layer3"
     inkscape:label="Bus"
     inkscape:highlight-color="#21f335"
     transform="matrix(1.2595586,0.43358335,-0.43358335,1.2595586,-7.4772654,17.310292)"
     style="display:inline;opacity:1"><g
       id="g4813"
       inkscape:label="Bus"
       style="display:inline;opacity:1"
       transform="matrix(1.4671336,0,0,1.4671336,-6.1097123,-60.685604)"><g
         id="g4678"
         style="fill:#ff6600"
         inkscape:label="Chassis"><path
           id="rect3089"
           style="font-variation-settings:normal;display:inline;opacity:1;fill:#ff6600;fill-opacity:1;stroke:#000000;stroke-width:0.154;stroke-linecap:round;stroke-linejoin:miter;stroke-miterlimit:4;stroke-dasharray:none;stroke-dashoffset:0;stroke-opacity:1;paint-order:stroke fill markers;stop-color:#000000;stop-opacity:1"
           d="m 36.060331,36.193656 c -0.368588,0 -0.665075,0.296488 -0.665075,0.665076 v 8.250143 c 0,0.368588 0.296487,0.665075 0.665075,0.665075 h 50.963815 c 0.02233,0 0.04439,-9.72e-4 0.06614,-0.0031 0.0011,-0.94223 0.480591,-0.49939 0.480591,-4.786788 0,-4.287417 -0.47945,-3.845061 -0.480591,-4.787305 -0.02175,-0.0021 -0.04381,-0.0031 -0.06614,-0.0031 z"
           inkscape:label="Main Chassis" /><rect
           style="font-variation-settings:normal;opacity:1;vector-effect:none;fill:#ff6600;fill-opacity:1;stroke:#000000;stroke-width:0.154;stroke-linecap:round;stroke-linejoin:miter;stroke-miterlimit:4;stroke-dasharray:none;stroke-dashoffset:0;stroke-opacity:1;-inkscape-stroke:none;paint-order:stroke fill markers;stop-color:#000000;stop-opacity:1"
           id="rect3653"
           width="0.80169088"
           height="0.31897762"
           x="-58.444439"
           y="77.124367"
           ry="0.1337648"
           rx="0.01318328"
           transform="rotate(-105,0.02296293,0.02992587)"
           inkscape:label="Left Mirror" /><rect
           style="font-variation-settings:normal;opacity:1;vector-effect:none;fill:#ff6600;fill-opacity:1;stroke:#000000;stroke-width:0.154;stroke-linecap:round;stroke-linejoin:miter;stroke-miterlimit:4;stroke-dasharray:none;stroke-dashoffset:0;stroke-opacity:1;-inkscape-stroke:none;paint-order:stroke fill markers;stop-color:#000000;stop-opacity:1"
           id="rect3776"
           width="0.80169088"
           height="0.31897762"
           x="-21.595352"
           y="-98.675133"
           ry="0.1337648"
           rx="0.01318328"
           transform="matrix(0.25881905,-0.96592583,-0.96592583,-0.25881905,-3.0000001e-6,-0.12556493)"
           inkscape:label="Right Mirror" /><path
           style="fill:#ff6600;stroke:#000000;stroke-width:0.264583px;stroke-linecap:butt;stroke-linejoin:miter;stroke-opacity:1"
           d="m 87.09004,36.193544 c 0.603254,-0.249097 1.899251,0.05157 2.429165,-0.08899"
           id="path3706"
           sodipodi:nodetypes="cc"
           transform="translate(0,0.05985174)" /><path
           style="fill:#ff6600;stroke:#000000;stroke-width:0.264583px;stroke-linecap:butt;stroke-linejoin:miter;stroke-opacity:1"
           d="m 87.105303,45.794684 c 0.536962,0.221724 1.852198,-0.0084 2.413906,0.134084"
           id="path3778"
           sodipodi:nodetypes="cc"
           transform="translate(-3.0000001e-6,-0.12556493)" /></g><path
         id="path3393"
         style="font-variation-settings:normal;display:inline;opacity:1;fill:url(#linearGradient4197);fill-opacity:1;stroke:#000000;stroke-width:0.154;stroke-linecap:butt;stroke-linejoin:round;stroke-miterlimit:4;stroke-dasharray:none;stroke-dashoffset:0;stroke-opacity:1;paint-order:stroke fill markers;stop-color:#000000;stop-opacity:1"
         d="m 87.090041,36.193546 c 0,0.946678 0.480709,0.497797 0.480709,4.790323 0,4.292524 -0.480709,3.843646 -0.480709,4.790323 0.682089,0 1.158355,-0.307687 1.442478,-0.927801 0.284126,-0.620114 0.270291,-3.862522 0.270291,-3.862522 0,0 0.01384,-3.24241 -0.270291,-3.862524 -0.284123,-0.620113 -0.760389,-0.927799 -1.442478,-0.927799 z"
         sodipodi:nodetypes="czcscsc"
         inkscape:label="Windshield" /><g
         id="g3819"
         inkscape:label="Brake Lights"
         style="stroke:#000000;stroke-width:0.228785;stroke-dasharray:none"
         transform="matrix(0.79824418,0,0,0.95734129,7.1565329,1.7370124)"><path
           style="font-variation-settings:normal;opacity:1;fill:#ff0000;fill-opacity:1;stroke:#000000;stroke-width:0.228785;stroke-linecap:butt;stroke-linejoin:round;stroke-miterlimit:4;stroke-dasharray:none;stroke-dashoffset:0;stroke-opacity:1;paint-order:stroke fill markers;stop-color:#000000;stop-opacity:1"
           d="m 35.397831,37.661018 c 0.0043,-1.02308 8e-5,-0.96507 0.08178,-1.127752 0.04974,-0.09905 0.168103,-0.219649 0.266912,-0.271952 0.06189,-0.03276 0.233875,-0.08629 0.244173,-0.07599 0.009,0.009 -0.01934,0.676484 -0.03558,0.838613 -0.04692,0.468847 -0.135385,0.821036 -0.284104,1.131046 -0.06598,0.137533 -0.206875,0.362643 -0.253005,0.404222 l -0.02403,0.02167 z"
           id="path3597" /><path
           style="font-variation-settings:normal;opacity:1;fill:#ff0000;fill-opacity:1;stroke:#000000;stroke-width:0.228785;stroke-linecap:butt;stroke-linejoin:round;stroke-miterlimit:4;stroke-dasharray:none;stroke-dashoffset:0;stroke-opacity:1;paint-order:stroke fill markers;stop-color:#000000;stop-opacity:1"
           d="m 35.397831,44.330203 c 0.0043,1.02308 8e-5,0.96507 0.08178,1.127752 0.04974,0.09905 0.168103,0.219649 0.266912,0.271952 0.06189,0.03276 0.233875,0.08629 0.244173,0.07599 0.009,-0.009 -0.01934,-0.676484 -0.03558,-0.838613 -0.04692,-0.468847 -0.135385,-0.821037 -0.284104,-1.131046 -0.06598,-0.137533 -0.206875,-0.362643 -0.253005,-0.404223 l -0.02403,-0.02167 z"
           id="path3599" /></g><g
         id="g3742"
         transform="matrix(1.3533759,0,0,1,-13.287574,0)"
         style="fill:#000000;stroke-width:0.859589;filter:url(#filter4160)"
         inkscape:label="Side Windows Left"><path
           id="rect3708"
           style="opacity:1;vector-effect:none;fill:#000000;stroke:none;stroke-width:0.257877;paint-order:stroke fill markers;stop-color:#000000;stop-opacity:1"
           d="m 37.601814,36.193657 h 5.865928 v 0.258024 a 0.52916667,0.52916667 135 0 1 -0.529167,0.529167 h -4.807594 a 0.52916667,0.52916667 45 0 1 -0.529167,-0.529167 z"
           inkscape:path-effect="#path-effect3711"
           inkscape:original-d="m 37.601814,36.193657 h 5.865928 v 0.787191 h -5.865928 z" /><path
           id="path3713"
           style="opacity:1;vector-effect:none;fill:#000000;stroke:none;stroke-width:0.257877;paint-order:stroke fill markers;stop-color:#000000;stop-opacity:1"
           d="m 44.388104,36.193657 h 5.865928 v 0.258024 a 0.52916667,0.52916667 135 0 1 -0.529167,0.529167 h -4.807594 a 0.52916667,0.52916667 45 0 1 -0.529167,-0.529167 z"
           inkscape:path-effect="#path-effect3717"
           inkscape:original-d="m 44.388104,36.193657 h 5.865928 v 0.787191 h -5.865928 z" /><path
           id="path3719"
           style="opacity:1;vector-effect:none;fill:#000000;stroke:none;stroke-width:0.257877;paint-order:stroke fill markers;stop-color:#000000;stop-opacity:1"
           d="m 51.174394,36.193657 h 5.865928 v 0.258024 a 0.52916667,0.52916667 135 0 1 -0.529167,0.529167 h -4.807594 a 0.52916667,0.52916667 45 0 1 -0.529167,-0.529167 z"
           inkscape:path-effect="#path-effect3723"
           inkscape:original-d="m 51.174394,36.193657 h 5.865928 v 0.787191 h -5.865928 z" /><path
           id="path3725"
           style="opacity:1;vector-effect:none;fill:#000000;stroke:none;stroke-width:0.257877;paint-order:stroke fill markers;stop-color:#000000;stop-opacity:1"
           d="m 57.960684,36.193657 h 5.865928 v 0.258024 a 0.52916667,0.52916667 135 0 1 -0.529167,0.529167 h -4.807594 a 0.52916667,0.52916667 45 0 1 -0.529167,-0.529167 z"
           inkscape:path-effect="#path-effect3729"
           inkscape:original-d="m 57.960684,36.193657 h 5.865928 v 0.787191 h -5.865928 z" /><path
           id="path3731"
           style="opacity:1;vector-effect:none;fill:#000000;stroke:none;stroke-width:0.257877;paint-order:stroke fill markers;stop-color:#000000;stop-opacity:1"
           d="m 64.746974,36.193657 h 5.865928 v 0.258024 a 0.52916667,0.52916667 135 0 1 -0.529167,0.529167 h -4.807594 a 0.52916667,0.52916667 45 0 1 -0.529167,-0.529167 z"
           inkscape:path-effect="#path-effect3735"
           inkscape:original-d="m 64.746974,36.193657 h 5.865928 v 0.787191 h -5.865928 z" /></g><g
         id="g3754"
         transform="matrix(1.3533759,0,0,-1,-13.287574,81.967607)"
         style="stroke-width:0.859589;filter:url(#filter4164)"
         inkscape:label="Side Windows Right"><path
           id="path3744"
           style="opacity:1;vector-effect:none;stroke:none;stroke-width:0.257877;paint-order:stroke fill markers;stop-color:#000000;stop-opacity:1"
           d="m 37.601814,36.193657 h 5.865928 v 0.258024 a 0.52916667,0.52916667 135 0 1 -0.529167,0.529167 h -4.807594 a 0.52916667,0.52916667 45 0 1 -0.529167,-0.529167 z"
           inkscape:path-effect="#path-effect3758"
           inkscape:original-d="m 37.601814,36.193657 h 5.865928 v 0.787191 h -5.865928 z" /><path
           id="path3746"
           style="opacity:1;vector-effect:none;stroke:none;stroke-width:0.257877;paint-order:stroke fill markers;stop-color:#000000;stop-opacity:1"
           d="m 44.388104,36.193657 h 5.865928 v 0.258024 a 0.52916667,0.52916667 135 0 1 -0.529167,0.529167 h -4.807594 a 0.52916667,0.52916667 45 0 1 -0.529167,-0.529167 z"
           inkscape:path-effect="#path-effect3762"
           inkscape:original-d="m 44.388104,36.193657 h 5.865928 v 0.787191 h -5.865928 z" /><path
           id="path3748"
           style="opacity:1;vector-effect:none;stroke:none;stroke-width:0.257877;paint-order:stroke fill markers;stop-color:#000000;stop-opacity:1"
           d="m 51.174394,36.193657 h 5.865928 v 0.258024 a 0.52916667,0.52916667 135 0 1 -0.529167,0.529167 h -4.807594 a 0.52916667,0.52916667 45 0 1 -0.529167,-0.529167 z"
           inkscape:path-effect="#path-effect3766"
           inkscape:original-d="m 51.174394,36.193657 h 5.865928 v 0.787191 h -5.865928 z" /><path
           id="path3750"
           style="opacity:1;vector-effect:none;stroke:none;stroke-width:0.257877;paint-order:stroke fill markers;stop-color:#000000;stop-opacity:1"
           d="m 57.960684,36.193657 h 5.865928 v 0.258024 a 0.52916667,0.52916667 135 0 1 -0.529167,0.529167 h -4.807594 a 0.52916667,0.52916667 45 0 1 -0.529167,-0.529167 z"
           inkscape:path-effect="#path-effect3770"
           inkscape:original-d="m 57.960684,36.193657 h 5.865928 v 0.787191 h -5.865928 z" /><path
           id="path3752"
           style="opacity:1;vector-effect:none;stroke:none;stroke-width:0.257877;paint-order:stroke fill markers;stop-color:#000000;stop-opacity:1"
           d="m 64.746974,36.193657 h 5.865928 v 0.258024 a 0.52916667,0.52916667 135 0 1 -0.529167,0.529167 h -4.807594 a 0.52916667,0.52916667 45 0 1 -0.529167,-0.529167 z"
           inkscape:path-effect="#path-effect3774"
           inkscape:original-d="m 64.746974,36.193657 h 5.865928 v 0.787191 h -5.865928 z" /></g><g
         id="g4671"
         inkscape:label="Outlets"
         style="display:inline"><rect
           style="opacity:0.25;fill:#000000;fill-opacity:1;stroke:#656565;stroke-width:0.3;stroke-linejoin:round;stroke-dasharray:none;stroke-opacity:1;paint-order:stroke fill markers;stop-color:#000000"
           id="rect3145"
           width="4.2580633"
           height="2.5725811"
           x="45.330647"
           y="39.697514"
           ry="0.17865145"
           inkscape:label="Outlet Rear" /><rect
           style="opacity:0.25;fill:#000000;fill-opacity:1;stroke:#656565;stroke-width:0.3;stroke-linejoin:round;stroke-dasharray:none;stroke-opacity:1;paint-order:stroke fill markers;stop-color:#000000"
           id="rect3147"
           width="4.2580633"
           height="2.5725811"
           x="70.036293"
           y="39.697514"
           ry="0.17865145"
           inkscape:label="Outlet Front" /></g></g><rect
       style="font-variation-settings:normal;display:none;opacity:1;fill:none;fill-opacity:1;stroke:#ffffff;stroke-width:0.366757;stroke-linecap:round;stroke-linejoin:miter;stroke-miterlimit:4;stroke-dasharray:none;stroke-dashoffset:0;stroke-opacity:1;paint-order:stroke fill markers;stop-color:#000000;stop-opacity:1"
       id="rect4734"
       width="80.083046"
       height="15.679524"
       x="45.780243"
       y="-8.3966522"
       rx="0.027102947"
       ry="0.34118721"
       inkscape:label="Bounding Box" /><path
       style="opacity:0.456853;fill:none;stroke:#ffffff;stroke-width:0.393965;stroke-linecap:butt;stroke-linejoin:miter;stroke-dasharray:1.1819, 0.393965, 0.787931;stroke-dashoffset:0;stroke-opacity:1"
       d="m 122.43702,0.94798317 c 0.43071,0.0498385 0.61005,0.27360863 1.69829,0.42116713"
       id="path17623"
       sodipodi:nodetypes="cc" /><path
       style="opacity:0.456853;fill:none;stroke:#ffffff;stroke-width:0.347686;stroke-linecap:butt;stroke-linejoin:miter;stroke-dasharray:1.04306, 0.347686, 0.695373;stroke-dashoffset:0;stroke-opacity:1"
       d="m 124.04233,-3.2580159 c -0.38106,-0.1080544 -1.17763,-0.2514946 -1.56381,-0.2408608"
       id="path17625"
       sodipodi:nodetypes="cc" /></g><g
     id="g11364"
     inkscape:label="Localization Grid"
     style="display:none;opacity:0.75;stroke:#ff0000;stroke-width:0.3;stroke-dasharray:none"
     transform="matrix(1.4671336,0,0,1.4671336,-36.842209,-51.139017)"><path
       style="fill:none;stroke:#ff0000;stroke-width:0.3;stroke-linecap:butt;stroke-linejoin:miter;stroke-dasharray:none;stroke-opacity:1"
       d="m 40.711213,37.136846 0.478454,36.48215"
       id="path10617"
       sodipodi:nodetypes="cc" /><path
       style="fill:none;stroke:#ff0000;stroke-width:0.3;stroke-linecap:butt;stroke-linejoin:miter;stroke-dasharray:none;stroke-opacity:1"
       d="M 87.826885,80.445464 96.937437,41.986238"
       id="path10619"
       sodipodi:nodetypes="cc" /><path
       style="fill:none;stroke:#ff0000;stroke-width:0.3;stroke-linecap:butt;stroke-linejoin:miter;stroke-dasharray:none;stroke-opacity:1"
       d="M 109.54837,94.559905 133.311,55.843819"
       id="path11347"
       sodipodi:nodetypes="cc" /><path
       style="fill:none;stroke:#ff0000;stroke-width:0.3;stroke-linecap:butt;stroke-linejoin:miter;stroke-dasharray:none;stroke-opacity:1"
       d="M 116.10869,101.97055 155.421,72.811089"
       id="path11349" /><path
       style="fill:none;stroke:#ff0000;stroke-width:0.3;stroke-linecap:butt;stroke-linejoin:miter;stroke-dasharray:none;stroke-opacity:1"
       d="M 40.711212,37.136845 96.937435,41.986237 133.30829,55.848232 155.421,72.811091"
       id="path11351" /><path
       style="fill:none;stroke:#ff0000;stroke-width:0.3;stroke-linecap:butt;stroke-linejoin:miter;stroke-dasharray:none;stroke-opacity:1"
       d="m 40.946252,55.058624 51.933742,4.055679 32.351586,9.893184 18.23736,12.668904"
       id="path11353" /><path
       style="display:inline;fill:none;stroke:#ffaf80;stroke-width:0.265;stroke-linecap:butt;stroke-linejoin:miter;stroke-dasharray:1.06, 0.265;stroke-dashoffset:0;stroke-opacity:1"
       d="M 133.28272,55.889892 155.421,72.811089 143.46894,81.676391 125.23158,69.007489 Z"
       id="path12310"
       sodipodi:nodetypes="ccccc" /><path
       style="fill:none;stroke:#ff0000;stroke-width:0.3;stroke-linecap:butt;stroke-linejoin:miter;stroke-dasharray:none;stroke-opacity:1"
       d="m 92.879999,59.114306 27.330281,18.074311 11.71158,13.052691"
       id="path11355" /><path
       style="fill:none;stroke:#ff0000;stroke-width:0.3;stroke-linecap:butt;stroke-linejoin:miter;stroke-dasharray:none;stroke-opacity:1"
       d="m 41.189666,73.618994 46.637217,6.826469 21.721487,14.114442 6.56032,7.410645"
       id="path11417" /></g><g
     inkscape:groupmode="layer"
     id="layer7"
     inkscape:label="Touched Areas"
     style="display:none"><path
       style="font-variation-settings:normal;opacity:0.6;fill:#ffffff;fill-opacity:0.75;stroke:#ffffff;stroke-width:0.388789;stroke-linecap:butt;stroke-linejoin:miter;stroke-miterlimit:4;stroke-dasharray:none;stroke-dashoffset:0;stroke-opacity:1;paint-order:stroke fill markers;stop-color:#000000;stop-opacity:1"
       d="m 23.602453,30.061089 c 0.06425,8.839436 0.161707,17.679044 0.306917,26.517468 22.543392,3.311975 45.083496,6.681001 67.640486,9.879014 0.707805,-1.584808 0.927844,-3.38045 1.409296,-5.054527 2.016873,-8.485505 4.096791,-17.013236 5.983816,-25.494426 C 73.834384,33.893685 48.719639,31.929235 23.603792,30.021951 Z"
       id="path15302" /><path
       style="font-variation-settings:normal;opacity:0.6;fill:#ffb380;fill-opacity:0.75;stroke:#ffffff;stroke-width:0.388789;stroke-linecap:butt;stroke-linejoin:miter;stroke-miterlimit:4;stroke-dasharray:none;stroke-dashoffset:0;stroke-opacity:1;paint-order:stroke fill markers;stop-color:#000000;stop-opacity:1"
       d="m 105.70964,10.9949 c -2.04723,7.988726 -3.95537,16.018757 -5.760411,24.0651 -0.09181,0.399129 0.668121,0.305275 0.895981,0.503177 14.76867,4.724151 29.6277,9.159921 44.45413,13.697574 0.56266,0.0132 1.43127,0.822603 1.69088,0.02356 3.76738,-6.101923 7.50908,-12.219653 11.26222,-18.330345 C 140.73118,24.319841 123.2414,17.598552 105.7201,10.965954 Z"
       id="path15304" /><path
       style="font-variation-settings:normal;opacity:0.6;fill:#ffffff;fill-opacity:0.75;stroke:#ffffff;stroke-width:0.388789;stroke-linecap:butt;stroke-linejoin:miter;stroke-miterlimit:4;stroke-dasharray:none;stroke-dashoffset:0;stroke-opacity:1;paint-order:stroke fill markers;stop-color:#000000;stop-opacity:1"
       d="m 99.538574,36.605015 c -2.404498,10.038575 -4.773209,20.08571 -7.157223,30.12918 10.469959,6.751144 20.856609,13.63389 31.372939,20.310217 5.09774,-8.059891 10.03938,-16.22106 14.93,-24.407994 0.68337,-0.665596 -0.55019,-0.877565 -0.92829,-1.284439 -12.52259,-8.268237 -24.97639,-16.645421 -37.61205,-24.738898 -0.254222,-0.05276 -0.6197,-0.629312 -0.605376,-0.0081 z"
       id="path15306" /><path
       style="font-variation-settings:normal;opacity:0.6;fill:#ffffff;fill-opacity:0.75;stroke:#ffffff;stroke-width:0.388789;stroke-linecap:butt;stroke-linejoin:miter;stroke-miterlimit:4;stroke-dasharray:none;stroke-dashoffset:0;stroke-opacity:1;paint-order:stroke fill markers;stop-color:#000000;stop-opacity:1"
       d="m 102.125,36.891025 c 12.36769,8.299778 24.80002,16.506962 37.26148,24.666305 2.38774,-3.696043 4.70184,-7.455837 6.91276,-11.255455 -14.77094,-4.581048 -29.56403,-9.089092 -44.37206,-13.548898 l 0.11254,0.07854 z"
       id="path15308" /><path
       style="font-variation-settings:normal;opacity:0.6;fill:#ffffff;fill-opacity:0.75;stroke:#ffffff;stroke-width:0.388789;stroke-linecap:butt;stroke-linejoin:miter;stroke-miterlimit:4;stroke-dasharray:none;stroke-dashoffset:0;stroke-opacity:1;paint-order:stroke fill markers;stop-color:#000000;stop-opacity:1"
       d="m 23.242995,3.7918378 c 0.05421,8.4942852 0.175988,16.9953832 0.382775,25.4835952 24.367795,2.026047 48.747686,3.911498 73.129097,5.767918 0.8139,0.03904 1.625054,0.167764 2.440603,0.105076 1.90249,-8.12831 3.90604,-16.236164 5.70064,-24.3878 C 77.684298,8.3721335 50.461701,6.0351672 23.244603,3.7510941 Z"
       id="path15310" /><path
       style="font-variation-settings:normal;opacity:0.6;fill:#ffffff;fill-opacity:0.75;stroke:#ffffff;stroke-width:0.388789;stroke-linecap:butt;stroke-linejoin:miter;stroke-miterlimit:4;stroke-dasharray:none;stroke-dashoffset:0;stroke-opacity:1;paint-order:stroke fill markers;stop-color:#000000;stop-opacity:1"
       d="m 131.94592,75.08961 c -2.54719,4.151215 -5.09439,8.302428 -7.64159,12.453643 3.01648,3.379635 5.91493,6.871678 9.05797,10.13286 0.43532,0.577992 0.88677,-0.362441 1.30514,-0.495892 7.10325,-5.296198 14.28111,-10.510867 21.33416,-15.862984 -0.67834,-1.295656 -1.87313,-2.291297 -2.78184,-3.437096 -4.53251,-5.088551 -9.10726,-10.139868 -13.64431,-15.224338 -2.54317,4.144604 -5.08635,8.289203 -7.62953,12.433807 z"
       id="path15312" /><path
       style="font-variation-settings:normal;opacity:0.6;fill:#ffffff;fill-opacity:0.75;stroke:#ffffff;stroke-width:0.388789;stroke-linecap:butt;stroke-linejoin:miter;stroke-miterlimit:4;stroke-dasharray:none;stroke-dashoffset:0;stroke-opacity:1;paint-order:stroke fill markers;stop-color:#000000;stop-opacity:1"
       d="m 143.48498,56.290667 c -1.10322,1.933757 -2.46642,3.74506 -3.36485,5.783466 0.26368,0.740882 1.08942,1.240157 1.54002,1.896739 5.03551,5.603319 10.01124,11.263707 15.15097,16.770055 5.43907,-3.982364 10.84761,-8.009552 16.23129,-12.067649 -8.67801,-6.041941 -17.38215,-12.046548 -26.04544,-18.109517 -1.17066,1.908971 -2.34133,3.817939 -3.51199,5.726906 z"
       id="path15314" /><path
       style="font-variation-settings:normal;opacity:0.6;fill:#ffb380;fill-opacity:0.75;stroke:#ffffff;stroke-width:0.388789;stroke-linecap:butt;stroke-linejoin:miter;stroke-miterlimit:4;stroke-dasharray:none;stroke-dashoffset:0;stroke-opacity:1;paint-order:stroke fill markers;stop-color:#000000;stop-opacity:1"
       d="m 158.81802,31.427882 c -1.23857,1.666287 -2.24692,3.577211 -3.38122,5.344477 -2.67363,4.42141 -5.39572,8.816417 -7.96216,13.300068 8.71241,6.060837 17.37013,12.209653 26.21457,18.077077 1.12709,-0.621895 2.209,-1.60197 3.31446,-2.357746 4.50509,-3.350754 9.02276,-6.685402 13.48831,-10.088657 -3.3546,-2.857542 -6.9753,-5.403932 -10.43982,-8.132147 -7.01966,-5.369686 -14.03279,-10.755728 -21.06902,-16.099114 -0.0508,-0.02434 -0.10695,-0.05081 -0.16512,-0.04396 z"
       id="path15316" /></g><g
     inkscape:groupmode="layer"
     id="layer6"
     inkscape:label="R-Tree Objects 1"
     style="display:none"><rect
       style="font-variation-settings:normal;display:none;opacity:0.75;fill:#ff0000;fill-opacity:0.25;stroke:#ff0000;stroke-width:0.388789;stroke-linecap:butt;stroke-linejoin:miter;stroke-miterlimit:4;stroke-dasharray:none;stroke-dashoffset:0;stroke-opacity:1;paint-order:stroke fill markers;stop-color:#000000;stop-opacity:1"
       id="rect14336"
       width="107.99667"
       height="54.904438"
       x="46.881836"
       y="26.405735"
       rx="0.027438877"
       ry="1.8746314" /></g></svg>
