<?xml version="1.0" encoding="UTF-8" standalone="no"?>
<!-- Created with Inkscape (http://www.inkscape.org/) -->

<svg
   width="210mm"
   height="132.59012mm"
   viewBox="0.5 0.5 209 131.95874"
   version="1.1"
   id="svg12177"
   sodipodi:docname="shadow_casting_step3.svg"
   inkscape:version="1.2.2 (732a01da63, 2022-12-09)"
   inkscape:export-filename="shadowing_1.png"
   inkscape:export-xdpi="600"
   inkscape:export-ydpi="600"
   xmlns:inkscape="http://www.inkscape.org/namespaces/inkscape"
   xmlns:sodipodi="http://sodipodi.sourceforge.net/DTD/sodipodi-0.dtd"
   xmlns:xlink="http://www.w3.org/1999/xlink"
   xmlns="http://www.w3.org/2000/svg"
   xmlns:svg="http://www.w3.org/2000/svg"
   xmlns:rdf="http://www.w3.org/1999/02/22-rdf-syntax-ns#"
   xmlns:cc="http://creativecommons.org/ns#"
   xmlns:dc="http://purl.org/dc/elements/1.1/">
  <title
     id="title613">Shadow Casting</title>
  <sodipodi:namedview
     id="namedview525"
     pagecolor="#505050"
     bordercolor="#eeeeee"
     borderopacity="1"
     inkscape:showpageshadow="0"
     inkscape:pageopacity="0"
     inkscape:pagecheckerboard="true"
     inkscape:deskcolor="#505050"
     inkscape:document-units="mm"
     showgrid="false"
     inkscape:zoom="1"
     inkscape:cx="354.5"
     inkscape:cy="334"
     inkscape:window-width="1920"
     inkscape:window-height="1017"
     inkscape:window-x="3832"
     inkscape:window-y="-8"
     inkscape:window-maximized="1"
     inkscape:current-layer="g38512" />
  <style
     type="text/css"
     id="style515">
      .line1{stroke:#000000;stroke-width:0.299655;stroke-miterlimit:4;stroke-dasharray:0.299655;stroke-dashoffset:0}
   </style>
  <defs
     id="defs12174">
    <marker
       style="overflow:visible"
       id="TriangleStart"
       refX="3"
       refY="0"
       orient="auto-start-reverse"
       inkscape:stockid="TriangleStart"
       markerWidth="4"
       markerHeight="4"
       viewBox="0 0 5.3244081 6.1553851"
       inkscape:isstock="true"
       inkscape:collect="always"
       preserveAspectRatio="xMidYMid">
      <path
         transform="scale(0.5)"
         style="fill:context-stroke;fill-rule:evenodd;stroke:context-stroke;stroke-width:1pt"
         d="M 5.77,0 -2.88,5 V -5 Z"
         id="path135" />
    </marker>
    <linearGradient
       id="linearGradient13254">
      <stop
         style="stop-color:#ffffff;stop-opacity:0.50193125"
         offset="0"
         id="stop13250" />
      <stop
         style="stop-color:#ffffff;stop-opacity:0"
         offset="1"
         id="stop13252" />
    </linearGradient>
    <radialGradient
       xlink:href="#linearGradient13254"
       id="radialGradient17053"
       cx="88.337814"
       cy="74.649353"
       fx="88.337814"
       fy="74.649353"
       r="49.89299"
       gradientTransform="matrix(0.99769605,0,0,0.99999285,-87.912228,-39.371667)"
       gradientUnits="userSpaceOnUse" />
    <filter
       inkscape:collect="always"
       style="color-interpolation-filters:sRGB"
       id="filter18222-0"
       x="-0.033541095"
       y="-0.018109434"
       width="1.0670822"
       height="1.0362189">
      <feGaussianBlur
         inkscape:collect="always"
         stdDeviation="0.40870019"
         id="feGaussianBlur18224-1" />
    </filter>
    <filter
       inkscape:collect="always"
       style="color-interpolation-filters:sRGB"
       id="filter18230-3"
       x="-0.033975737"
       y="-0.01798521"
       width="1.0679515"
       height="1.0359704">
      <feGaussianBlur
         inkscape:collect="always"
         stdDeviation="0.33132421"
         id="feGaussianBlur18232-0" />
    </filter>
    <filter
       inkscape:collect="always"
       style="color-interpolation-filters:sRGB"
       id="filter18226-1"
       x="-0.012851508"
       y="-0.13846328"
       width="1.025703"
       height="1.2769266">
      <feGaussianBlur
         inkscape:collect="always"
         stdDeviation="0.10292743"
         id="feGaussianBlur18228-7" />
    </filter>
    <filter
       inkscape:collect="always"
       style="color-interpolation-filters:sRGB"
       id="filter19744"
       x="-0.16377558"
       y="-0.11438444"
       width="1.3275512"
       height="1.2287689">
      <feGaussianBlur
         inkscape:collect="always"
         stdDeviation="0.095859125"
         id="feGaussianBlur19746" />
    </filter>
    <filter
       inkscape:collect="always"
       style="color-interpolation-filters:sRGB"
       id="filter18242-0"
       x="-0.079568165"
       y="-0.013799525"
       width="1.1591363"
       height="1.027599">
      <feGaussianBlur
         inkscape:collect="always"
         stdDeviation="0.13980316"
         id="feGaussianBlur18244-1" />
    </filter>
    <filter
       inkscape:collect="always"
       style="color-interpolation-filters:sRGB"
       id="filter18234-5"
       x="-0.019646573"
       y="-0.049054145"
       width="1.0499933"
       height="1.0801728">
      <feGaussianBlur
         inkscape:collect="always"
         stdDeviation="0.092708589"
         id="feGaussianBlur18236-7" />
    </filter>
    <filter
       inkscape:collect="always"
       style="color-interpolation-filters:sRGB"
       id="filter18226-1-8"
       x="-0.012851508"
       y="-0.13846328"
       width="1.025703"
       height="1.2769266">
      <feGaussianBlur
         inkscape:collect="always"
         stdDeviation="0.10292743"
         id="feGaussianBlur18228-7-5" />
    </filter>
    <filter
       inkscape:collect="always"
       style="color-interpolation-filters:sRGB"
       id="filter19748"
       x="-0.16377558"
       y="-0.11438501"
       width="1.3275512"
       height="1.22877">
      <feGaussianBlur
         inkscape:collect="always"
         stdDeviation="0.095859125"
         id="feGaussianBlur19750" />
    </filter>
    <filter
       inkscape:collect="always"
       style="color-interpolation-filters:sRGB"
       id="filter18234-5-9"
       x="-0.019646573"
       y="-0.049054159"
       width="1.0499933"
       height="1.0801729">
      <feGaussianBlur
         inkscape:collect="always"
         stdDeviation="0.092708589"
         id="feGaussianBlur18236-7-1" />
    </filter>
    <filter
       inkscape:collect="always"
       style="color-interpolation-filters:sRGB"
       id="filter18222-0-27"
       x="-0.033541095"
       y="-0.018109434"
       width="1.0670822"
       height="1.0362189">
      <feGaussianBlur
         inkscape:collect="always"
         stdDeviation="0.40870019"
         id="feGaussianBlur18224-1-7" />
    </filter>
    <filter
       inkscape:collect="always"
       style="color-interpolation-filters:sRGB"
       id="filter18230-3-7"
       x="-0.033975737"
       y="-0.01798521"
       width="1.0679515"
       height="1.0359704">
      <feGaussianBlur
         inkscape:collect="always"
         stdDeviation="0.33132421"
         id="feGaussianBlur18232-0-0" />
    </filter>
    <filter
       inkscape:collect="always"
       style="color-interpolation-filters:sRGB"
       id="filter18226-1-7"
       x="-0.012851508"
       y="-0.13846328"
       width="1.025703"
       height="1.2769266">
      <feGaussianBlur
         inkscape:collect="always"
         stdDeviation="0.10292743"
         id="feGaussianBlur18228-7-2" />
    </filter>
    <filter
       inkscape:collect="always"
       style="color-interpolation-filters:sRGB"
       id="filter19744-7"
       x="-0.16377558"
       y="-0.11438444"
       width="1.3275512"
       height="1.2287689">
      <feGaussianBlur
         inkscape:collect="always"
         stdDeviation="0.095859125"
         id="feGaussianBlur19746-2" />
    </filter>
    <filter
       inkscape:collect="always"
       style="color-interpolation-filters:sRGB"
       id="filter18242-0-2"
       x="-0.079568165"
       y="-0.013799525"
       width="1.1591363"
       height="1.027599">
      <feGaussianBlur
         inkscape:collect="always"
         stdDeviation="0.13980316"
         id="feGaussianBlur18244-1-7" />
    </filter>
    <filter
       inkscape:collect="always"
       style="color-interpolation-filters:sRGB"
       id="filter18234-5-2"
       x="-0.019646573"
       y="-0.049054145"
       width="1.0499933"
       height="1.0801728">
      <feGaussianBlur
         inkscape:collect="always"
         stdDeviation="0.092708589"
         id="feGaussianBlur18236-7-9" />
    </filter>
    <filter
       inkscape:collect="always"
       style="color-interpolation-filters:sRGB"
       id="filter18226-1-8-2"
       x="-0.012851508"
       y="-0.13846328"
       width="1.025703"
       height="1.2769266">
      <feGaussianBlur
         inkscape:collect="always"
         stdDeviation="0.10292743"
         id="feGaussianBlur18228-7-5-6" />
    </filter>
    <filter
       inkscape:collect="always"
       style="color-interpolation-filters:sRGB"
       id="filter19748-3"
       x="-0.16377558"
       y="-0.11438501"
       width="1.3275512"
       height="1.22877">
      <feGaussianBlur
         inkscape:collect="always"
         stdDeviation="0.095859125"
         id="feGaussianBlur19750-6" />
    </filter>
    <filter
       inkscape:collect="always"
       style="color-interpolation-filters:sRGB"
       id="filter18234-5-9-4"
       x="-0.019646573"
       y="-0.049054159"
       width="1.0499933"
       height="1.0801729">
      <feGaussianBlur
         inkscape:collect="always"
         stdDeviation="0.092708589"
         id="feGaussianBlur18236-7-1-15" />
    </filter>
  </defs>
  <g
     inkscape:groupmode="layer"
     id="layer7"
     inkscape:label="Background"
     transform="matrix(0.76003563,0,0,0.90146085,8.9307869,6.9345447)"
     style="display:inline;opacity:1;fill:#00ff00;stroke:#000000;stroke-opacity:1"
     sodipodi:insensitive="true">
    <rect
       style="fill:#408040;fill-opacity:1;stroke:none;stroke-width:0.264026;stroke-linecap:round;stroke-linejoin:round;stroke-dasharray:0.612916, 0.306457;stroke-dashoffset:0;stroke-opacity:1"
       id="rect11660"
       width="275.974"
       height="146.24295"
       x="-11.750484"
       y="-7.352387"
       inkscape:label="Grass" />
  </g>
  <g
     inkscape:groupmode="layer"
     id="layer5"
     inkscape:label="Road"
     style="display:inline"
     sodipodi:insensitive="true">
    <rect
       style="display:inline;fill:#6d6d6d;fill-opacity:1;stroke:none;stroke-width:0.190629;stroke-linecap:round"
       id="rect846"
       width="209.99998"
       height="51.221489"
       x="1.3933685e-07"
       y="15.001317"
       inkscape:label="LeftLane" />
    <rect
       style="fill:#6d6d6d;fill-opacity:1;stroke:none;stroke-width:0.190629;stroke-linecap:round"
       id="rect846-6"
       width="209.99998"
       height="51.221489"
       x="1.3933685e-07"
       y="66.222809"
       inkscape:label="RightLane" />
    <path
       style="fill:none;stroke:#ffffff;stroke-width:2.1;stroke-linecap:butt;stroke-linejoin:miter;stroke-miterlimit:4;stroke-dasharray:none;stroke-opacity:1"
       d="M 1.8331004e-6,15.001317 H 209.99999"
       id="path1858"
       sodipodi:nodetypes="cc"
       inkscape:label="Left Line" />
    <path
       style="fill:none;stroke:#ffffff;stroke-width:2.1;stroke-linecap:butt;stroke-linejoin:miter;stroke-miterlimit:4;stroke-dasharray:none;stroke-opacity:1"
       d="M 1.8331004e-6,117.44429 H 209.99999"
       id="path1858-1"
       sodipodi:nodetypes="cc"
       inkscape:label="Right Line" />
    <path
       style="fill:none;stroke:#ffffff;stroke-width:1.75;stroke-linecap:butt;stroke-linejoin:miter;stroke-miterlimit:4;stroke-dasharray:6.99999, 6.99999;stroke-dashoffset:0;stroke-opacity:1"
       d="M 6.4336677e-6,66.222803 H 210"
       id="path1858-1-7"
       sodipodi:nodetypes="cc"
       inkscape:label="Center Line" />
  </g>
  <g
     inkscape:groupmode="layer"
     id="layer4"
     inkscape:label="Ideal Detection Range"
     style="display:none">
    <path
       id="path2502"
       style="fill:#4d4d4d;fill-opacity:1;stroke:none;stroke-width:0.0248813;stroke-linecap:round;stroke-linejoin:round;stroke-dasharray:none;stroke-opacity:1"
       inkscape:label="Covered Area"
       d="m 160.75099,40.240952 c -29.40362,13.884941 -52.34252,24.404477 -82.012849,37.9469 L 77.090003,96.960718 171.39915,108.70326 C 174.1688,88.268983 171.24668,61.729777 160.75099,40.240952 Z"
       sodipodi:nodetypes="ccccc" />
  </g>
  <g
     inkscape:groupmode="layer"
     id="layer3"
     inkscape:label="Detection Wrong Scale"
     style="display:none">
    <path
       id="path11043"
       style="display:inline;fill:#ffffff;fill-opacity:0.5;stroke:none;stroke-width:0.0248813;stroke-linecap:round;stroke-linejoin:round;stroke-dasharray:none;stroke-opacity:1"
       inkscape:label="Covererd Area"
       d="m 160.75099,40.240952 c -29.40362,13.884941 -52.34252,24.404477 -82.012849,37.9469 l -1.648138,18.772866 94.309147,11.742542 z"
       sodipodi:nodetypes="ccccc" />
    <path
       id="path2475"
       style="display:inline;fill:#ff0000;fill-opacity:0.5;stroke:none;stroke-width:0.0248813;stroke-linecap:round;stroke-linejoin:round;stroke-dasharray:none;stroke-opacity:1"
       inkscape:label="Missing Area"
       d="m 160.75081,40.240748 10.64814,68.462542 C 174.1686,88.269035 171.24649,61.729552 160.75081,40.240748 Z" />
  </g>
  <g
     inkscape:groupmode="layer"
     id="g2828"
     inkscape:label="Right Scale"
     style="display:inline">
    <path
       id="path3024"
       style="display:inline;fill:#ffffff;fill-opacity:0.5;stroke:none;stroke-width:0.0248813;stroke-linecap:round;stroke-linejoin:round;stroke-dasharray:none;stroke-opacity:1"
       inkscape:label="Covererd Area"
       d="M 184.40003,29.010416 78.846429,78.137204 c -1.756347,18.823509 0,0 -1.756347,18.823509 l 77.560578,9.657077 22.52803,2.80501 z M 77.090082,96.960713 78.738425,78.187606 h -5.14e-4 z"
       sodipodi:nodetypes="cccccccccc" />
  </g>
  <g
     inkscape:groupmode="layer"
     id="layer9"
     inkscape:label="FinalShadow"
     style="display:none">
    <path
       id="path2822"
       style="display:inline;fill:#ffffff;fill-opacity:0.5;stroke:none;stroke-width:0.0248813;stroke-linecap:round;stroke-linejoin:round;stroke-dasharray:none;stroke-opacity:1"
       inkscape:label="Covererd Area"
       d="m 184.40003,29.010416 -105.553601,49.126788 45.011331,3.951394 -1.65349,18.832762 -45.114188,-3.960647 77.560578,9.657077 22.52803,2.80501 z M 77.090082,96.960713 78.738425,78.187606 h -5.14e-4 z" />
  </g>
  <g
     inkscape:groupmode="layer"
     id="layer1"
     inkscape:label="Vectors"
     inkscape:highlight-color="#f3f3f3"
     style="display:inline">
    <path
       style="display:inline;fill:none;stroke:#ffffff;stroke-width:1.11321;stroke-linecap:butt;stroke-linejoin:miter;stroke-miterlimit:4;stroke-dasharray:none;stroke-opacity:1;marker-end:url(#TriangleStart)"
       d="M 46.337739,93.179263 78.738142,78.187858"
       id="path29646"
       inkscape:label="LeftVector" />
    <path
       style="display:inline;fill:none;stroke:#ffffff;stroke-width:1.11321;stroke-linecap:butt;stroke-linejoin:miter;stroke-miterlimit:4;stroke-dasharray:none;stroke-opacity:1;marker-end:url(#TriangleStart)"
       d="m 46.337739,93.179263 30.752264,3.781455"
       id="path29995"
       sodipodi:nodetypes="cc"
       inkscape:label="RightVector" />
  </g>
  <g
     inkscape:groupmode="layer"
     id="layer8"
     inkscape:label="RightScaleBoundaries"
     inkscape:highlight-color="#f3f3f3"
     style="display:inline">
    <path
       style="font-variation-settings:normal;display:inline;opacity:1;vector-effect:none;fill:none;fill-opacity:1;stroke:#00ff00;stroke-width:0.556603;stroke-linecap:butt;stroke-linejoin:miter;stroke-miterlimit:4;stroke-dasharray:0.556603, 0.556603;stroke-dashoffset:0;stroke-opacity:1;-inkscape-stroke:none;stop-color:#000000;stop-opacity:1"
       d="M 85.936463,0.02544663 73.766699,132.56467"
       id="path30189"
       sodipodi:nodetypes="cc"
       inkscape:label="InnerBound" />
    <path
       style="font-variation-settings:normal;display:inline;opacity:1;vector-effect:none;fill:none;fill-opacity:1;stroke:#00ff00;stroke-width:0.556605;stroke-linecap:butt;stroke-linejoin:miter;stroke-miterlimit:4;stroke-dasharray:0.556605, 0.556605;stroke-dashoffset:0;stroke-opacity:1;-inkscape-stroke:none;stop-color:#000000;stop-opacity:1"
       d="M 187.27417,0.08465123 175.04379,132.38312"
       id="path432"
       sodipodi:nodetypes="cc"
       inkscape:label="OutherBound" />
  </g>
  <g
     inkscape:groupmode="layer"
     id="layer6"
     inkscape:label="Detection Boundaries"
     inkscape:highlight-color="#21d7f3"
     style="display:inline"
     sodipodi:insensitive="true">
    <path
       id="path18240"
       style="font-variation-settings:normal;display:inline;opacity:1;vector-effect:none;fill:none;fill-opacity:1;stroke:#000000;stroke-width:0.556603;stroke-linecap:butt;stroke-linejoin:miter;stroke-miterlimit:4;stroke-dasharray:1.6698, 1.6698;stroke-dashoffset:0;stroke-opacity:1;-inkscape-stroke:none;stop-color:#000000;stop-opacity:1"
       d="M 46.337891,93.179403 171.40485,108.71632 c 2.7759,-20.421253 -0.14621,-46.960459 -10.648,-68.46244 L 46.337891,93.179403"
       sodipodi:nodetypes="cccc"
       inkscape:label="Real Detection Boundary" />
  </g>
  <g
     inkscape:groupmode="layer"
     id="layer2"
     inkscape:label="Cars"
     style="display:inline"
     sodipodi:insensitive="true">
    <g
       id="g10990"
       inkscape:label="Green Car"
       transform="matrix(1.4632512,0,0,1.4632512,29.783263,44.83126)"
       style="display:inline">
      <path
         id="rect5329-3"
         style="display:inline;fill:#008080;fill-opacity:1;stroke:#000000;stroke-width:0.660026;stroke-linecap:round;stroke-miterlimit:4;stroke-dasharray:none"
         d="M 111.64432,2.0438227 C 105.04229,2.0523434 98.237005,2.1331568 90.758177,2.2169563 68.478685,2.4667353 41.869774,2.8505737 30.297465,3.4078715 23.230107,3.6384901 14.684348,2.8709548 9.3789488,7.2023519 2.0152129,13.214203 2.4599894,25.811026 2.4600716,35.566974 c 8.62e-5,9.755983 -0.4448587,22.350682 6.9188772,28.362514 5.3053992,4.331416 13.8511582,3.563881 20.9185162,3.794495 11.572309,0.55731 38.18122,0.94324 60.460712,1.193033 19.943523,0.22363 35.097833,0.411016 54.377613,-0.665139 13.73019,-0.865401 18.17953,0.501523 21.27874,-4.567317 5.08975,-8.603198 6.55453,-18.471425 6.55461,-28.117586 7e-5,-9.646154 -1.46486,-19.516463 -6.55461,-28.1196843 C 163.31532,2.3784606 158.86598,3.7474951 145.13579,2.8821032 133.08592,2.2094824 122.64768,2.0289899 111.64432,2.0438106 Z"
         sodipodi:nodetypes="sscszscscczccs"
         inkscape:label="Chassis"
         transform="matrix(0.17960963,0,0,0.17960963,-17.34453,26.451478)" />
      <g
         id="g2331"
         inkscape:label="Paths"
         style="display:inline"
         transform="matrix(0.17960963,0,0,0.17960963,-17.34453,26.451478)">
        <path
           id="rect9419-4"
           style="fill:#000000;fill-opacity:1;stroke-width:3.26929;stroke-linecap:round;filter:url(#filter18222-0)"
           d="m 179.92578,278.80469 c -8.3074,2.61456 0.001,-10e-4 -21.16406,6.57617 2.41461,6.36953 2.70871,14.02215 2.58789,20.50586 -0.12082,6.48371 -0.13018,14.58793 -2.58789,20.5039 21.1653,6.57727 12.85666,3.96357 21.16406,6.57813 7.92037,-3.87861 8.08005,-21.27699 8.08008,-27.08203 3e-5,-5.80504 -0.15921,-23.20318 -8.08008,-27.08203 z"
           transform="matrix(1.036111,0,0,1.0811201,-64.646328,-295.13328)"
           sodipodi:nodetypes="cczcczc" />
        <path
           id="rect9419-9-6"
           style="fill:#000000;fill-opacity:1;stroke-width:2.64998;stroke-linecap:round;filter:url(#filter18230-3)"
           d="m 84.568359,283.7793 c -4.873618,6.66755 -5.189458,17.65863 -5.189453,22.10742 5e-6,4.44879 0.315887,15.43799 5.189453,22.10547 l 18.214841,-2.34766 c -2.861983,-6.16343 -3.308769,-13.64671 -3.224099,-19.75781 0.0847,-6.1111 0.421501,-14.2142 3.224099,-19.75977 z"
           transform="matrix(1.036111,0,0,1.0811201,-64.646328,-295.13328)"
           sodipodi:nodetypes="czcczcc" />
        <path
           id="rect11566-1"
           style="fill:#000000;fill-opacity:1;stroke-width:0.865;stroke-linecap:round;filter:url(#filter18226-1)"
           d="m 10.450971,2.232998 c 10.925005,-0.04102 15.686682,-0.182423 17.55118,-0.240478 1.17779,-0.03667 1.055942,-0.0049 1.055942,-0.0049 0,0 -4.06942,1.500063 -4.952975,1.60637 -1.521174,0.183024 -2.059657,0.131203 -4.505694,0.150817 -2.329844,0.01868 -5.473135,0.03909 -6.95085,-0.08392 C 9.7616799,3.420568 9.2382709,2.704488 10.450971,2.233002 Z"
           sodipodi:nodetypes="cscssscc"
           transform="matrix(3.9160101,0,0,4.086123,2.1315657,-2.4723443)" />
        <path
           id="rect13708-8"
           style="fill-opacity:0.92268;stroke-width:0.865;stroke-linecap:round;filter:url(#filter19744)"
           d="m 27.698733,0.23010595 c 0.778394,0.03326 1.35936,1.75751405 1.35936,1.75751405 l -0.707949,0.253746 c 0,0 -0.906933,-2.02217705 -0.651411,-2.01126005 z"
           sodipodi:nodetypes="sccs"
           transform="matrix(3.9160101,0,0,4.086123,2.1315657,-2.4723443)" />
        <path
           id="rect15650-6"
           style="fill:#000000;fill-opacity:0.5;stroke-width:3.26929;stroke-linecap:round;filter:url(#filter18242-0)"
           d="m 191.18359,293.72852 -0.125,12.08789 h -0.002 v 0.0703 0.0703 h 0.002 l 0.125,12.08594 c 0,0 3.74641,-0.39654 3.87891,-2.23438 0.1854,-2.57154 0.20967,-9.43993 0.21094,-9.85156 2e-5,-0.006 -1e-5,-0.0671 0,-0.0703 -1e-5,-0.003 2e-5,-0.0641 0,-0.0703 -0.001,-0.411 -0.0255,-7.27989 -0.21094,-9.85157 -0.1325,-1.83783 -3.87891,-2.23632 -3.87891,-2.23632 z"
           transform="matrix(1.036111,0,0,1.0811201,-64.646328,-295.13328)" />
        <path
           style="fill:none;stroke:#000000;stroke-width:0.264583px;stroke-linecap:butt;stroke-linejoin:miter;stroke-opacity:1;filter:url(#filter18234-5)"
           d="m 31.289163,2.121441 c 0,0 7.578859,0.412884 10.642205,2.922704 1.11139,0.910576 1.0486,4.305966 1.0486,4.305966"
           id="path16032-9"
           sodipodi:nodetypes="csc"
           transform="matrix(3.9160101,0,0,4.086123,2.1315657,-2.4723443)" />
        <path
           id="rect11566-1-1"
           style="fill:#000000;fill-opacity:1;stroke-width:0.865;stroke-linecap:round;filter:url(#filter18226-1-8)"
           d="m 46.021383,84.029808 c 10.925005,-0.04102 15.686682,-0.182423 17.55118,-0.240478 1.17779,-0.03667 1.055942,-0.0049 1.055942,-0.0049 0,0 -4.06942,1.500063 -4.952975,1.60637 -1.521174,0.183024 -2.059657,0.131203 -4.505694,0.150817 -2.329844,0.01868 -5.473135,0.03909 -6.95085,-0.08392 -2.886894,-0.240319 -3.410303,-0.956399 -2.197603,-1.427885 z"
           sodipodi:nodetypes="cscssscc"
           transform="matrix(3.9160101,0,0,-4.086123,-137.16253,407.8369)" />
        <path
           id="rect13708-8-4"
           style="fill-opacity:0.92268;stroke-width:0.865;stroke-linecap:round;filter:url(#filter19748)"
           d="m 27.698733,18.388361 c 0.778394,-0.0332 1.35936,-1.75751 1.35936,-1.75751 l -0.707949,-0.25374 c 0,0 -0.906933,2.02217 -0.651411,2.01125 z"
           sodipodi:nodetypes="sccs"
           transform="matrix(3.9160101,0,0,4.086123,2.1315657,-2.4723443)" />
        <path
           style="fill:none;stroke:#000000;stroke-width:0.264583px;stroke-linecap:butt;stroke-linejoin:miter;stroke-opacity:1;filter:url(#filter18234-5-9)"
           d="m 66.859575,83.918251 c 0,0 7.578859,0.412884 10.642202,2.922704 1.111396,0.910576 1.048603,4.305964 1.048603,4.305964"
           id="path16032-9-5"
           sodipodi:nodetypes="csc"
           transform="matrix(3.9160101,0,0,-4.086123,-137.16253,407.8369)" />
      </g>
    </g>
    <g
       id="g38512"
       inkscape:label="Front Car"
       style="display:inline;opacity:1"
       transform="matrix(1.4575507,0.12903395,-0.12903395,1.4575507,107.03838,41.878471)">
      <path
         id="path38490"
         style="display:inline;opacity:1;fill:#ff0000;fill-opacity:1;stroke:#000000;stroke-width:0.660026;stroke-linecap:round;stroke-miterlimit:4;stroke-dasharray:none"
         d="M 111.64432,2.0438227 C 105.04229,2.0523434 98.237005,2.1331568 90.758177,2.2169563 68.478685,2.4667353 41.869774,2.8505737 30.297465,3.4078715 23.230107,3.6384901 14.684348,2.8709548 9.3789488,7.2023519 2.0152129,13.214203 2.4599894,25.811026 2.4600716,35.566974 c 8.62e-5,9.755983 -0.4448587,22.350682 6.9188772,28.362514 5.3053992,4.331416 13.8511582,3.563881 20.9185162,3.794495 11.572309,0.55731 38.18122,0.94324 60.460712,1.193033 19.943523,0.22363 35.097833,0.411016 54.377613,-0.665139 13.73019,-0.865401 18.17953,0.501523 21.27874,-4.567317 5.08975,-8.603198 6.55453,-18.471425 6.55461,-28.117586 7e-5,-9.646154 -1.46486,-19.516463 -6.55461,-28.1196843 C 163.31532,2.3784606 158.86598,3.7474951 145.13579,2.8821032 133.08592,2.2094824 122.64768,2.0289899 111.64432,2.0438106 Z"
         sodipodi:nodetypes="sscszscscczccs"
         inkscape:label="Chassis"
         transform="matrix(0.17960964,0,0,0.17960964,-17.34453,26.451478)" />
      <g
         id="g38510"
         transform="matrix(0.17960963,0,0,0.17960963,-17.34453,26.451478)"
         inkscape:label="Paths">
        <path
           id="path38492"
           style="fill:#000000;fill-opacity:1;stroke-width:3.26929;stroke-linecap:round;filter:url(#filter18222-0-27)"
           d="m 179.92578,278.80469 c -8.3074,2.61456 0.001,-10e-4 -21.16406,6.57617 2.41461,6.36953 2.70871,14.02215 2.58789,20.50586 -0.12082,6.48371 -0.13018,14.58793 -2.58789,20.5039 21.1653,6.57727 12.85666,3.96357 21.16406,6.57813 7.92037,-3.87861 8.08005,-21.27699 8.08008,-27.08203 3e-5,-5.80504 -0.15921,-23.20318 -8.08008,-27.08203 z"
           transform="matrix(1.036111,0,0,1.0811201,-64.646328,-295.13328)"
           sodipodi:nodetypes="cczcczc" />
        <path
           id="path38494"
           style="fill:#000000;fill-opacity:1;stroke-width:2.64998;stroke-linecap:round;filter:url(#filter18230-3-7)"
           d="m 84.568359,283.7793 c -4.873618,6.66755 -5.189458,17.65863 -5.189453,22.10742 5e-6,4.44879 0.315887,15.43799 5.189453,22.10547 l 18.214841,-2.34766 c -2.861983,-6.16343 -3.308769,-13.64671 -3.224099,-19.75781 0.0847,-6.1111 0.421501,-14.2142 3.224099,-19.75977 z"
           transform="matrix(1.036111,0,0,1.0811201,-64.646328,-295.13328)"
           sodipodi:nodetypes="czcczcc" />
        <path
           id="path38496"
           style="fill:#000000;fill-opacity:1;stroke-width:0.865;stroke-linecap:round;filter:url(#filter18226-1-7)"
           d="m 10.450971,2.232998 c 10.925005,-0.04102 15.686682,-0.182423 17.55118,-0.240478 1.17779,-0.03667 1.055942,-0.0049 1.055942,-0.0049 0,0 -4.06942,1.500063 -4.952975,1.60637 -1.521174,0.183024 -2.059657,0.131203 -4.505694,0.150817 -2.329844,0.01868 -5.473135,0.03909 -6.95085,-0.08392 C 9.7616799,3.420568 9.2382709,2.704488 10.450971,2.233002 Z"
           sodipodi:nodetypes="cscssscc"
           transform="matrix(3.9160101,0,0,4.086123,2.1315657,-2.4723443)" />
        <path
           id="path38498"
           style="fill-opacity:0.92268;stroke-width:0.865;stroke-linecap:round;filter:url(#filter19744-7)"
           d="m 27.698733,0.23010595 c 0.778394,0.03326 1.35936,1.75751405 1.35936,1.75751405 l -0.707949,0.253746 c 0,0 -0.906933,-2.02217705 -0.651411,-2.01126005 z"
           sodipodi:nodetypes="sccs"
           transform="matrix(3.9160101,0,0,4.086123,2.1315657,-2.4723443)" />
        <path
           id="path38500"
           style="fill:#000000;fill-opacity:0.5;stroke-width:3.26929;stroke-linecap:round;filter:url(#filter18242-0-2)"
           d="m 191.18359,293.72852 -0.125,12.08789 h -0.002 v 0.0703 0.0703 h 0.002 l 0.125,12.08594 c 0,0 3.74641,-0.39654 3.87891,-2.23438 0.1854,-2.57154 0.20967,-9.43993 0.21094,-9.85156 2e-5,-0.006 -1e-5,-0.0671 0,-0.0703 -1e-5,-0.003 2e-5,-0.0641 0,-0.0703 -0.001,-0.411 -0.0255,-7.27989 -0.21094,-9.85157 -0.1325,-1.83783 -3.87891,-2.23632 -3.87891,-2.23632 z"
           transform="matrix(1.036111,0,0,1.0811201,-64.646328,-295.13328)" />
        <path
           style="fill:none;stroke:#000000;stroke-width:0.264583px;stroke-linecap:butt;stroke-linejoin:miter;stroke-opacity:1;filter:url(#filter18234-5-2)"
           d="m 31.289163,2.121441 c 0,0 7.578859,0.412884 10.642205,2.922704 1.11139,0.910576 1.0486,4.305966 1.0486,4.305966"
           id="path38502"
           sodipodi:nodetypes="csc"
           transform="matrix(3.9160101,0,0,4.086123,2.1315657,-2.4723443)" />
        <path
           id="path38504"
           style="fill:#000000;fill-opacity:1;stroke-width:0.865;stroke-linecap:round;filter:url(#filter18226-1-8-2)"
           d="m 46.021383,84.029808 c 10.925005,-0.04102 15.686682,-0.182423 17.55118,-0.240478 1.17779,-0.03667 1.055942,-0.0049 1.055942,-0.0049 0,0 -4.06942,1.500063 -4.952975,1.60637 -1.521174,0.183024 -2.059657,0.131203 -4.505694,0.150817 -2.329844,0.01868 -5.473135,0.03909 -6.95085,-0.08392 -2.886894,-0.240319 -3.410303,-0.956399 -2.197603,-1.427885 z"
           sodipodi:nodetypes="cscssscc"
           transform="matrix(3.9160101,0,0,-4.086123,-137.16253,407.8369)" />
        <path
           id="path38506"
           style="fill-opacity:0.92268;stroke-width:0.865;stroke-linecap:round;filter:url(#filter19748-3)"
           d="m 27.698733,18.388361 c 0.778394,-0.0332 1.35936,-1.75751 1.35936,-1.75751 l -0.707949,-0.25374 c 0,0 -0.906933,2.02217 -0.651411,2.01125 z"
           sodipodi:nodetypes="sccs"
           transform="matrix(3.9160101,0,0,4.086123,2.1315657,-2.4723443)" />
        <path
           style="fill:none;stroke:#000000;stroke-width:0.264583px;stroke-linecap:butt;stroke-linejoin:miter;stroke-opacity:1;filter:url(#filter18234-5-9-4)"
           d="m 66.859575,83.918251 c 0,0 7.578859,0.412884 10.642202,2.922704 1.111396,0.910576 1.048603,4.305964 1.048603,4.305964"
           id="path38508"
           sodipodi:nodetypes="csc"
           transform="matrix(3.9160101,0,0,-4.086123,-137.16253,407.8369)" />
      </g>
      <path
         style="display:inline;fill:none;stroke:#ffffff;stroke-width:0.49761903;stroke-linecap:butt;stroke-linejoin:round;stroke-opacity:1;stroke-dasharray:none"
         d="m 78.738425,78.187605 -1.648423,18.773113 45.114268,3.960642 1.65349,-18.832762 z"
         id="path3202"
         transform="matrix(0.68074734,-0.06026515,0.06026515,0.68074734,-75.389904,-22.057973)"
         inkscape:label="BoundingBox" />
    </g>
  </g>
  <metadata
     id="metadata551">
    <rdf:RDF>
      <cc:Work
         rdf:about="">
        <dc:creator>
          <cc:Agent>
            <dc:title>René Paris</dc:title>
          </cc:Agent>
        </dc:creator>
        <dc:rights>
          <cc:Agent>
            <dc:title>2023 - Bayerische Motoren Werke Aktiengesellschaft (BMW AG)</dc:title>
          </cc:Agent>
        </dc:rights>
        <dc:title>Shadow Casting</dc:title>
        <cc:license
           rdf:resource="https://www.eclipse.org/legal/epl-2.0/" />
      </cc:Work>
    </rdf:RDF>
  </metadata>
</svg>
