<?xml version="1.0" encoding="UTF-8" standalone="no"?>
<!-- Created with Inkscape (http://www.inkscape.org/) -->

<svg
   width="210mm"
   height="218.62462mm"
   viewBox="0 0 210 218.62462"
   version="1.1"
   id="svg12177"
   sodipodi:docname="sensor2d_kite_polygon.svg"
   inkscape:version="1.2.2 (732a01da63, 2022-12-09)"
   inkscape:export-filename="shadowing_3.png"
   inkscape:export-xdpi="300"
   inkscape:export-ydpi="300"
   xmlns:inkscape="http://www.inkscape.org/namespaces/inkscape"
   xmlns:sodipodi="http://sodipodi.sourceforge.net/DTD/sodipodi-0.dtd"
   xmlns:xlink="http://www.w3.org/1999/xlink"
   xmlns="http://www.w3.org/2000/svg"
   xmlns:svg="http://www.w3.org/2000/svg"
   xmlns:rdf="http://www.w3.org/1999/02/22-rdf-syntax-ns#"
   xmlns:cc="http://creativecommons.org/ns#"
   xmlns:dc="http://purl.org/dc/elements/1.1/">
  <title
     id="title485">Sensor2D</title>
  <sodipodi:namedview
     id="namedview525"
     pagecolor="#505050"
     bordercolor="#eeeeee"
     borderopacity="1"
     inkscape:showpageshadow="0"
     inkscape:pageopacity="0"
     inkscape:pagecheckerboard="0"
     inkscape:deskcolor="#505050"
     inkscape:document-units="mm"
     showgrid="false"
     inkscape:zoom="1.1544643"
     inkscape:cx="301.87161"
     inkscape:cy="456.48878"
     inkscape:window-width="1920"
     inkscape:window-height="1017"
     inkscape:window-x="-8"
     inkscape:window-y="-8"
     inkscape:window-maximized="1"
     inkscape:current-layer="layer1" />
  <style
     type="text/css"
     id="style515">
      .line1{stroke:#000000;stroke-width:0.299655;stroke-miterlimit:4;stroke-dasharray:0.299655;stroke-dashoffset:0}
   </style>
  <defs
     id="defs12174">
    <pattern
       inkscape:collect="always"
       xlink:href="#Strips1_1"
       id="pattern19283"
       patternTransform="matrix(0.66231134,0.66231134,-0.66231134,0.66231134,88.510344,83.946698)" />
    <pattern
       inkscape:collect="always"
       patternUnits="userSpaceOnUse"
       width="2"
       height="1"
       patternTransform="translate(0,0) scale(10,10)"
       id="Strips1_1"
       inkscape:stockid="Stripes 1:1"
       inkscape:isstock="true">
      <rect
         style="fill:black;stroke:none"
         x="0"
         y="-0.5"
         width="1"
         height="2"
         id="rect7558" />
    </pattern>
    <linearGradient
       id="linearGradient13254">
      <stop
         style="stop-color:#ffffff;stop-opacity:0.50193125"
         offset="0"
         id="stop13250" />
      <stop
         style="stop-color:#ffffff;stop-opacity:0"
         offset="1"
         id="stop13252" />
    </linearGradient>
    <radialGradient
       xlink:href="#linearGradient13254"
       id="radialGradient17053"
       cx="88.337814"
       cy="74.649353"
       fx="88.337814"
       fy="74.649353"
       r="49.89299"
       gradientTransform="matrix(0.99769605,0,0,0.99999285,-87.912228,-39.371667)"
       gradientUnits="userSpaceOnUse" />
    <filter
       inkscape:collect="always"
       style="color-interpolation-filters:sRGB"
       id="filter18222-0"
       x="-0.033541095"
       y="-0.018109434"
       width="1.0670822"
       height="1.0362189">
      <feGaussianBlur
         inkscape:collect="always"
         stdDeviation="0.40870019"
         id="feGaussianBlur18224-1" />
    </filter>
    <filter
       inkscape:collect="always"
       style="color-interpolation-filters:sRGB"
       id="filter18230-3"
       x="-0.033975737"
       y="-0.01798521"
       width="1.0679515"
       height="1.0359704">
      <feGaussianBlur
         inkscape:collect="always"
         stdDeviation="0.33132421"
         id="feGaussianBlur18232-0" />
    </filter>
    <filter
       inkscape:collect="always"
       style="color-interpolation-filters:sRGB"
       id="filter18226-1"
       x="-0.012851508"
       y="-0.13846328"
       width="1.025703"
       height="1.2769266">
      <feGaussianBlur
         inkscape:collect="always"
         stdDeviation="0.10292743"
         id="feGaussianBlur18228-7" />
    </filter>
    <filter
       inkscape:collect="always"
       style="color-interpolation-filters:sRGB"
       id="filter19744"
       x="-0.16377558"
       y="-0.11438444"
       width="1.3275512"
       height="1.2287689">
      <feGaussianBlur
         inkscape:collect="always"
         stdDeviation="0.095859125"
         id="feGaussianBlur19746" />
    </filter>
    <filter
       inkscape:collect="always"
       style="color-interpolation-filters:sRGB"
       id="filter18242-0"
       x="-0.079568165"
       y="-0.013799525"
       width="1.1591363"
       height="1.027599">
      <feGaussianBlur
         inkscape:collect="always"
         stdDeviation="0.13980316"
         id="feGaussianBlur18244-1" />
    </filter>
    <filter
       inkscape:collect="always"
       style="color-interpolation-filters:sRGB"
       id="filter18234-5"
       x="-0.019646573"
       y="-0.049054145"
       width="1.0499933"
       height="1.0801728">
      <feGaussianBlur
         inkscape:collect="always"
         stdDeviation="0.092708589"
         id="feGaussianBlur18236-7" />
    </filter>
    <filter
       inkscape:collect="always"
       style="color-interpolation-filters:sRGB"
       id="filter18226-1-8"
       x="-0.012851508"
       y="-0.13846328"
       width="1.025703"
       height="1.2769266">
      <feGaussianBlur
         inkscape:collect="always"
         stdDeviation="0.10292743"
         id="feGaussianBlur18228-7-5" />
    </filter>
    <filter
       inkscape:collect="always"
       style="color-interpolation-filters:sRGB"
       id="filter19748"
       x="-0.16377558"
       y="-0.11438501"
       width="1.3275512"
       height="1.22877">
      <feGaussianBlur
         inkscape:collect="always"
         stdDeviation="0.095859125"
         id="feGaussianBlur19750" />
    </filter>
    <filter
       inkscape:collect="always"
       style="color-interpolation-filters:sRGB"
       id="filter18234-5-9"
       x="-0.019646573"
       y="-0.049054159"
       width="1.0499933"
       height="1.0801729">
      <feGaussianBlur
         inkscape:collect="always"
         stdDeviation="0.092708589"
         id="feGaussianBlur18236-7-1" />
    </filter>
    <filter
       inkscape:collect="always"
       style="color-interpolation-filters:sRGB"
       id="filter18222-0-2"
       x="-0.033541095"
       y="-0.018109434"
       width="1.0670822"
       height="1.0362189">
      <feGaussianBlur
         inkscape:collect="always"
         stdDeviation="0.40870019"
         id="feGaussianBlur18224-1-1" />
    </filter>
    <filter
       inkscape:collect="always"
       style="color-interpolation-filters:sRGB"
       id="filter18230-3-2"
       x="-0.033975737"
       y="-0.01798521"
       width="1.0679515"
       height="1.0359704">
      <feGaussianBlur
         inkscape:collect="always"
         stdDeviation="0.33132421"
         id="feGaussianBlur18232-0-2" />
    </filter>
    <filter
       inkscape:collect="always"
       style="color-interpolation-filters:sRGB"
       id="filter18226-1-5"
       x="-0.012851508"
       y="-0.13846328"
       width="1.025703"
       height="1.2769266">
      <feGaussianBlur
         inkscape:collect="always"
         stdDeviation="0.10292743"
         id="feGaussianBlur18228-7-4" />
    </filter>
    <filter
       inkscape:collect="always"
       style="color-interpolation-filters:sRGB"
       id="filter19744-6"
       x="-0.16377558"
       y="-0.11438444"
       width="1.3275512"
       height="1.2287689">
      <feGaussianBlur
         inkscape:collect="always"
         stdDeviation="0.095859125"
         id="feGaussianBlur19746-1" />
    </filter>
    <filter
       inkscape:collect="always"
       style="color-interpolation-filters:sRGB"
       id="filter18242-0-1"
       x="-0.079568165"
       y="-0.013799525"
       width="1.1591363"
       height="1.027599">
      <feGaussianBlur
         inkscape:collect="always"
         stdDeviation="0.13980316"
         id="feGaussianBlur18244-1-5" />
    </filter>
    <filter
       inkscape:collect="always"
       style="color-interpolation-filters:sRGB"
       id="filter18234-5-0"
       x="-0.019646573"
       y="-0.049054145"
       width="1.0499933"
       height="1.0801728">
      <feGaussianBlur
         inkscape:collect="always"
         stdDeviation="0.092708589"
         id="feGaussianBlur18236-7-5" />
    </filter>
    <filter
       inkscape:collect="always"
       style="color-interpolation-filters:sRGB"
       id="filter18226-1-8-4"
       x="-0.012851508"
       y="-0.13846328"
       width="1.025703"
       height="1.2769266">
      <feGaussianBlur
         inkscape:collect="always"
         stdDeviation="0.10292743"
         id="feGaussianBlur18228-7-5-7" />
    </filter>
    <filter
       inkscape:collect="always"
       style="color-interpolation-filters:sRGB"
       id="filter19748-1"
       x="-0.16377558"
       y="-0.11438501"
       width="1.3275512"
       height="1.22877">
      <feGaussianBlur
         inkscape:collect="always"
         stdDeviation="0.095859125"
         id="feGaussianBlur19750-3" />
    </filter>
    <filter
       inkscape:collect="always"
       style="color-interpolation-filters:sRGB"
       id="filter18234-5-9-3"
       x="-0.019646573"
       y="-0.049054159"
       width="1.0499933"
       height="1.0801729">
      <feGaussianBlur
         inkscape:collect="always"
         stdDeviation="0.092708589"
         id="feGaussianBlur18236-7-1-1" />
    </filter>
    <filter
       inkscape:collect="always"
       style="color-interpolation-filters:sRGB"
       id="filter18222-0-2-6-7"
       x="-0.033541095"
       y="-0.018109434"
       width="1.0670822"
       height="1.0362189">
      <feGaussianBlur
         inkscape:collect="always"
         stdDeviation="0.40870019"
         id="feGaussianBlur18224-1-1-8-0" />
    </filter>
    <filter
       inkscape:collect="always"
       style="color-interpolation-filters:sRGB"
       id="filter18230-3-2-8-9"
       x="-0.033975737"
       y="-0.01798521"
       width="1.0679515"
       height="1.0359704">
      <feGaussianBlur
         inkscape:collect="always"
         stdDeviation="0.33132421"
         id="feGaussianBlur18232-0-2-7-5" />
    </filter>
    <filter
       inkscape:collect="always"
       style="color-interpolation-filters:sRGB"
       id="filter18226-1-5-1-0"
       x="-0.012851508"
       y="-0.13846328"
       width="1.025703"
       height="1.2769266">
      <feGaussianBlur
         inkscape:collect="always"
         stdDeviation="0.10292743"
         id="feGaussianBlur18228-7-4-6-5" />
    </filter>
    <filter
       inkscape:collect="always"
       style="color-interpolation-filters:sRGB"
       id="filter19744-6-1-4"
       x="-0.16377558"
       y="-0.11438444"
       width="1.3275512"
       height="1.2287689">
      <feGaussianBlur
         inkscape:collect="always"
         stdDeviation="0.095859125"
         id="feGaussianBlur19746-1-0-1" />
    </filter>
    <filter
       inkscape:collect="always"
       style="color-interpolation-filters:sRGB"
       id="filter18242-0-1-1-8"
       x="-0.079568165"
       y="-0.013799525"
       width="1.1591363"
       height="1.027599">
      <feGaussianBlur
         inkscape:collect="always"
         stdDeviation="0.13980316"
         id="feGaussianBlur18244-1-5-6-0" />
    </filter>
    <filter
       inkscape:collect="always"
       style="color-interpolation-filters:sRGB"
       id="filter18234-5-0-0-8"
       x="-0.019646573"
       y="-0.049054145"
       width="1.0499933"
       height="1.0801728">
      <feGaussianBlur
         inkscape:collect="always"
         stdDeviation="0.092708589"
         id="feGaussianBlur18236-7-5-8-3" />
    </filter>
    <filter
       inkscape:collect="always"
       style="color-interpolation-filters:sRGB"
       id="filter18226-1-8-4-3-1"
       x="-0.012851508"
       y="-0.13846328"
       width="1.025703"
       height="1.2769266">
      <feGaussianBlur
         inkscape:collect="always"
         stdDeviation="0.10292743"
         id="feGaussianBlur18228-7-5-7-9-7" />
    </filter>
    <filter
       inkscape:collect="always"
       style="color-interpolation-filters:sRGB"
       id="filter19748-1-1-0"
       x="-0.16377558"
       y="-0.11438501"
       width="1.3275512"
       height="1.22877">
      <feGaussianBlur
         inkscape:collect="always"
         stdDeviation="0.095859125"
         id="feGaussianBlur19750-3-8-0" />
    </filter>
    <filter
       inkscape:collect="always"
       style="color-interpolation-filters:sRGB"
       id="filter18234-5-9-3-2-6"
       x="-0.019646573"
       y="-0.049054159"
       width="1.0499933"
       height="1.0801729">
      <feGaussianBlur
         inkscape:collect="always"
         stdDeviation="0.092708589"
         id="feGaussianBlur18236-7-1-1-0-3" />
    </filter>
    <filter
       inkscape:collect="always"
       style="color-interpolation-filters:sRGB"
       id="filter18222-0-2-6-7-1"
       x="-0.033541095"
       y="-0.018109434"
       width="1.0670822"
       height="1.0362189">
      <feGaussianBlur
         inkscape:collect="always"
         stdDeviation="0.40870019"
         id="feGaussianBlur18224-1-1-8-0-7" />
    </filter>
    <filter
       inkscape:collect="always"
       style="color-interpolation-filters:sRGB"
       id="filter18230-3-2-8-9-5"
       x="-0.033975737"
       y="-0.01798521"
       width="1.0679515"
       height="1.0359704">
      <feGaussianBlur
         inkscape:collect="always"
         stdDeviation="0.33132421"
         id="feGaussianBlur18232-0-2-7-5-0" />
    </filter>
    <filter
       inkscape:collect="always"
       style="color-interpolation-filters:sRGB"
       id="filter18226-1-5-1-0-2"
       x="-0.012851508"
       y="-0.13846328"
       width="1.025703"
       height="1.2769266">
      <feGaussianBlur
         inkscape:collect="always"
         stdDeviation="0.10292743"
         id="feGaussianBlur18228-7-4-6-5-5" />
    </filter>
    <filter
       inkscape:collect="always"
       style="color-interpolation-filters:sRGB"
       id="filter19744-6-1-4-0"
       x="-0.16377558"
       y="-0.11438444"
       width="1.3275512"
       height="1.2287689">
      <feGaussianBlur
         inkscape:collect="always"
         stdDeviation="0.095859125"
         id="feGaussianBlur19746-1-0-1-5" />
    </filter>
    <filter
       inkscape:collect="always"
       style="color-interpolation-filters:sRGB"
       id="filter18242-0-1-1-8-3"
       x="-0.079568165"
       y="-0.013799525"
       width="1.1591363"
       height="1.027599">
      <feGaussianBlur
         inkscape:collect="always"
         stdDeviation="0.13980316"
         id="feGaussianBlur18244-1-5-6-0-5" />
    </filter>
    <filter
       inkscape:collect="always"
       style="color-interpolation-filters:sRGB"
       id="filter18234-5-0-0-8-9"
       x="-0.019646573"
       y="-0.049054145"
       width="1.0499933"
       height="1.0801728">
      <feGaussianBlur
         inkscape:collect="always"
         stdDeviation="0.092708589"
         id="feGaussianBlur18236-7-5-8-3-8" />
    </filter>
    <filter
       inkscape:collect="always"
       style="color-interpolation-filters:sRGB"
       id="filter18226-1-8-4-3-1-9"
       x="-0.012851508"
       y="-0.13846328"
       width="1.025703"
       height="1.2769266">
      <feGaussianBlur
         inkscape:collect="always"
         stdDeviation="0.10292743"
         id="feGaussianBlur18228-7-5-7-9-7-3" />
    </filter>
    <filter
       inkscape:collect="always"
       style="color-interpolation-filters:sRGB"
       id="filter19748-1-1-0-3"
       x="-0.16377558"
       y="-0.11438501"
       width="1.3275512"
       height="1.22877">
      <feGaussianBlur
         inkscape:collect="always"
         stdDeviation="0.095859125"
         id="feGaussianBlur19750-3-8-0-9" />
    </filter>
    <filter
       inkscape:collect="always"
       style="color-interpolation-filters:sRGB"
       id="filter18234-5-9-3-2-6-6"
       x="-0.019646573"
       y="-0.049054159"
       width="1.0499933"
       height="1.0801729">
      <feGaussianBlur
         inkscape:collect="always"
         stdDeviation="0.092708589"
         id="feGaussianBlur18236-7-1-1-0-3-5" />
    </filter>
    <filter
       inkscape:collect="always"
       style="color-interpolation-filters:sRGB"
       id="filter18222-0-2-6-7-1-2"
       x="-0.033541095"
       y="-0.018109434"
       width="1.0670822"
       height="1.0362189">
      <feGaussianBlur
         inkscape:collect="always"
         stdDeviation="0.40870019"
         id="feGaussianBlur18224-1-1-8-0-7-5" />
    </filter>
    <filter
       inkscape:collect="always"
       style="color-interpolation-filters:sRGB"
       id="filter18230-3-2-8-9-5-7"
       x="-0.033975737"
       y="-0.01798521"
       width="1.0679515"
       height="1.0359704">
      <feGaussianBlur
         inkscape:collect="always"
         stdDeviation="0.33132421"
         id="feGaussianBlur18232-0-2-7-5-0-4" />
    </filter>
    <filter
       inkscape:collect="always"
       style="color-interpolation-filters:sRGB"
       id="filter18226-1-5-1-0-2-3"
       x="-0.012851508"
       y="-0.13846328"
       width="1.025703"
       height="1.2769266">
      <feGaussianBlur
         inkscape:collect="always"
         stdDeviation="0.10292743"
         id="feGaussianBlur18228-7-4-6-5-5-7" />
    </filter>
    <filter
       inkscape:collect="always"
       style="color-interpolation-filters:sRGB"
       id="filter19744-6-1-4-0-4"
       x="-0.16377558"
       y="-0.11438444"
       width="1.3275512"
       height="1.2287689">
      <feGaussianBlur
         inkscape:collect="always"
         stdDeviation="0.095859125"
         id="feGaussianBlur19746-1-0-1-5-0" />
    </filter>
    <filter
       inkscape:collect="always"
       style="color-interpolation-filters:sRGB"
       id="filter18242-0-1-1-8-3-3"
       x="-0.079568165"
       y="-0.013799525"
       width="1.1591363"
       height="1.027599">
      <feGaussianBlur
         inkscape:collect="always"
         stdDeviation="0.13980316"
         id="feGaussianBlur18244-1-5-6-0-5-0" />
    </filter>
    <filter
       inkscape:collect="always"
       style="color-interpolation-filters:sRGB"
       id="filter18234-5-0-0-8-9-7"
       x="-0.019646573"
       y="-0.049054145"
       width="1.0499933"
       height="1.0801728">
      <feGaussianBlur
         inkscape:collect="always"
         stdDeviation="0.092708589"
         id="feGaussianBlur18236-7-5-8-3-8-2" />
    </filter>
    <filter
       inkscape:collect="always"
       style="color-interpolation-filters:sRGB"
       id="filter18226-1-8-4-3-1-9-9"
       x="-0.012851508"
       y="-0.13846328"
       width="1.025703"
       height="1.2769266">
      <feGaussianBlur
         inkscape:collect="always"
         stdDeviation="0.10292743"
         id="feGaussianBlur18228-7-5-7-9-7-3-3" />
    </filter>
    <filter
       inkscape:collect="always"
       style="color-interpolation-filters:sRGB"
       id="filter19748-1-1-0-3-0"
       x="-0.16377558"
       y="-0.11438501"
       width="1.3275512"
       height="1.22877">
      <feGaussianBlur
         inkscape:collect="always"
         stdDeviation="0.095859125"
         id="feGaussianBlur19750-3-8-0-9-8" />
    </filter>
    <filter
       inkscape:collect="always"
       style="color-interpolation-filters:sRGB"
       id="filter18234-5-9-3-2-6-6-2"
       x="-0.019646573"
       y="-0.049054159"
       width="1.0499933"
       height="1.0801729">
      <feGaussianBlur
         inkscape:collect="always"
         stdDeviation="0.092708589"
         id="feGaussianBlur18236-7-1-1-0-3-5-1" />
    </filter>
    <filter
       inkscape:collect="always"
       style="color-interpolation-filters:sRGB"
       id="filter18222-0-2-6-7-1-2-8"
       x="-0.033541095"
       y="-0.018109434"
       width="1.0670822"
       height="1.0362189">
      <feGaussianBlur
         inkscape:collect="always"
         stdDeviation="0.40870019"
         id="feGaussianBlur18224-1-1-8-0-7-5-9" />
    </filter>
    <filter
       inkscape:collect="always"
       style="color-interpolation-filters:sRGB"
       id="filter18230-3-2-8-9-5-7-7"
       x="-0.033975737"
       y="-0.01798521"
       width="1.0679515"
       height="1.0359704">
      <feGaussianBlur
         inkscape:collect="always"
         stdDeviation="0.33132421"
         id="feGaussianBlur18232-0-2-7-5-0-4-1" />
    </filter>
    <filter
       inkscape:collect="always"
       style="color-interpolation-filters:sRGB"
       id="filter18226-1-5-1-0-2-3-6"
       x="-0.012851508"
       y="-0.13846328"
       width="1.025703"
       height="1.2769266">
      <feGaussianBlur
         inkscape:collect="always"
         stdDeviation="0.10292743"
         id="feGaussianBlur18228-7-4-6-5-5-7-6" />
    </filter>
    <filter
       inkscape:collect="always"
       style="color-interpolation-filters:sRGB"
       id="filter19744-6-1-4-0-4-2"
       x="-0.16377558"
       y="-0.11438444"
       width="1.3275512"
       height="1.2287689">
      <feGaussianBlur
         inkscape:collect="always"
         stdDeviation="0.095859125"
         id="feGaussianBlur19746-1-0-1-5-0-5" />
    </filter>
    <filter
       inkscape:collect="always"
       style="color-interpolation-filters:sRGB"
       id="filter18242-0-1-1-8-3-3-4"
       x="-0.079568165"
       y="-0.013799525"
       width="1.1591363"
       height="1.027599">
      <feGaussianBlur
         inkscape:collect="always"
         stdDeviation="0.13980316"
         id="feGaussianBlur18244-1-5-6-0-5-0-0" />
    </filter>
    <filter
       inkscape:collect="always"
       style="color-interpolation-filters:sRGB"
       id="filter18234-5-0-0-8-9-7-8"
       x="-0.019646573"
       y="-0.049054145"
       width="1.0499933"
       height="1.0801728">
      <feGaussianBlur
         inkscape:collect="always"
         stdDeviation="0.092708589"
         id="feGaussianBlur18236-7-5-8-3-8-2-3" />
    </filter>
    <filter
       inkscape:collect="always"
       style="color-interpolation-filters:sRGB"
       id="filter18226-1-8-4-3-1-9-9-7"
       x="-0.012851508"
       y="-0.13846328"
       width="1.025703"
       height="1.2769266">
      <feGaussianBlur
         inkscape:collect="always"
         stdDeviation="0.10292743"
         id="feGaussianBlur18228-7-5-7-9-7-3-3-5" />
    </filter>
    <filter
       inkscape:collect="always"
       style="color-interpolation-filters:sRGB"
       id="filter19748-1-1-0-3-0-8"
       x="-0.16377558"
       y="-0.11438501"
       width="1.3275512"
       height="1.22877">
      <feGaussianBlur
         inkscape:collect="always"
         stdDeviation="0.095859125"
         id="feGaussianBlur19750-3-8-0-9-8-3" />
    </filter>
    <filter
       inkscape:collect="always"
       style="color-interpolation-filters:sRGB"
       id="filter18234-5-9-3-2-6-6-2-7"
       x="-0.019646573"
       y="-0.049054159"
       width="1.0499933"
       height="1.0801729">
      <feGaussianBlur
         inkscape:collect="always"
         stdDeviation="0.092708589"
         id="feGaussianBlur18236-7-1-1-0-3-5-1-4" />
    </filter>
    <pattern
       inkscape:collect="always"
       xlink:href="#Strips1_1-2"
       id="pattern19283-6"
       patternTransform="matrix(0.76389972,0.76389972,-0.76389972,0.76389972,0,0)" />
    <pattern
       inkscape:collect="always"
       patternUnits="userSpaceOnUse"
       width="2"
       height="1"
       patternTransform="translate(0,0) scale(10,10)"
       id="Strips1_1-2"
       inkscape:stockid="Stripes 1:1"
       inkscape:isstock="true">
      <rect
         style="fill:black;stroke:none"
         x="0"
         y="-0.5"
         width="1"
         height="2"
         id="rect7558-8" />
    </pattern>
  </defs>
  <g
     inkscape:groupmode="layer"
     id="layer7"
     inkscape:label="Background"
     transform="matrix(0.76003563,0,0,0.90146085,8.9307861,6.934532)"
     style="display:inline;opacity:1;fill:#00ff00;stroke:#000000;stroke-opacity:1">
    <rect
       style="fill:#408040;fill-opacity:1;stroke:none;stroke-width:0.184689;stroke-linecap:round;stroke-linejoin:round;stroke-dasharray:0.428741, 0.214372;stroke-dashoffset:0;stroke-opacity:1"
       id="rect11660"
       width="276.09979"
       height="242.5226"
       x="-11.648958"
       y="-7.6925492" />
  </g>
  <g
     inkscape:groupmode="layer"
     id="layer5"
     inkscape:label="Road"
     style="display:inline"
     transform="translate(0,-1.2660984e-5)">
    <rect
       style="fill:#6d6d6d;fill-opacity:1;stroke:none;stroke-width:0.112953;stroke-linecap:round"
       id="rect846"
       width="209.99998"
       height="30.350033"
       x="1.1100144e-05"
       y="66.271698" />
    <rect
       style="fill:#6d6d6d;fill-opacity:1;stroke:none;stroke-width:0.112953;stroke-linecap:round"
       id="rect846-6"
       width="209.99998"
       height="30.350033"
       x="1.1100144e-05"
       y="5.5716257" />
    <path
       style="fill:none;stroke:#ffffff;stroke-width:1.24429;stroke-linecap:butt;stroke-linejoin:miter;stroke-miterlimit:4;stroke-dasharray:none;stroke-opacity:1"
       d="M 0,5.5716279 H 209.99999"
       id="path1858-1"
       sodipodi:nodetypes="cc" />
    <rect
       style="fill:#6d6d6d;fill-opacity:1;stroke:none;stroke-width:0.112953;stroke-linecap:round"
       id="rect18825"
       width="209.99998"
       height="30.350033"
       x="1.1100144e-05"
       y="35.921661" />
    <path
       style="fill:none;stroke:#ffffff;stroke-width:1.03692;stroke-linecap:butt;stroke-linejoin:miter;stroke-miterlimit:4;stroke-dasharray:4.14766, 4.14766;stroke-dashoffset:0;stroke-opacity:1"
       d="M 1.7340269e-5,66.271688 H 210"
       id="path1858-1-7"
       sodipodi:nodetypes="cc" />
    <rect
       style="fill:#6d6d6d;fill-opacity:1;stroke:none;stroke-width:0.112953;stroke-linecap:round"
       id="rect16747"
       width="209.99998"
       height="30.350033"
       x="1.1100144e-05"
       y="126.86807" />
    <rect
       style="fill:#6d6d6d;fill-opacity:1;stroke:none;stroke-width:0.112953;stroke-linecap:round"
       id="rect16749"
       width="209.99998"
       height="30.350033"
       x="1.1100144e-05"
       y="96.518036" />
    <path
       style="fill:none;stroke:#ffffff;stroke-width:1.24429;stroke-linecap:butt;stroke-linejoin:miter;stroke-miterlimit:4;stroke-dasharray:none;stroke-opacity:1"
       d="M 8.6701345e-6,96.518028 H 210"
       id="path1858"
       sodipodi:nodetypes="cc" />
    <path
       style="fill:none;stroke:#ffffff;stroke-width:1.24429;stroke-linecap:butt;stroke-linejoin:miter;stroke-miterlimit:4;stroke-dasharray:none;stroke-opacity:1"
       d="M 8.6701345e-6,157.11441 H 210"
       id="path16751"
       sodipodi:nodetypes="cc" />
    <path
       style="fill:none;stroke:#ffffff;stroke-width:1.03692;stroke-linecap:butt;stroke-linejoin:miter;stroke-miterlimit:4;stroke-dasharray:4.14766, 4.14766;stroke-dashoffset:0;stroke-opacity:1"
       d="M 1.7340269e-5,126.86807 H 210"
       id="path16753"
       sodipodi:nodetypes="cc" />
    <path
       style="fill:none;stroke:#ffffff;stroke-width:1.03692;stroke-linecap:butt;stroke-linejoin:miter;stroke-miterlimit:4;stroke-dasharray:4.14766, 4.14766;stroke-dashoffset:0;stroke-opacity:1"
       d="M 8.6701345e-6,35.921648 H 209.99999"
       id="path18827"
       sodipodi:nodetypes="cc" />
  </g>
  <g
     inkscape:groupmode="layer"
     id="layer3"
     inkscape:label="Cones"
     style="display:inline"
     transform="translate(0,-1.2660984e-5)">
    <ellipse
       style="opacity:1;fill:none;fill-opacity:0.25;stroke:#000000;stroke-width:0.514491;stroke-linecap:round;stroke-linejoin:round;stroke-dasharray:0.514491, 1.54347;stroke-dashoffset:0;stroke-opacity:1"
       id="path18687"
       cx="97.992821"
       cy="112.70363"
       rx="75.089951"
       ry="74.818748" />
    <path
       id="path18579"
       style="display:inline;opacity:1;fill:#ffffff;fill-opacity:0.25;stroke:#000000;stroke-width:0.184689;stroke-linecap:round;stroke-linejoin:round;stroke-dasharray:none;stroke-dashoffset:0;stroke-opacity:1"
       d="m 98.21135,112.48531 53.00072,53.00069 c 13.36001,-13.51317 21.87069,-32.28605 21.87071,-52.78254 -2e-5,-20.723042 -8.43117,-39.478322 -22.05271,-53.027412 z"
       sodipodi:nodetypes="ccccc" />
  </g>
  <g
     inkscape:groupmode="layer"
     id="layer6"
     inkscape:label="Inner Cones"
     inkscape:highlight-color="#21d7f3"
     style="display:inline"
     transform="translate(0,-1.2660984e-5)">
    <path
       id="path601"
       style="font-variation-settings:normal;opacity:0.25;vector-effect:none;fill:url(#pattern19283);fill-opacity:1;stroke:#000000;stroke-width:0.184689;stroke-linecap:round;stroke-linejoin:round;stroke-miterlimit:4;stroke-dasharray:none;stroke-dashoffset:0;stroke-opacity:1;-inkscape-stroke:none;stop-color:#000000;stop-opacity:1"
       d="m 98.21135,112.48532 52.79801,-52.798022 53.41021,53.442132 -0.21273,-0.21273 -52.98448,52.57962 z"
       sodipodi:nodetypes="cccccc" />
    <path
       id="path1717"
       style="font-variation-settings:normal;opacity:1;vector-effect:none;fill:none;fill-opacity:1;stroke:#000000;stroke-width:0.184689;stroke-linecap:round;stroke-linejoin:round;stroke-miterlimit:4;stroke-dasharray:none;stroke-dashoffset:0;stroke-opacity:1;-inkscape-stroke:none;stop-color:#000000;stop-opacity:1"
       d="m 98.21135,112.48532 52.79801,-52.798022 53.41021,53.442132 -0.21273,-0.21273 -52.98448,52.57962 v 0 z"
       sodipodi:nodetypes="ccccccc" />
  </g>
  <g
     inkscape:groupmode="layer"
     id="layer2"
     inkscape:label="Cars"
     style="display:inline"
     transform="translate(0,-1.2660984e-5)">
    <g
       id="g10977"
       inkscape:label="Orange Car"
       style="display:inline"
       transform="matrix(0.86701345,0,0,0.86701345,88.510344,83.946688)">
      <path
         id="rect5329-3-5"
         style="fill:#ff7f2a;fill-opacity:1;stroke:#000000;stroke-width:0.118547;stroke-linecap:round;stroke-miterlimit:4;stroke-dasharray:none"
         d="m 49.177794,23.040304 c -1.185788,0.0015 -2.408083,0.01605 -3.751352,0.0311 -4.001612,0.04486 -8.780828,0.113803 -10.859327,0.2139 -1.269365,0.04142 -2.804266,-0.09644 -3.757166,0.681525 -1.322598,1.079786 -1.242712,3.342297 -1.242697,5.094559 1.5e-5,1.752269 -0.0799,4.014398 1.242697,5.094181 0.9529,0.777964 2.487801,0.640107 3.757166,0.681528 2.078499,0.100098 6.857715,0.169415 10.859327,0.21428 3.582048,0.04017 6.303908,0.07382 9.766743,-0.119466 2.466074,-0.155434 3.265218,0.09008 3.821866,-0.820334 0.914168,-1.545217 1.177257,-3.317646 1.177271,-5.050189 1.3e-5,-1.732542 -0.263103,-3.505345 -1.177271,-5.050566 -0.556648,-0.910411 -1.355792,-0.664519 -3.821866,-0.819952 -2.164273,-0.120809 -4.039082,-0.153227 -6.015391,-0.150566 z"
         sodipodi:nodetypes="sscszscscczccs" />
      <path
         id="rect9419-4-8"
         style="fill:#000000;fill-opacity:1;stroke-width:3.26929;stroke-linecap:round;filter:url(#filter18222-0-2)"
         d="m 179.92578,278.80469 c -8.3074,2.61456 0.001,-10e-4 -21.16406,6.57617 2.41461,6.36953 2.70871,14.02215 2.58789,20.50586 -0.12082,6.48371 -0.13018,14.58793 -2.58789,20.5039 21.1653,6.57727 12.85666,3.96357 21.16406,6.57813 7.92037,-3.87861 8.08005,-21.27699 8.08008,-27.08203 3e-5,-5.80504 -0.15921,-23.20318 -8.08008,-27.08203 z"
         transform="matrix(0.18609551,0,0,0.19417958,17.967956,-30.335608)"
         sodipodi:nodetypes="cczcczc" />
      <path
         id="rect9419-9-6-0"
         style="fill:#000000;fill-opacity:1;stroke-width:2.64998;stroke-linecap:round;filter:url(#filter18230-3-2)"
         d="m 84.568359,283.7793 c -4.873618,6.66755 -5.189458,17.65863 -5.189453,22.10742 5e-6,4.44879 0.315887,15.43799 5.189453,22.10547 l 18.214841,-2.34766 c -2.861983,-6.16343 -3.308769,-13.64671 -3.224099,-19.75781 0.0847,-6.1111 0.421501,-14.2142 3.224099,-19.75977 z"
         transform="matrix(0.18609551,0,0,0.19417958,17.967956,-30.335608)"
         sodipodi:nodetypes="czcczcc" />
      <path
         id="rect11566-1-6"
         style="fill:#000000;fill-opacity:1;stroke-width:0.865;stroke-linecap:round;filter:url(#filter18226-1-5)"
         d="m 10.450971,2.232998 c 10.925005,-0.04102 15.686682,-0.182423 17.55118,-0.240478 1.17779,-0.03667 1.055942,-0.0049 1.055942,-0.0049 0,0 -4.06942,1.500063 -4.952975,1.60637 -1.521174,0.183024 -2.059657,0.131203 -4.505694,0.150817 -2.329844,0.01868 -5.473135,0.03909 -6.95085,-0.08392 C 9.7616799,3.420568 9.2382709,2.704488 10.450971,2.233002 Z"
         sodipodi:nodetypes="cscssscc"
         transform="matrix(0.70335313,0,0,0.73390704,29.961909,22.229114)" />
      <path
         id="rect13708-8-42"
         style="fill-opacity:0.92268;stroke-width:0.865;stroke-linecap:round;filter:url(#filter19744-6)"
         d="m 27.698733,0.23010595 c 0.778394,0.03326 1.35936,1.75751405 1.35936,1.75751405 l -0.707949,0.253746 c 0,0 -0.906933,-2.02217705 -0.651411,-2.01126005 z"
         sodipodi:nodetypes="sccs"
         transform="matrix(0.70335313,0,0,0.73390704,29.961909,22.229114)" />
      <path
         id="rect15650-6-6"
         style="fill:#000000;fill-opacity:0.5;stroke-width:3.26929;stroke-linecap:round;filter:url(#filter18242-0-1)"
         d="m 191.18359,293.72852 -0.125,12.08789 h -0.002 v 0.0703 0.0703 h 0.002 l 0.125,12.08594 c 0,0 3.74641,-0.39654 3.87891,-2.23438 0.1854,-2.57154 0.20967,-9.43993 0.21094,-9.85156 2e-5,-0.006 -1e-5,-0.0671 0,-0.0703 -1e-5,-0.003 2e-5,-0.0641 0,-0.0703 -0.001,-0.411 -0.0255,-7.27989 -0.21094,-9.85157 -0.1325,-1.83783 -3.87891,-2.23632 -3.87891,-2.23632 z"
         transform="matrix(0.18609551,0,0,0.19417958,17.967956,-30.335608)" />
      <path
         style="fill:none;stroke:#000000;stroke-width:0.264583px;stroke-linecap:butt;stroke-linejoin:miter;stroke-opacity:1;filter:url(#filter18234-5-0)"
         d="m 31.289163,2.121441 c 0,0 7.578859,0.412884 10.642205,2.922704 1.11139,0.910576 1.0486,4.305966 1.0486,4.305966"
         id="path16032-9-3"
         sodipodi:nodetypes="csc"
         transform="matrix(0.70335313,0,0,0.73390704,29.961909,22.229114)" />
      <path
         id="rect11566-1-1-2"
         style="fill:#000000;fill-opacity:1;stroke-width:0.865;stroke-linecap:round;filter:url(#filter18226-1-8-4)"
         d="m 46.021383,84.029808 c 10.925005,-0.04102 15.686682,-0.182423 17.55118,-0.240478 1.17779,-0.03667 1.055942,-0.0049 1.055942,-0.0049 0,0 -4.06942,1.500063 -4.952975,1.60637 -1.521174,0.183024 -2.059657,0.131203 -4.505694,0.150817 -2.329844,0.01868 -5.473135,0.03909 -6.95085,-0.08392 -2.886894,-0.240319 -3.410303,-0.956399 -2.197603,-1.427885 z"
         sodipodi:nodetypes="cscssscc"
         transform="matrix(0.70335313,0,0,-0.73390704,4.9433483,95.924606)" />
      <path
         id="rect13708-8-4-7"
         style="fill-opacity:0.92268;stroke-width:0.865;stroke-linecap:round;filter:url(#filter19748-1)"
         d="m 27.698733,18.388361 c 0.778394,-0.0332 1.35936,-1.75751 1.35936,-1.75751 l -0.707949,-0.25374 c 0,0 -0.906933,2.02217 -0.651411,2.01125 z"
         sodipodi:nodetypes="sccs"
         transform="matrix(0.70335313,0,0,0.73390704,29.961909,22.229114)" />
      <path
         style="fill:none;stroke:#000000;stroke-width:0.264583px;stroke-linecap:butt;stroke-linejoin:miter;stroke-opacity:1;filter:url(#filter18234-5-9-3)"
         d="m 66.859575,83.918251 c 0,0 7.578859,0.412884 10.642202,2.922704 1.111396,0.910576 1.048603,4.305964 1.048603,4.305964"
         id="path16032-9-5-7"
         sodipodi:nodetypes="csc"
         transform="matrix(0.70335313,0,0,-0.73390704,4.9433483,95.924606)" />
    </g>
    <g
       id="g10977-9-6"
       inkscape:label="Orange Car"
       style="display:inline"
       transform="matrix(-0.86701345,0,0,-0.86701345,120.15089,105.84532)">
      <path
         id="rect5329-3-5-8-5"
         style="fill:#ff7f2a;fill-opacity:1;stroke:#000000;stroke-width:0.118547;stroke-linecap:round;stroke-miterlimit:4;stroke-dasharray:none"
         d="m 49.177794,23.040304 c -1.185788,0.0015 -2.408083,0.01605 -3.751352,0.0311 -4.001612,0.04486 -8.780828,0.113803 -10.859327,0.2139 -1.269365,0.04142 -2.804266,-0.09644 -3.757166,0.681525 -1.322598,1.079786 -1.242712,3.342297 -1.242697,5.094559 1.5e-5,1.752269 -0.0799,4.014398 1.242697,5.094181 0.9529,0.777964 2.487801,0.640107 3.757166,0.681528 2.078499,0.100098 6.857715,0.169415 10.859327,0.21428 3.582048,0.04017 6.303908,0.07382 9.766743,-0.119466 2.466074,-0.155434 3.265218,0.09008 3.821866,-0.820334 0.914168,-1.545217 1.177257,-3.317646 1.177271,-5.050189 1.3e-5,-1.732542 -0.263103,-3.505345 -1.177271,-5.050566 -0.556648,-0.910411 -1.355792,-0.664519 -3.821866,-0.819952 -2.164273,-0.120809 -4.039082,-0.153227 -6.015391,-0.150566 z"
         sodipodi:nodetypes="sscszscscczccs" />
      <path
         id="rect9419-4-8-5-8"
         style="fill:#000000;fill-opacity:1;stroke-width:3.26929;stroke-linecap:round;filter:url(#filter18222-0-2-6-7)"
         d="m 179.92578,278.80469 c -8.3074,2.61456 0.001,-10e-4 -21.16406,6.57617 2.41461,6.36953 2.70871,14.02215 2.58789,20.50586 -0.12082,6.48371 -0.13018,14.58793 -2.58789,20.5039 21.1653,6.57727 12.85666,3.96357 21.16406,6.57813 7.92037,-3.87861 8.08005,-21.27699 8.08008,-27.08203 3e-5,-5.80504 -0.15921,-23.20318 -8.08008,-27.08203 z"
         transform="matrix(0.18609551,0,0,0.19417958,17.967956,-30.335608)"
         sodipodi:nodetypes="cczcczc" />
      <path
         id="rect9419-9-6-0-9-0"
         style="fill:#000000;fill-opacity:1;stroke-width:2.64998;stroke-linecap:round;filter:url(#filter18230-3-2-8-9)"
         d="m 84.568359,283.7793 c -4.873618,6.66755 -5.189458,17.65863 -5.189453,22.10742 5e-6,4.44879 0.315887,15.43799 5.189453,22.10547 l 18.214841,-2.34766 c -2.861983,-6.16343 -3.308769,-13.64671 -3.224099,-19.75781 0.0847,-6.1111 0.421501,-14.2142 3.224099,-19.75977 z"
         transform="matrix(0.18609551,0,0,0.19417958,17.967956,-30.335608)"
         sodipodi:nodetypes="czcczcc" />
      <path
         id="rect11566-1-6-8-3"
         style="fill:#000000;fill-opacity:1;stroke-width:0.865;stroke-linecap:round;filter:url(#filter18226-1-5-1-0)"
         d="m 10.450971,2.232998 c 10.925005,-0.04102 15.686682,-0.182423 17.55118,-0.240478 1.17779,-0.03667 1.055942,-0.0049 1.055942,-0.0049 0,0 -4.06942,1.500063 -4.952975,1.60637 -1.521174,0.183024 -2.059657,0.131203 -4.505694,0.150817 -2.329844,0.01868 -5.473135,0.03909 -6.95085,-0.08392 C 9.7616799,3.420568 9.2382709,2.704488 10.450971,2.233002 Z"
         sodipodi:nodetypes="cscssscc"
         transform="matrix(0.70335313,0,0,0.73390704,29.961909,22.229114)" />
      <path
         id="rect13708-8-42-4-7"
         style="fill-opacity:0.92268;stroke-width:0.865;stroke-linecap:round;filter:url(#filter19744-6-1-4)"
         d="m 27.698733,0.23010595 c 0.778394,0.03326 1.35936,1.75751405 1.35936,1.75751405 l -0.707949,0.253746 c 0,0 -0.906933,-2.02217705 -0.651411,-2.01126005 z"
         sodipodi:nodetypes="sccs"
         transform="matrix(0.70335313,0,0,0.73390704,29.961909,22.229114)" />
      <path
         id="rect15650-6-6-5-9"
         style="fill:#000000;fill-opacity:0.5;stroke-width:3.26929;stroke-linecap:round;filter:url(#filter18242-0-1-1-8)"
         d="m 191.18359,293.72852 -0.125,12.08789 h -0.002 v 0.0703 0.0703 h 0.002 l 0.125,12.08594 c 0,0 3.74641,-0.39654 3.87891,-2.23438 0.1854,-2.57154 0.20967,-9.43993 0.21094,-9.85156 2e-5,-0.006 -1e-5,-0.0671 0,-0.0703 -1e-5,-0.003 2e-5,-0.0641 0,-0.0703 -0.001,-0.411 -0.0255,-7.27989 -0.21094,-9.85157 -0.1325,-1.83783 -3.87891,-2.23632 -3.87891,-2.23632 z"
         transform="matrix(0.18609551,0,0,0.19417958,17.967956,-30.335608)" />
      <path
         style="fill:none;stroke:#000000;stroke-width:0.264583px;stroke-linecap:butt;stroke-linejoin:miter;stroke-opacity:1;filter:url(#filter18234-5-0-0-8)"
         d="m 31.289163,2.121441 c 0,0 7.578859,0.412884 10.642205,2.922704 1.11139,0.910576 1.0486,4.305966 1.0486,4.305966"
         id="path16032-9-3-5-4"
         sodipodi:nodetypes="csc"
         transform="matrix(0.70335313,0,0,0.73390704,29.961909,22.229114)" />
      <path
         id="rect11566-1-1-2-7-5"
         style="fill:#000000;fill-opacity:1;stroke-width:0.865;stroke-linecap:round;filter:url(#filter18226-1-8-4-3-1)"
         d="m 46.021383,84.029808 c 10.925005,-0.04102 15.686682,-0.182423 17.55118,-0.240478 1.17779,-0.03667 1.055942,-0.0049 1.055942,-0.0049 0,0 -4.06942,1.500063 -4.952975,1.60637 -1.521174,0.183024 -2.059657,0.131203 -4.505694,0.150817 -2.329844,0.01868 -5.473135,0.03909 -6.95085,-0.08392 -2.886894,-0.240319 -3.410303,-0.956399 -2.197603,-1.427885 z"
         sodipodi:nodetypes="cscssscc"
         transform="matrix(0.70335313,0,0,-0.73390704,4.9433483,95.924606)" />
      <path
         id="rect13708-8-4-7-7-3"
         style="fill-opacity:0.92268;stroke-width:0.865;stroke-linecap:round;filter:url(#filter19748-1-1-0)"
         d="m 27.698733,18.388361 c 0.778394,-0.0332 1.35936,-1.75751 1.35936,-1.75751 l -0.707949,-0.25374 c 0,0 -0.906933,2.02217 -0.651411,2.01125 z"
         sodipodi:nodetypes="sccs"
         transform="matrix(0.70335313,0,0,0.73390704,29.961909,22.229114)" />
      <path
         style="fill:none;stroke:#000000;stroke-width:0.264583px;stroke-linecap:butt;stroke-linejoin:miter;stroke-opacity:1;filter:url(#filter18234-5-9-3-2-6)"
         d="m 66.859575,83.918251 c 0,0 7.578859,0.412884 10.642202,2.922704 1.111396,0.910576 1.048603,4.305964 1.048603,4.305964"
         id="path16032-9-5-7-3-0"
         sodipodi:nodetypes="csc"
         transform="matrix(0.70335313,0,0,-0.73390704,4.9433483,95.924606)" />
    </g>
    <g
       id="g10977-9-6-9"
       inkscape:label="Orange Car"
       style="display:inline"
       transform="matrix(-0.86701345,0,0,-0.86701345,186.80618,82.969422)">
      <path
         id="rect5329-3-5-8-5-5"
         style="fill:#ff7f2a;fill-opacity:1;stroke:#000000;stroke-width:0.118547;stroke-linecap:round;stroke-miterlimit:4;stroke-dasharray:none"
         d="m 49.177794,23.040304 c -1.185788,0.0015 -2.408083,0.01605 -3.751352,0.0311 -4.001612,0.04486 -8.780828,0.113803 -10.859327,0.2139 -1.269365,0.04142 -2.804266,-0.09644 -3.757166,0.681525 -1.322598,1.079786 -1.242712,3.342297 -1.242697,5.094559 1.5e-5,1.752269 -0.0799,4.014398 1.242697,5.094181 0.9529,0.777964 2.487801,0.640107 3.757166,0.681528 2.078499,0.100098 6.857715,0.169415 10.859327,0.21428 3.582048,0.04017 6.303908,0.07382 9.766743,-0.119466 2.466074,-0.155434 3.265218,0.09008 3.821866,-0.820334 0.914168,-1.545217 1.177257,-3.317646 1.177271,-5.050189 1.3e-5,-1.732542 -0.263103,-3.505345 -1.177271,-5.050566 -0.556648,-0.910411 -1.355792,-0.664519 -3.821866,-0.819952 -2.164273,-0.120809 -4.039082,-0.153227 -6.015391,-0.150566 z"
         sodipodi:nodetypes="sscszscscczccs" />
      <path
         id="rect9419-4-8-5-8-0"
         style="fill:#000000;fill-opacity:1;stroke-width:3.26929;stroke-linecap:round;filter:url(#filter18222-0-2-6-7-1)"
         d="m 179.92578,278.80469 c -8.3074,2.61456 0.001,-10e-4 -21.16406,6.57617 2.41461,6.36953 2.70871,14.02215 2.58789,20.50586 -0.12082,6.48371 -0.13018,14.58793 -2.58789,20.5039 21.1653,6.57727 12.85666,3.96357 21.16406,6.57813 7.92037,-3.87861 8.08005,-21.27699 8.08008,-27.08203 3e-5,-5.80504 -0.15921,-23.20318 -8.08008,-27.08203 z"
         transform="matrix(0.18609551,0,0,0.19417958,17.967956,-30.335608)"
         sodipodi:nodetypes="cczcczc" />
      <path
         id="rect9419-9-6-0-9-0-0"
         style="fill:#000000;fill-opacity:1;stroke-width:2.64998;stroke-linecap:round;filter:url(#filter18230-3-2-8-9-5)"
         d="m 84.568359,283.7793 c -4.873618,6.66755 -5.189458,17.65863 -5.189453,22.10742 5e-6,4.44879 0.315887,15.43799 5.189453,22.10547 l 18.214841,-2.34766 c -2.861983,-6.16343 -3.308769,-13.64671 -3.224099,-19.75781 0.0847,-6.1111 0.421501,-14.2142 3.224099,-19.75977 z"
         transform="matrix(0.18609551,0,0,0.19417958,17.967956,-30.335608)"
         sodipodi:nodetypes="czcczcc" />
      <path
         id="rect11566-1-6-8-3-0"
         style="fill:#000000;fill-opacity:1;stroke-width:0.865;stroke-linecap:round;filter:url(#filter18226-1-5-1-0-2)"
         d="m 10.450971,2.232998 c 10.925005,-0.04102 15.686682,-0.182423 17.55118,-0.240478 1.17779,-0.03667 1.055942,-0.0049 1.055942,-0.0049 0,0 -4.06942,1.500063 -4.952975,1.60637 -1.521174,0.183024 -2.059657,0.131203 -4.505694,0.150817 -2.329844,0.01868 -5.473135,0.03909 -6.95085,-0.08392 C 9.7616799,3.420568 9.2382709,2.704488 10.450971,2.233002 Z"
         sodipodi:nodetypes="cscssscc"
         transform="matrix(0.70335313,0,0,0.73390704,29.961909,22.229114)" />
      <path
         id="rect13708-8-42-4-7-6"
         style="fill-opacity:0.92268;stroke-width:0.865;stroke-linecap:round;filter:url(#filter19744-6-1-4-0)"
         d="m 27.698733,0.23010595 c 0.778394,0.03326 1.35936,1.75751405 1.35936,1.75751405 l -0.707949,0.253746 c 0,0 -0.906933,-2.02217705 -0.651411,-2.01126005 z"
         sodipodi:nodetypes="sccs"
         transform="matrix(0.70335313,0,0,0.73390704,29.961909,22.229114)" />
      <path
         id="rect15650-6-6-5-9-5"
         style="fill:#000000;fill-opacity:0.5;stroke-width:3.26929;stroke-linecap:round;filter:url(#filter18242-0-1-1-8-3)"
         d="m 191.18359,293.72852 -0.125,12.08789 h -0.002 v 0.0703 0.0703 h 0.002 l 0.125,12.08594 c 0,0 3.74641,-0.39654 3.87891,-2.23438 0.1854,-2.57154 0.20967,-9.43993 0.21094,-9.85156 2e-5,-0.006 -1e-5,-0.0671 0,-0.0703 -1e-5,-0.003 2e-5,-0.0641 0,-0.0703 -0.001,-0.411 -0.0255,-7.27989 -0.21094,-9.85157 -0.1325,-1.83783 -3.87891,-2.23632 -3.87891,-2.23632 z"
         transform="matrix(0.18609551,0,0,0.19417958,17.967956,-30.335608)" />
      <path
         style="fill:none;stroke:#000000;stroke-width:0.264583px;stroke-linecap:butt;stroke-linejoin:miter;stroke-opacity:1;filter:url(#filter18234-5-0-0-8-9)"
         d="m 31.289163,2.121441 c 0,0 7.578859,0.412884 10.642205,2.922704 1.11139,0.910576 1.0486,4.305966 1.0486,4.305966"
         id="path16032-9-3-5-4-7"
         sodipodi:nodetypes="csc"
         transform="matrix(0.70335313,0,0,0.73390704,29.961909,22.229114)" />
      <path
         id="rect11566-1-1-2-7-5-5"
         style="fill:#000000;fill-opacity:1;stroke-width:0.865;stroke-linecap:round;filter:url(#filter18226-1-8-4-3-1-9)"
         d="m 46.021383,84.029808 c 10.925005,-0.04102 15.686682,-0.182423 17.55118,-0.240478 1.17779,-0.03667 1.055942,-0.0049 1.055942,-0.0049 0,0 -4.06942,1.500063 -4.952975,1.60637 -1.521174,0.183024 -2.059657,0.131203 -4.505694,0.150817 -2.329844,0.01868 -5.473135,0.03909 -6.95085,-0.08392 -2.886894,-0.240319 -3.410303,-0.956399 -2.197603,-1.427885 z"
         sodipodi:nodetypes="cscssscc"
         transform="matrix(0.70335313,0,0,-0.73390704,4.9433483,95.924606)" />
      <path
         id="rect13708-8-4-7-7-3-5"
         style="fill-opacity:0.92268;stroke-width:0.865;stroke-linecap:round;filter:url(#filter19748-1-1-0-3)"
         d="m 27.698733,18.388361 c 0.778394,-0.0332 1.35936,-1.75751 1.35936,-1.75751 l -0.707949,-0.25374 c 0,0 -0.906933,2.02217 -0.651411,2.01125 z"
         sodipodi:nodetypes="sccs"
         transform="matrix(0.70335313,0,0,0.73390704,29.961909,22.229114)" />
      <path
         style="fill:none;stroke:#000000;stroke-width:0.264583px;stroke-linecap:butt;stroke-linejoin:miter;stroke-opacity:1;filter:url(#filter18234-5-9-3-2-6-6)"
         d="m 66.859575,83.918251 c 0,0 7.578859,0.412884 10.642202,2.922704 1.111396,0.910576 1.048603,4.305964 1.048603,4.305964"
         id="path16032-9-5-7-3-0-8"
         sodipodi:nodetypes="csc"
         transform="matrix(0.70335313,0,0,-0.73390704,4.9433483,95.924606)" />
    </g>
    <g
       id="g10977-9-6-9-9"
       inkscape:label="Orange Car"
       style="display:inline"
       transform="matrix(0.86701345,0,0,0.86701345,153.92479,119.51386)"
       inkscape:transform-center-x="-1.5369342"
       inkscape:transform-center-y="-0.25303635">
      <path
         id="rect5329-3-5-8-5-5-2"
         style="fill:#ff7f2a;fill-opacity:1;stroke:#000000;stroke-width:0.118547;stroke-linecap:round;stroke-miterlimit:4;stroke-dasharray:none"
         d="m 49.177794,23.040304 c -1.185788,0.0015 -2.408083,0.01605 -3.751352,0.0311 -4.001612,0.04486 -8.780828,0.113803 -10.859327,0.2139 -1.269365,0.04142 -2.804266,-0.09644 -3.757166,0.681525 -1.322598,1.079786 -1.242712,3.342297 -1.242697,5.094559 1.5e-5,1.752269 -0.0799,4.014398 1.242697,5.094181 0.9529,0.777964 2.487801,0.640107 3.757166,0.681528 2.078499,0.100098 6.857715,0.169415 10.859327,0.21428 3.582048,0.04017 6.303908,0.07382 9.766743,-0.119466 2.466074,-0.155434 3.265218,0.09008 3.821866,-0.820334 0.914168,-1.545217 1.177257,-3.317646 1.177271,-5.050189 1.3e-5,-1.732542 -0.263103,-3.505345 -1.177271,-5.050566 -0.556648,-0.910411 -1.355792,-0.664519 -3.821866,-0.819952 -2.164273,-0.120809 -4.039082,-0.153227 -6.015391,-0.150566 z"
         sodipodi:nodetypes="sscszscscczccs" />
      <path
         id="rect9419-4-8-5-8-0-2"
         style="fill:#000000;fill-opacity:1;stroke-width:3.26929;stroke-linecap:round;filter:url(#filter18222-0-2-6-7-1-2)"
         d="m 179.92578,278.80469 c -8.3074,2.61456 0.001,-10e-4 -21.16406,6.57617 2.41461,6.36953 2.70871,14.02215 2.58789,20.50586 -0.12082,6.48371 -0.13018,14.58793 -2.58789,20.5039 21.1653,6.57727 12.85666,3.96357 21.16406,6.57813 7.92037,-3.87861 8.08005,-21.27699 8.08008,-27.08203 3e-5,-5.80504 -0.15921,-23.20318 -8.08008,-27.08203 z"
         transform="matrix(0.18609551,0,0,0.19417958,17.967956,-30.335608)"
         sodipodi:nodetypes="cczcczc" />
      <path
         id="rect9419-9-6-0-9-0-0-1"
         style="fill:#000000;fill-opacity:1;stroke-width:2.64998;stroke-linecap:round;filter:url(#filter18230-3-2-8-9-5-7)"
         d="m 84.568359,283.7793 c -4.873618,6.66755 -5.189458,17.65863 -5.189453,22.10742 5e-6,4.44879 0.315887,15.43799 5.189453,22.10547 l 18.214841,-2.34766 c -2.861983,-6.16343 -3.308769,-13.64671 -3.224099,-19.75781 0.0847,-6.1111 0.421501,-14.2142 3.224099,-19.75977 z"
         transform="matrix(0.18609551,0,0,0.19417958,17.967956,-30.335608)"
         sodipodi:nodetypes="czcczcc" />
      <path
         id="rect11566-1-6-8-3-0-3"
         style="fill:#000000;fill-opacity:1;stroke-width:0.865;stroke-linecap:round;filter:url(#filter18226-1-5-1-0-2-3)"
         d="m 10.450971,2.232998 c 10.925005,-0.04102 15.686682,-0.182423 17.55118,-0.240478 1.17779,-0.03667 1.055942,-0.0049 1.055942,-0.0049 0,0 -4.06942,1.500063 -4.952975,1.60637 -1.521174,0.183024 -2.059657,0.131203 -4.505694,0.150817 -2.329844,0.01868 -5.473135,0.03909 -6.95085,-0.08392 C 9.7616799,3.420568 9.2382709,2.704488 10.450971,2.233002 Z"
         sodipodi:nodetypes="cscssscc"
         transform="matrix(0.70335313,0,0,0.73390704,29.961909,22.229114)" />
      <path
         id="rect13708-8-42-4-7-6-8"
         style="fill-opacity:0.92268;stroke-width:0.865;stroke-linecap:round;filter:url(#filter19744-6-1-4-0-4)"
         d="m 27.698733,0.23010595 c 0.778394,0.03326 1.35936,1.75751405 1.35936,1.75751405 l -0.707949,0.253746 c 0,0 -0.906933,-2.02217705 -0.651411,-2.01126005 z"
         sodipodi:nodetypes="sccs"
         transform="matrix(0.70335313,0,0,0.73390704,29.961909,22.229114)" />
      <path
         id="rect15650-6-6-5-9-5-8"
         style="fill:#000000;fill-opacity:0.5;stroke-width:3.26929;stroke-linecap:round;filter:url(#filter18242-0-1-1-8-3-3)"
         d="m 191.18359,293.72852 -0.125,12.08789 h -0.002 v 0.0703 0.0703 h 0.002 l 0.125,12.08594 c 0,0 3.74641,-0.39654 3.87891,-2.23438 0.1854,-2.57154 0.20967,-9.43993 0.21094,-9.85156 2e-5,-0.006 -1e-5,-0.0671 0,-0.0703 -1e-5,-0.003 2e-5,-0.0641 0,-0.0703 -0.001,-0.411 -0.0255,-7.27989 -0.21094,-9.85157 -0.1325,-1.83783 -3.87891,-2.23632 -3.87891,-2.23632 z"
         transform="matrix(0.18609551,0,0,0.19417958,17.967956,-30.335608)" />
      <path
         style="fill:none;stroke:#000000;stroke-width:0.264583px;stroke-linecap:butt;stroke-linejoin:miter;stroke-opacity:1;filter:url(#filter18234-5-0-0-8-9-7)"
         d="m 31.289163,2.121441 c 0,0 7.578859,0.412884 10.642205,2.922704 1.11139,0.910576 1.0486,4.305966 1.0486,4.305966"
         id="path16032-9-3-5-4-7-9"
         sodipodi:nodetypes="csc"
         transform="matrix(0.70335313,0,0,0.73390704,29.961909,22.229114)" />
      <path
         id="rect11566-1-1-2-7-5-5-2"
         style="fill:#000000;fill-opacity:1;stroke-width:0.865;stroke-linecap:round;filter:url(#filter18226-1-8-4-3-1-9-9)"
         d="m 46.021383,84.029808 c 10.925005,-0.04102 15.686682,-0.182423 17.55118,-0.240478 1.17779,-0.03667 1.055942,-0.0049 1.055942,-0.0049 0,0 -4.06942,1.500063 -4.952975,1.60637 -1.521174,0.183024 -2.059657,0.131203 -4.505694,0.150817 -2.329844,0.01868 -5.473135,0.03909 -6.95085,-0.08392 -2.886894,-0.240319 -3.410303,-0.956399 -2.197603,-1.427885 z"
         sodipodi:nodetypes="cscssscc"
         transform="matrix(0.70335313,0,0,-0.73390704,4.9433483,95.924606)" />
      <path
         id="rect13708-8-4-7-7-3-5-4"
         style="fill-opacity:0.92268;stroke-width:0.865;stroke-linecap:round;filter:url(#filter19748-1-1-0-3-0)"
         d="m 27.698733,18.388361 c 0.778394,-0.0332 1.35936,-1.75751 1.35936,-1.75751 l -0.707949,-0.25374 c 0,0 -0.906933,2.02217 -0.651411,2.01125 z"
         sodipodi:nodetypes="sccs"
         transform="matrix(0.70335313,0,0,0.73390704,29.961909,22.229114)" />
      <path
         style="fill:none;stroke:#000000;stroke-width:0.264583px;stroke-linecap:butt;stroke-linejoin:miter;stroke-opacity:1;filter:url(#filter18234-5-9-3-2-6-6-2)"
         d="m 66.859575,83.918251 c 0,0 7.578859,0.412884 10.642202,2.922704 1.111396,0.910576 1.048603,4.305964 1.048603,4.305964"
         id="path16032-9-5-7-3-0-8-1"
         sodipodi:nodetypes="csc"
         transform="matrix(0.70335313,0,0,-0.73390704,4.9433483,95.924606)" />
    </g>
    <g
       id="g10977-9-6-9-9-9"
       inkscape:label="Orange Car"
       style="display:inline"
       transform="matrix(0.86701345,0,0,0.86701345,155.09304,87.012758)"
       inkscape:transform-center-x="-1.5369356"
       inkscape:transform-center-y="-0.10121581">
      <path
         id="rect5329-3-5-8-5-5-2-7"
         style="fill:#ff7f2a;fill-opacity:1;stroke:#000000;stroke-width:0.118547;stroke-linecap:round;stroke-miterlimit:4;stroke-dasharray:none"
         d="m 49.177794,23.040304 c -1.185788,0.0015 -2.408083,0.01605 -3.751352,0.0311 -4.001612,0.04486 -8.780828,0.113803 -10.859327,0.2139 -1.269365,0.04142 -2.804266,-0.09644 -3.757166,0.681525 -1.322598,1.079786 -1.242712,3.342297 -1.242697,5.094559 1.5e-5,1.752269 -0.0799,4.014398 1.242697,5.094181 0.9529,0.777964 2.487801,0.640107 3.757166,0.681528 2.078499,0.100098 6.857715,0.169415 10.859327,0.21428 3.582048,0.04017 6.303908,0.07382 9.766743,-0.119466 2.466074,-0.155434 3.265218,0.09008 3.821866,-0.820334 0.914168,-1.545217 1.177257,-3.317646 1.177271,-5.050189 1.3e-5,-1.732542 -0.263103,-3.505345 -1.177271,-5.050566 -0.556648,-0.910411 -1.355792,-0.664519 -3.821866,-0.819952 -2.164273,-0.120809 -4.039082,-0.153227 -6.015391,-0.150566 z"
         sodipodi:nodetypes="sscszscscczccs" />
      <path
         id="rect9419-4-8-5-8-0-2-9"
         style="fill:#000000;fill-opacity:1;stroke-width:3.26929;stroke-linecap:round;filter:url(#filter18222-0-2-6-7-1-2-8)"
         d="m 179.92578,278.80469 c -8.3074,2.61456 0.001,-10e-4 -21.16406,6.57617 2.41461,6.36953 2.70871,14.02215 2.58789,20.50586 -0.12082,6.48371 -0.13018,14.58793 -2.58789,20.5039 21.1653,6.57727 12.85666,3.96357 21.16406,6.57813 7.92037,-3.87861 8.08005,-21.27699 8.08008,-27.08203 3e-5,-5.80504 -0.15921,-23.20318 -8.08008,-27.08203 z"
         transform="matrix(0.18609551,0,0,0.19417958,17.967956,-30.335608)"
         sodipodi:nodetypes="cczcczc" />
      <path
         id="rect9419-9-6-0-9-0-0-1-6"
         style="fill:#000000;fill-opacity:1;stroke-width:2.64998;stroke-linecap:round;filter:url(#filter18230-3-2-8-9-5-7-7)"
         d="m 84.568359,283.7793 c -4.873618,6.66755 -5.189458,17.65863 -5.189453,22.10742 5e-6,4.44879 0.315887,15.43799 5.189453,22.10547 l 18.214841,-2.34766 c -2.861983,-6.16343 -3.308769,-13.64671 -3.224099,-19.75781 0.0847,-6.1111 0.421501,-14.2142 3.224099,-19.75977 z"
         transform="matrix(0.18609551,0,0,0.19417958,17.967956,-30.335608)"
         sodipodi:nodetypes="czcczcc" />
      <path
         id="rect11566-1-6-8-3-0-3-1"
         style="fill:#000000;fill-opacity:1;stroke-width:0.865;stroke-linecap:round;filter:url(#filter18226-1-5-1-0-2-3-6)"
         d="m 10.450971,2.232998 c 10.925005,-0.04102 15.686682,-0.182423 17.55118,-0.240478 1.17779,-0.03667 1.055942,-0.0049 1.055942,-0.0049 0,0 -4.06942,1.500063 -4.952975,1.60637 -1.521174,0.183024 -2.059657,0.131203 -4.505694,0.150817 -2.329844,0.01868 -5.473135,0.03909 -6.95085,-0.08392 C 9.7616799,3.420568 9.2382709,2.704488 10.450971,2.233002 Z"
         sodipodi:nodetypes="cscssscc"
         transform="matrix(0.70335313,0,0,0.73390704,29.961909,22.229114)" />
      <path
         id="rect13708-8-42-4-7-6-8-2"
         style="fill-opacity:0.92268;stroke-width:0.865;stroke-linecap:round;filter:url(#filter19744-6-1-4-0-4-2)"
         d="m 27.698733,0.23010595 c 0.778394,0.03326 1.35936,1.75751405 1.35936,1.75751405 l -0.707949,0.253746 c 0,0 -0.906933,-2.02217705 -0.651411,-2.01126005 z"
         sodipodi:nodetypes="sccs"
         transform="matrix(0.70335313,0,0,0.73390704,29.961909,22.229114)" />
      <path
         id="rect15650-6-6-5-9-5-8-9"
         style="fill:#000000;fill-opacity:0.5;stroke-width:3.26929;stroke-linecap:round;filter:url(#filter18242-0-1-1-8-3-3-4)"
         d="m 191.18359,293.72852 -0.125,12.08789 h -0.002 v 0.0703 0.0703 h 0.002 l 0.125,12.08594 c 0,0 3.74641,-0.39654 3.87891,-2.23438 0.1854,-2.57154 0.20967,-9.43993 0.21094,-9.85156 2e-5,-0.006 -1e-5,-0.0671 0,-0.0703 -1e-5,-0.003 2e-5,-0.0641 0,-0.0703 -0.001,-0.411 -0.0255,-7.27989 -0.21094,-9.85157 -0.1325,-1.83783 -3.87891,-2.23632 -3.87891,-2.23632 z"
         transform="matrix(0.18609551,0,0,0.19417958,17.967956,-30.335608)" />
      <path
         style="fill:none;stroke:#000000;stroke-width:0.264583px;stroke-linecap:butt;stroke-linejoin:miter;stroke-opacity:1;filter:url(#filter18234-5-0-0-8-9-7-8)"
         d="m 31.289163,2.121441 c 0,0 7.578859,0.412884 10.642205,2.922704 1.11139,0.910576 1.0486,4.305966 1.0486,4.305966"
         id="path16032-9-3-5-4-7-9-0"
         sodipodi:nodetypes="csc"
         transform="matrix(0.70335313,0,0,0.73390704,29.961909,22.229114)" />
      <path
         id="rect11566-1-1-2-7-5-5-2-6"
         style="fill:#000000;fill-opacity:1;stroke-width:0.865;stroke-linecap:round;filter:url(#filter18226-1-8-4-3-1-9-9-7)"
         d="m 46.021383,84.029808 c 10.925005,-0.04102 15.686682,-0.182423 17.55118,-0.240478 1.17779,-0.03667 1.055942,-0.0049 1.055942,-0.0049 0,0 -4.06942,1.500063 -4.952975,1.60637 -1.521174,0.183024 -2.059657,0.131203 -4.505694,0.150817 -2.329844,0.01868 -5.473135,0.03909 -6.95085,-0.08392 -2.886894,-0.240319 -3.410303,-0.956399 -2.197603,-1.427885 z"
         sodipodi:nodetypes="cscssscc"
         transform="matrix(0.70335313,0,0,-0.73390704,4.9433483,95.924606)" />
      <path
         id="rect13708-8-4-7-7-3-5-4-9"
         style="fill-opacity:0.92268;stroke-width:0.865;stroke-linecap:round;filter:url(#filter19748-1-1-0-3-0-8)"
         d="m 27.698733,18.388361 c 0.778394,-0.0332 1.35936,-1.75751 1.35936,-1.75751 l -0.707949,-0.25374 c 0,0 -0.906933,2.02217 -0.651411,2.01125 z"
         sodipodi:nodetypes="sccs"
         transform="matrix(0.70335313,0,0,0.73390704,29.961909,22.229114)" />
      <path
         style="fill:none;stroke:#000000;stroke-width:0.264583px;stroke-linecap:butt;stroke-linejoin:miter;stroke-opacity:1;filter:url(#filter18234-5-9-3-2-6-6-2-7)"
         d="m 66.859575,83.918251 c 0,0 7.578859,0.412884 10.642202,2.922704 1.111396,0.910576 1.048603,4.305964 1.048603,4.305964"
         id="path16032-9-5-7-3-0-8-1-6"
         sodipodi:nodetypes="csc"
         transform="matrix(0.70335313,0,0,-0.73390704,4.9433483,95.924606)" />
    </g>
    <g
       id="g10990"
       inkscape:label="Green Car"
       transform="matrix(0.86701345,0,0,0.86701345,88.510344,83.946688)">
      <g
         id="g3439"
         transform="matrix(0.17960963,0,0,0.17960963,-17.34453,26.451478)">
        <path
           id="rect5329-3"
           style="fill:#008080;fill-opacity:1;stroke:#000000;stroke-width:0.660026;stroke-linecap:round;stroke-miterlimit:4;stroke-dasharray:none"
           d="M 111.64432,2.0438227 C 105.04229,2.0523434 98.237005,2.1331568 90.758177,2.2169563 68.478685,2.4667353 41.869774,2.8505737 30.297465,3.4078715 23.230107,3.6384901 14.684348,2.8709548 9.3789488,7.2023519 2.0152129,13.214203 2.4599894,25.811026 2.4600716,35.566974 c 8.62e-5,9.755983 -0.4448587,22.350682 6.9188772,28.362514 5.3053992,4.331416 13.8511582,3.563881 20.9185162,3.794495 11.572309,0.55731 38.18122,0.94324 60.460712,1.193033 19.943523,0.22363 35.097833,0.411016 54.377613,-0.665139 13.73019,-0.865401 18.17953,0.501523 21.27874,-4.567317 5.08975,-8.603198 6.55453,-18.471425 6.55461,-28.117586 7e-5,-9.646154 -1.46486,-19.516463 -6.55461,-28.1196843 C 163.31532,2.3784606 158.86598,3.7474951 145.13579,2.8821032 133.08592,2.2094824 122.64768,2.0289899 111.64432,2.0438106 Z"
           sodipodi:nodetypes="sscszscscczccs" />
        <path
           id="rect9419-4"
           style="fill:#000000;fill-opacity:1;stroke-width:3.26929;stroke-linecap:round;filter:url(#filter18222-0)"
           d="m 179.92578,278.80469 c -8.3074,2.61456 0.001,-10e-4 -21.16406,6.57617 2.41461,6.36953 2.70871,14.02215 2.58789,20.50586 -0.12082,6.48371 -0.13018,14.58793 -2.58789,20.5039 21.1653,6.57727 12.85666,3.96357 21.16406,6.57813 7.92037,-3.87861 8.08005,-21.27699 8.08008,-27.08203 3e-5,-5.80504 -0.15921,-23.20318 -8.08008,-27.08203 z"
           transform="matrix(1.036111,0,0,1.0811201,-64.646328,-295.13328)"
           sodipodi:nodetypes="cczcczc" />
        <path
           id="rect9419-9-6"
           style="fill:#000000;fill-opacity:1;stroke-width:2.64998;stroke-linecap:round;filter:url(#filter18230-3)"
           d="m 84.568359,283.7793 c -4.873618,6.66755 -5.189458,17.65863 -5.189453,22.10742 5e-6,4.44879 0.315887,15.43799 5.189453,22.10547 l 18.214841,-2.34766 c -2.861983,-6.16343 -3.308769,-13.64671 -3.224099,-19.75781 0.0847,-6.1111 0.421501,-14.2142 3.224099,-19.75977 z"
           transform="matrix(1.036111,0,0,1.0811201,-64.646328,-295.13328)"
           sodipodi:nodetypes="czcczcc" />
        <path
           id="rect11566-1"
           style="fill:#000000;fill-opacity:1;stroke-width:0.865;stroke-linecap:round;filter:url(#filter18226-1)"
           d="m 10.450971,2.232998 c 10.925005,-0.04102 15.686682,-0.182423 17.55118,-0.240478 1.17779,-0.03667 1.055942,-0.0049 1.055942,-0.0049 0,0 -4.06942,1.500063 -4.952975,1.60637 -1.521174,0.183024 -2.059657,0.131203 -4.505694,0.150817 -2.329844,0.01868 -5.473135,0.03909 -6.95085,-0.08392 C 9.7616799,3.420568 9.2382709,2.704488 10.450971,2.233002 Z"
           sodipodi:nodetypes="cscssscc"
           transform="matrix(3.9160101,0,0,4.086123,2.1315657,-2.4723443)" />
        <path
           id="rect13708-8"
           style="fill-opacity:0.92268;stroke-width:0.865;stroke-linecap:round;filter:url(#filter19744)"
           d="m 27.698733,0.23010595 c 0.778394,0.03326 1.35936,1.75751405 1.35936,1.75751405 l -0.707949,0.253746 c 0,0 -0.906933,-2.02217705 -0.651411,-2.01126005 z"
           sodipodi:nodetypes="sccs"
           transform="matrix(3.9160101,0,0,4.086123,2.1315657,-2.4723443)" />
        <path
           id="rect15650-6"
           style="fill:#000000;fill-opacity:0.5;stroke-width:3.26929;stroke-linecap:round;filter:url(#filter18242-0)"
           d="m 191.18359,293.72852 -0.125,12.08789 h -0.002 v 0.0703 0.0703 h 0.002 l 0.125,12.08594 c 0,0 3.74641,-0.39654 3.87891,-2.23438 0.1854,-2.57154 0.20967,-9.43993 0.21094,-9.85156 2e-5,-0.006 -1e-5,-0.0671 0,-0.0703 -1e-5,-0.003 2e-5,-0.0641 0,-0.0703 -0.001,-0.411 -0.0255,-7.27989 -0.21094,-9.85157 -0.1325,-1.83783 -3.87891,-2.23632 -3.87891,-2.23632 z"
           transform="matrix(1.036111,0,0,1.0811201,-64.646328,-295.13328)" />
        <path
           style="fill:none;stroke:#000000;stroke-width:0.264583px;stroke-linecap:butt;stroke-linejoin:miter;stroke-opacity:1;filter:url(#filter18234-5)"
           d="m 31.289163,2.121441 c 0,0 7.578859,0.412884 10.642205,2.922704 1.11139,0.910576 1.0486,4.305966 1.0486,4.305966"
           id="path16032-9"
           sodipodi:nodetypes="csc"
           transform="matrix(3.9160101,0,0,4.086123,2.1315657,-2.4723443)" />
        <path
           id="rect11566-1-1"
           style="fill:#000000;fill-opacity:1;stroke-width:0.865;stroke-linecap:round;filter:url(#filter18226-1-8)"
           d="m 46.021383,84.029808 c 10.925005,-0.04102 15.686682,-0.182423 17.55118,-0.240478 1.17779,-0.03667 1.055942,-0.0049 1.055942,-0.0049 0,0 -4.06942,1.500063 -4.952975,1.60637 -1.521174,0.183024 -2.059657,0.131203 -4.505694,0.150817 -2.329844,0.01868 -5.473135,0.03909 -6.95085,-0.08392 -2.886894,-0.240319 -3.410303,-0.956399 -2.197603,-1.427885 z"
           sodipodi:nodetypes="cscssscc"
           transform="matrix(3.9160101,0,0,-4.086123,-137.16253,407.8369)" />
        <path
           id="rect13708-8-4"
           style="fill-opacity:0.92268;stroke-width:0.865;stroke-linecap:round;filter:url(#filter19748)"
           d="m 27.698733,18.388361 c 0.778394,-0.0332 1.35936,-1.75751 1.35936,-1.75751 l -0.707949,-0.25374 c 0,0 -0.906933,2.02217 -0.651411,2.01125 z"
           sodipodi:nodetypes="sccs"
           transform="matrix(3.9160101,0,0,4.086123,2.1315657,-2.4723443)" />
        <path
           style="fill:none;stroke:#000000;stroke-width:0.264583px;stroke-linecap:butt;stroke-linejoin:miter;stroke-opacity:1;filter:url(#filter18234-5-9)"
           d="m 66.859575,83.918251 c 0,0 7.578859,0.412884 10.642202,2.922704 1.111396,0.910576 1.048603,4.305964 1.048603,4.305964"
           id="path16032-9-5"
           sodipodi:nodetypes="csc"
           transform="matrix(3.9160101,0,0,-4.086123,-137.16253,407.8369)" />
      </g>
    </g>
  </g>
  <g
     inkscape:groupmode="layer"
     id="layer1"
     inkscape:label="Labels"
     style="display:inline"
     transform="translate(0,-1.2660984e-5)">
    <text
       xml:space="preserve"
       style="font-size:6.9808px;line-height:1.25;font-family:sans-serif;fill:#ffffff;fill-opacity:1;stroke-width:0.872596"
       x="123.16145"
       y="111.68126"
       id="text39715"><tspan
         sodipodi:role="line"
         id="tspan39713"
         style="font-size:6.9808px;fill:#ffffff;fill-opacity:1;stroke-width:0.872596"
         x="123.16145"
         y="111.68126">E</tspan></text>
    <text
       xml:space="preserve"
       style="font-size:6.9808px;line-height:1.25;font-family:sans-serif;fill:#ffffff;fill-opacity:1;stroke-width:0.872596"
       x="80.40477"
       y="83.186584"
       id="text39719"><tspan
         sodipodi:role="line"
         id="tspan39717"
         style="font-size:6.9808px;fill:#ffffff;fill-opacity:1;stroke-width:0.872596"
         x="80.40477"
         y="83.186584">A</tspan></text>
    <text
       xml:space="preserve"
       style="font-size:6.9808px;line-height:1.25;font-family:sans-serif;fill:#ffffff;fill-opacity:1;stroke-width:0.872596"
       x="146.73036"
       y="60.31068"
       id="text39723"><tspan
         sodipodi:role="line"
         id="tspan39721"
         style="font-size:6.9808px;fill:#ffffff;fill-opacity:1;stroke-width:0.872596"
         x="146.73036"
         y="60.31068">B</tspan></text>
    <text
       xml:space="preserve"
       style="font-size:6.9808px;line-height:1.25;font-family:sans-serif;fill:#ffffff;fill-opacity:1;stroke-width:0.872596"
       x="188.89037"
       y="147.24887"
       id="text39727"><tspan
         sodipodi:role="line"
         id="tspan39725"
         style="font-size:6.9808px;fill:#ffffff;fill-opacity:1;stroke-width:0.872596"
         x="188.89037"
         y="147.24887">D</tspan></text>
    <text
       xml:space="preserve"
       style="font-size:6.9808px;line-height:1.25;font-family:sans-serif;fill:#ffffff;fill-opacity:1;stroke-width:0.872596"
       x="190.28804"
       y="114.9498"
       id="text39731"
       inkscape:transform-center-x="-0.12340883"
       inkscape:transform-center-y="0.10165031"><tspan
         sodipodi:role="line"
         id="tspan39729"
         style="font-size:6.9808px;fill:#ffffff;fill-opacity:1;stroke-width:0.872596"
         x="190.28804"
         y="114.9498">C</tspan></text>
  </g>
  <metadata
     id="metadata481">
    <rdf:RDF>
      <cc:Work
         rdf:about="">
        <cc:license
           rdf:resource="https://www.eclipse.org/legal/epl-2.0/" />
        <dc:creator>
          <cc:Agent>
            <dc:title>René Paris</dc:title>
          </cc:Agent>
        </dc:creator>
        <dc:rights>
          <cc:Agent>
            <dc:title>2023 - Bayerische Motoren Werke Aktiengesellschaft (BMW AG)</dc:title>
          </cc:Agent>
        </dc:rights>
        <dc:title>Sensor2D</dc:title>
      </cc:Work>
    </rdf:RDF>
  </metadata>
</svg>
