2011-12-03T07:15:30.454994Z, TP-0001
2011-12-03T07:35:15.454894Z, TP-0002
2011-12-03T07:35:15.455168Z, TP-0005
2011-12-03T07:35:15.455172Z, TP-0006
2011-12-03T07:35:15.455429Z, TP-0007
2011-12-03T07:35:15.455434Z, TP-0008
2011-12-03T07:35:15.455588Z, TP-0009
2011-12-03T07:35:15.455591Z, TP-0011
2011-12-03T07:35:15.455797Z, TP-0010
2011-12-03T07:35:15.455805Z, TP-0012
2011-12-03T07:35:15.456519Z, TP-0003
2011-12-03T07:35:15.456716Z, TP-0004
