<?xml version="1.0" encoding="UTF-8" standalone="no"?>
<!-- Created with Inkscape (http://www.inkscape.org/) -->

<svg
   xmlns:dc="http://purl.org/dc/elements/1.1/"
   xmlns:cc="http://creativecommons.org/ns#"
   xmlns:rdf="http://www.w3.org/1999/02/22-rdf-syntax-ns#"
   xmlns:svg="http://www.w3.org/2000/svg"
   xmlns="http://www.w3.org/2000/svg"
   xmlns:sodipodi="http://sodipodi.sourceforge.net/DTD/sodipodi-0.dtd"
   xmlns:inkscape="http://www.inkscape.org/namespaces/inkscape"
   width="9"
   height="9"
   id="svg4791"
   version="1.1"
   inkscape:version="0.91 r13725"
   sodipodi:docname="icon_sdysfunctionalassociation.svg">
  <defs
     id="defs4793" />
  <sodipodi:namedview
     id="base"
     pagecolor="#ffffff"
     bordercolor="#666666"
     borderopacity="1.0"
     inkscape:pageopacity="0.0"
     inkscape:pageshadow="2"
     inkscape:zoom="63.356767"
     inkscape:cx="0.89300209"
     inkscape:cy="6.783176"
     inkscape:document-units="px"
     inkscape:current-layer="layer1"
     showgrid="false"
     fit-margin-top="0"
     fit-margin-left="0"
     fit-margin-right="0"
     fit-margin-bottom="0"
     inkscape:window-width="1920"
     inkscape:window-height="1173"
     inkscape:window-x="-9"
     inkscape:window-y="-9"
     inkscape:window-maximized="1">
    <inkscape:grid
       type="xygrid"
       id="grid4141" />
  </sodipodi:namedview>
  <metadata
     id="metadata4796">
    <rdf:RDF>
      <cc:Work
         rdf:about="">
        <dc:format>image/svg+xml</dc:format>
        <dc:type
           rdf:resource="http://purl.org/dc/dcmitype/StillImage" />
        <dc:title />
      </cc:Work>
    </rdf:RDF>
  </metadata>
  <g
     inkscape:label="Calque 1"
     inkscape:groupmode="layer"
     id="layer1"
     transform="translate(-429.61902,-531.54768)">
    <path
       style="fill:#ffb523;fill-opacity:0;fill-rule:evenodd;stroke:#ffa600;stroke-width:0.95499998;stroke-linecap:butt;stroke-linejoin:miter;stroke-miterlimit:4;stroke-dasharray:none;stroke-opacity:1"
       d="m 433.04849,537.21389 2.35869,-2.39223"
       id="path4150"
       inkscape:connector-curvature="0"
       sodipodi:nodetypes="cc"
       inkscape:export-xdpi="201.99809"
       inkscape:export-ydpi="201.99809" />
    <path
       style="fill:#ff6a00;fill-opacity:1;stroke:#000000;stroke-width:0.347;stroke-miterlimit:0;stroke-dasharray:none;stroke-opacity:1"
       d="m 435.70895,535.17627 c -0.50332,-0.20326 -0.86612,-0.71456 -0.86612,-1.22059 0,-0.61131 0.36043,-1.1121 0.93492,-1.299 0.26826,-0.0873 0.51083,-0.0873 0.7791,0 0.56999,0.18536 0.93491,0.69019 0.93491,1.29319 0,0.21532 -0.0839,0.503 -0.19694,0.67465 -0.11088,0.16854 -0.33717,0.37655 -0.52651,0.48408 -0.23384,0.13294 -0.80736,0.1695 -1.05936,0.0677 z"
       id="path4148"
       inkscape:connector-curvature="0"
       inkscape:export-xdpi="201.99809"
       inkscape:export-ydpi="201.99809"
       sodipodi:nodetypes="csccscccc" />
    <rect
       style="fill:#f2f2f2;fill-opacity:1;stroke:#002200;stroke-width:0.329;stroke-miterlimit:4;stroke-dasharray:none;stroke-opacity:1"
       id="rect4139"
       width="2.5170515"
       height="2.5328345"
       x="430.90958"
       y="536.85052"
       inkscape:export-xdpi="201.99809"
       inkscape:export-ydpi="201.99809" />
    <path
       style="fill:#ff8c00;fill-opacity:1;fill-rule:evenodd;stroke:#000000;stroke-width:0.08721104;stroke-linecap:butt;stroke-linejoin:miter;stroke-miterlimit:4;stroke-dasharray:none;stroke-opacity:1"
       d="m 431.00094,539.33074 2.34951,-2.41271 -0.0273,2.40066 -2.35604,0.0519 z"
       id="path4152"
       inkscape:connector-curvature="0"
       inkscape:export-xdpi="201"
       inkscape:export-ydpi="201"
       sodipodi:nodetypes="ccccc" />
  </g>
  <g
     inkscape:label="LayerLabel"
     inkscape:groupmode="layer"
     id="layer2"
     style="display:none"
     transform="translate(0,-3.0625)">
    <rect
       sytle="fill:none;stroke:none"
       id="PapyrusLabel"
       width="30"
       height="10"
       x="0"
       y="0" />
  </g>
</svg>
