<?xml version="1.0" encoding="UTF-8" standalone="no"?>
<!-- Created with Inkscape (http://www.inkscape.org/) -->

<svg
   xmlns:dc="http://purl.org/dc/elements/1.1/"
   xmlns:cc="http://creativecommons.org/ns#"
   xmlns:rdf="http://www.w3.org/1999/02/22-rdf-syntax-ns#"
   xmlns:svg="http://www.w3.org/2000/svg"
   xmlns="http://www.w3.org/2000/svg"
   xmlns:sodipodi="http://sodipodi.sourceforge.net/DTD/sodipodi-0.dtd"
   xmlns:inkscape="http://www.inkscape.org/namespaces/inkscape"
   width="12.59375"
   height="12.0625"
   id="svg4791"
   version="1.1"
   inkscape:version="0.48.4 r9939"
   sodipodi:docname="SpecificFailureModeShape.svg">
  <defs
     id="defs4793" />
  <sodipodi:namedview
     id="base"
     pagecolor="#ffffff"
     bordercolor="#666666"
     borderopacity="1.0"
     inkscape:pageopacity="0.0"
     inkscape:pageshadow="2"
     inkscape:zoom="63.356767"
     inkscape:cx="4.6539521"
     inkscape:cy="5.3138067"
     inkscape:document-units="px"
     inkscape:current-layer="layer1"
     showgrid="false"
     fit-margin-top="0"
     fit-margin-left="0"
     fit-margin-right="0"
     fit-margin-bottom="0"
     inkscape:window-width="1920"
     inkscape:window-height="1018"
     inkscape:window-x="-8"
     inkscape:window-y="1042"
     inkscape:window-maximized="1" />
  <metadata
     id="metadata4796">
    <rdf:RDF>
      <cc:Work
         rdf:about="">
        <dc:format>image/svg+xml</dc:format>
        <dc:type
           rdf:resource="http://purl.org/dc/dcmitype/StillImage" />
        <dc:title />
      </cc:Work>
    </rdf:RDF>
  </metadata>
  <g
     inkscape:label="Calque 1"
     inkscape:groupmode="layer"
     id="layer1"
     transform="translate(-429.61902,-528.48518)">
    <path
       style="fill:none;stroke:#ff0000;stroke-width:0.1;stroke-linecap:butt;stroke-linejoin:miter;stroke-miterlimit:4;stroke-opacity:1;stroke-dasharray:none"
       d="M 0.36302357,5.7490465 0.75761441,3.8234432 2.1307905,1.9609745 4.1668793,0.71406742 6.029348,0.33526021 7.797115,0.52466382 9.7858529,1.37698 11.174813,2.7659398 12.027129,4.439005 12.184965,6.7276318 11.664105,8.7163697 10.275145,10.3263 8.2074895,11.462722 5.729459,11.778395 3.188294,10.941862 1.7519833,9.7423059 0.66291261,8.0850243 z"
       id="PapyrusPath"
       inkscape:connector-curvature="0"
       transform="translate(429.61902,528.48518)" />
    <path
       sodipodi:type="arc"
       style="fill:#ff7400;fill-opacity:1;stroke:#1a1a1a;stroke-width:0.3;stroke-miterlimit:4;stroke-opacity:1;stroke-dasharray:none"
       id="path3003"
       sodipodi:cx="16.920055"
       sodipodi:cy="15.669309"
       sodipodi:rx="5.9346461"
       sodipodi:ry="5.6821079"
       d="m 22.854702,15.669309 c 0,3.138141 -2.657032,5.682108 -5.934647,5.682108 -3.277614,0 -5.934646,-2.543967 -5.934646,-5.682108 0,-3.138142 2.657032,-5.6821083 5.934646,-5.6821083 3.277615,0 5.934647,2.5439663 5.934647,5.6821083 z"
       transform="translate(418.99402,518.86018)" />
    <text
       xml:space="preserve"
       style="font-size:10.11725903px;font-style:normal;font-weight:normal;line-height:125%;letter-spacing:0px;word-spacing:0px;fill:#000000;fill-opacity:1;stroke:none;font-family:Sans"
       x="412.89883"
       y="563.02924"
       id="text3773"
       sodipodi:linespacing="125%"
       transform="scale(1.0473795,0.95476377)"><tspan
         sodipodi:role="line"
         id="tspan3775"
         x="412.89883"
         y="563.02924">A</tspan></text>
  </g>
</svg>
