WARNING: Used uncontrollable event iteration limit (at most 5 attempts) is less than the limit derived from the bounded response property of the controller properties annotation (5 + 1 attempts are needed).
WARNING: Used controllable event iteration limit (at most 2 attempts) is less than the limit derived from the bounded response property of the controller properties annotation (2 + 1 attempts are needed).
WARNING: Using a lower limit than the one derived from the bound of the controller properties annotation in the specification may result in undesired or unexpected behavior of the controlled system.
WARNING: I/O table file "plcgen/generation/option_max_iter_5_2.csv" not found. The PLC code will not perform any I/O with the environment.
