Loading CIF specification "controllercheck/common/anno_true_to_false.cif".
Checking for finite response:
    Converting CIF specification to an MDD representation:
        Analyzing automaton "p":
            Initializing the automaton data for event "c".
            Initializing the automaton data for event "a".
            Initializing the automaton data for event "b".
            Processing edges from location "loc1" of automaton "p".
            Processing edges from location "loc2" of automaton "p".
            Updating global guards for event "c".
            Updating global guards for event "a".
            Updating global guards for event "b".

    Iteration 1.
        The following events have been encountered in a controllable-event loop of automaton p:
            (c), which is not controllable unconnectable.

    Iteration 2.
        The following events have been encountered in a controllable-event loop of automaton p:
            (c), which is not controllable unconnectable.

CONCLUSION:
    [UNKNOWN] Bounded response checking was disabled, bounded response property is unknown.
    [UNKNOWN] Non-blocking under control checking was disabled, non-blocking under control property is unknown.

    [ERROR] The specification may NOT have finite response:

        At least one controllable-event loop was found.
        The following events might still occur in a controllable-event loop:
            - c

    [UNKNOWN] Confluence checking was disabled, confluence property is unknown.

The model with the check results has been written to "controllercheck/common/anno_true_to_false.xxFx.out.cif.real".
