Reading CIF file "datasynth/no_marked_req_inv.cif".

Preprocessing CIF specification (includes checking that the specification is supported).

Converting CIF specification to internal format (BDDs):
    CIF variables and location pointers:
        Nr     Kind               Type       Name  Group  BDD vars  CIF values  BDD values  Values used
        -----  -----------------  ---------  ----  -----  --------  ----------  ----------  -----------
        1      discrete variable  int[0..5]  p.x   0      3 * 2     6 * 2       8 * 2       75%
        -----  -----------------  ---------  ----  -----  --------  ----------  ----------  -----------
        Total                                      1      6         12          16          75%

    Skipping variable ordering: only one variable present.

Starting data-based synthesis.

Synthesis input:
    Invariant (components state plant inv):      true
    Invariant (locations state plant invariant): true
    Invariant (system state plant invariant):    true

    Invariant (component state req invariant):   p.x = 1
    Invariant (components state req invariant):  p.x = 1
    Invariant (locations state req invariant):   true
    Invariant (system state req invariant):      p.x = 1

    Initial   (discrete variable 0):             true
    Initial   (discrete variables):              true
    Initial   (components init predicate):       true
    Initial   (aut/locs init predicate):         true
    Initial   (auts/locs init predicate):        true
    Initial   (uncontrolled system):             true
    Initial   (system, combined init/plant inv): true
    Initial   (system, combined init/state inv): p.x = 1

    Marked    (components marker predicate):     true
    Marked    (aut/locs marker predicate):       p.x = 3
    Marked    (auts/locs marker predicate):      p.x = 3
    Marked    (uncontrolled system):             p.x = 3
    Marked    (system, combined mark/plant inv): p.x = 3
    Marked    (system, combined mark/state inv): false

    State/event exclusion plants:
        None

    State/event exclusion requirements:
        None

    Uncontrolled system:
        State: (controlled-behavior: ?)

Checking input for potential problems.

Restricting edge guards to prevent runtime errors:
    No guards changed.

Restricting uncontrolled system behavior using state/event exclusion plant invariants:
    No guards changed.

Initializing edges for being applied.

Restricting uncontrolled system behavior using state plant invariants:
    No restrictions needed.

Initializing controlled behavior:
    Controlled-behavior predicate: true.
    Controlled-initialization predicate: true.

Restricting behavior using state requirements:
    Controlled behavior: true -> p.x = 1 [state requirements: p.x = 1].

Extending controlled-behavior predicate using variable ranges:
    Controlled behavior not changed.

Restricting behavior using state/event exclusion requirements:
    Guards and controlled behavior not changed.

Restricting behavior using implicit runtime error requirements:
    Controlled behavior not changed.

Re-initializing edges for being applied.

Checking pre-synthesis for events that are never enabled.

Synthesis round 1:
    Computing backward controlled-behavior predicate:
        Saturation matrix:
            No edges.

        Backward controlled-behavior: p.x = 3 [marker predicate]
        Backward controlled-behavior: p.x = 3 -> false [restricted to current/previous controlled-behavior predicate: p.x = 1]

        Backward controlled-behavior: false [fixed point].

        Controlled behavior: p.x = 1 -> false.

    Finished: all states are bad.

Computing final controlled system guards:
    No guards changed.

Cleaning up cached predicate of edges that were used when applying edges.

Final synthesis result:
    State: (controlled-behavior: false)

Computing initialization predicate of the controlled system.

Controlled system: exactly 0 states.

Determining initialization predicate for output model:
    Initial (synthesis result):            false
    Initial (uncontrolled system):         true
    Initial (controlled system):           false
    Initial (removed by supervisor):       true
    Initial (added by supervisor):         false

    Simplifying of controlled system initialization predicate under the assumption of the uncontrolled system initialization predicates:
        Predicate not changed.

    Initial (output model):                false

