WARNING: File "cif2cif/elim_state_invs_init_value.cif": Semantic warning at line 80, column 13: Automaton "init_aut.a1a" has no initial location.
WARNING: File "cif2cif/elim_state_invs_init_value.cif": Semantic warning at line 84, column 13: Automaton "init_aut.a1b" has no initial location.
WARNING: File "cif2cif/elim_state_invs_init_value.cif": Semantic warning at line 97, column 13: Automaton "init_aut.a3" has no initial location.
WARNING: File "cif2cif/elim_state_invs_init_value.cif": Semantic warning at line 98, column 14: Location "loc1" is not reachable from any of the initial locations of automaton "init_aut.a3".
WARNING: File "cif2cif/elim_state_invs_init_value.cif": Semantic warning at line 100, column 14: Location "loc2" is not reachable from any of the initial locations of automaton "init_aut.a3".
WARNING: File "cif2cif/elim_state_invs_init_value.cif": Semantic warning at line 102, column 14: Location "loc3" is not reachable from any of the initial locations of automaton "init_aut.a3".
