Loading CIF specification "controllercheck/bounded_response/bounded_tree.cif".
Checking for bounded response:
    Converting CIF specification to a BDD representation:
        CIF variables and location pointers:
            Nr     Kind              Type  Name  Group  BDD vars  CIF values  BDD values  Values used
            -----  ----------------  ----  ----  -----  --------  ----------  ----------  -----------
            1      location pointer  n/a   p1    0      3 * 2     5 * 2       8 * 2       ~63%
            2      location pointer  n/a   p2    1      3 * 2     6 * 2       8 * 2       75%
            -----  ----------------  ----  ----  -----  --------  ----------  ----------  -----------
            Total                                2      12        22          32          ~69%

        Applying variable ordering:
            Applying 4 orderers, sequentially:
                Applying sorted variable order:
                    Effect: both

                Applying DCSH algorithm:
                    Metric: wes
                    Relations: legacy
                    Effect: var-order
                    Number of hyper-edges: 9

                    Applying Weighted Cuthill-McKee algorithm:
                        Node finder: george-liu
                        Relations: legacy
                        Effect: var-order
                        Number of graph edges: 0

                        Skipping algorithm: no graph edges.

                    Found new best variable order.

                    Applying Sloan algorithm:
                        Relations: legacy
                        Effect: var-order
                        Number of graph edges: 0

                        Skipping algorithm: no graph edges.

                    Applying 2 orderers, sequentially:
                        Applying Weighted Cuthill-McKee algorithm:
                            Node finder: george-liu
                            Relations: legacy
                            Effect: var-order
                            Number of graph edges: 0

                            Skipping algorithm: no graph edges.

                        Reversing the variable order:
                            Relations: legacy
                            Effect: var-order
                            Number of hyper-edges: 9

                            Total span:   0 (total)   0.00 (avg/edge) / WES:   0.277778 (total)   0.030864 (avg/edge) [before]
                            Total span:   0 (total)   0.00 (avg/edge) / WES:   0.277778 (total)   0.030864 (avg/edge) [reversed]

                    Found new best variable order.

                    Applying 2 orderers, sequentially:
                        Applying Sloan algorithm:
                            Relations: legacy
                            Effect: var-order
                            Number of graph edges: 0

                            Skipping algorithm: no graph edges.

                        Reversing the variable order:
                            Relations: legacy
                            Effect: var-order
                            Number of hyper-edges: 9

                            Total span:   0 (total)   0.00 (avg/edge) / WES:   0.277778 (total)   0.030864 (avg/edge) [before]
                            Total span:   0 (total)   0.00 (avg/edge) / WES:   0.277778 (total)   0.030864 (avg/edge) [reversed]

                Applying FORCE algorithm:
                    Metric: total-span
                    Relations: linearized
                    Effect: var-order
                    Number of hyper-edges: 9
                    Maximum number of iterations: 10

                    Total span:   0 (total)   0.00 (avg/edge) / WES:   0.222222 (total)   0.024691 (avg/edge) [before]
                    Total span:   0 (total)   0.00 (avg/edge) / WES:   0.222222 (total)   0.024691 (avg/edge) [iteration 1]
                    Total span:   0 (total)   0.00 (avg/edge) / WES:   0.222222 (total)   0.024691 (avg/edge) [after]

                Applying sliding window algorithm:
                    Size: 4
                    Metric: total-span
                    Relations: linearized
                    Effect: var-order
                    Number of hyper-edges: 9
                    Window length: 2

                    Total span:   0 (total)   0.00 (avg/edge) / WES:   0.222222 (total)   0.024691 (avg/edge) [before]
                    Total span:   0 (total)   0.00 (avg/edge) / WES:   0.222222 (total)   0.024691 (avg/edge) [after]

        Variable order changed.

        CIF variables and location pointers:
            Nr     Kind              Type  Name  Group  BDD vars  CIF values  BDD values  Values used
            -----  ----------------  ----  ----  -----  --------  ----------  ----------  -----------
            1      location pointer  n/a   p2    0      3 * 2     6 * 2       8 * 2       75%
            2      location pointer  n/a   p1    1      3 * 2     5 * 2       8 * 2       ~63%
            -----  ----------------  ----  ----  -----  --------  ----------  ----------  -----------
            Total                                2      12        22          32          ~69%

        Restricting system behavior using state/event exclusion plant invariants:
            No guards changed.

    Computing states we can be in at the start of uncontrollable and controllable event loops:
        Round 1:
            Pre input states: p2.loc1 and p1.loc1
            Pre uncontrollables states: false
            Pre controllables states: false

            Applying event loop for input variable events:
                No input variable events.

            Pre uncontrollables states: false -> p2.loc1 and p1.loc1

            Applying event loop for uncontrollable events:
                Iteration 1 (states before iteration: p2.loc1 and p1.loc1):
                    Event u_a: p2.loc1 and p1.loc1 -> p2.loc1 and p1.loc2
                    Event u_b: p2.loc1 and p1.loc2 -> p2.loc1 and p1.loc3
                    All iterations end states: p2.loc1 and p1.loc3

                Iteration 2 (states before iteration: p2.loc1 and p1.loc3):
                    0 edges enabled. No state changes.
                    All iterations end states: p2.loc1 and p1.loc3

            Pre controllables states: false -> p2.loc1 and p1.loc3

            Applying event loop for controllable events:
                Iteration 1 (states before iteration: p2.loc1 and p1.loc3):
                    Event c_a: p2.loc1 and p1.loc3 -> p2.loc2 and p1.loc3
                    Event c_b: p2.loc2 and p1.loc3 -> p2.loc3 and p1.loc3
                    Event c_c: p2.loc3 and p1.loc3 -> p2.loc4 and p1.loc3
                    All iterations end states: p2.loc4 and p1.loc3

                Iteration 2 (states before iteration: p2.loc4 and p1.loc3):
                    0 edges enabled. No state changes.
                    All iterations end states: p2.loc4 and p1.loc3

            Pre input states: p2.loc1 and p1.loc1 -> p2.loc1 and p1.loc1 or p2.loc4 and p1.loc3

        Round 2:
            Pre input states: p2.loc1 and p1.loc1 or p2.loc4 and p1.loc3
            Pre uncontrollables states: p2.loc1 and p1.loc1
            Pre controllables states: p2.loc1 and p1.loc3

            Applying event loop for input variable events:
                No input variable events.

            Pre uncontrollables states: p2.loc1 and p1.loc1 -> p2.loc1 and p1.loc1 or p2.loc4 and p1.loc3

            Applying event loop for uncontrollable events:
                Iteration 1 (states before iteration: p2.loc1 and p1.loc1 or p2.loc4 and p1.loc3):
                    Event u_a: p2.loc1 and p1.loc1 or p2.loc4 and p1.loc3 -> p2.loc1 and p1.loc2 or p2.loc4 and p1.loc3
                    Event u_b: p2.loc1 and p1.loc2 or p2.loc4 and p1.loc3 -> p2.loc1 and p1.loc3 or p2.loc4 and p1.loc3
                    All iterations end states: p2.loc1 and p1.loc3 or p2.loc4 and p1.loc3

                Iteration 2 (states before iteration: p2.loc1 and p1.loc3 or p2.loc4 and p1.loc3):
                    0 edges enabled. No state changes.
                    All iterations end states: p2.loc1 and p1.loc3 or p2.loc4 and p1.loc3

            Pre controllables states: p2.loc1 and p1.loc3 -> p2.loc1 and p1.loc3 or p2.loc4 and p1.loc3

            Applying event loop for controllable events:
                Iteration 1 (states before iteration: p2.loc1 and p1.loc3 or p2.loc4 and p1.loc3):
                    Event c_a: p2.loc1 and p1.loc3 or p2.loc4 and p1.loc3 -> (p2.loc2 or p2.loc4) and p1.loc3
                    Event c_b: (p2.loc2 or p2.loc4) and p1.loc3 -> (p2.loc3 or p2.loc4) and p1.loc3
                    Event c_c: (p2.loc3 or p2.loc4) and p1.loc3 -> p2.loc4 and p1.loc3
                    All iterations end states: p2.loc4 and p1.loc3

                Iteration 2 (states before iteration: p2.loc4 and p1.loc3):
                    0 edges enabled. No state changes.
                    All iterations end states: p2.loc4 and p1.loc3

        Round 3:
            Pre input states: p2.loc1 and p1.loc1 or p2.loc4 and p1.loc3
            Pre uncontrollables states: p2.loc1 and p1.loc1 or p2.loc4 and p1.loc3
            Pre controllables states: p2.loc1 and p1.loc3 or p2.loc4 and p1.loc3

            Applying event loop for input variable events:
                No input variable events.

            Applying event loop for uncontrollable events:
                Iteration 1 (states before iteration: p2.loc1 and p1.loc1 or p2.loc4 and p1.loc3):
                    Event u_a: p2.loc1 and p1.loc1 or p2.loc4 and p1.loc3 -> p2.loc1 and p1.loc2 or p2.loc4 and p1.loc3
                    Event u_b: p2.loc1 and p1.loc2 or p2.loc4 and p1.loc3 -> p2.loc1 and p1.loc3 or p2.loc4 and p1.loc3
                    All iterations end states: p2.loc1 and p1.loc3 or p2.loc4 and p1.loc3

                Iteration 2 (states before iteration: p2.loc1 and p1.loc3 or p2.loc4 and p1.loc3):
                    0 edges enabled. No state changes.
                    All iterations end states: p2.loc1 and p1.loc3 or p2.loc4 and p1.loc3

            Applying event loop for controllable events:
                Iteration 1 (states before iteration: p2.loc1 and p1.loc3 or p2.loc4 and p1.loc3):
                    Event c_a: p2.loc1 and p1.loc3 or p2.loc4 and p1.loc3 -> (p2.loc2 or p2.loc4) and p1.loc3
                    Event c_b: (p2.loc2 or p2.loc4) and p1.loc3 -> (p2.loc3 or p2.loc4) and p1.loc3
                    Event c_c: (p2.loc3 or p2.loc4) and p1.loc3 -> p2.loc4 and p1.loc3
                    All iterations end states: p2.loc4 and p1.loc3

                Iteration 2 (states before iteration: p2.loc4 and p1.loc3):
                    0 edges enabled. No state changes.
                    All iterations end states: p2.loc4 and p1.loc3

    Computing bound for uncontrollable events:
        Iteration 1 (states before iteration: p2.loc1 and p1.loc1 or p2.loc4 and p1.loc3):
            Event u_a: p2.loc1 and p1.loc1 or p2.loc4 and p1.loc3 -> p2.loc1 and p1.loc2 or p2.loc4 and p1.loc3
            Event u_b: p2.loc1 and p1.loc2 or p2.loc4 and p1.loc3 -> p2.loc1 and p1.loc3 or p2.loc4 and p1.loc3

        Iteration 2 (states before iteration: p2.loc1 and p1.loc3 or p2.loc4 and p1.loc3):
            0 edges enabled. No state changes.

        Bound: 1.

    Computing bound for controllable events:
        Iteration 1 (states before iteration: p2.loc1 and p1.loc3 or p2.loc4 and p1.loc3):
            Event c_a: p2.loc1 and p1.loc3 or p2.loc4 and p1.loc3 -> (p2.loc2 or p2.loc4) and p1.loc3
            Event c_b: (p2.loc2 or p2.loc4) and p1.loc3 -> (p2.loc3 or p2.loc4) and p1.loc3
            Event c_c: (p2.loc3 or p2.loc4) and p1.loc3 -> p2.loc4 and p1.loc3

        Iteration 2 (states before iteration: p2.loc4 and p1.loc3):
            0 edges enabled. No state changes.

        Bound: 1.

    Bounded response check completed.

CONCLUSION:
    [OK] The specification has bounded response:

        - At most 1 iteration is needed for the event loop for uncontrollable events.
        - At most 1 iteration is needed for the event loop for controllable events.

    [UNKNOWN] Non-blocking under control checking was disabled, non-blocking under control property is unknown.
    [UNKNOWN] Finite response checking was disabled, finite response property is unknown.
    [UNKNOWN] Confluence checking was disabled, confluence property is unknown.

The model with the check results has been written to "controllercheck/bounded_response/bounded_tree.Bxxx.out.cif.real".
