Reading CIF file "datasynth/asgn_inc_mod.cif".

Preprocessing CIF specification (includes checking that the specification is supported).

Converting CIF specification to internal format (BDDs):
    CIF variables and location pointers:
        Nr     Kind               Type       Name  Group  BDD vars  CIF values  BDD values  Values used
        -----  -----------------  ---------  ----  -----  --------  ----------  ----------  -----------
        1      discrete variable  int[0..4]  p.x   0      3 * 2     5 * 2       8 * 2       ~63%
        -----  -----------------  ---------  ----  -----  --------  ----------  ----------  -----------
        Total                                      1      6         10          16          ~63%

    Skipping variable ordering: only one variable present.

Starting data-based synthesis.

Synthesis input:
    Invariant (components state plant inv):      true
    Invariant (locations state plant invariant): true
    Invariant (system state plant invariant):    true

    Invariant (component state req invariant):   p.x = 0 or (p.x = 2 or p.x = 4)
    Invariant (components state req invariant):  p.x = 0 or (p.x = 2 or p.x = 4)
    Invariant (locations state req invariant):   true
    Invariant (system state req invariant):      p.x = 0 or (p.x = 2 or p.x = 4)

    Initial   (discrete variable 0):             p.x = 2
    Initial   (discrete variables):              p.x = 2
    Initial   (components init predicate):       true
    Initial   (aut/locs init predicate):         true
    Initial   (auts/locs init predicate):        true
    Initial   (uncontrolled system):             p.x = 2
    Initial   (system, combined init/plant inv): p.x = 2
    Initial   (system, combined init/state inv): p.x = 2

    Marked    (components marker predicate):     true
    Marked    (aut/locs marker predicate):       true
    Marked    (auts/locs marker predicate):      true
    Marked    (uncontrolled system):             true
    Marked    (system, combined mark/plant inv): true
    Marked    (system, combined mark/state inv): p.x = 0 or (p.x = 2 or p.x = 4)

    State/event exclusion plants:
        None

    State/event exclusion requirements:
        None

    Uncontrolled system:
        State: (controlled-behavior: ?)
            Edge: (event: next) (guard: true) (assignments: p.x := (p.x + 1) mod count)

Checking input for potential problems.

Restricting edge guards to prevent runtime errors:
    No guards changed.

Restricting uncontrolled system behavior using state/event exclusion plant invariants:
    No guards changed.

Initializing edges for being applied.

Restricting uncontrolled system behavior using state plant invariants:
    No restrictions needed.

Initializing controlled behavior:
    Controlled-behavior predicate: true.
    Controlled-initialization predicate: p.x = 2.

Restricting behavior using state requirements:
    Controlled behavior: true -> p.x = 0 or (p.x = 2 or p.x = 4) [state requirements: p.x = 0 or (p.x = 2 or p.x = 4)].

Extending controlled-behavior predicate using variable ranges:
    Controlled behavior: p.x = 0 or (p.x = 2 or p.x = 4) -> p.x = 0 or (p.x = 2 or p.x = 4) [range: true, variable: discrete variable "p.x" of type "int[0..4]" (group: 0, domain: 0+1, BDD variables: 3, CIF/BDD values: 5/8)].

    Extended controlled-behavior predicate using variable ranges: p.x = 0 or (p.x = 2 or p.x = 4).

Restricting behavior using state/event exclusion requirements:
    Guards and controlled behavior not changed.

Restricting behavior using implicit runtime error requirements:
    Controlled behavior not changed.

Re-initializing edges for being applied.

Checking pre-synthesis for events that are never enabled.

Synthesis round 1:
    Computing backward controlled-behavior predicate:
        Saturation matrix:
                   /------ 1 p.x#0
                   |/----- 2 p.x#0+
                   ||/---- 3 p.x#1
                   |||/--- 4 p.x#1+
                   ||||/-- 5 p.x#2
                   |||||/- 6 p.x#2+
            1 next rwrwrw

        Backward controlled-behavior: true [marker predicate]
        Backward controlled-behavior: true -> p.x = 0 or (p.x = 2 or p.x = 4) [restricted to current/previous controlled-behavior predicate: p.x = 0 or (p.x = 2 or p.x = 4)]

        Backward controlled-behavior: p.x = 0 or (p.x = 2 or p.x = 4) [fixed point].

        Controlled behavior not changed.

    Computing backward uncontrolled bad-state predicate:
        Saturation matrix:
            No edges.

        Backward uncontrolled bad-state: p.x = 1 or p.x = 3 [current/previous controlled behavior predicate]

        Controlled behavior not changed.

    Computing forward controlled-behavior predicate:
        Saturation matrix:
                   /------ 1 p.x#0
                   |/----- 2 p.x#0+
                   ||/---- 3 p.x#1
                   |||/--- 4 p.x#1+
                   ||||/-- 5 p.x#2
                   |||||/- 6 p.x#2+
            1 next rwrwrw

        Forward controlled-behavior: p.x = 2 [initialization predicate]

        Controlled behavior: p.x = 0 or (p.x = 2 or p.x = 4) -> p.x = 2.

    Need another round.

Synthesis round 2:
    Computing backward controlled-behavior predicate:
        Saturation matrix:
                   /------ 1 p.x#0
                   |/----- 2 p.x#0+
                   ||/---- 3 p.x#1
                   |||/--- 4 p.x#1+
                   ||||/-- 5 p.x#2
                   |||||/- 6 p.x#2+
            1 next rwrwrw

        Backward controlled-behavior: true [marker predicate]
        Backward controlled-behavior: true -> p.x = 2 [restricted to current/previous controlled-behavior predicate: p.x = 2]

        Backward controlled-behavior: p.x = 2 [fixed point].

        Controlled behavior not changed.

    Computing backward uncontrolled bad-state predicate:
        Saturation matrix:
            No edges.

        Backward uncontrolled bad-state: p.x != 2 [current/previous controlled behavior predicate]

        Controlled behavior not changed.

    Finished: controlled behavior is stable.

Computing final controlled system guards:
    Edge (event: next) (guard: true) (assignments: p.x := (p.x + 1) mod count): guard: true -> p.x = 1.

Cleaning up cached predicate of edges that were used when applying edges.

Final synthesis result:
    State: (controlled-behavior: p.x = 2)
        Edge: (event: next) (guard: true -> p.x = 1) (assignments: p.x := (p.x + 1) mod count)

Computing initialization predicate of the controlled system.

Controlled system: exactly 1 state.

Determining initialization predicate for output model:
    Initial (synthesis result):            p.x = 2
    Initial (uncontrolled system):         p.x = 2
    Initial (controlled system):           p.x = 2
    Initial (removed by supervisor):       false
    Initial (added by supervisor):         true

    Initial (output model):                n/a

Determining supervisor guards for output model:
    Event next: guard: p.x = 1.

Checking post-synthesis for events that are never enabled.

Simplifying supervisor guards for output model:
    Simplification under the assumption of the plants.

    Guards not changed.

Constructing output CIF specification.

Checking output CIF specification.

Writing output CIF file "datasynth/asgn_inc_mod.ctrlsys.real.cif".
