<?xml version="1.0" encoding="UTF-8" standalone="no"?>
<!--
  Copyright (c) 2010, 2025 Contributors to the Eclipse Foundation

  See the NOTICE file(s) distributed with this work for additional
  information regarding copyright ownership.

  This program and the accompanying materials are made available under the terms
  of the MIT License which is available at https://opensource.org/licenses/MIT

  SPDX-License-Identifier: MIT
-->

<svg
   width="575"
   height="199"
   viewBox="0 0 152.13538 52.652088"
   version="1.1"
   id="svg5"
   inkscape:version="1.1.2 (b8e25be833, 2022-02-05)"
   sodipodi:docname="lock-traffic-lights-water.svg"
   inkscape:export-xdpi="96"
   inkscape:export-ydpi="96"
   xmlns:inkscape="http://www.inkscape.org/namespaces/inkscape"
   xmlns:sodipodi="http://sodipodi.sourceforge.net/DTD/sodipodi-0.dtd"
   xmlns="http://www.w3.org/2000/svg"
   xmlns:svg="http://www.w3.org/2000/svg">
  <sodipodi:namedview
     id="namedview7"
     pagecolor="#ffffff"
     bordercolor="#666666"
     borderopacity="1.0"
     inkscape:pageshadow="2"
     inkscape:pageopacity="0.0"
     inkscape:pagecheckerboard="0"
     inkscape:document-units="px"
     showgrid="false"
     showguides="false"
     inkscape:zoom="1.5473854"
     inkscape:cx="276.27248"
     inkscape:cy="127.95778"
     inkscape:window-width="1920"
     inkscape:window-height="1009"
     inkscape:window-x="-8"
     inkscape:window-y="-8"
     inkscape:window-maximized="1"
     inkscape:current-layer="layer1"
     units="px"
     width="793.70081px"
     inkscape:showpageshadow="2"
     inkscape:deskcolor="#d1d1d1" />
  <defs
     id="defs2">
    <marker
       style="overflow:visible"
       id="Arrow1Mend"
       refX="0"
       refY="0"
       orient="auto"
       inkscape:stockid="Arrow1Mend"
       inkscape:isstock="true">
      <path
         transform="matrix(-0.4,0,0,-0.4,-4,0)"
         style="fill:context-stroke;fill-rule:evenodd;stroke:context-stroke;stroke-width:1pt"
         d="M 0,0 5,-5 -12.5,0 5,5 Z"
         id="path2719" />
    </marker>
    <marker
       style="overflow:visible"
       id="Arrow1Lend"
       refX="0"
       refY="0"
       orient="auto"
       inkscape:stockid="Arrow1Lend"
       inkscape:isstock="true">
      <path
         transform="matrix(-0.8,0,0,-0.8,-10,0)"
         style="fill:context-stroke;fill-rule:evenodd;stroke:context-stroke;stroke-width:1pt"
         d="M 0,0 5,-5 -12.5,0 5,5 Z"
         id="path2713" />
    </marker>
    <marker
       style="overflow:visible"
       id="Arrow1Send"
       refX="0"
       refY="0"
       orient="auto"
       inkscape:stockid="Arrow1Send"
       inkscape:isstock="true">
      <path
         transform="matrix(-0.2,0,0,-0.2,-1.2,0)"
         style="fill:context-stroke;fill-rule:evenodd;stroke:context-stroke;stroke-width:1pt"
         d="M 0,0 5,-5 -12.5,0 5,5 Z"
         id="path958" />
    </marker>
    <marker
       style="overflow:visible"
       id="marker1222"
       refX="0"
       refY="0"
       orient="auto"
       inkscape:stockid="Arrow2Lend"
       inkscape:isstock="true">
      <path
         transform="matrix(-1.1,0,0,-1.1,-1.1,0)"
         d="M 8.7185878,4.0337352 -2.2072895,0.01601326 8.7185884,-4.0017078 c -1.7454984,2.3720609 -1.7354408,5.6174519 -6e-7,8.035443 z"
         style="fill:context-stroke;fill-rule:evenodd;stroke-width:0.625;stroke-linejoin:round"
         id="path1220" />
    </marker>
    <marker
       style="overflow:visible"
       id="marker1212"
       refX="0"
       refY="0"
       orient="auto"
       inkscape:stockid="Arrow2Lend"
       inkscape:isstock="true">
      <path
         transform="matrix(-1.1,0,0,-1.1,-1.1,0)"
         d="M 8.7185878,4.0337352 -2.2072895,0.01601326 8.7185884,-4.0017078 c -1.7454984,2.3720609 -1.7354408,5.6174519 -6e-7,8.035443 z"
         style="fill:context-stroke;fill-rule:evenodd;stroke-width:0.625;stroke-linejoin:round"
         id="path964" />
    </marker>
    <marker
       style="overflow:visible"
       id="Arrow2Mend"
       refX="0"
       refY="0"
       orient="auto"
       inkscape:stockid="Arrow2Mend"
       inkscape:isstock="true">
      <path
         transform="scale(-0.6)"
         d="M 8.7185878,4.0337352 -2.2072895,0.01601326 8.7185884,-4.0017078 c -1.7454984,2.3720609 -1.7354408,5.6174519 -6e-7,8.035443 z"
         style="fill:context-stroke;fill-rule:evenodd;stroke-width:0.625;stroke-linejoin:round"
         id="path970" />
    </marker>
    <marker
       style="overflow:visible"
       id="Arrow2Lend"
       refX="0"
       refY="0"
       orient="auto"
       inkscape:stockid="Arrow2Lend"
       inkscape:isstock="true">
      <path
         transform="matrix(-1.1,0,0,-1.1,-1.1,0)"
         d="M 8.7185878,4.0337352 -2.2072895,0.01601326 8.7185884,-4.0017078 c -1.7454984,2.3720609 -1.7354408,5.6174519 -6e-7,8.035443 z"
         style="fill:context-stroke;fill-rule:evenodd;stroke-width:0.625;stroke-linejoin:round"
         id="path39345" />
    </marker>
    <linearGradient
       id="linearGradient8670"
       inkscape:swatch="solid">
      <stop
         style="stop-color:black;stop-opacity:1;"
         offset="0"
         id="stop8668" />
    </linearGradient>
    <linearGradient
       id="linearGradient8620"
       inkscape:swatch="solid">
      <stop
         style="stop-color:#e6e6e6;stop-opacity:1;"
         offset="0"
         id="stop8618" />
    </linearGradient>
    <marker
       style="overflow:visible"
       id="Arrow1Mend-1"
       refX="0"
       refY="0"
       orient="auto"
       inkscape:stockid="Arrow1Mend"
       inkscape:isstock="true">
      <path
         transform="matrix(-0.4,0,0,-0.4,-4,0)"
         style="fill:context-stroke;fill-rule:evenodd;stroke:context-stroke;stroke-width:1pt"
         d="M 0,0 5,-5 -12.5,0 5,5 Z"
         id="path2719-9" />
    </marker>
  </defs>
  <g
     inkscape:label="Layer 1"
     inkscape:groupmode="layer"
     id="layer1"
     transform="scale(4)">
    <path
       id="rect6175-3-8-9-6-6"
       style="fill:#393b3b;fill-opacity:1;fill-rule:evenodd;stroke:none;stroke-width:0.0735786;stroke-linecap:butt;stroke-miterlimit:12;stroke-dasharray:none;stroke-dashoffset:0;stroke-opacity:1"
       d="m 2.1667927,0.06614583 a 2.100698,1.8464986 0 0 0 -2.10064687,1.84639887 2.100698,1.8464986 0 0 0 0.0015503,0.038241 h -0.0015503 v 3.8082944 0.038241 1.4291116 0.1214397 3.7250956 h 0.0051676 a 2.100698,1.8464986 0 0 0 -0.0051676,0.121439 2.100698,1.8464986 0 0 0 2.10064687,1.8464 2.100698,1.8464986 0 0 0 2.1006467,-1.8464 2.100698,1.8464986 0 0 0 -0.00517,-0.121439 h 0.00517 V 7.3478716 7.2264319 5.7973203 5.7590797 1.9507853 H 4.2669255 A 2.100698,1.8464986 0 0 0 4.2674421,1.9125447 2.100698,1.8464986 0 0 0 2.1667954,0.06614583 Z" />
    <ellipse
       style="fill:#313131;fill-opacity:1;fill-rule:evenodd;stroke:#000000;stroke-width:0.303784;stroke-linecap:butt;stroke-miterlimit:12;stroke-dasharray:none;stroke-dashoffset:0;stroke-opacity:1"
       id="BTLSW1"
       cx="-2.1667926"
       cy="-6.5534868"
       transform="scale(-1)"
       rx="1.4356081"
       ry="1.435608" />
    <ellipse
       style="fill:#ff4040;fill-opacity:1;fill-rule:evenodd;stroke:#000000;stroke-width:0.303784;stroke-linecap:butt;stroke-miterlimit:12;stroke-dasharray:none;stroke-dashoffset:0;stroke-opacity:1"
       id="BTLSW1-1"
       cx="-2.1667926"
       cy="-10.400055"
       transform="scale(-1)"
       rx="1.435629"
       ry="1.435608" />
    <ellipse
       style="fill:#ff4040;fill-opacity:1;fill-rule:evenodd;stroke:#000000;stroke-width:0.303783;stroke-linecap:butt;stroke-miterlimit:12;stroke-dasharray:none;stroke-dashoffset:0;stroke-opacity:1"
       id="BTLSW2"
       cx="-2.1667922"
       cy="-2.7069297"
       transform="scale(-1)"
       rx="1.4356084"
       ry="1.4356081" />
    <path
       id="rect6175-3-8-9-6-6-3"
       style="fill:#393b3b;fill-opacity:1;fill-rule:evenodd;stroke:none;stroke-width:0.0735786;stroke-linecap:butt;stroke-miterlimit:12;stroke-dasharray:none;stroke-dashoffset:0;stroke-opacity:1"
       d="m 8.0537715,0.06614583 a 2.100698,1.8464986 0 0 0 -2.1006469,1.84639887 2.100698,1.8464986 0 0 0 0.00155,0.038241 h -0.00155 v 3.8082944 0.03824 1.429112 0.121439 3.7250959 h 0.00517 a 2.100698,1.8464986 0 0 0 -0.00517,0.121439 2.100698,1.8464986 0 0 0 2.1006469,1.8464 2.100698,1.8464986 0 0 0 2.1006465,-1.8464 2.100698,1.8464986 0 0 0 -0.0052,-0.121439 h 0.0052 V 7.3478711 7.2264321 5.7973201 5.7590801 1.9507853 h -5.14e-4 a 2.100698,1.8464986 0 0 0 5.17e-4,-0.038241 2.100698,1.8464986 0 0 0 -2.1006468,-1.84639887 z" />
    <ellipse
       style="fill:#313131;fill-opacity:1;fill-rule:evenodd;stroke:#000000;stroke-width:0.303784;stroke-linecap:butt;stroke-miterlimit:12;stroke-dasharray:none;stroke-dashoffset:0;stroke-opacity:1"
       id="BTLSW1-6"
       cx="-8.053772"
       cy="-6.5534868"
       transform="scale(-1)"
       rx="1.4356081"
       ry="1.435608" />
    <ellipse
       style="fill:#313131;fill-opacity:1;fill-rule:evenodd;stroke:#000000;stroke-width:0.303784;stroke-linecap:butt;stroke-miterlimit:12;stroke-dasharray:none;stroke-dashoffset:0;stroke-opacity:1"
       id="BTLSW1-1-1"
       cx="-8.053772"
       cy="-10.400055"
       transform="scale(-1)"
       rx="1.4356081"
       ry="1.435608" />
    <ellipse
       style="fill:#ff4040;fill-opacity:1;fill-rule:evenodd;stroke:#000000;stroke-width:0.303783;stroke-linecap:butt;stroke-miterlimit:12;stroke-dasharray:none;stroke-dashoffset:0;stroke-opacity:1"
       id="BTLSW2-5"
       cx="-8.053771"
       cy="-2.7069297"
       transform="scale(-1)"
       rx="1.4356084"
       ry="1.4356081" />
    <path
       id="rect6175-3-8-9-6-6-3-8"
       style="fill:#393b3b;fill-opacity:1;fill-rule:evenodd;stroke:none;stroke-width:0.0735786;stroke-linecap:butt;stroke-miterlimit:12;stroke-dasharray:none;stroke-dashoffset:0;stroke-opacity:1"
       d="m 14.006896,0.06614623 a 2.100698,1.8464986 0 0 0 -2.100647,1.84639907 2.100698,1.8464986 0 0 0 0.0015,0.03824 h -0.0015 v 3.808294 0.03824 1.429112 0.121439 3.7250957 h 0.0052 a 2.100698,1.8464986 0 0 0 -0.0052,0.121439 2.100698,1.8464986 0 0 0 2.100647,1.8464 2.100698,1.8464986 0 0 0 2.100647,-1.8464 2.100698,1.8464986 0 0 0 -0.0052,-0.121439 h 0.0052 v -3.7250957 -0.121439 -1.429112 -0.03824 -3.808295 h -5.14e-4 a 2.100698,1.8464986 0 0 0 5.17e-4,-0.03824 2.100698,1.8464986 0 0 0 -2.100647,-1.84639847 z" />
    <ellipse
       style="fill:#008000;fill-opacity:1;fill-rule:evenodd;stroke:#000000;stroke-width:0.303784;stroke-linecap:butt;stroke-miterlimit:12;stroke-dasharray:none;stroke-dashoffset:0;stroke-opacity:1"
       id="BTLSW1-6-6"
       cx="-14.006897"
       cy="-6.5534868"
       transform="scale(-1)"
       rx="1.4356081"
       ry="1.435608" />
    <ellipse
       style="fill:#313131;fill-opacity:1;fill-rule:evenodd;stroke:#000000;stroke-width:0.303784;stroke-linecap:butt;stroke-miterlimit:12;stroke-dasharray:none;stroke-dashoffset:0;stroke-opacity:1"
       id="BTLSW1-1-1-3"
       cx="-14.006897"
       cy="-10.400055"
       transform="scale(-1)"
       rx="1.4356081"
       ry="1.435608" />
    <ellipse
       style="fill:#ff4040;fill-opacity:1;fill-rule:evenodd;stroke:#000000;stroke-width:0.303783;stroke-linecap:butt;stroke-miterlimit:12;stroke-dasharray:none;stroke-dashoffset:0;stroke-opacity:1"
       id="BTLSW2-5-8"
       cx="-14.006896"
       cy="-2.7069299"
       transform="scale(-1)"
       rx="1.4356084"
       ry="1.4356081" />
    <path
       id="rect6175-3-8-9-6-6-3-4"
       style="fill:#393b3b;fill-opacity:1;fill-rule:evenodd;stroke:none;stroke-width:0.0735786;stroke-linecap:butt;stroke-miterlimit:12;stroke-dasharray:none;stroke-dashoffset:0;stroke-opacity:1"
       d="m 19.960021,0.06614623 a 2.100698,1.8464986 0 0 0 -2.100647,1.84639887 2.100698,1.8464986 0 0 0 0.0015,0.038241 h -0.0015 v 3.8082944 0.03824 1.4291124 0.121439 3.7250961 h 0.0052 a 2.100698,1.8464986 0 0 0 -0.0052,0.121439 2.100698,1.8464986 0 0 0 2.100647,1.846399 2.100698,1.8464986 0 0 0 2.100646,-1.846399 2.100698,1.8464986 0 0 0 -0.0052,-0.121439 h 0.0052 V 7.3478719 7.2264329 5.7973205 5.7590805 1.9507857 h -5.14e-4 a 2.100698,1.8464986 0 0 0 5.17e-4,-0.038241 2.100698,1.8464986 0 0 0 -2.100647,-1.84639887 z" />
    <ellipse
       style="fill:#008000;fill-opacity:1;fill-rule:evenodd;stroke:#000000;stroke-width:0.303784;stroke-linecap:butt;stroke-miterlimit:12;stroke-dasharray:none;stroke-dashoffset:0;stroke-opacity:1"
       id="BTLSW1-6-66"
       cx="-19.960022"
       cy="-6.5534873"
       transform="scale(-1)"
       rx="1.4356081"
       ry="1.435608" />
    <ellipse
       style="fill:#313131;fill-opacity:1;fill-rule:evenodd;stroke:#000000;stroke-width:0.303784;stroke-linecap:butt;stroke-miterlimit:12;stroke-dasharray:none;stroke-dashoffset:0;stroke-opacity:1"
       id="BTLSW1-1-1-4"
       cx="-19.960022"
       cy="-10.400055"
       transform="scale(-1)"
       rx="1.4356081"
       ry="1.435608" />
    <ellipse
       style="fill:none;fill-opacity:1;fill-rule:evenodd;stroke:#000000;stroke-width:0.303783;stroke-linecap:butt;stroke-miterlimit:12;stroke-dasharray:none;stroke-dashoffset:0;stroke-opacity:1"
       id="BTLSW2-5-0"
       cx="-19.96002"
       cy="-2.7069299"
       transform="scale(-1)"
       rx="1.4356084"
       ry="1.4356081" />
    <path
       id="rect6175-3-8-9-6-6-7"
       style="fill:#393b3b;fill-opacity:1;fill-rule:evenodd;stroke:none;stroke-width:0.0735788;stroke-linecap:butt;stroke-miterlimit:12;stroke-dasharray:none;stroke-dashoffset:0;stroke-opacity:1"
       d="m 31.982542,5.7590813 a 2.100698,1.8464986 0 0 0 -2.100647,-1.846399 2.100698,1.8464986 0 0 0 -2.100647,1.846399 2.100698,1.8464986 0 0 0 0.0016,0.03824 h -0.0016 v 5.2756467 h 0.0052 a 2.100698,1.8464986 0 0 0 -0.0052,0.121439 2.100698,1.8464986 0 0 0 2.100647,1.846399 2.100698,1.8464986 0 0 0 2.100647,-1.846399 2.100698,1.8464986 0 0 0 -0.0052,-0.121439 h 0.0052 V 5.7973213 h -5.16e-4 a 2.100698,1.8464986 0 0 0 5.16e-4,-0.03824 z" />
    <ellipse
       style="fill:#313131;fill-opacity:1;fill-rule:evenodd;stroke:#000000;stroke-width:0.303784;stroke-linecap:butt;stroke-miterlimit:12;stroke-dasharray:none;stroke-dashoffset:0;stroke-opacity:1"
       id="BTLSW1-0"
       cx="-29.881895"
       cy="-10.400023"
       transform="scale(-1)"
       rx="1.4356081"
       ry="1.435608" />
    <ellipse
       style="fill:#ff4040;fill-opacity:1;fill-rule:evenodd;stroke:#000000;stroke-width:0.303783;stroke-linecap:butt;stroke-miterlimit:12;stroke-dasharray:none;stroke-dashoffset:0;stroke-opacity:1"
       id="BTLSW2-7"
       cx="-29.881895"
       cy="-6.5534663"
       transform="scale(-1)"
       rx="1.4356084"
       ry="1.4356081" />
    <path
       id="rect6175-3-8-9-6-6-7-2"
       style="fill:#393b3b;fill-opacity:1;fill-rule:evenodd;stroke:none;stroke-width:0.0735788;stroke-linecap:butt;stroke-miterlimit:12;stroke-dasharray:none;stroke-dashoffset:0;stroke-opacity:1"
       d="m 37.935667,5.759058 a 2.100698,1.8464986 0 0 0 -2.100647,-1.846399 2.100698,1.8464986 0 0 0 -2.100647,1.846399 2.100698,1.8464986 0 0 0 0.0016,0.03824 h -0.0016 v 5.275647 h 0.0052 a 2.100698,1.8464986 0 0 0 -0.0052,0.121439 2.100698,1.8464986 0 0 0 2.100647,1.846399 2.100698,1.8464986 0 0 0 2.100647,-1.846399 2.100698,1.8464986 0 0 0 -0.0052,-0.121439 h 0.0052 V 5.797298 h -5.16e-4 a 2.100698,1.8464986 0 0 0 5.16e-4,-0.03824 z" />
    <ellipse
       style="fill:#008000;fill-opacity:1;fill-rule:evenodd;stroke:#000000;stroke-width:0.303784;stroke-linecap:butt;stroke-miterlimit:12;stroke-dasharray:none;stroke-dashoffset:0;stroke-opacity:1"
       id="BTLSW1-0-0"
       cx="-35.835018"
       cy="-10.399999"
       transform="scale(-1)"
       rx="1.4356081"
       ry="1.435608" />
    <ellipse
       style="fill:none;fill-opacity:1;fill-rule:evenodd;stroke:#000000;stroke-width:0.303783;stroke-linecap:butt;stroke-miterlimit:12;stroke-dasharray:none;stroke-dashoffset:0;stroke-opacity:1"
       id="BTLSW2-7-9"
       cx="-35.835018"
       cy="-6.553442"
       transform="scale(-1)"
       rx="1.4356084"
       ry="1.4356081" />
  </g>
</svg>
