Reading CIF file "datasynth/evts.cif".

Preprocessing CIF specification (includes checking that the specification is supported).

Converting CIF specification to internal format (BDDs):
    The specification has no BDD variables.

Starting data-based synthesis.

Synthesis input:
    Invariant (components state plant inv):      true
    Invariant (locations state plant invariant): true
    Invariant (system state plant invariant):    true

    Invariant (components state req invariant):  true
    Invariant (locations state req invariant):   true
    Invariant (system state req invariant):      true

    Initial   (discrete variables):              true
    Initial   (components init predicate):       true
    Initial   (aut/locs init predicate):         true
    Initial   (aut/locs init predicate):         true
    Initial   (auts/locs init predicate):        true
    Initial   (uncontrolled system):             true
    Initial   (system, combined init/plant inv): true
    Initial   (system, combined init/state inv): true

    Marked    (components marker predicate):     true
    Marked    (aut/locs marker predicate):       true
    Marked    (aut/locs marker predicate):       true
    Marked    (auts/locs marker predicate):      true
    Marked    (uncontrolled system):             true
    Marked    (system, combined mark/plant inv): true
    Marked    (system, combined mark/state inv): true

    State/event exclusion plants:
        None

    State/event exclusion requirements:
        Event "caa" needs:
            false
        Event "cae" needs:
            true
        Event "cea" needs:
            false
        Event "cee" needs:
            true
        Event "uaa" needs:
            false
        Event "uae" needs:
            true
        Event "uea" needs:
            false
        Event "uee" needs:
            true

    Uncontrolled system:
        State: (controlled-behavior: ?)
            Edge: (event: cen) (guard: true)
            Edge: (event: cea) (guard: true)
            Edge: (event: cee) (guard: true)
            Edge: (event: uen) (guard: true)
            Edge: (event: uea) (guard: true)
            Edge: (event: uee) (guard: true)

Checking input for potential problems.

Restricting edge guards to prevent runtime errors:
    No guards changed.

Restricting uncontrolled system behavior using state/event exclusion plant invariants:
    No guards changed.

Initializing edges for being applied.

Restricting uncontrolled system behavior using state plant invariants:
    No restrictions needed.

Initializing controlled behavior:
    Controlled-behavior predicate: true.
    Controlled-initialization predicate: true.

Restricting behavior using state requirements:
    Controlled behavior not changed.

Extending controlled-behavior predicate using variable ranges:
    Controlled behavior not changed.

Restricting behavior using state/event exclusion requirements:
    Edge (event: cea) (guard: true): guard: true -> false [state/event exclusion requirement: false].
    Controlled behavior: true -> false [state/event exclusion requirement: false, edge: (event: uea) (guard: true)].

    Restricted behavior using state/event exclusion requirements:
        State: (controlled-behavior: false)
            Edge: (event: cen) (guard: true)
            Edge: (event: cea) (guard: true -> false)
            Edge: (event: cee) (guard: true)
            Edge: (event: uen) (guard: true)
            Edge: (event: uea) (guard: true)
            Edge: (event: uee) (guard: true)

Restricting behavior using implicit runtime error requirements:
    Controlled behavior not changed.

Re-initializing edges for being applied.

Checking pre-synthesis for events that are never enabled.

Synthesis round 1:
    Computing backward controlled-behavior predicate:
        Saturation matrix:
            No variables.

        Backward controlled-behavior: true [marker predicate]
        Backward controlled-behavior: true -> false [restricted to current/previous controlled-behavior predicate: false]

        Backward controlled-behavior: false [fixed point].

        Controlled behavior not changed.

    Finished: all states are bad.

Computing final controlled system guards:
    Edge (event: cen) (guard: true): guard: true -> false.
    Edge (event: cee) (guard: true): guard: true -> false.

Cleaning up cached predicate of edges that were used when applying edges.

Final synthesis result:
    State: (controlled-behavior: false)
        Edge: (event: cen) (guard: true -> false)
        Edge: (event: cea) (guard: true -> false)
        Edge: (event: cee) (guard: true -> false)
        Edge: (event: uen) (guard: true)
        Edge: (event: uea) (guard: true)
        Edge: (event: uee) (guard: true)

Computing initialization predicate of the controlled system.

Controlled system: exactly 0 states.

Determining initialization predicate for output model:
    Initial (synthesis result):            false
    Initial (uncontrolled system):         true
    Initial (controlled system):           false
    Initial (removed by supervisor):       true
    Initial (added by supervisor):         false

    Simplifying of controlled system initialization predicate under the assumption of the uncontrolled system initialization predicates:
        Predicate not changed.

    Initial (output model):                false

