WARNING: File "cif2cif/elim_state_invs_extra_guard.cif": Semantic warning at line 229, column 13: Automaton "loc_named_nameless_inv_in_loc.a1" has no initial location.
WARNING: File "cif2cif/elim_state_invs_extra_guard.cif": Semantic warning at line 244, column 13: Automaton "loc_named_nameless_inv_in_loc.a3" has no initial location.
WARNING: File "cif2cif/elim_state_invs_extra_guard.cif": Semantic warning at line 300, column 13: Automaton "loc_named_nameless_inv_in_comp.a1" has no initial location.
WARNING: File "cif2cif/elim_state_invs_extra_guard.cif": Semantic warning at line 315, column 13: Automaton "loc_named_nameless_inv_in_comp.a3" has no initial location.
WARNING: File "cif2cif/elim_state_invs_extra_guard.cif": Semantic warning at line 353, column 22: Discrete variable "simplify.a.v3" is not used anywhere in the specification.
