ERROR: Simulation resulted in a runtime error, for state: time=0.0.
CAUSE: Evaluation of invariant "f()" of the top level scope of the specification failed.
CAUSE: Evaluation of function "f" failed.
CAUSE: Execution of assignment "f.x := f.x + [5]" failed.
CAUSE: Variable "f.x" is assigned value "[5, 5, 5]", which violates the list type bounds of the type "list[0..2] int" of that variable.
