ERROR: File "tchecker/dupl_var_asgn_edge.cif": Semantic error at line 20, column 15: Variable "x.x", or a part of it, may have been assigned twice on a single edge, for assignments to "x.x" and "x.x".
ERROR: File "tchecker/dupl_var_asgn_edge.cif": Semantic error at line 20, column 26: Variable "x.x", or a part of it, may have been assigned twice on a single edge, for assignments to "x.x" and "x.x".
ERROR: File "tchecker/dupl_var_asgn_edge.cif": Semantic error at line 30, column 24: Variable "y.x2", or a part of it, may have been assigned twice on a single edge, for assignments to "y.x2" and "y.x2".
ERROR: File "tchecker/dupl_var_asgn_edge.cif": Semantic error at line 31, column 15: Variable "y.x2", or a part of it, may have been assigned twice on a single edge, for assignments to "y.x2" and "y.x2".
ERROR: File "tchecker/dupl_var_asgn_edge.cif": Semantic error at line 33, column 24: Variable "y.x2", or a part of it, may have been assigned twice on a single edge, for assignments to "y.x2" and "y.x2".
ERROR: File "tchecker/dupl_var_asgn_edge.cif": Semantic error at line 33, column 40: Variable "y.x3", or a part of it, may have been assigned twice on a single edge, for assignments to "y.x3" and "y.x3".
ERROR: File "tchecker/dupl_var_asgn_edge.cif": Semantic error at line 34, column 25: Variable "y.x3", or a part of it, may have been assigned twice on a single edge, for assignments to "y.x3" and "y.x3".
ERROR: File "tchecker/dupl_var_asgn_edge.cif": Semantic error at line 34, column 41: Variable "y.x2", or a part of it, may have been assigned twice on a single edge, for assignments to "y.x2" and "y.x2".
ERROR: File "tchecker/dupl_var_asgn_edge.cif": Semantic error at line 42, column 14: Variable "z.v", or a part of it, may have been assigned twice on a single edge, for assignments to "z.v" and "z.v".
ERROR: File "tchecker/dupl_var_asgn_edge.cif": Semantic error at line 42, column 21: Variable "z.v", or a part of it, may have been assigned twice on a single edge, for assignments to "z.v" and "z.v".
ERROR: File "tchecker/dupl_var_asgn_edge.cif": Semantic error at line 55, column 13: Variable "a.x", or a part of it, may have been assigned twice on a single edge, for assignments to "a.x[1]" and "a.x[1]".
ERROR: File "tchecker/dupl_var_asgn_edge.cif": Semantic error at line 55, column 24: Variable "a.x", or a part of it, may have been assigned twice on a single edge, for assignments to "a.x[1]" and "a.x[1]".
ERROR: File "tchecker/dupl_var_asgn_edge.cif": Semantic error at line 58, column 13: Variable "a.y", or a part of it, may have been assigned twice on a single edge, for assignments to "a.y[0]" and "a.y[0]".
ERROR: File "tchecker/dupl_var_asgn_edge.cif": Semantic error at line 58, column 24: Variable "a.y", or a part of it, may have been assigned twice on a single edge, for assignments to "a.y[0]" and "a.y[0]".
ERROR: File "tchecker/dupl_var_asgn_edge.cif": Semantic error at line 61, column 13: Variable "a.d", or a part of it, may have been assigned twice on a single edge, for assignments to "a.d[true]" and "a.d[true]".
ERROR: File "tchecker/dupl_var_asgn_edge.cif": Semantic error at line 61, column 29: Variable "a.d", or a part of it, may have been assigned twice on a single edge, for assignments to "a.d[true]" and "a.d[true]".
ERROR: File "tchecker/dupl_var_asgn_edge.cif": Semantic error at line 64, column 13: Variable "a.z", or a part of it, may have been assigned twice on a single edge, for assignments to "a.z" and "a.z[0]".
ERROR: File "tchecker/dupl_var_asgn_edge.cif": Semantic error at line 64, column 26: Variable "a.z", or a part of it, may have been assigned twice on a single edge, for assignments to "a.z[0]" and "a.z".
ERROR: File "tchecker/dupl_var_asgn_edge.cif": Semantic error at line 65, column 14: Variable "a.z", or a part of it, may have been assigned twice on a single edge, for assignments to "a.z" and "a.z[0]".
ERROR: File "tchecker/dupl_var_asgn_edge.cif": Semantic error at line 65, column 17: Variable "a.z", or a part of it, may have been assigned twice on a single edge, for assignments to "a.z[0]" and "a.z".
ERROR: File "tchecker/dupl_var_asgn_edge.cif": Semantic error at line 66, column 13: Variable "a.z", or a part of it, may have been assigned twice on a single edge, for assignments to "a.z" and "a.z[0]".
ERROR: File "tchecker/dupl_var_asgn_edge.cif": Semantic error at line 66, column 13: Variable "a.z", or a part of it, may have been assigned twice on a single edge, for assignments to "a.z" and "a.z[1]".
ERROR: File "tchecker/dupl_var_asgn_edge.cif": Semantic error at line 66, column 26: Variable "a.z", or a part of it, may have been assigned twice on a single edge, for assignments to "a.z[0]" and "a.z".
ERROR: File "tchecker/dupl_var_asgn_edge.cif": Semantic error at line 66, column 37: Variable "a.z", or a part of it, may have been assigned twice on a single edge, for assignments to "a.z[1]" and "a.z".
ERROR: File "tchecker/dupl_var_asgn_edge.cif": Semantic error at line 76, column 13: Variable "c.x", or a part of it, may have been assigned twice on a single edge, for assignments to "c.x[0]" and "c.x[0]".
ERROR: File "tchecker/dupl_var_asgn_edge.cif": Semantic error at line 76, column 24: Variable "c.y", or a part of it, may have been assigned twice on a single edge, for assignments to "c.y[0]" and "c.y".
ERROR: File "tchecker/dupl_var_asgn_edge.cif": Semantic error at line 76, column 24: Variable "c.y", or a part of it, may have been assigned twice on a single edge, for assignments to "c.y[0]" and "c.y[0]".
ERROR: File "tchecker/dupl_var_asgn_edge.cif": Semantic error at line 76, column 46: Variable "c.y", or a part of it, may have been assigned twice on a single edge, for assignments to "c.y[0]" and "c.y[0]".
ERROR: File "tchecker/dupl_var_asgn_edge.cif": Semantic error at line 76, column 57: Variable "c.x", or a part of it, may have been assigned twice on a single edge, for assignments to "c.x[0]" and "c.x[0]".
ERROR: File "tchecker/dupl_var_asgn_edge.cif": Semantic error at line 76, column 68: Variable "c.y", or a part of it, may have been assigned twice on a single edge, for assignments to "c.y" and "c.y[0]".
ERROR: File "tchecker/dupl_var_asgn_edge.cif": Semantic error at line 86, column 13: Variable "d.x", or a part of it, may have been assigned twice on a single edge, for assignments to "d.x[...]" and "d.x".
ERROR: File "tchecker/dupl_var_asgn_edge.cif": Semantic error at line 86, column 13: Variable "d.x", or a part of it, may have been assigned twice on a single edge, for assignments to "d.x[...]" and "d.x[...]".
ERROR: File "tchecker/dupl_var_asgn_edge.cif": Semantic error at line 86, column 13: Variable "d.x", or a part of it, may have been assigned twice on a single edge, for assignments to "d.x[...]" and "d.x[0]".
ERROR: File "tchecker/dupl_var_asgn_edge.cif": Semantic error at line 86, column 25: Variable "d.x", or a part of it, may have been assigned twice on a single edge, for assignments to "d.x[...]" and "d.x[...]".
ERROR: File "tchecker/dupl_var_asgn_edge.cif": Semantic error at line 86, column 37: Variable "d.x", or a part of it, may have been assigned twice on a single edge, for assignments to "d.x[0]" and "d.x[...]".
ERROR: File "tchecker/dupl_var_asgn_edge.cif": Semantic error at line 86, column 48: Variable "d.x", or a part of it, may have been assigned twice on a single edge, for assignments to "d.x" and "d.x[...]".
ERROR: File "tchecker/dupl_var_asgn_edge.cif": Semantic error at line 87, column 13: Variable "d.x", or a part of it, may have been assigned twice on a single edge, for assignments to "d.x" and "d.x[...]".
ERROR: File "tchecker/dupl_var_asgn_edge.cif": Semantic error at line 87, column 23: Variable "d.x", or a part of it, may have been assigned twice on a single edge, for assignments to "d.x[...]" and "d.x".
ERROR: File "tchecker/dupl_var_asgn_edge.cif": Semantic error at line 97, column 13: Variable "e.x", or a part of it, may have been assigned twice on a single edge, for assignments to "e.x" and "e.x".
ERROR: File "tchecker/dupl_var_asgn_edge.cif": Semantic error at line 97, column 28: Variable "e.x", or a part of it, may have been assigned twice on a single edge, for assignments to "e.x" and "e.x".
ERROR: File "tchecker/dupl_var_asgn_edge.cif": Semantic error at line 100, column 13: Variable "e.x", or a part of it, may have been assigned twice on a single edge, for assignments to "e.x" and "e.x[0]".
ERROR: File "tchecker/dupl_var_asgn_edge.cif": Semantic error at line 100, column 28: Variable "e.x", or a part of it, may have been assigned twice on a single edge, for assignments to "e.x[0]" and "e.x".
ERROR: File "tchecker/dupl_var_asgn_edge.cif": Semantic error at line 101, column 13: Variable "e.x", or a part of it, may have been assigned twice on a single edge, for assignments to "e.x[0]" and "e.x".
ERROR: File "tchecker/dupl_var_asgn_edge.cif": Semantic error at line 101, column 28: Variable "e.x", or a part of it, may have been assigned twice on a single edge, for assignments to "e.x" and "e.x[0]".
ERROR: File "tchecker/dupl_var_asgn_edge.cif": Semantic error at line 104, column 13: Variable "e.x", or a part of it, may have been assigned twice on a single edge, for assignments to "e.x[0]" and "e.x[0]".
ERROR: File "tchecker/dupl_var_asgn_edge.cif": Semantic error at line 104, column 28: Variable "e.x", or a part of it, may have been assigned twice on a single edge, for assignments to "e.x[0]" and "e.x[0]".
ERROR: File "tchecker/dupl_var_asgn_edge.cif": Semantic error at line 107, column 13: Variable "e.x", or a part of it, may have been assigned twice on a single edge, for assignments to "e.x[1]" and "e.x[1]".
ERROR: File "tchecker/dupl_var_asgn_edge.cif": Semantic error at line 107, column 28: Variable "e.x", or a part of it, may have been assigned twice on a single edge, for assignments to "e.x[1]" and "e.x[1]".
ERROR: File "tchecker/dupl_var_asgn_edge.cif": Semantic error at line 110, column 13: Variable "e.x", or a part of it, may have been assigned twice on a single edge, for assignments to "e.x[0]" and "e.x[0][0]".
ERROR: File "tchecker/dupl_var_asgn_edge.cif": Semantic error at line 110, column 28: Variable "e.x", or a part of it, may have been assigned twice on a single edge, for assignments to "e.x[0][0]" and "e.x[0]".
ERROR: File "tchecker/dupl_var_asgn_edge.cif": Semantic error at line 111, column 13: Variable "e.x", or a part of it, may have been assigned twice on a single edge, for assignments to "e.x[0]" and "e.x[0][1]".
ERROR: File "tchecker/dupl_var_asgn_edge.cif": Semantic error at line 111, column 28: Variable "e.x", or a part of it, may have been assigned twice on a single edge, for assignments to "e.x[0][1]" and "e.x[0]".
ERROR: File "tchecker/dupl_var_asgn_edge.cif": Semantic error at line 116, column 13: Variable "e.x", or a part of it, may have been assigned twice on a single edge, for assignments to "e.x[1]" and "e.x[1][0]".
ERROR: File "tchecker/dupl_var_asgn_edge.cif": Semantic error at line 116, column 28: Variable "e.x", or a part of it, may have been assigned twice on a single edge, for assignments to "e.x[1][0]" and "e.x[1]".
ERROR: File "tchecker/dupl_var_asgn_edge.cif": Semantic error at line 117, column 13: Variable "e.x", or a part of it, may have been assigned twice on a single edge, for assignments to "e.x[1]" and "e.x[1][1]".
ERROR: File "tchecker/dupl_var_asgn_edge.cif": Semantic error at line 117, column 28: Variable "e.x", or a part of it, may have been assigned twice on a single edge, for assignments to "e.x[1][1]" and "e.x[1]".
ERROR: File "tchecker/dupl_var_asgn_edge.cif": Semantic error at line 119, column 13: Variable "e.x", or a part of it, may have been assigned twice on a single edge, for assignments to "e.x[0][0]" and "e.x[0]".
ERROR: File "tchecker/dupl_var_asgn_edge.cif": Semantic error at line 119, column 28: Variable "e.x", or a part of it, may have been assigned twice on a single edge, for assignments to "e.x[0]" and "e.x[0][0]".
ERROR: File "tchecker/dupl_var_asgn_edge.cif": Semantic error at line 120, column 13: Variable "e.x", or a part of it, may have been assigned twice on a single edge, for assignments to "e.x[0][1]" and "e.x[0]".
ERROR: File "tchecker/dupl_var_asgn_edge.cif": Semantic error at line 120, column 28: Variable "e.x", or a part of it, may have been assigned twice on a single edge, for assignments to "e.x[0]" and "e.x[0][1]".
ERROR: File "tchecker/dupl_var_asgn_edge.cif": Semantic error at line 125, column 13: Variable "e.x", or a part of it, may have been assigned twice on a single edge, for assignments to "e.x[1][0]" and "e.x[1]".
ERROR: File "tchecker/dupl_var_asgn_edge.cif": Semantic error at line 125, column 28: Variable "e.x", or a part of it, may have been assigned twice on a single edge, for assignments to "e.x[1]" and "e.x[1][0]".
ERROR: File "tchecker/dupl_var_asgn_edge.cif": Semantic error at line 126, column 13: Variable "e.x", or a part of it, may have been assigned twice on a single edge, for assignments to "e.x[1][1]" and "e.x[1]".
ERROR: File "tchecker/dupl_var_asgn_edge.cif": Semantic error at line 126, column 28: Variable "e.x", or a part of it, may have been assigned twice on a single edge, for assignments to "e.x[1]" and "e.x[1][1]".
ERROR: File "tchecker/dupl_var_asgn_edge.cif": Semantic error at line 129, column 13: Variable "e.x", or a part of it, may have been assigned twice on a single edge, for assignments to "e.x[0][0]" and "e.x[0][0]".
ERROR: File "tchecker/dupl_var_asgn_edge.cif": Semantic error at line 129, column 28: Variable "e.x", or a part of it, may have been assigned twice on a single edge, for assignments to "e.x[0][0]" and "e.x[0][0]".
ERROR: File "tchecker/dupl_var_asgn_edge.cif": Semantic error at line 135, column 13: Variable "e.x", or a part of it, may have been assigned twice on a single edge, for assignments to "e.x[0][1]" and "e.x[0][1]".
ERROR: File "tchecker/dupl_var_asgn_edge.cif": Semantic error at line 135, column 28: Variable "e.x", or a part of it, may have been assigned twice on a single edge, for assignments to "e.x[0][1]" and "e.x[0][1]".
ERROR: File "tchecker/dupl_var_asgn_edge.cif": Semantic error at line 141, column 13: Variable "e.x", or a part of it, may have been assigned twice on a single edge, for assignments to "e.x[1][0]" and "e.x[1][0]".
ERROR: File "tchecker/dupl_var_asgn_edge.cif": Semantic error at line 141, column 28: Variable "e.x", or a part of it, may have been assigned twice on a single edge, for assignments to "e.x[1][0]" and "e.x[1][0]".
ERROR: File "tchecker/dupl_var_asgn_edge.cif": Semantic error at line 147, column 13: Variable "e.x", or a part of it, may have been assigned twice on a single edge, for assignments to "e.x[1][1]" and "e.x[1][1]".
ERROR: File "tchecker/dupl_var_asgn_edge.cif": Semantic error at line 147, column 28: Variable "e.x", or a part of it, may have been assigned twice on a single edge, for assignments to "e.x[1][1]" and "e.x[1][1]".
ERROR: File "tchecker/dupl_var_asgn_edge.cif": Semantic error at line 149, column 13: Variable "e.x", or a part of it, may have been assigned twice on a single edge, for assignments to "e.x[0][0]" and "e.x[0][0]".
ERROR: File "tchecker/dupl_var_asgn_edge.cif": Semantic error at line 149, column 28: Variable "e.x", or a part of it, may have been assigned twice on a single edge, for assignments to "e.x[0][0]" and "e.x[0][0]".
ERROR: File "tchecker/dupl_var_asgn_edge.cif": Semantic error at line 155, column 13: Variable "e.x", or a part of it, may have been assigned twice on a single edge, for assignments to "e.x[0][1]" and "e.x[0][1]".
ERROR: File "tchecker/dupl_var_asgn_edge.cif": Semantic error at line 155, column 28: Variable "e.x", or a part of it, may have been assigned twice on a single edge, for assignments to "e.x[0][1]" and "e.x[0][1]".
ERROR: File "tchecker/dupl_var_asgn_edge.cif": Semantic error at line 161, column 13: Variable "e.x", or a part of it, may have been assigned twice on a single edge, for assignments to "e.x[1][0]" and "e.x[1][0]".
ERROR: File "tchecker/dupl_var_asgn_edge.cif": Semantic error at line 161, column 28: Variable "e.x", or a part of it, may have been assigned twice on a single edge, for assignments to "e.x[1][0]" and "e.x[1][0]".
ERROR: File "tchecker/dupl_var_asgn_edge.cif": Semantic error at line 167, column 13: Variable "e.x", or a part of it, may have been assigned twice on a single edge, for assignments to "e.x[1][1]" and "e.x[1][1]".
ERROR: File "tchecker/dupl_var_asgn_edge.cif": Semantic error at line 167, column 28: Variable "e.x", or a part of it, may have been assigned twice on a single edge, for assignments to "e.x[1][1]" and "e.x[1][1]".
ERROR: File "tchecker/dupl_var_asgn_edge.cif": Semantic error at line 178, column 13: Variable "f.x", or a part of it, may have been assigned twice on a single edge, for assignments to "f.x" and "f.x[...]".
ERROR: File "tchecker/dupl_var_asgn_edge.cif": Semantic error at line 178, column 28: Variable "f.x", or a part of it, may have been assigned twice on a single edge, for assignments to "f.x[...]" and "f.x".
ERROR: File "tchecker/dupl_var_asgn_edge.cif": Semantic error at line 179, column 13: Variable "f.x", or a part of it, may have been assigned twice on a single edge, for assignments to "f.x[...]" and "f.x".
ERROR: File "tchecker/dupl_var_asgn_edge.cif": Semantic error at line 179, column 28: Variable "f.x", or a part of it, may have been assigned twice on a single edge, for assignments to "f.x" and "f.x[...]".
ERROR: File "tchecker/dupl_var_asgn_edge.cif": Semantic error at line 182, column 13: Variable "f.x", or a part of it, may have been assigned twice on a single edge, for assignments to "f.x[0]" and "f.x[...]".
ERROR: File "tchecker/dupl_var_asgn_edge.cif": Semantic error at line 182, column 28: Variable "f.x", or a part of it, may have been assigned twice on a single edge, for assignments to "f.x[...]" and "f.x[0]".
ERROR: File "tchecker/dupl_var_asgn_edge.cif": Semantic error at line 183, column 13: Variable "f.x", or a part of it, may have been assigned twice on a single edge, for assignments to "f.x[...]" and "f.x[0]".
ERROR: File "tchecker/dupl_var_asgn_edge.cif": Semantic error at line 183, column 28: Variable "f.x", or a part of it, may have been assigned twice on a single edge, for assignments to "f.x[0]" and "f.x[...]".
ERROR: File "tchecker/dupl_var_asgn_edge.cif": Semantic error at line 184, column 13: Variable "f.x", or a part of it, may have been assigned twice on a single edge, for assignments to "f.x[...]" and "f.x[...]".
ERROR: File "tchecker/dupl_var_asgn_edge.cif": Semantic error at line 184, column 28: Variable "f.x", or a part of it, may have been assigned twice on a single edge, for assignments to "f.x[...]" and "f.x[...]".
ERROR: File "tchecker/dupl_var_asgn_edge.cif": Semantic error at line 187, column 13: Variable "f.x", or a part of it, may have been assigned twice on a single edge, for assignments to "f.x[0]" and "f.x[0][0]".
ERROR: File "tchecker/dupl_var_asgn_edge.cif": Semantic error at line 187, column 28: Variable "f.x", or a part of it, may have been assigned twice on a single edge, for assignments to "f.x[0][0]" and "f.x[0]".
ERROR: File "tchecker/dupl_var_asgn_edge.cif": Semantic error at line 188, column 13: Variable "f.x", or a part of it, may have been assigned twice on a single edge, for assignments to "f.x[0]" and "f.x[0][...]".
ERROR: File "tchecker/dupl_var_asgn_edge.cif": Semantic error at line 188, column 28: Variable "f.x", or a part of it, may have been assigned twice on a single edge, for assignments to "f.x[0][...]" and "f.x[0]".
ERROR: File "tchecker/dupl_var_asgn_edge.cif": Semantic error at line 189, column 13: Variable "f.x", or a part of it, may have been assigned twice on a single edge, for assignments to "f.x[0]" and "f.x[...][0]".
ERROR: File "tchecker/dupl_var_asgn_edge.cif": Semantic error at line 189, column 28: Variable "f.x", or a part of it, may have been assigned twice on a single edge, for assignments to "f.x[...][0]" and "f.x[0]".
ERROR: File "tchecker/dupl_var_asgn_edge.cif": Semantic error at line 190, column 13: Variable "f.x", or a part of it, may have been assigned twice on a single edge, for assignments to "f.x[0]" and "f.x[...][...]".
ERROR: File "tchecker/dupl_var_asgn_edge.cif": Semantic error at line 190, column 28: Variable "f.x", or a part of it, may have been assigned twice on a single edge, for assignments to "f.x[...][...]" and "f.x[0]".
ERROR: File "tchecker/dupl_var_asgn_edge.cif": Semantic error at line 193, column 13: Variable "f.x", or a part of it, may have been assigned twice on a single edge, for assignments to "f.x[1]" and "f.x[...][0]".
ERROR: File "tchecker/dupl_var_asgn_edge.cif": Semantic error at line 193, column 28: Variable "f.x", or a part of it, may have been assigned twice on a single edge, for assignments to "f.x[...][0]" and "f.x[1]".
ERROR: File "tchecker/dupl_var_asgn_edge.cif": Semantic error at line 194, column 13: Variable "f.x", or a part of it, may have been assigned twice on a single edge, for assignments to "f.x[1]" and "f.x[...][1]".
ERROR: File "tchecker/dupl_var_asgn_edge.cif": Semantic error at line 194, column 28: Variable "f.x", or a part of it, may have been assigned twice on a single edge, for assignments to "f.x[...][1]" and "f.x[1]".
ERROR: File "tchecker/dupl_var_asgn_edge.cif": Semantic error at line 196, column 13: Variable "f.x", or a part of it, may have been assigned twice on a single edge, for assignments to "f.x[0][0]" and "f.x[0]".
ERROR: File "tchecker/dupl_var_asgn_edge.cif": Semantic error at line 196, column 28: Variable "f.x", or a part of it, may have been assigned twice on a single edge, for assignments to "f.x[0]" and "f.x[0][0]".
ERROR: File "tchecker/dupl_var_asgn_edge.cif": Semantic error at line 197, column 13: Variable "f.x", or a part of it, may have been assigned twice on a single edge, for assignments to "f.x[0][...]" and "f.x[0]".
ERROR: File "tchecker/dupl_var_asgn_edge.cif": Semantic error at line 197, column 28: Variable "f.x", or a part of it, may have been assigned twice on a single edge, for assignments to "f.x[0]" and "f.x[0][...]".
ERROR: File "tchecker/dupl_var_asgn_edge.cif": Semantic error at line 198, column 13: Variable "f.x", or a part of it, may have been assigned twice on a single edge, for assignments to "f.x[...][0]" and "f.x[0]".
ERROR: File "tchecker/dupl_var_asgn_edge.cif": Semantic error at line 198, column 28: Variable "f.x", or a part of it, may have been assigned twice on a single edge, for assignments to "f.x[0]" and "f.x[...][0]".
ERROR: File "tchecker/dupl_var_asgn_edge.cif": Semantic error at line 199, column 13: Variable "f.x", or a part of it, may have been assigned twice on a single edge, for assignments to "f.x[...][...]" and "f.x[0]".
ERROR: File "tchecker/dupl_var_asgn_edge.cif": Semantic error at line 199, column 28: Variable "f.x", or a part of it, may have been assigned twice on a single edge, for assignments to "f.x[0]" and "f.x[...][...]".
ERROR: File "tchecker/dupl_var_asgn_edge.cif": Semantic error at line 202, column 13: Variable "f.x", or a part of it, may have been assigned twice on a single edge, for assignments to "f.x[...][0]" and "f.x[1]".
ERROR: File "tchecker/dupl_var_asgn_edge.cif": Semantic error at line 202, column 28: Variable "f.x", or a part of it, may have been assigned twice on a single edge, for assignments to "f.x[1]" and "f.x[...][0]".
ERROR: File "tchecker/dupl_var_asgn_edge.cif": Semantic error at line 203, column 13: Variable "f.x", or a part of it, may have been assigned twice on a single edge, for assignments to "f.x[...][...]" and "f.x[1]".
ERROR: File "tchecker/dupl_var_asgn_edge.cif": Semantic error at line 203, column 28: Variable "f.x", or a part of it, may have been assigned twice on a single edge, for assignments to "f.x[1]" and "f.x[...][...]".
ERROR: File "tchecker/dupl_var_asgn_edge.cif": Semantic error at line 206, column 13: Variable "f.x", or a part of it, may have been assigned twice on a single edge, for assignments to "f.x[0][0]" and "f.x[0][0]".
ERROR: File "tchecker/dupl_var_asgn_edge.cif": Semantic error at line 206, column 28: Variable "f.x", or a part of it, may have been assigned twice on a single edge, for assignments to "f.x[0][0]" and "f.x[0][0]".
ERROR: File "tchecker/dupl_var_asgn_edge.cif": Semantic error at line 207, column 13: Variable "f.x", or a part of it, may have been assigned twice on a single edge, for assignments to "f.x[0][0]" and "f.x[0][...]".
ERROR: File "tchecker/dupl_var_asgn_edge.cif": Semantic error at line 207, column 28: Variable "f.x", or a part of it, may have been assigned twice on a single edge, for assignments to "f.x[0][...]" and "f.x[0][0]".
ERROR: File "tchecker/dupl_var_asgn_edge.cif": Semantic error at line 208, column 13: Variable "f.x", or a part of it, may have been assigned twice on a single edge, for assignments to "f.x[0][0]" and "f.x[...][0]".
ERROR: File "tchecker/dupl_var_asgn_edge.cif": Semantic error at line 208, column 28: Variable "f.x", or a part of it, may have been assigned twice on a single edge, for assignments to "f.x[...][0]" and "f.x[0][0]".
ERROR: File "tchecker/dupl_var_asgn_edge.cif": Semantic error at line 209, column 13: Variable "f.x", or a part of it, may have been assigned twice on a single edge, for assignments to "f.x[0][0]" and "f.x[...][...]".
ERROR: File "tchecker/dupl_var_asgn_edge.cif": Semantic error at line 209, column 28: Variable "f.x", or a part of it, may have been assigned twice on a single edge, for assignments to "f.x[...][...]" and "f.x[0][0]".
ERROR: File "tchecker/dupl_var_asgn_edge.cif": Semantic error at line 211, column 13: Variable "f.x", or a part of it, may have been assigned twice on a single edge, for assignments to "f.x[0][...]" and "f.x[0][0]".
ERROR: File "tchecker/dupl_var_asgn_edge.cif": Semantic error at line 211, column 28: Variable "f.x", or a part of it, may have been assigned twice on a single edge, for assignments to "f.x[0][0]" and "f.x[0][...]".
ERROR: File "tchecker/dupl_var_asgn_edge.cif": Semantic error at line 212, column 13: Variable "f.x", or a part of it, may have been assigned twice on a single edge, for assignments to "f.x[0][...]" and "f.x[0][...]".
ERROR: File "tchecker/dupl_var_asgn_edge.cif": Semantic error at line 212, column 28: Variable "f.x", or a part of it, may have been assigned twice on a single edge, for assignments to "f.x[0][...]" and "f.x[0][...]".
ERROR: File "tchecker/dupl_var_asgn_edge.cif": Semantic error at line 213, column 13: Variable "f.x", or a part of it, may have been assigned twice on a single edge, for assignments to "f.x[0][...]" and "f.x[...][0]".
ERROR: File "tchecker/dupl_var_asgn_edge.cif": Semantic error at line 213, column 28: Variable "f.x", or a part of it, may have been assigned twice on a single edge, for assignments to "f.x[...][0]" and "f.x[0][...]".
ERROR: File "tchecker/dupl_var_asgn_edge.cif": Semantic error at line 214, column 13: Variable "f.x", or a part of it, may have been assigned twice on a single edge, for assignments to "f.x[0][...]" and "f.x[...][...]".
ERROR: File "tchecker/dupl_var_asgn_edge.cif": Semantic error at line 214, column 28: Variable "f.x", or a part of it, may have been assigned twice on a single edge, for assignments to "f.x[...][...]" and "f.x[0][...]".
ERROR: File "tchecker/dupl_var_asgn_edge.cif": Semantic error at line 216, column 13: Variable "f.x", or a part of it, may have been assigned twice on a single edge, for assignments to "f.x[...][0]" and "f.x[0][0]".
ERROR: File "tchecker/dupl_var_asgn_edge.cif": Semantic error at line 216, column 28: Variable "f.x", or a part of it, may have been assigned twice on a single edge, for assignments to "f.x[0][0]" and "f.x[...][0]".
ERROR: File "tchecker/dupl_var_asgn_edge.cif": Semantic error at line 217, column 13: Variable "f.x", or a part of it, may have been assigned twice on a single edge, for assignments to "f.x[...][0]" and "f.x[0][...]".
ERROR: File "tchecker/dupl_var_asgn_edge.cif": Semantic error at line 217, column 28: Variable "f.x", or a part of it, may have been assigned twice on a single edge, for assignments to "f.x[0][...]" and "f.x[...][0]".
ERROR: File "tchecker/dupl_var_asgn_edge.cif": Semantic error at line 218, column 13: Variable "f.x", or a part of it, may have been assigned twice on a single edge, for assignments to "f.x[...][0]" and "f.x[...][0]".
ERROR: File "tchecker/dupl_var_asgn_edge.cif": Semantic error at line 218, column 28: Variable "f.x", or a part of it, may have been assigned twice on a single edge, for assignments to "f.x[...][0]" and "f.x[...][0]".
ERROR: File "tchecker/dupl_var_asgn_edge.cif": Semantic error at line 219, column 13: Variable "f.x", or a part of it, may have been assigned twice on a single edge, for assignments to "f.x[...][0]" and "f.x[...][...]".
ERROR: File "tchecker/dupl_var_asgn_edge.cif": Semantic error at line 219, column 28: Variable "f.x", or a part of it, may have been assigned twice on a single edge, for assignments to "f.x[...][...]" and "f.x[...][0]".
ERROR: File "tchecker/dupl_var_asgn_edge.cif": Semantic error at line 221, column 13: Variable "f.x", or a part of it, may have been assigned twice on a single edge, for assignments to "f.x[...][...]" and "f.x[0][0]".
ERROR: File "tchecker/dupl_var_asgn_edge.cif": Semantic error at line 221, column 28: Variable "f.x", or a part of it, may have been assigned twice on a single edge, for assignments to "f.x[0][0]" and "f.x[...][...]".
ERROR: File "tchecker/dupl_var_asgn_edge.cif": Semantic error at line 222, column 13: Variable "f.x", or a part of it, may have been assigned twice on a single edge, for assignments to "f.x[...][...]" and "f.x[0][...]".
ERROR: File "tchecker/dupl_var_asgn_edge.cif": Semantic error at line 222, column 28: Variable "f.x", or a part of it, may have been assigned twice on a single edge, for assignments to "f.x[0][...]" and "f.x[...][...]".
ERROR: File "tchecker/dupl_var_asgn_edge.cif": Semantic error at line 223, column 13: Variable "f.x", or a part of it, may have been assigned twice on a single edge, for assignments to "f.x[...][...]" and "f.x[...][0]".
ERROR: File "tchecker/dupl_var_asgn_edge.cif": Semantic error at line 223, column 28: Variable "f.x", or a part of it, may have been assigned twice on a single edge, for assignments to "f.x[...][0]" and "f.x[...][...]".
ERROR: File "tchecker/dupl_var_asgn_edge.cif": Semantic error at line 224, column 13: Variable "f.x", or a part of it, may have been assigned twice on a single edge, for assignments to "f.x[...][...]" and "f.x[...][...]".
ERROR: File "tchecker/dupl_var_asgn_edge.cif": Semantic error at line 224, column 28: Variable "f.x", or a part of it, may have been assigned twice on a single edge, for assignments to "f.x[...][...]" and "f.x[...][...]".
ERROR: File "tchecker/dupl_var_asgn_edge.cif": Semantic error at line 226, column 13: Variable "f.x", or a part of it, may have been assigned twice on a single edge, for assignments to "f.x[0][0]" and "f.x[0][0]".
ERROR: File "tchecker/dupl_var_asgn_edge.cif": Semantic error at line 226, column 28: Variable "f.x", or a part of it, may have been assigned twice on a single edge, for assignments to "f.x[0][0]" and "f.x[0][0]".
ERROR: File "tchecker/dupl_var_asgn_edge.cif": Semantic error at line 227, column 13: Variable "f.x", or a part of it, may have been assigned twice on a single edge, for assignments to "f.x[0][...]" and "f.x[0][0]".
ERROR: File "tchecker/dupl_var_asgn_edge.cif": Semantic error at line 227, column 28: Variable "f.x", or a part of it, may have been assigned twice on a single edge, for assignments to "f.x[0][0]" and "f.x[0][...]".
ERROR: File "tchecker/dupl_var_asgn_edge.cif": Semantic error at line 228, column 13: Variable "f.x", or a part of it, may have been assigned twice on a single edge, for assignments to "f.x[...][0]" and "f.x[0][0]".
ERROR: File "tchecker/dupl_var_asgn_edge.cif": Semantic error at line 228, column 28: Variable "f.x", or a part of it, may have been assigned twice on a single edge, for assignments to "f.x[0][0]" and "f.x[...][0]".
ERROR: File "tchecker/dupl_var_asgn_edge.cif": Semantic error at line 229, column 13: Variable "f.x", or a part of it, may have been assigned twice on a single edge, for assignments to "f.x[...][...]" and "f.x[0][0]".
ERROR: File "tchecker/dupl_var_asgn_edge.cif": Semantic error at line 229, column 28: Variable "f.x", or a part of it, may have been assigned twice on a single edge, for assignments to "f.x[0][0]" and "f.x[...][...]".
ERROR: File "tchecker/dupl_var_asgn_edge.cif": Semantic error at line 231, column 13: Variable "f.x", or a part of it, may have been assigned twice on a single edge, for assignments to "f.x[0][0]" and "f.x[0][...]".
ERROR: File "tchecker/dupl_var_asgn_edge.cif": Semantic error at line 231, column 28: Variable "f.x", or a part of it, may have been assigned twice on a single edge, for assignments to "f.x[0][...]" and "f.x[0][0]".
ERROR: File "tchecker/dupl_var_asgn_edge.cif": Semantic error at line 232, column 13: Variable "f.x", or a part of it, may have been assigned twice on a single edge, for assignments to "f.x[0][...]" and "f.x[0][...]".
ERROR: File "tchecker/dupl_var_asgn_edge.cif": Semantic error at line 232, column 28: Variable "f.x", or a part of it, may have been assigned twice on a single edge, for assignments to "f.x[0][...]" and "f.x[0][...]".
ERROR: File "tchecker/dupl_var_asgn_edge.cif": Semantic error at line 233, column 13: Variable "f.x", or a part of it, may have been assigned twice on a single edge, for assignments to "f.x[...][0]" and "f.x[0][...]".
ERROR: File "tchecker/dupl_var_asgn_edge.cif": Semantic error at line 233, column 28: Variable "f.x", or a part of it, may have been assigned twice on a single edge, for assignments to "f.x[0][...]" and "f.x[...][0]".
ERROR: File "tchecker/dupl_var_asgn_edge.cif": Semantic error at line 234, column 13: Variable "f.x", or a part of it, may have been assigned twice on a single edge, for assignments to "f.x[...][...]" and "f.x[0][...]".
ERROR: File "tchecker/dupl_var_asgn_edge.cif": Semantic error at line 234, column 28: Variable "f.x", or a part of it, may have been assigned twice on a single edge, for assignments to "f.x[0][...]" and "f.x[...][...]".
ERROR: File "tchecker/dupl_var_asgn_edge.cif": Semantic error at line 236, column 13: Variable "f.x", or a part of it, may have been assigned twice on a single edge, for assignments to "f.x[0][0]" and "f.x[...][0]".
ERROR: File "tchecker/dupl_var_asgn_edge.cif": Semantic error at line 236, column 28: Variable "f.x", or a part of it, may have been assigned twice on a single edge, for assignments to "f.x[...][0]" and "f.x[0][0]".
ERROR: File "tchecker/dupl_var_asgn_edge.cif": Semantic error at line 237, column 13: Variable "f.x", or a part of it, may have been assigned twice on a single edge, for assignments to "f.x[0][...]" and "f.x[...][0]".
ERROR: File "tchecker/dupl_var_asgn_edge.cif": Semantic error at line 237, column 28: Variable "f.x", or a part of it, may have been assigned twice on a single edge, for assignments to "f.x[...][0]" and "f.x[0][...]".
ERROR: File "tchecker/dupl_var_asgn_edge.cif": Semantic error at line 238, column 13: Variable "f.x", or a part of it, may have been assigned twice on a single edge, for assignments to "f.x[...][0]" and "f.x[...][0]".
ERROR: File "tchecker/dupl_var_asgn_edge.cif": Semantic error at line 238, column 28: Variable "f.x", or a part of it, may have been assigned twice on a single edge, for assignments to "f.x[...][0]" and "f.x[...][0]".
ERROR: File "tchecker/dupl_var_asgn_edge.cif": Semantic error at line 239, column 13: Variable "f.x", or a part of it, may have been assigned twice on a single edge, for assignments to "f.x[...][...]" and "f.x[...][0]".
ERROR: File "tchecker/dupl_var_asgn_edge.cif": Semantic error at line 239, column 28: Variable "f.x", or a part of it, may have been assigned twice on a single edge, for assignments to "f.x[...][0]" and "f.x[...][...]".
ERROR: File "tchecker/dupl_var_asgn_edge.cif": Semantic error at line 241, column 13: Variable "f.x", or a part of it, may have been assigned twice on a single edge, for assignments to "f.x[0][0]" and "f.x[...][...]".
ERROR: File "tchecker/dupl_var_asgn_edge.cif": Semantic error at line 241, column 28: Variable "f.x", or a part of it, may have been assigned twice on a single edge, for assignments to "f.x[...][...]" and "f.x[0][0]".
ERROR: File "tchecker/dupl_var_asgn_edge.cif": Semantic error at line 242, column 13: Variable "f.x", or a part of it, may have been assigned twice on a single edge, for assignments to "f.x[0][...]" and "f.x[...][...]".
ERROR: File "tchecker/dupl_var_asgn_edge.cif": Semantic error at line 242, column 28: Variable "f.x", or a part of it, may have been assigned twice on a single edge, for assignments to "f.x[...][...]" and "f.x[0][...]".
ERROR: File "tchecker/dupl_var_asgn_edge.cif": Semantic error at line 243, column 13: Variable "f.x", or a part of it, may have been assigned twice on a single edge, for assignments to "f.x[...][0]" and "f.x[...][...]".
ERROR: File "tchecker/dupl_var_asgn_edge.cif": Semantic error at line 243, column 28: Variable "f.x", or a part of it, may have been assigned twice on a single edge, for assignments to "f.x[...][...]" and "f.x[...][0]".
ERROR: File "tchecker/dupl_var_asgn_edge.cif": Semantic error at line 244, column 13: Variable "f.x", or a part of it, may have been assigned twice on a single edge, for assignments to "f.x[...][...]" and "f.x[...][...]".
ERROR: File "tchecker/dupl_var_asgn_edge.cif": Semantic error at line 244, column 28: Variable "f.x", or a part of it, may have been assigned twice on a single edge, for assignments to "f.x[...][...]" and "f.x[...][...]".
ERROR: File "tchecker/dupl_var_asgn_edge.cif": Semantic error at line 261, column 17: Variable "g_rcv.x", or a part of it, may have been assigned twice on a single edge, for assignments to "g_rcv.x[0]" and "g_rcv.x[...]".
ERROR: File "tchecker/dupl_var_asgn_edge.cif": Semantic error at line 261, column 28: Variable "g_rcv.x", or a part of it, may have been assigned twice on a single edge, for assignments to "g_rcv.x[...]" and "g_rcv.x[0]".
ERROR: File "tchecker/dupl_var_asgn_edge.cif": Semantic error at line 271, column 15: Variable "a1.b", or a part of it, may have been assigned twice on a single edge, for assignments to "a1.b" and "a1.b".
ERROR: File "tchecker/dupl_var_asgn_edge.cif": Semantic error at line 271, column 29: Variable "a1.b", or a part of it, may have been assigned twice on a single edge, for assignments to "a1.b" and "a1.b".
WARNING: File "tchecker/dupl_var_asgn_edge.cif": Semantic warning at line 271, column 15: Convoluted reference to local declaration. Use "b" instead.
ERROR: Failed to load CIF file "tchecker/dupl_var_asgn_edge.cif": the file has errors.
