Loading CIF specification "controllercheck/finite_response/if_switch_expressions.cif".
Checking for finite response:
    Converting CIF specification to an MDD representation:
        Analyzing automaton "Aut1":
            Initializing the automaton data for event "Aut1.c_a".
            Initializing the automaton data for event "Aut1.c_b".
            Processing edges from location "l1" of automaton "Aut1".
            Processing edges from location "l2" of automaton "Aut1".
            Updating global guards for event "Aut1.c_a".
            Updating global guards for event "Aut1.c_b".

        Analyzing automaton "Aut2":
            Initializing the automaton data for event "Aut2.c_a".
            Initializing the automaton data for event "Aut2.c_b".
            Processing edges from location "l1" of automaton "Aut2".
            Processing edges from location "l2" of automaton "Aut2".
            Updating global guards for event "Aut2.c_a".
            Updating global guards for event "Aut2.c_b".

        Analyzing automaton "Aut3":
            Initializing the automaton data for event "Aut3.c_a".
            Initializing the automaton data for event "Aut3.c_b".
            Processing edges from location "l1" of automaton "Aut3".
            Processing edges from location "l2" of automaton "Aut3".
            Updating global guards for event "Aut3.c_a".
            Updating global guards for event "Aut3.c_b".

        Analyzing automaton "Aut4":
            Initializing the automaton data for event "Aut4.c_a".
            Initializing the automaton data for event "Aut4.c_b".
            Processing edges from location "l1" of automaton "Aut4".
            Processing edges from location "l2" of automaton "Aut4".
            Updating global guards for event "Aut4.c_a".
            Updating global guards for event "Aut4.c_b".

        Analyzing automaton "Aut5":
            Initializing the automaton data for event "Aut5.c_a".
            Initializing the automaton data for event "Aut5.c_b".
            Processing edges from location "l1" of automaton "Aut5".
            Processing edges from location "l2" of automaton "Aut5".
            Updating global guards for event "Aut5.c_a".
            Updating global guards for event "Aut5.c_b".

        Analyzing automaton "Aut6":
            Initializing the automaton data for event "Aut6.c_a".
            Initializing the automaton data for event "Aut6.c_b".
            Processing edges from location "l1" of automaton "Aut6".
            Processing edges from location "l2" of automaton "Aut6".
            Updating global guards for event "Aut6.c_a".
            Updating global guards for event "Aut6.c_b".

        Analyzing automaton "SupervisorStateEvtExcls":
            Initializing the automaton data for event "Aut1.c_a".
            Initializing the automaton data for event "Aut2.c_a".
            Initializing the automaton data for event "Aut3.c_a".
            Initializing the automaton data for event "Aut3.c_b".
            Initializing the automaton data for event "Aut4.c_a".
            Initializing the automaton data for event "Aut5.c_a".
            Initializing the automaton data for event "Aut6.c_a".
            Initializing the automaton data for event "Aut6.c_b".
            Processing edges from the location of automaton "SupervisorStateEvtExcls".
            Updating global guards for event "Aut1.c_a".
            Updating global guards for event "Aut2.c_a".
            Updating global guards for event "Aut3.c_a".
            Updating global guards for event "Aut3.c_b".
            Updating global guards for event "Aut4.c_a".
            Updating global guards for event "Aut5.c_a".
            Updating global guards for event "Aut6.c_a".
            Updating global guards for event "Aut6.c_b".

    Iteration 1.
        The following events have been encountered in a controllable-event loop of automaton Aut1:
            (Aut1.c_a Aut1.c_b), which is not controllable unconnectable.
        The following events have been encountered in a controllable-event loop of automaton Aut3:
            (Aut3.c_a Aut3.c_b), which is controllable unconnectable.
        The following events have been encountered in a controllable-event loop of automaton Aut4:
            (Aut4.c_a Aut4.c_b), which is not controllable unconnectable.
        The following events have been encountered in a controllable-event loop of automaton Aut6:
            (Aut6.c_a Aut6.c_b), which is controllable unconnectable.
        The following events have been encountered in a controllable-event loop of automaton SupervisorStateEvtExcls:
            (Aut1.c_a), which is not controllable unconnectable.
            (Aut4.c_a), which is not controllable unconnectable.

    Iteration 2.
        The following events have been encountered in a controllable-event loop of automaton Aut1:
            (Aut1.c_a Aut1.c_b), which is not controllable unconnectable.
        The following events have been encountered in a controllable-event loop of automaton Aut4:
            (Aut4.c_a Aut4.c_b), which is not controllable unconnectable.
        The following events have been encountered in a controllable-event loop of automaton SupervisorStateEvtExcls:
            (Aut1.c_a), which is not controllable unconnectable.
            (Aut4.c_a), which is not controllable unconnectable.

CONCLUSION:
    [UNKNOWN] Bounded response checking was disabled, bounded response property is unknown.
    [UNKNOWN] Non-blocking under control checking was disabled, non-blocking under control property is unknown.

    [ERROR] The specification may NOT have finite response:

        At least one controllable-event loop was found.
        The following events might still occur in a controllable-event loop:
            - Aut1.c_a
            - Aut1.c_b
            - Aut4.c_a
            - Aut4.c_b

    [UNKNOWN] Confluence checking was disabled, confluence property is unknown.

The model with the check results has been written to "controllercheck/finite_response/if_switch_expressions.xxFx.out.cif.real".
