Reading CIF file "datasynth/input_vars1.cif".

Preprocessing CIF specification (includes checking that the specification is supported).

Converting CIF specification to internal format (BDDs):
    CIF variables and location pointers:
        Nr     Kind            Type       Name  Group  BDD vars  CIF values  BDD values  Values used
        -----  --------------  ---------  ----  -----  --------  ----------  ----------  -----------
        1      input variable  bool       io.b  0      1 * 2     2 * 2       2 * 2       100%
        2      input variable  int[0..3]  io.i  1      2 * 2     4 * 2       4 * 2       100%
        3      input variable  E          io.e  2      1 * 2     2 * 2       2 * 2       100%
        -----  --------------  ---------  ----  -----  --------  ----------  ----------  -----------
        Total                                   3      8         16          16          100%

    Applying variable ordering:
        Applying 4 orderers, sequentially:
            Applying model variable order:
                Effect: both

            Applying DCSH algorithm:
                Metric: wes
                Relations: legacy
                Effect: var-order
                Number of hyper-edges: 1

                Applying Weighted Cuthill-McKee algorithm:
                    Node finder: george-liu
                    Relations: legacy
                    Effect: var-order
                    Number of graph edges: 3

                    Total span:   2 (total)   2.00 (avg/edge) / WES:   1.333333 (total)   1.333333 (avg/edge) [before]
                    Total span:   2 (total)   2.00 (avg/edge) / WES:   1.333333 (total)   1.333333 (avg/edge) [after]

                Found new best variable order.

                Applying Sloan algorithm:
                    Relations: legacy
                    Effect: var-order
                    Number of graph edges: 3

                    Total span:   2 (total)   2.00 (avg/edge) / WES:   1.333333 (total)   1.333333 (avg/edge) [before]
                    Total span:   2 (total)   2.00 (avg/edge) / WES:   1.333333 (total)   1.333333 (avg/edge) [after]

                Applying 2 orderers, sequentially:
                    Applying Weighted Cuthill-McKee algorithm:
                        Node finder: george-liu
                        Relations: legacy
                        Effect: var-order
                        Number of graph edges: 3

                        Total span:   2 (total)   2.00 (avg/edge) / WES:   1.333333 (total)   1.333333 (avg/edge) [before]
                        Total span:   2 (total)   2.00 (avg/edge) / WES:   1.333333 (total)   1.333333 (avg/edge) [after]

                    Reversing the variable order:
                        Relations: legacy
                        Effect: var-order
                        Number of hyper-edges: 1

                        Total span:   2 (total)   2.00 (avg/edge) / WES:   1.333333 (total)   1.333333 (avg/edge) [before]
                        Total span:   2 (total)   2.00 (avg/edge) / WES:   1.333333 (total)   1.333333 (avg/edge) [reversed]

                Applying 2 orderers, sequentially:
                    Applying Sloan algorithm:
                        Relations: legacy
                        Effect: var-order
                        Number of graph edges: 3

                        Total span:   2 (total)   2.00 (avg/edge) / WES:   1.333333 (total)   1.333333 (avg/edge) [before]
                        Total span:   2 (total)   2.00 (avg/edge) / WES:   1.333333 (total)   1.333333 (avg/edge) [after]

                    Reversing the variable order:
                        Relations: legacy
                        Effect: var-order
                        Number of hyper-edges: 1

                        Total span:   2 (total)   2.00 (avg/edge) / WES:   1.333333 (total)   1.333333 (avg/edge) [before]
                        Total span:   2 (total)   2.00 (avg/edge) / WES:   1.333333 (total)   1.333333 (avg/edge) [reversed]

            Applying FORCE algorithm:
                Metric: total-span
                Relations: linearized
                Effect: var-order
                Number of hyper-edges: 0
                Maximum number of iterations: 20

                Skipping algorithm: no hyper-edges.

            Applying sliding window algorithm:
                Size: 4
                Metric: total-span
                Relations: linearized
                Effect: var-order
                Number of hyper-edges: 0
                Window length: 3

                Skipping algorithm: no hyper-edges.

    Variable order unchanged.

Starting data-based synthesis.

Synthesis input:
    Invariant (components state plant inv):      true
    Invariant (locations state plant invariant): true
    Invariant (system state plant invariant):    true

    Invariant (component state req invariant):   io.b and (io.i = 3 and io.e = A)
    Invariant (components state req invariant):  io.b and (io.i = 3 and io.e = A)
    Invariant (locations state req invariant):   true
    Invariant (system state req invariant):      io.b and (io.i = 3 and io.e = A)

    Initial   (discrete variables):              true
    Initial   (components init predicate):       true
    Initial   (aut/locs init predicate):         true
    Initial   (auts/locs init predicate):        true
    Initial   (uncontrolled system):             true
    Initial   (system, combined init/plant inv): true
    Initial   (system, combined init/state inv): io.b and (io.i = 3 and io.e = A)

    Marked    (components marker predicate):     true
    Marked    (aut/locs marker predicate):       true
    Marked    (auts/locs marker predicate):      true
    Marked    (uncontrolled system):             true
    Marked    (system, combined mark/plant inv): true
    Marked    (system, combined mark/state inv): io.b and (io.i = 3 and io.e = A)

    State/event exclusion plants:
        None

    State/event exclusion requirements:
        None

    Uncontrolled system:
        State: (controlled-behavior: ?)
            Edge: (event: io.b) (guard: true) (assignments: io.b+ != io.b)
            Edge: (event: io.i) (guard: true) (assignments: io.i+ != io.i)
            Edge: (event: io.e) (guard: true) (assignments: io.e+ != io.e)

Checking input for potential problems.

Restricting edge guards to prevent runtime errors:
    No guards changed.

Restricting uncontrolled system behavior using state/event exclusion plant invariants:
    No guards changed.

Initializing edges for being applied.

Restricting uncontrolled system behavior using state plant invariants:
    No restrictions needed.

Initializing controlled behavior:
    Controlled-behavior predicate: true.
    Controlled-initialization predicate: true.

Restricting behavior using state requirements:
    Controlled behavior: true -> io.b and (io.i = 3 and io.e = A) [state requirements: io.b and (io.i = 3 and io.e = A)].

Extending controlled-behavior predicate using variable ranges:
    Controlled behavior not changed.

Restricting behavior using state/event exclusion requirements:
    Guards and controlled behavior not changed.

Restricting behavior using implicit runtime error requirements:
    Controlled behavior not changed.

Re-initializing edges for being applied.

Checking pre-synthesis for events that are never enabled.

Synthesis round 1:
    Computing backward controlled-behavior predicate:
        Saturation matrix:
                   /-------- 1 io.b#0
                   |/------- 2 io.b#0+
                   ||/------ 3 io.i#0
                   |||/----- 4 io.i#0+
                   ||||/---- 5 io.i#1
                   |||||/--- 6 io.i#1+
                   ||||||/-- 7 io.e#0
                   |||||||/- 8 io.e#0+
            1 io.b rw
            2 io.i   rwrw
            3 io.e       rw

        Backward controlled-behavior: true [marker predicate]
        Backward controlled-behavior: true -> io.b and (io.i = 3 and io.e = A) [restricted to current/previous controlled-behavior predicate: io.b and (io.i = 3 and io.e = A)]

        Backward controlled-behavior: io.b and (io.i = 3 and io.e = A) [fixed point].

        Controlled behavior not changed.

    Computing backward uncontrolled bad-state predicate:
        Saturation matrix:
                   /-------- 1 io.b#0
                   |/------- 2 io.b#0+
                   ||/------ 3 io.i#0
                   |||/----- 4 io.i#0+
                   ||||/---- 5 io.i#1
                   |||||/--- 6 io.i#1+
                   ||||||/-- 7 io.e#0
                   |||||||/- 8 io.e#0+
            1 io.b rw
            2 io.i   rwrw
            3 io.e       rw

        Backward uncontrolled bad-state: not io.b or (io.i != 3 or io.e = B) [current/previous controlled behavior predicate]
        Backward uncontrolled bad-state: io.e = B -> true [backward reach using saturation (transition: 3 of 3) (level: 7 of 8) with edge: (event: io.e) (guard: true) (assignments: io.e+ != io.e)]

        Backward uncontrolled bad-state: true [fixed point].

        Controlled behavior: io.b and (io.i = 3 and io.e = A) -> false.

    Finished: all states are bad.

Computing final controlled system guards:
    No guards changed.

Cleaning up cached predicate of edges that were used when applying edges.

Final synthesis result:
    State: (controlled-behavior: false)
        Edge: (event: io.b) (guard: true) (assignments: io.b+ != io.b)
        Edge: (event: io.i) (guard: true) (assignments: io.i+ != io.i)
        Edge: (event: io.e) (guard: true) (assignments: io.e+ != io.e)

Computing initialization predicate of the controlled system.

Controlled system: exactly 0 states.

Determining initialization predicate for output model:
    Initial (synthesis result):            false
    Initial (uncontrolled system):         true
    Initial (controlled system):           false
    Initial (removed by supervisor):       true
    Initial (added by supervisor):         false

    Simplifying of controlled system initialization predicate under the assumption of the uncontrolled system initialization predicates:
        Predicate not changed.

    Initial (output model):                false

