Loading CIF specification "controllercheck/common/anno_true_to_false.cif".
Checking for confluence:
    Converting CIF specification to a BDD representation:
        CIF variables and location pointers:
            Nr     Kind               Type  Name  Group  BDD vars  CIF values  BDD values  Values used
            -----  -----------------  ----  ----  -----  --------  ----------  ----------  -----------
            1      location pointer   n/a   p     0      1 * 4     2 * 4       2 * 4       100%
            2      discrete variable  bool  p.v   1      1 * 4     2 * 4       2 * 4       100%
            -----  -----------------  ----  ----  -----  --------  ----------  ----------  -----------
            Total                                 2      8         16          16          100%

        Applying variable ordering:
            Applying 4 orderers, sequentially:
                Applying sorted variable order:
                    Effect: both

                Applying DCSH algorithm:
                    Metric: wes
                    Relations: legacy
                    Effect: var-order
                    Number of hyper-edges: 6

                    Applying Weighted Cuthill-McKee algorithm:
                        Node finder: george-liu
                        Relations: legacy
                        Effect: var-order
                        Number of graph edges: 1

                        Total span:   2 (total)   0.33 (avg/edge) / WES:   0.500000 (total)   0.083333 (avg/edge) [before]
                        Total span:   2 (total)   0.33 (avg/edge) / WES:   0.500000 (total)   0.083333 (avg/edge) [after]

                    Found new best variable order.

                    Applying Sloan algorithm:
                        Relations: legacy
                        Effect: var-order
                        Number of graph edges: 1

                        Total span:   2 (total)   0.33 (avg/edge) / WES:   0.500000 (total)   0.083333 (avg/edge) [before]
                        Total span:   2 (total)   0.33 (avg/edge) / WES:   0.500000 (total)   0.083333 (avg/edge) [after]

                    Applying 2 orderers, sequentially:
                        Applying Weighted Cuthill-McKee algorithm:
                            Node finder: george-liu
                            Relations: legacy
                            Effect: var-order
                            Number of graph edges: 1

                            Total span:   2 (total)   0.33 (avg/edge) / WES:   0.500000 (total)   0.083333 (avg/edge) [before]
                            Total span:   2 (total)   0.33 (avg/edge) / WES:   0.500000 (total)   0.083333 (avg/edge) [after]

                        Reversing the variable order:
                            Relations: legacy
                            Effect: var-order
                            Number of hyper-edges: 6

                            Total span:   2 (total)   0.33 (avg/edge) / WES:   0.500000 (total)   0.083333 (avg/edge) [before]
                            Total span:   2 (total)   0.33 (avg/edge) / WES:   0.500000 (total)   0.083333 (avg/edge) [reversed]

                    Applying 2 orderers, sequentially:
                        Applying Sloan algorithm:
                            Relations: legacy
                            Effect: var-order
                            Number of graph edges: 1

                            Total span:   2 (total)   0.33 (avg/edge) / WES:   0.500000 (total)   0.083333 (avg/edge) [before]
                            Total span:   2 (total)   0.33 (avg/edge) / WES:   0.500000 (total)   0.083333 (avg/edge) [after]

                        Reversing the variable order:
                            Relations: legacy
                            Effect: var-order
                            Number of hyper-edges: 6

                            Total span:   2 (total)   0.33 (avg/edge) / WES:   0.500000 (total)   0.083333 (avg/edge) [before]
                            Total span:   2 (total)   0.33 (avg/edge) / WES:   0.500000 (total)   0.083333 (avg/edge) [reversed]

                Applying FORCE algorithm:
                    Metric: total-span
                    Relations: linearized
                    Effect: var-order
                    Number of hyper-edges: 5
                    Maximum number of iterations: 10

                    Total span:   2 (total)   0.40 (avg/edge) / WES:   0.400000 (total)   0.080000 (avg/edge) [before]
                    Total span:   2 (total)   0.40 (avg/edge) / WES:   0.400000 (total)   0.080000 (avg/edge) [iteration 1]
                    Total span:   2 (total)   0.40 (avg/edge) / WES:   0.400000 (total)   0.080000 (avg/edge) [after]

                Applying sliding window algorithm:
                    Size: 4
                    Metric: total-span
                    Relations: linearized
                    Effect: var-order
                    Number of hyper-edges: 5
                    Window length: 2

                    Total span:   2 (total)   0.40 (avg/edge) / WES:   0.400000 (total)   0.080000 (avg/edge) [before]
                    Total span:   2 (total)   0.40 (avg/edge) / WES:   0.400000 (total)   0.080000 (avg/edge) [after]

        Variable order unchanged.

        Restricting system behavior using state/event exclusion plant invariants:
            No guards changed.

    Independent event pairs:
        (a, c), (b, c)

    Some pairs unproven. Confluence may not hold.

CONCLUSION:
    [UNKNOWN] Bounded response checking was disabled, bounded response property is unknown.
    [UNKNOWN] Non-blocking under control checking was disabled, non-blocking under control property is unknown.
    [UNKNOWN] Finite response checking was disabled, finite response property is unknown.

    [ERROR] The specification may NOT have confluence:

        Confluence of the following event pair could not be decided:
            (a, b)

The model with the check results has been written to "controllercheck/common/anno_true_to_false.xCxx.out.cif.real".
