Loading CIF specification "controllercheck/mdd/disabled_evts.cif".
Checking for bounded response:
    Converting CIF specification to a BDD representation:
        The specification has no BDD variables.

        Restricting system behavior using state/event exclusion plant invariants:
            No guards changed.

    Computing states we can be in at the start of uncontrollable and controllable event loops:
        Round 1:
            Pre input states: true
            Pre uncontrollables states: false
            Pre controllables states: false

            Applying event loop for input variable events:
                No input variable events.

            Pre uncontrollables states: false -> true

            Applying event loop for uncontrollable events:
                No uncontrollable events.

            Pre controllables states: false -> true

            Applying event loop for controllable events:
                No controllable events.

        Round 2:
            Pre input states: true
            Pre uncontrollables states: true
            Pre controllables states: true

            Applying event loop for input variable events:
                No input variable events.

            Applying event loop for uncontrollable events:
                No uncontrollable events.

            Applying event loop for controllable events:
                No controllable events.

    Computing bound for uncontrollable events:
        No uncontrollable events.

        Bound: 0.

    Computing bound for controllable events:
        No controllable events.

        Bound: 0.

    Bounded response check completed.

Checking for non-blocking under control:
    Converting CIF specification to a BDD representation:
        The specification has no BDD variables.

        Restricting system behavior using state/event exclusion plant invariants:
            No guards changed.

    Computing the condition for no controllable event to be enabled:
        Condition under which no controllable event is enabled: true

    Computing the controllable-complete path states:
        Saturation matrix:
            No variables and edges.

        Controllable-complete path states: false [controllable-complete path end states predicate]

        Controllable-complete path states: false

    Computing the bad states:
        Saturation matrix:
            No variables and edges.

        Bad states: true [not controllable-complete path states predicate]

        Bad states: true

    Computing the result of the non-blocking under control check:
        Initial states: true
        Bad initial states: true

    Non-blocking under control: no

Checking for finite response:
    Converting CIF specification to an MDD representation:
        Analyzing automaton "A":
            Initializing the automaton data for event "c_a".
            Processing edges from location "l1" of automaton "A".
            Updating global guards for event "c_a".

        Analyzing automaton "B":
            Initializing the automaton data for event "c_a".
            Processing edges from location "l2" of automaton "B".
            Updating global guards for event "c_a".

    Iteration 1.

Checking for confluence:
    Converting CIF specification to a BDD representation:
        The specification has no BDD variables.

        Restricting system behavior using state/event exclusion plant invariants:
            No guards changed.

    One controllable event. Confluence trivially holds.

CONCLUSION:
    [OK] The specification has bounded response:

        - No transitions are possible for uncontrollable events.
        - No transitions are possible for controllable events.

    [ERROR] The specification is NOT non-blocking under control.
    [OK] The specification has finite response.
    [OK] The specification has confluence.

The model with the check results has been written to "controllercheck/mdd/disabled_evts.BCFN.out.cif.real".
