Reading CIF file "datasynth/state_plant_invs_req_aut.cif".

Preprocessing CIF specification (includes checking that the specification is supported).

Converting CIF specification to internal format (BDDs):
    CIF variables and location pointers:
        Nr     Kind              Type  Name  Group  BDD vars  CIF values  BDD values  Values used
        -----  ----------------  ----  ----  -----  --------  ----------  ----------  -----------
        1      location pointer  n/a   A     0      2 * 2     3 * 2       4 * 2       75%
        -----  ----------------  ----  ----  -----  --------  ----------  ----------  -----------
        Total                                1      4         6           8           75%

    Skipping variable ordering: only one variable present.

Starting data-based synthesis.

Synthesis input:
    Invariant (component state plant invariant): not A.l3
    Invariant (components state plant inv):      not A.l3
    Invariant (locations state plant invariant): true
    Invariant (system state plant invariant):    not A.l3

    Invariant (components state req invariant):  true
    Invariant (locations state req invariant):   true
    Invariant (system state req invariant):      true

    Initial   (discrete variables):              true
    Initial   (components init predicate):       true
    Initial   (aut/locs init predicate):         A.l1
    Initial   (aut/locs init predicate):         true
    Initial   (auts/locs init predicate):        A.l1
    Initial   (uncontrolled system):             A.l1
    Initial   (system, combined init/plant inv): A.l1
    Initial   (system, combined init/state inv): A.l1

    Marked    (components marker predicate):     true
    Marked    (aut/locs marker predicate):       true
    Marked    (aut/locs marker predicate):       true
    Marked    (auts/locs marker predicate):      true
    Marked    (uncontrolled system):             true
    Marked    (system, combined mark/plant inv): not A.l3
    Marked    (system, combined mark/state inv): not A.l3

    State/event exclusion plants:
        None

    State/event exclusion requirements:
        Event "A.c" needs:
            A.l1
        Event "A.u1" needs:
            true

    Uncontrolled system:
        State: (controlled-behavior: ?)
            Edge: (event: A.c) (guard: A.l1) (assignments: A := A.l2)
            Edge: (event: A.c) (guard: not A.l1)
            Edge: (event: A.u1) (guard: A.l1)
            Edge: (event: A.u1) (guard: A.l2) (assignments: A := A.l3)
            Edge: (event: A.u1) (guard: A.l3)

Checking input for potential problems.

Restricting edge guards to prevent runtime errors:
    No guards changed.

Restricting uncontrolled system behavior using state/event exclusion plant invariants:
    No guards changed.

Initializing edges for being applied.

Restricting uncontrolled system behavior using state plant invariants:
    Edge (event: A.u1) (guard: A.l2) (assignments: A := A.l3): guard: A.l2 -> false.

    Uncontrolled system:
        State: (controlled-behavior: ?)
            Edge: (event: A.c) (guard: A.l1) (assignments: A := A.l2)
            Edge: (event: A.c) (guard: not A.l1)
            Edge: (event: A.u1) (guard: A.l1)
            Edge: (event: A.u1) (guard: A.l2 -> false) (assignments: A := A.l3)
            Edge: (event: A.u1) (guard: A.l3)

Initializing controlled behavior:
    Controlled-behavior predicate: true.
    Controlled-initialization predicate: A.l1.

Restricting behavior using state requirements:
    Controlled behavior not changed.

Extending controlled-behavior predicate using variable ranges:
    Controlled behavior: true -> true [range: true, variable: location pointer for automaton "A" (group: 0, domain: 0+1, BDD variables: 2, CIF/BDD values: 3/4)].

    Extended controlled-behavior predicate using variable ranges: true.

Restricting behavior using state/event exclusion requirements:
    Edge (event: A.c) (guard: not A.l1): guard: not A.l1 -> false [state/event exclusion requirement: A.l1].

    Restricted behavior using state/event exclusion requirements:
        State: (controlled-behavior: true)
            Edge: (event: A.c) (guard: A.l1) (assignments: A := A.l2)
            Edge: (event: A.c) (guard: not A.l1 -> false)
            Edge: (event: A.u1) (guard: A.l1)
            Edge: (event: A.u1) (guard: A.l2 -> false) (assignments: A := A.l3)
            Edge: (event: A.u1) (guard: A.l3)

Restricting behavior using implicit runtime error requirements:
    Controlled behavior not changed.

Re-initializing edges for being applied.

Checking pre-synthesis for events that are never enabled.

Synthesis round 1:
    Computing backward controlled-behavior predicate:
        Saturation matrix:
                   /---- 1 A#0
                   |/--- 2 A#0+
                   ||/-- 3 A#1
                   |||/- 4 A#1+
            1 A.c  rwrw
            2 A.u1 r r
            3 A.u1 rwrw
            4 A.u1 r r
            5 A.c

        Backward controlled-behavior: true [marker predicate]

        Controlled behavior not changed.

    Computing backward uncontrolled bad-state predicate:
        Saturation matrix:
                   /---- 1 A#0
                   |/--- 2 A#0+
                   ||/-- 3 A#1
                   |||/- 4 A#1+
            1 A.u1 r r
            2 A.u1 rwrw
            3 A.u1 r r

        Backward uncontrolled bad-state: false [current/previous controlled behavior predicate]

        Controlled behavior not changed.

    Computing forward controlled-behavior predicate:
        Saturation matrix:
                   /---- 1 A#0
                   |/--- 2 A#0+
                   ||/-- 3 A#1
                   |||/- 4 A#1+
            1 A.c  rwrw
            2 A.u1 r r
            3 A.u1 rwrw
            4 A.u1 r r
            5 A.c

        Forward controlled-behavior: A.l1 [initialization predicate]
        Forward controlled-behavior: A.l1 -> not A.l3 [forward reach using bounded saturation (transition: 1 of 5) (level: 1 of 4) with edge: (event: A.c) (guard: A.l1) (assignments: A := A.l2)]

        Forward controlled-behavior: not A.l3 [fixed point].

        Controlled behavior: true -> not A.l3.

    Need another round.

Synthesis round 2:
    Computing backward controlled-behavior predicate:
        Saturation matrix:
                   /---- 1 A#0
                   |/--- 2 A#0+
                   ||/-- 3 A#1
                   |||/- 4 A#1+
            1 A.c  rwrw
            2 A.u1 r r
            3 A.u1 rwrw
            4 A.u1 r r
            5 A.c

        Backward controlled-behavior: true [marker predicate]
        Backward controlled-behavior: true -> not A.l3 [restricted to current/previous controlled-behavior predicate: not A.l3]

        Backward controlled-behavior: not A.l3 [fixed point].

        Controlled behavior not changed.

    Computing backward uncontrolled bad-state predicate:
        Saturation matrix:
                   /---- 1 A#0
                   |/--- 2 A#0+
                   ||/-- 3 A#1
                   |||/- 4 A#1+
            1 A.u1 r r
            2 A.u1 rwrw
            3 A.u1 r r

        Backward uncontrolled bad-state: A.l3 [current/previous controlled behavior predicate]

        Controlled behavior not changed.

    Finished: controlled behavior is stable.

Computing final controlled system guards:
    No guards changed.

Cleaning up cached predicate of edges that were used when applying edges.

Final synthesis result:
    State: (controlled-behavior: not A.l3)
        Edge: (event: A.c) (guard: A.l1) (assignments: A := A.l2)
        Edge: (event: A.c) (guard: not A.l1 -> false)
        Edge: (event: A.u1) (guard: A.l1)
        Edge: (event: A.u1) (guard: A.l2 -> false) (assignments: A := A.l3)
        Edge: (event: A.u1) (guard: A.l3)

Computing initialization predicate of the controlled system.

Controlled system: exactly 2 states.

Determining initialization predicate for output model:
    Initial (synthesis result):            not A.l3
    Initial (uncontrolled system):         A.l1
    Initial (controlled system):           A.l1
    Initial (removed by supervisor):       false
    Initial (added by supervisor):         true

    Initial (output model):                n/a

Determining supervisor guards for output model:
    Event A.c: guard: A.l1.

Checking post-synthesis for events that are never enabled.

Simplifying supervisor guards for output model:
    Simplification under the assumption of the plants.

    Guards not changed.

Constructing output CIF specification.

Checking output CIF specification.

Writing output CIF file "datasynth/state_plant_invs_req_aut.ctrlsys.real.cif".
