Reading CIF file "datasynth/simplify_ctrl_beh_on.cif".

Preprocessing CIF specification (includes checking that the specification is supported).

Converting CIF specification to internal format (BDDs):
    CIF variables and location pointers:
        Nr     Kind               Type       Name  Group  BDD vars  CIF values  BDD values  Values used
        -----  -----------------  ---------  ----  -----  --------  ----------  ----------  -----------
        1      location pointer   n/a        p1    0      1 * 2     2 * 2       2 * 2       100%
        2      discrete variable  int[0..3]  p1.x  1      2 * 2     4 * 2       4 * 2       100%
        3      location pointer   n/a        p2    2      1 * 2     2 * 2       2 * 2       100%
        4      discrete variable  int[0..3]  p2.x  3      2 * 2     4 * 2       4 * 2       100%
        -----  -----------------  ---------  ----  -----  --------  ----------  ----------  -----------
        Total                                      4      12        24          24          100%

    Applying variable ordering:
        Applying 4 orderers, sequentially:
            Applying model variable order:
                Effect: both

            Applying DCSH algorithm:
                Metric: wes
                Relations: legacy
                Effect: var-order
                Number of hyper-edges: 8

                Applying Weighted Cuthill-McKee algorithm:
                    Node finder: george-liu
                    Relations: legacy
                    Effect: var-order
                    Number of graph edges: 2

                    Total span:   2 (total)   0.25 (avg/edge) / WES:   0.281250 (total)   0.035156 (avg/edge) [before]
                    Total span:   2 (total)   0.25 (avg/edge) / WES:   0.281250 (total)   0.035156 (avg/edge) [after]

                Found new best variable order.

                Applying Sloan algorithm:
                    Relations: legacy
                    Effect: var-order
                    Number of graph edges: 2

                    Total span:   2 (total)   0.25 (avg/edge) / WES:   0.281250 (total)   0.035156 (avg/edge) [before]
                    Total span:   2 (total)   0.25 (avg/edge) / WES:   0.281250 (total)   0.035156 (avg/edge) [after]

                Applying 2 orderers, sequentially:
                    Applying Weighted Cuthill-McKee algorithm:
                        Node finder: george-liu
                        Relations: legacy
                        Effect: var-order
                        Number of graph edges: 2

                        Total span:   2 (total)   0.25 (avg/edge) / WES:   0.281250 (total)   0.035156 (avg/edge) [before]
                        Total span:   2 (total)   0.25 (avg/edge) / WES:   0.281250 (total)   0.035156 (avg/edge) [after]

                    Reversing the variable order:
                        Relations: legacy
                        Effect: var-order
                        Number of hyper-edges: 8

                        Total span:   2 (total)   0.25 (avg/edge) / WES:   0.281250 (total)   0.035156 (avg/edge) [before]
                        Total span:   2 (total)   0.25 (avg/edge) / WES:   0.281250 (total)   0.035156 (avg/edge) [reversed]

                Found new best variable order.

                Applying 2 orderers, sequentially:
                    Applying Sloan algorithm:
                        Relations: legacy
                        Effect: var-order
                        Number of graph edges: 2

                        Total span:   2 (total)   0.25 (avg/edge) / WES:   0.281250 (total)   0.035156 (avg/edge) [before]
                        Total span:   2 (total)   0.25 (avg/edge) / WES:   0.281250 (total)   0.035156 (avg/edge) [after]

                    Reversing the variable order:
                        Relations: legacy
                        Effect: var-order
                        Number of hyper-edges: 8

                        Total span:   2 (total)   0.25 (avg/edge) / WES:   0.281250 (total)   0.035156 (avg/edge) [before]
                        Total span:   2 (total)   0.25 (avg/edge) / WES:   0.281250 (total)   0.035156 (avg/edge) [reversed]

            Applying FORCE algorithm:
                Metric: total-span
                Relations: linearized
                Effect: var-order
                Number of hyper-edges: 4
                Maximum number of iterations: 20

                Total span:   2 (total)   0.50 (avg/edge) / WES:   0.375000 (total)   0.093750 (avg/edge) [before]
                Total span:   2 (total)   0.50 (avg/edge) / WES:   0.375000 (total)   0.093750 (avg/edge) [iteration 1]
                Total span:   2 (total)   0.50 (avg/edge) / WES:   0.375000 (total)   0.093750 (avg/edge) [after]

            Applying sliding window algorithm:
                Size: 4
                Metric: total-span
                Relations: linearized
                Effect: var-order
                Number of hyper-edges: 4
                Window length: 4

                Total span:   2 (total)   0.50 (avg/edge) / WES:   0.375000 (total)   0.093750 (avg/edge) [before]
                Total span:   2 (total)   0.50 (avg/edge) / WES:   0.375000 (total)   0.093750 (avg/edge) [after]

    Variable order changed.

    CIF variables and location pointers:
        Nr     Kind               Type       Name  Group  BDD vars  CIF values  BDD values  Values used
        -----  -----------------  ---------  ----  -----  --------  ----------  ----------  -----------
        1      discrete variable  int[0..3]  p2.x  0      2 * 2     4 * 2       4 * 2       100%
        2      location pointer   n/a        p2    1      1 * 2     2 * 2       2 * 2       100%
        3      discrete variable  int[0..3]  p1.x  2      2 * 2     4 * 2       4 * 2       100%
        4      location pointer   n/a        p1    3      1 * 2     2 * 2       2 * 2       100%
        -----  -----------------  ---------  ----  -----  --------  ----------  ----------  -----------
        Total                                      4      12        24          24          100%

Starting data-based synthesis.

Synthesis input:
    Invariant (components state plant inv):      true
    Invariant (locations state plant invariant): true
    Invariant (system state plant invariant):    true

    Invariant (components state req invariant):  true
    Invariant (locations state req invariant):   true
    Invariant (system state req invariant):      true

    Initial   (discrete variable 0):             p2.x = 0
    Initial   (discrete variable 2):             p1.x = 0
    Initial   (discrete variables):              p2.x = 0 and p1.x = 0
    Initial   (components init predicate):       true
    Initial   (aut/locs init predicate):         p1.a
    Initial   (aut/locs init predicate):         p2.a
    Initial   (auts/locs init predicate):        p2.a and p1.a
    Initial   (uncontrolled system):             p2.x = 0 and p2.a and (p1.x = 0 and p1.a)
    Initial   (system, combined init/plant inv): p2.x = 0 and p2.a and (p1.x = 0 and p1.a)
    Initial   (system, combined init/state inv): p2.x = 0 and p2.a and (p1.x = 0 and p1.a)

    Marked    (components marker predicate):     true
    Marked    (aut/locs marker predicate):       p1.a
    Marked    (aut/locs marker predicate):       p2.a
    Marked    (auts/locs marker predicate):      p2.a and p1.a
    Marked    (uncontrolled system):             p2.a and p1.a
    Marked    (system, combined mark/plant inv): p2.a and p1.a
    Marked    (system, combined mark/state inv): p2.a and p1.a

    State/event exclusion plants:
        None

    State/event exclusion requirements:
        None

    Uncontrolled system:
        State: (controlled-behavior: ?)
            Edge: (event: c1) (guard: p1.a) (assignments: p1 := p1.b)
            Edge: (event: u1) (guard: (p1.x = 0 or p1.x = 1) and p1.b) (assignments: p1.x := p1.x + 1, p1 := p1.a)
            Edge: (event: c2) (guard: p2.a) (assignments: p2 := p2.b)
            Edge: (event: u2) (guard: (p2.x = 0 or p2.x = 1) and p2.b) (assignments: p2.x := p2.x + 1, p2 := p2.a)

Checking input for potential problems.

Restricting edge guards to prevent runtime errors:
    No guards changed.

Restricting uncontrolled system behavior using state/event exclusion plant invariants:
    No guards changed.

Initializing edges for being applied.

Restricting uncontrolled system behavior using state plant invariants:
    No restrictions needed.

Initializing controlled behavior:
    Controlled-behavior predicate: true.
    Controlled-initialization predicate: p2.x = 0 and p2.a and (p1.x = 0 and p1.a).

Restricting behavior using state requirements:
    Controlled behavior not changed.

Extending controlled-behavior predicate using variable ranges:
    Controlled behavior not changed.

Restricting behavior using state/event exclusion requirements:
    Guards and controlled behavior not changed.

Restricting behavior using implicit runtime error requirements:
    Controlled behavior not changed.

Re-initializing edges for being applied.

Checking pre-synthesis for events that are never enabled.

Synthesis round 1:
    Computing backward controlled-behavior predicate:
        Saturation matrix:
                 /------------ 1  p2.x#0
                 |/----------- 2  p2.x#0+
                 ||/---------- 3  p2.x#1
                 |||/--------- 4  p2.x#1+
                 ||||/-------- 5  p2#0
                 |||||/------- 6  p2#0+
                 ||||||/------ 7  p1.x#0
                 |||||||/----- 8  p1.x#0+
                 ||||||||/---- 9  p1.x#1
                 |||||||||/--- 10 p1.x#1+
                 ||||||||||/-- 11 p1#0
                 |||||||||||/- 12 p1#0+
            1 u2 rwrwrw
            2 c2     rw
            3 u1       rwrwrw
            4 c1           rw

        Backward controlled-behavior: p2.a and p1.a [marker predicate]
        Backward controlled-behavior: p1.a -> p1.x = 0 or (p1.x = 1 or p1.a) [backward reach using bounded saturation (transition: 3 of 4) (level: 7 of 12) with edge: (event: u1) (guard: (p1.x = 0 or p1.x = 1) and p1.b) (assignments: p1.x := p1.x + 1, p1 := p1.a)]
        Backward controlled-behavior: (p2.b or p1.x = 0 or (p1.x = 1 or p1.a)) and p2.a -> (p2.x = 2 or p2.x = 3 or (p1.x = 0 or (p1.x = 1 or p1.a))) and ((p2.x = 0 or (p2.x = 1 or p2.b) or (p1.x = 0 or (p1.x = 1 or p1.a))) and (p2.x = 0 or (p2.x = 1 or p2.a))) [backward reach using bounded saturation (transition: 1 of 4) (level: 1 of 12) with edge: (event: u2) (guard: (p2.x = 0 or p2.x = 1) and p2.b) (assignments: p2.x := p2.x + 1, p2 := p2.a)]

        Backward controlled-behavior: (p2.x = 2 or p2.x = 3 or (p1.x = 0 or (p1.x = 1 or p1.a))) and ((p2.x = 0 or (p2.x = 1 or p2.b) or (p1.x = 0 or (p1.x = 1 or p1.a))) and (p2.x = 0 or (p2.x = 1 or p2.a))) [fixed point].

        Controlled behavior: true -> (p2.x = 2 or p2.x = 3 or (p1.x = 0 or (p1.x = 1 or p1.a))) and ((p2.x = 0 or (p2.x = 1 or p2.b) or (p1.x = 0 or (p1.x = 1 or p1.a))) and (p2.x = 0 or (p2.x = 1 or p2.a))).

    Computing backward uncontrolled bad-state predicate:
        Saturation matrix:
                 /------------ 1  p2.x#0
                 |/----------- 2  p2.x#0+
                 ||/---------- 3  p2.x#1
                 |||/--------- 4  p2.x#1+
                 ||||/-------- 5  p2#0
                 |||||/------- 6  p2#0+
                 ||||||/------ 7  p1.x#0
                 |||||||/----- 8  p1.x#0+
                 ||||||||/---- 9  p1.x#1
                 |||||||||/--- 10 p1.x#1+
                 ||||||||||/-- 11 p1#0
                 |||||||||||/- 12 p1#0+
            1 u2 rwrwrw
            2 u1       rwrwrw

        Backward uncontrolled bad-state: (p2.x = 0 or p2.x = 1) and ((p1.x = 2 or p1.x = 3) and p1.b) or ((p2.x = 2 or p2.x = 3) and p2.a and ((p1.x = 2 or p1.x = 3) and p1.b) or (p2.x = 2 or p2.x = 3) and p2.b) [current/previous controlled behavior predicate]

        Controlled behavior not changed.

    Computing forward controlled-behavior predicate:
        Saturation matrix:
                 /------------ 1  p2.x#0
                 |/----------- 2  p2.x#0+
                 ||/---------- 3  p2.x#1
                 |||/--------- 4  p2.x#1+
                 ||||/-------- 5  p2#0
                 |||||/------- 6  p2#0+
                 ||||||/------ 7  p1.x#0
                 |||||||/----- 8  p1.x#0+
                 ||||||||/---- 9  p1.x#1
                 |||||||||/--- 10 p1.x#1+
                 ||||||||||/-- 11 p1#0
                 |||||||||||/- 12 p1#0+
            1 u2 rwrwrw
            2 c2     rw
            3 u1       rwrwrw
            4 c1           rw

        Forward controlled-behavior: p2.x = 0 and p2.a and (p1.x = 0 and p1.a) [initialization predicate]
        Forward controlled-behavior: p1.a -> true [forward reach using bounded saturation (transition: 4 of 4) (level: 11 of 12) with edge: (event: c1) (guard: p1.a) (assignments: p1 := p1.b)]
        Forward controlled-behavior: p1.x = 0 -> p1.x = 0 or p1.x = 1 and p1.a [forward reach using bounded saturation (transition: 3 of 4) (level: 7 of 12) with edge: (event: u1) (guard: (p1.x = 0 or p1.x = 1) and p1.b) (assignments: p1.x := p1.x + 1, p1 := p1.a)]
        Forward controlled-behavior: p1.x = 0 or p1.x = 1 -> (p1.x != 2 or p1.a) and p1.x != 3 [forward reach using bounded saturation (transition: 3 of 4) (level: 7 of 12) with edge: (event: u1) (guard: (p1.x = 0 or p1.x = 1) and p1.b) (assignments: p1.x := p1.x + 1, p1 := p1.a)]
        Forward controlled-behavior: (p2.b or (p1.x != 2 or p1.a)) and ((p2.b or p1.x != 3) and p2.a) -> (p1.x != 2 or p1.a) and p1.x != 3 [forward reach using bounded saturation (transition: 2 of 4) (level: 5 of 12) with edge: (event: c2) (guard: p2.a) (assignments: p2 := p2.b)]
        Forward controlled-behavior: p2.x = 0 and p1.x = 0 or (p2.x = 0 and (p1.x = 2 and p1.a) or p2.x = 0 and p1.x = 1) -> (p2.x != 0 or (p1.x != 2 or p1.a)) and ((p2.x != 0 or p1.x != 3) and p2.x != 2) and ((p2.x != 1 or p2.b or (p1.x != 2 or p1.a)) and (p2.x != 1 or (p2.b or p1.x != 3)) and ((p2.x != 1 or p2.a) and p2.x != 3)) [forward reach using bounded saturation (transition: 1 of 4) (level: 1 of 12) with edge: (event: u2) (guard: (p2.x = 0 or p2.x = 1) and p2.b) (assignments: p2.x := p2.x + 1, p2 := p2.a)]
        Forward controlled-behavior: (p2.b or (p1.x != 2 or p1.a)) and ((p2.b or p1.x != 3) and p2.a) -> (p1.x != 2 or p1.a) and p1.x != 3 [forward reach using bounded saturation (transition: 2 of 4) (level: 5 of 12) with edge: (event: c2) (guard: p2.a) (assignments: p2 := p2.b)]
        Forward controlled-behavior: (p2.x = 2 or p2.x = 3 or (p1.x != 2 or p1.a)) and ((p2.x = 2 or (p2.x = 3 or p1.x != 3)) and (p2.x = 0 or p2.x = 1)) -> (p2.x != 0 or (p1.x != 2 or p1.a)) and (p2.x != 0 or p1.x != 3) and ((p2.x != 2 or p2.b or (p1.x != 2 or p1.a)) and (p2.x != 2 or (p2.b or p1.x != 3))) and ((p2.x != 2 or p2.a) and (p2.x != 1 or (p1.x != 2 or p1.a)) and ((p2.x != 1 or p1.x != 3) and p2.x != 3)) [forward reach using bounded saturation (transition: 1 of 4) (level: 1 of 12) with edge: (event: u2) (guard: (p2.x = 0 or p2.x = 1) and p2.b) (assignments: p2.x := p2.x + 1, p2 := p2.a)]

        Forward controlled-behavior: (p2.x != 0 or (p1.x != 2 or p1.a)) and (p2.x != 0 or p1.x != 3) and ((p2.x != 2 or p2.b or (p1.x != 2 or p1.a)) and (p2.x != 2 or (p2.b or p1.x != 3))) and ((p2.x != 2 or p2.a) and (p2.x != 1 or (p1.x != 2 or p1.a)) and ((p2.x != 1 or p1.x != 3) and p2.x != 3)) [fixed point].

        Controlled behavior: (p2.x = 2 or p2.x = 3 or (p1.x = 0 or (p1.x = 1 or p1.a))) and ((p2.x = 0 or (p2.x = 1 or p2.b) or (p1.x = 0 or (p1.x = 1 or p1.a))) and (p2.x = 0 or (p2.x = 1 or p2.a))) -> (p2.x != 0 or (p1.x != 2 or p1.a)) and (p2.x != 0 or p1.x != 3) and ((p2.x != 2 or p2.b or (p1.x != 2 or p1.a)) and (p2.x != 2 or (p2.b or p1.x != 3))) and ((p2.x != 2 or p2.a) and (p2.x != 1 or (p1.x != 2 or p1.a)) and ((p2.x != 1 or p1.x != 3) and p2.x != 3)).

    Need another round.

Synthesis round 2:
    Computing backward controlled-behavior predicate:
        Saturation matrix:
                 /------------ 1  p2.x#0
                 |/----------- 2  p2.x#0+
                 ||/---------- 3  p2.x#1
                 |||/--------- 4  p2.x#1+
                 ||||/-------- 5  p2#0
                 |||||/------- 6  p2#0+
                 ||||||/------ 7  p1.x#0
                 |||||||/----- 8  p1.x#0+
                 ||||||||/---- 9  p1.x#1
                 |||||||||/--- 10 p1.x#1+
                 ||||||||||/-- 11 p1#0
                 |||||||||||/- 12 p1#0+
            1 u2 rwrwrw
            2 c2     rw
            3 u1       rwrwrw
            4 c1           rw

        Backward controlled-behavior: p2.a and p1.a [marker predicate]
        Backward controlled-behavior: p2.a and p1.a -> (p2.x = 0 or p2.x = 2) and p2.a and ((p1.x = 0 or p1.x = 2) and p1.a) or (p2.x = 0 or p2.x = 2) and p2.a and (p1.x = 1 and p1.a) or (p2.x = 1 and p2.a and ((p1.x = 0 or p1.x = 2) and p1.a) or p2.x = 1 and p2.a and (p1.x = 1 and p1.a)) [restricted to current/previous controlled-behavior predicate: (p2.x != 0 or (p1.x != 2 or p1.a)) and (p2.x != 0 or p1.x != 3) and ((p2.x != 2 or p2.b or (p1.x != 2 or p1.a)) and (p2.x != 2 or (p2.b or p1.x != 3))) and ((p2.x != 2 or p2.a) and (p2.x != 1 or (p1.x != 2 or p1.a)) and ((p2.x != 1 or p1.x != 3) and p2.x != 3))]
        Backward controlled-behavior: (p1.x = 0 or p1.x = 2) and p1.a or p1.x = 1 and p1.a -> (p1.x != 2 or p1.a) and p1.x != 3 [backward reach using bounded saturation (transition: 3 of 4) (level: 7 of 12) with edge: (event: u1) (guard: (p1.x = 0 or p1.x = 1) and p1.b) (assignments: p1.x := p1.x + 1, p1 := p1.a)]
        Backward controlled-behavior: (p2.x = 1 or p2.x = 3 or (p2.b or (p1.x != 2 or p1.a))) and ((p2.x = 1 or p2.x = 3 or (p2.b or p1.x != 3)) and (p2.x = 1 or (p2.x = 3 or p2.a))) and ((p2.x != 1 or p2.b or (p1.x != 2 or p1.a)) and (p2.x != 1 or (p2.b or p1.x != 3)) and ((p2.x != 1 or p2.a) and p2.x != 3)) -> (p2.x != 0 or (p1.x != 2 or p1.a)) and (p2.x != 0 or p1.x != 3) and ((p2.x != 2 or p2.b or (p1.x != 2 or p1.a)) and (p2.x != 2 or (p2.b or p1.x != 3))) and ((p2.x != 2 or p2.a) and (p2.x != 1 or (p1.x != 2 or p1.a)) and ((p2.x != 1 or p1.x != 3) and p2.x != 3)) [backward reach using bounded saturation (transition: 1 of 4) (level: 1 of 12) with edge: (event: u2) (guard: (p2.x = 0 or p2.x = 1) and p2.b) (assignments: p2.x := p2.x + 1, p2 := p2.a)]

        Backward controlled-behavior: (p2.x != 0 or (p1.x != 2 or p1.a)) and (p2.x != 0 or p1.x != 3) and ((p2.x != 2 or p2.b or (p1.x != 2 or p1.a)) and (p2.x != 2 or (p2.b or p1.x != 3))) and ((p2.x != 2 or p2.a) and (p2.x != 1 or (p1.x != 2 or p1.a)) and ((p2.x != 1 or p1.x != 3) and p2.x != 3)) [fixed point].

        Controlled behavior not changed.

    Computing backward uncontrolled bad-state predicate:
        Saturation matrix:
                 /------------ 1  p2.x#0
                 |/----------- 2  p2.x#0+
                 ||/---------- 3  p2.x#1
                 |||/--------- 4  p2.x#1+
                 ||||/-------- 5  p2#0
                 |||||/------- 6  p2#0+
                 ||||||/------ 7  p1.x#0
                 |||||||/----- 8  p1.x#0+
                 ||||||||/---- 9  p1.x#1
                 |||||||||/--- 10 p1.x#1+
                 ||||||||||/-- 11 p1#0
                 |||||||||||/- 12 p1#0+
            1 u2 rwrwrw
            2 u1       rwrwrw

        Backward uncontrolled bad-state: p2.x = 0 and (p1.x = 2 and p1.b) or p2.x = 0 and p1.x = 3 or (p2.x = 2 and p2.a and (p1.x = 2 and p1.b) or p2.x = 2 and (p2.a and p1.x = 3)) or (p2.x = 2 and p2.b or p2.x = 1 and (p1.x = 2 and p1.b) or (p2.x = 1 and p1.x = 3 or p2.x = 3)) [current/previous controlled behavior predicate]

        Controlled behavior not changed.

    Finished: controlled behavior is stable.

Computing final controlled system guards:
    Edge (event: c1) (guard: p1.a) (assignments: p1 := p1.b): guard: p1.a -> p2.x = 0 and ((p1.x = 0 or p1.x = 1) and p1.a) or (p2.x = 2 and p2.a and ((p1.x = 0 or p1.x = 1) and p1.a) or p2.x = 1 and ((p1.x = 0 or p1.x = 1) and p1.a)).
    Edge (event: c2) (guard: p2.a) (assignments: p2 := p2.b): guard: p2.a -> (p2.x = 0 or p2.x = 1) and (p2.a and p1.x = 0) or ((p2.x = 0 or p2.x = 1) and p2.a and (p1.x = 2 and p1.a) or (p2.x = 0 or p2.x = 1) and (p2.a and p1.x = 1)).

Cleaning up cached predicate of edges that were used when applying edges.

Final synthesis result:
    State: (controlled-behavior: (p2.x != 0 or (p1.x != 2 or p1.a)) and (p2.x != 0 or p1.x != 3) and ((p2.x != 2 or p2.b or (p1.x != 2 or p1.a)) and (p2.x != 2 or (p2.b or p1.x != 3))) and ((p2.x != 2 or p2.a) and (p2.x != 1 or (p1.x != 2 or p1.a)) and ((p2.x != 1 or p1.x != 3) and p2.x != 3)))
        Edge: (event: c1) (guard: p1.a -> p2.x = 0 and ((p1.x = 0 or p1.x = 1) and p1.a) or (p2.x = 2 and p2.a and ((p1.x = 0 or p1.x = 1) and p1.a) or p2.x = 1 and ((p1.x = 0 or p1.x = 1) and p1.a))) (assignments: p1 := p1.b)
        Edge: (event: u1) (guard: (p1.x = 0 or p1.x = 1) and p1.b) (assignments: p1.x := p1.x + 1, p1 := p1.a)
        Edge: (event: c2) (guard: p2.a -> (p2.x = 0 or p2.x = 1) and (p2.a and p1.x = 0) or ((p2.x = 0 or p2.x = 1) and p2.a and (p1.x = 2 and p1.a) or (p2.x = 0 or p2.x = 1) and (p2.a and p1.x = 1))) (assignments: p2 := p2.b)
        Edge: (event: u2) (guard: (p2.x = 0 or p2.x = 1) and p2.b) (assignments: p2.x := p2.x + 1, p2 := p2.a)

Computing initialization predicate of the controlled system.

Controlled system: exactly 25 states.

Determining initialization predicate for output model:
    Initial (synthesis result):            (p2.x != 0 or (p1.x != 2 or p1.a)) and (p2.x != 0 or p1.x != 3) and ((p2.x != 2 or p2.b or (p1.x != 2 or p1.a)) and (p2.x != 2 or (p2.b or p1.x != 3))) and ((p2.x != 2 or p2.a) and (p2.x != 1 or (p1.x != 2 or p1.a)) and ((p2.x != 1 or p1.x != 3) and p2.x != 3))
    Initial (uncontrolled system):         p2.x = 0 and p2.a and (p1.x = 0 and p1.a)
    Initial (controlled system):           p2.x = 0 and p2.a and (p1.x = 0 and p1.a)
    Initial (removed by supervisor):       false
    Initial (added by supervisor):         true

    Initial (output model):                n/a

Determining supervisor guards for output model:
    Event c1: guard: p2.x = 0 and ((p1.x = 0 or p1.x = 1) and p1.a) or (p2.x = 2 and p2.a and ((p1.x = 0 or p1.x = 1) and p1.a) or p2.x = 1 and ((p1.x = 0 or p1.x = 1) and p1.a)).
    Event c2: guard: (p2.x = 0 or p2.x = 1) and (p2.a and p1.x = 0) or ((p2.x = 0 or p2.x = 1) and p2.a and (p1.x = 2 and p1.a) or (p2.x = 0 or p2.x = 1) and (p2.a and p1.x = 1)).

Checking post-synthesis for events that are never enabled.

Simplifying supervisor guards for output model:
    Simplification under the assumption of the controlled behavior.

    Event c1: guard: p2.x = 0 and ((p1.x = 0 or p1.x = 1) and p1.a) or (p2.x = 2 and p2.a and ((p1.x = 0 or p1.x = 1) and p1.a) or p2.x = 1 and ((p1.x = 0 or p1.x = 1) and p1.a)) -> (p1.x = 0 or p1.x = 1) and p1.a [assume (p2.x != 0 or (p1.x != 2 or p1.a)) and (p2.x != 0 or p1.x != 3) and ((p2.x != 2 or p2.b or (p1.x != 2 or p1.a)) and (p2.x != 2 or (p2.b or p1.x != 3))) and ((p2.x != 2 or p2.a) and (p2.x != 1 or (p1.x != 2 or p1.a)) and ((p2.x != 1 or p1.x != 3) and p2.x != 3))].
    Event c2: guard: (p2.x = 0 or p2.x = 1) and (p2.a and p1.x = 0) or ((p2.x = 0 or p2.x = 1) and p2.a and (p1.x = 2 and p1.a) or (p2.x = 0 or p2.x = 1) and (p2.a and p1.x = 1)) -> (p2.x = 0 or p2.x = 1) and p2.a [assume (p2.x != 0 or (p1.x != 2 or p1.a)) and (p2.x != 0 or p1.x != 3) and ((p2.x != 2 or p2.b or (p1.x != 2 or p1.a)) and (p2.x != 2 or (p2.b or p1.x != 3))) and ((p2.x != 2 or p2.a) and (p2.x != 1 or (p1.x != 2 or p1.a)) and ((p2.x != 1 or p1.x != 3) and p2.x != 3))].

Constructing output CIF specification.

Checking output CIF specification.

Writing output CIF file "datasynth/simplify_ctrl_beh_on.ctrlsys.real.cif".
