Loading CIF specification "controllercheck/non_blocking_under_control/buc_intermediate_unctrl.cif".
Checking for non-blocking under control:
    Converting CIF specification to a BDD representation:
        CIF variables and location pointers:
            Nr     Kind              Type  Name        Group  BDD vars  CIF values  BDD values  Values used
            -----  ----------------  ----  ----------  -----  --------  ----------  ----------  -----------
            1      location pointer  n/a   Supervisor  0      2 * 2     4 * 2       4 * 2       100%
            -----  ----------------  ----  ----------  -----  --------  ----------  ----------  -----------
            Total                                      1      4         8           8           100%

        Skipping variable ordering: only one variable present.

        Restricting system behavior using state/event exclusion plant invariants:
            No guards changed.

    Computing the condition for no controllable event to be enabled:
        Condition under which no controllable event is enabled: Supervisor.BothDone or Supervisor.Halt

    Computing the controllable-complete path states:
        Saturation matrix:
                                         /---- 1 Supervisor#0
                                         |/--- 2 Supervisor#0+
                                         ||/-- 3 Supervisor#1
                                         |||/- 4 Supervisor#1+
            1 Supervisor.c_act1          rwrw
            2 Supervisor.c_act2          rwrw
            3 Supervisor.u_button_pushed rwrw

        Controllable-complete path states: Supervisor.Halt [controllable-complete path end states predicate]

        Controllable-complete path states: Supervisor.Halt

    Computing the bad states:
        Saturation matrix:
                                         /---- 1 Supervisor#0
                                         |/--- 2 Supervisor#0+
                                         ||/-- 3 Supervisor#1
                                         |||/- 4 Supervisor#1+
            1 Supervisor.c_act1          rwrw
            2 Supervisor.c_act2          rwrw
            3 Supervisor.u_button_pushed rwrw

        Bad states: not Supervisor.Halt [not controllable-complete path states predicate]

        Bad states: not Supervisor.Halt

    Computing the result of the non-blocking under control check:
        Initial states: Supervisor.Start
        Bad initial states: Supervisor.Start

    Non-blocking under control: no

CONCLUSION:
    [UNKNOWN] Bounded response checking was disabled, bounded response property is unknown.
    [ERROR] The specification is NOT non-blocking under control.
    [UNKNOWN] Finite response checking was disabled, finite response property is unknown.
    [UNKNOWN] Confluence checking was disabled, confluence property is unknown.

The model with the check results has been written to "controllercheck/non_blocking_under_control/buc_intermediate_unctrl.xxxN.out.cif.real".
