Loading CIF specification "controllercheck/bounded_response/bounded_channel_non_deterministic_unctrl.cif".
Checking for bounded response:
    Converting CIF specification to a BDD representation:
        CIF variables and location pointers:
            Nr     Kind              Type  Name    Group  BDD vars  CIF values  BDD values  Values used
            -----  ----------------  ----  ------  -----  --------  ----------  ----------  -----------
            1      location pointer  n/a   usend1  0      1 * 2     2 * 2       2 * 2       100%
            2      location pointer  n/a   usend2  1      1 * 2     2 * 2       2 * 2       100%
            3      location pointer  n/a   usend3  2      1 * 2     2 * 2       2 * 2       100%
            4      location pointer  n/a   urecv1  3      1 * 2     2 * 2       2 * 2       100%
            5      location pointer  n/a   urecv2  4      1 * 2     2 * 2       2 * 2       100%
            6      location pointer  n/a   urecv3  5      1 * 2     2 * 2       2 * 2       100%
            7      location pointer  n/a   urecv4  6      1 * 2     2 * 2       2 * 2       100%
            -----  ----------------  ----  ------  -----  --------  ----------  ----------  -----------
            Total                                  7      14        28          28          100%

        Applying variable ordering:
            Applying 4 orderers, sequentially:
                Applying sorted variable order:
                    Effect: both

                Applying DCSH algorithm:
                    Metric: wes
                    Relations: legacy
                    Effect: var-order
                    Number of hyper-edges: 1

                    Applying Weighted Cuthill-McKee algorithm:
                        Node finder: george-liu
                        Relations: legacy
                        Effect: var-order
                        Number of graph edges: 21

                        Total span:   6 (total)   6.00 (avg/edge) / WES:   1.714286 (total)   1.714286 (avg/edge) [before]
                        Total span:   6 (total)   6.00 (avg/edge) / WES:   1.714286 (total)   1.714286 (avg/edge) [after]

                    Found new best variable order.

                    Applying Sloan algorithm:
                        Relations: legacy
                        Effect: var-order
                        Number of graph edges: 21

                        Total span:   6 (total)   6.00 (avg/edge) / WES:   1.714286 (total)   1.714286 (avg/edge) [before]
                        Total span:   6 (total)   6.00 (avg/edge) / WES:   1.714286 (total)   1.714286 (avg/edge) [after]

                    Applying 2 orderers, sequentially:
                        Applying Weighted Cuthill-McKee algorithm:
                            Node finder: george-liu
                            Relations: legacy
                            Effect: var-order
                            Number of graph edges: 21

                            Total span:   6 (total)   6.00 (avg/edge) / WES:   1.714286 (total)   1.714286 (avg/edge) [before]
                            Total span:   6 (total)   6.00 (avg/edge) / WES:   1.714286 (total)   1.714286 (avg/edge) [after]

                        Reversing the variable order:
                            Relations: legacy
                            Effect: var-order
                            Number of hyper-edges: 1

                            Total span:   6 (total)   6.00 (avg/edge) / WES:   1.714286 (total)   1.714286 (avg/edge) [before]
                            Total span:   6 (total)   6.00 (avg/edge) / WES:   1.714286 (total)   1.714286 (avg/edge) [reversed]

                    Applying 2 orderers, sequentially:
                        Applying Sloan algorithm:
                            Relations: legacy
                            Effect: var-order
                            Number of graph edges: 21

                            Total span:   6 (total)   6.00 (avg/edge) / WES:   1.714286 (total)   1.714286 (avg/edge) [before]
                            Total span:   6 (total)   6.00 (avg/edge) / WES:   1.714286 (total)   1.714286 (avg/edge) [after]

                        Reversing the variable order:
                            Relations: legacy
                            Effect: var-order
                            Number of hyper-edges: 1

                            Total span:   6 (total)   6.00 (avg/edge) / WES:   1.714286 (total)   1.714286 (avg/edge) [before]
                            Total span:   6 (total)   6.00 (avg/edge) / WES:   1.714286 (total)   1.714286 (avg/edge) [reversed]

                Applying FORCE algorithm:
                    Metric: total-span
                    Relations: linearized
                    Effect: var-order
                    Number of hyper-edges: 12
                    Maximum number of iterations: 20

                    Total span:   42 (total)   3.50 (avg/edge) / WES:   0.945578 (total)   0.078798 (avg/edge) [before]
                    Total span:   28 (total)   2.33 (avg/edge) / WES:   0.612245 (total)   0.051020 (avg/edge) [iteration 1]
                    Total span:   28 (total)   2.33 (avg/edge) / WES:   0.612245 (total)   0.051020 (avg/edge) [iteration 2]
                    Total span:   28 (total)   2.33 (avg/edge) / WES:   0.612245 (total)   0.051020 (avg/edge) [after]

                Applying sliding window algorithm:
                    Size: 4
                    Metric: total-span
                    Relations: linearized
                    Effect: var-order
                    Number of hyper-edges: 12
                    Window length: 4

                    Total span:   28 (total)   2.33 (avg/edge) / WES:   0.612245 (total)   0.051020 (avg/edge) [before]
                    Total span:   28 (total)   2.33 (avg/edge) / WES:   0.612245 (total)   0.051020 (avg/edge) [after]

        Variable order changed.

        CIF variables and location pointers:
            Nr     Kind              Type  Name    Group  BDD vars  CIF values  BDD values  Values used
            -----  ----------------  ----  ------  -----  --------  ----------  ----------  -----------
            1      location pointer  n/a   urecv1  0      1 * 2     2 * 2       2 * 2       100%
            2      location pointer  n/a   usend1  1      1 * 2     2 * 2       2 * 2       100%
            3      location pointer  n/a   urecv2  2      1 * 2     2 * 2       2 * 2       100%
            4      location pointer  n/a   usend2  3      1 * 2     2 * 2       2 * 2       100%
            5      location pointer  n/a   urecv3  4      1 * 2     2 * 2       2 * 2       100%
            6      location pointer  n/a   usend3  5      1 * 2     2 * 2       2 * 2       100%
            7      location pointer  n/a   urecv4  6      1 * 2     2 * 2       2 * 2       100%
            -----  ----------------  ----  ------  -----  --------  ----------  ----------  -----------
            Total                                  7      14        28          28          100%

        Restricting system behavior using state/event exclusion plant invariants:
            No guards changed.

    Computing states we can be in at the start of uncontrollable and controllable event loops:
        Round 1:
            Pre input states: urecv1.loc1 and (usend1.loc1 and urecv2.loc1) and (usend2.loc1 and urecv3.loc1 and (usend3.loc1 and urecv4.loc1))
            Pre uncontrollables states: false
            Pre controllables states: false

            Applying event loop for input variable events:
                No input variable events.

            Pre uncontrollables states: false -> urecv1.loc1 and (usend1.loc1 and urecv2.loc1) and (usend2.loc1 and urecv3.loc1 and (usend3.loc1 and urecv4.loc1))

            Applying event loop for uncontrollable events:
                Iteration 1 (states before iteration: urecv1.loc1 and (usend1.loc1 and urecv2.loc1) and (usend2.loc1 and urecv3.loc1 and (usend3.loc1 and urecv4.loc1))):
                    Event u_chan: urecv1.loc1 and (usend1.loc1 and urecv2.loc1) and (usend2.loc1 and urecv3.loc1 and (usend3.loc1 and urecv4.loc1)) -> urecv1.loc2 and (usend1.loc2 and urecv2.loc1) and (usend2.loc1 and urecv3.loc1 and (usend3.loc1 and urecv4.loc1))
                    All iterations end states: urecv1.loc2 and (usend1.loc2 and urecv2.loc1) and (usend2.loc1 and urecv3.loc1 and (usend3.loc1 and urecv4.loc1))

                Iteration 2 (states before iteration: urecv1.loc2 and (usend1.loc2 and urecv2.loc1) and (usend2.loc1 and urecv3.loc1 and (usend3.loc1 and urecv4.loc1))):
                    Event u_chan: urecv1.loc2 and (usend1.loc2 and urecv2.loc1) and (usend2.loc1 and urecv3.loc1 and (usend3.loc1 and urecv4.loc1)) -> urecv1.loc2 and (usend1.loc2 and urecv2.loc2) and (usend2.loc2 and urecv3.loc1 and (usend3.loc1 and urecv4.loc1))
                    All iterations end states: urecv1.loc2 and (usend1.loc2 and urecv2.loc1) and (usend2.loc1 and urecv3.loc1 and (usend3.loc1 and urecv4.loc1)) or urecv1.loc2 and (usend1.loc2 and urecv2.loc2) and (usend2.loc2 and urecv3.loc1 and (usend3.loc1 and urecv4.loc1))

                Iteration 3 (states before iteration: urecv1.loc2 and (usend1.loc2 and urecv2.loc2) and (usend2.loc2 and urecv3.loc1 and (usend3.loc1 and urecv4.loc1))):
                    Event u_chan: urecv1.loc2 and (usend1.loc2 and urecv2.loc2) and (usend2.loc2 and urecv3.loc1 and (usend3.loc1 and urecv4.loc1)) -> urecv1.loc2 and (usend1.loc2 and urecv2.loc2) and (usend2.loc2 and urecv3.loc2 and (usend3.loc2 and urecv4.loc1))
                    All iterations end states: urecv1.loc2 and (usend1.loc2 and urecv2.loc1) and (usend2.loc1 and urecv3.loc1 and (usend3.loc1 and urecv4.loc1)) or (urecv1.loc2 and (usend1.loc2 and urecv2.loc2) and (usend2.loc2 and urecv3.loc1 and (usend3.loc1 and urecv4.loc1)) or urecv1.loc2 and (usend1.loc2 and urecv2.loc2) and (usend2.loc2 and urecv3.loc2 and (usend3.loc2 and urecv4.loc1)))

                Iteration 4 (states before iteration: urecv1.loc2 and (usend1.loc2 and urecv2.loc2) and (usend2.loc2 and urecv3.loc2 and (usend3.loc2 and urecv4.loc1))):
                    0 edges enabled. No state changes.
                    All iterations end states: urecv1.loc2 and (usend1.loc2 and urecv2.loc1) and (usend2.loc1 and urecv3.loc1 and (usend3.loc1 and urecv4.loc1)) or (urecv1.loc2 and (usend1.loc2 and urecv2.loc2) and (usend2.loc2 and urecv3.loc1 and (usend3.loc1 and urecv4.loc1)) or urecv1.loc2 and (usend1.loc2 and urecv2.loc2) and (usend2.loc2 and urecv3.loc2 and (usend3.loc2 and urecv4.loc1)))

            Pre controllables states: false -> urecv1.loc2 and (usend1.loc2 and urecv2.loc2) and (usend2.loc2 and urecv3.loc2 and (usend3.loc2 and urecv4.loc1))

            Applying event loop for controllable events:
                No controllable events.

            Pre input states: urecv1.loc1 and (usend1.loc1 and urecv2.loc1) and (usend2.loc1 and urecv3.loc1 and (usend3.loc1 and urecv4.loc1)) -> <bdd 12n 2p>

        Round 2:
            Pre input states: <bdd 12n 2p>
            Pre uncontrollables states: urecv1.loc1 and (usend1.loc1 and urecv2.loc1) and (usend2.loc1 and urecv3.loc1 and (usend3.loc1 and urecv4.loc1))
            Pre controllables states: urecv1.loc2 and (usend1.loc2 and urecv2.loc2) and (usend2.loc2 and urecv3.loc2 and (usend3.loc2 and urecv4.loc1))

            Applying event loop for input variable events:
                No input variable events.

            Pre uncontrollables states: urecv1.loc1 and (usend1.loc1 and urecv2.loc1) and (usend2.loc1 and urecv3.loc1 and (usend3.loc1 and urecv4.loc1)) -> <bdd 12n 2p>

            Applying event loop for uncontrollable events:
                Iteration 1 (states before iteration: <bdd 12n 2p>):
                    Event u_chan: <bdd 12n 2p> -> urecv1.loc2 and (usend1.loc2 and urecv2.loc1) and (usend2.loc1 and urecv3.loc1 and (usend3.loc1 and urecv4.loc1)) or urecv1.loc2 and (usend1.loc2 and urecv2.loc2) and (usend2.loc2 and urecv3.loc2 and (usend3.loc2 and urecv4.loc1))
                    All iterations end states: urecv1.loc2 and (usend1.loc2 and urecv2.loc1) and (usend2.loc1 and urecv3.loc1 and (usend3.loc1 and urecv4.loc1)) or urecv1.loc2 and (usend1.loc2 and urecv2.loc2) and (usend2.loc2 and urecv3.loc2 and (usend3.loc2 and urecv4.loc1))

                Iteration 2 (states before iteration: urecv1.loc2 and (usend1.loc2 and urecv2.loc1) and (usend2.loc1 and urecv3.loc1 and (usend3.loc1 and urecv4.loc1)) or urecv1.loc2 and (usend1.loc2 and urecv2.loc2) and (usend2.loc2 and urecv3.loc2 and (usend3.loc2 and urecv4.loc1))):
                    Event u_chan: urecv1.loc2 and (usend1.loc2 and urecv2.loc1) and (usend2.loc1 and urecv3.loc1 and (usend3.loc1 and urecv4.loc1)) or urecv1.loc2 and (usend1.loc2 and urecv2.loc2) and (usend2.loc2 and urecv3.loc2 and (usend3.loc2 and urecv4.loc1)) -> urecv1.loc2 and (usend1.loc2 and urecv2.loc2) and (usend2.loc2 and urecv3.loc1 and (usend3.loc1 and urecv4.loc1)) or urecv1.loc2 and (usend1.loc2 and urecv2.loc2) and (usend2.loc2 and urecv3.loc2 and (usend3.loc2 and urecv4.loc1))
                    All iterations end states: urecv1.loc2 and (usend1.loc2 and urecv2.loc1) and (usend2.loc1 and urecv3.loc1 and (usend3.loc1 and urecv4.loc1)) or (urecv1.loc2 and (usend1.loc2 and urecv2.loc2) and (usend2.loc2 and urecv3.loc1 and (usend3.loc1 and urecv4.loc1)) or urecv1.loc2 and (usend1.loc2 and urecv2.loc2) and (usend2.loc2 and urecv3.loc2 and (usend3.loc2 and urecv4.loc1)))

                Iteration 3 (states before iteration: urecv1.loc2 and (usend1.loc2 and urecv2.loc2) and (usend2.loc2 and urecv3.loc1 and (usend3.loc1 and urecv4.loc1)) or urecv1.loc2 and (usend1.loc2 and urecv2.loc2) and (usend2.loc2 and urecv3.loc2 and (usend3.loc2 and urecv4.loc1))):
                    Event u_chan: urecv1.loc2 and (usend1.loc2 and urecv2.loc2) and (usend2.loc2 and urecv3.loc1 and (usend3.loc1 and urecv4.loc1)) or urecv1.loc2 and (usend1.loc2 and urecv2.loc2) and (usend2.loc2 and urecv3.loc2 and (usend3.loc2 and urecv4.loc1)) -> urecv1.loc2 and (usend1.loc2 and urecv2.loc2) and (usend2.loc2 and urecv3.loc2 and (usend3.loc2 and urecv4.loc1))
                    All iterations end states: urecv1.loc2 and (usend1.loc2 and urecv2.loc1) and (usend2.loc1 and urecv3.loc1 and (usend3.loc1 and urecv4.loc1)) or (urecv1.loc2 and (usend1.loc2 and urecv2.loc2) and (usend2.loc2 and urecv3.loc1 and (usend3.loc1 and urecv4.loc1)) or urecv1.loc2 and (usend1.loc2 and urecv2.loc2) and (usend2.loc2 and urecv3.loc2 and (usend3.loc2 and urecv4.loc1)))

            Applying event loop for controllable events:
                No controllable events.

        Round 3:
            Pre input states: <bdd 12n 2p>
            Pre uncontrollables states: <bdd 12n 2p>
            Pre controllables states: urecv1.loc2 and (usend1.loc2 and urecv2.loc2) and (usend2.loc2 and urecv3.loc2 and (usend3.loc2 and urecv4.loc1))

            Applying event loop for input variable events:
                No input variable events.

            Applying event loop for uncontrollable events:
                Iteration 1 (states before iteration: <bdd 12n 2p>):
                    Event u_chan: <bdd 12n 2p> -> urecv1.loc2 and (usend1.loc2 and urecv2.loc1) and (usend2.loc1 and urecv3.loc1 and (usend3.loc1 and urecv4.loc1)) or urecv1.loc2 and (usend1.loc2 and urecv2.loc2) and (usend2.loc2 and urecv3.loc2 and (usend3.loc2 and urecv4.loc1))
                    All iterations end states: urecv1.loc2 and (usend1.loc2 and urecv2.loc1) and (usend2.loc1 and urecv3.loc1 and (usend3.loc1 and urecv4.loc1)) or urecv1.loc2 and (usend1.loc2 and urecv2.loc2) and (usend2.loc2 and urecv3.loc2 and (usend3.loc2 and urecv4.loc1))

                Iteration 2 (states before iteration: urecv1.loc2 and (usend1.loc2 and urecv2.loc1) and (usend2.loc1 and urecv3.loc1 and (usend3.loc1 and urecv4.loc1)) or urecv1.loc2 and (usend1.loc2 and urecv2.loc2) and (usend2.loc2 and urecv3.loc2 and (usend3.loc2 and urecv4.loc1))):
                    Event u_chan: urecv1.loc2 and (usend1.loc2 and urecv2.loc1) and (usend2.loc1 and urecv3.loc1 and (usend3.loc1 and urecv4.loc1)) or urecv1.loc2 and (usend1.loc2 and urecv2.loc2) and (usend2.loc2 and urecv3.loc2 and (usend3.loc2 and urecv4.loc1)) -> urecv1.loc2 and (usend1.loc2 and urecv2.loc2) and (usend2.loc2 and urecv3.loc1 and (usend3.loc1 and urecv4.loc1)) or urecv1.loc2 and (usend1.loc2 and urecv2.loc2) and (usend2.loc2 and urecv3.loc2 and (usend3.loc2 and urecv4.loc1))
                    All iterations end states: urecv1.loc2 and (usend1.loc2 and urecv2.loc1) and (usend2.loc1 and urecv3.loc1 and (usend3.loc1 and urecv4.loc1)) or (urecv1.loc2 and (usend1.loc2 and urecv2.loc2) and (usend2.loc2 and urecv3.loc1 and (usend3.loc1 and urecv4.loc1)) or urecv1.loc2 and (usend1.loc2 and urecv2.loc2) and (usend2.loc2 and urecv3.loc2 and (usend3.loc2 and urecv4.loc1)))

                Iteration 3 (states before iteration: urecv1.loc2 and (usend1.loc2 and urecv2.loc2) and (usend2.loc2 and urecv3.loc1 and (usend3.loc1 and urecv4.loc1)) or urecv1.loc2 and (usend1.loc2 and urecv2.loc2) and (usend2.loc2 and urecv3.loc2 and (usend3.loc2 and urecv4.loc1))):
                    Event u_chan: urecv1.loc2 and (usend1.loc2 and urecv2.loc2) and (usend2.loc2 and urecv3.loc1 and (usend3.loc1 and urecv4.loc1)) or urecv1.loc2 and (usend1.loc2 and urecv2.loc2) and (usend2.loc2 and urecv3.loc2 and (usend3.loc2 and urecv4.loc1)) -> urecv1.loc2 and (usend1.loc2 and urecv2.loc2) and (usend2.loc2 and urecv3.loc2 and (usend3.loc2 and urecv4.loc1))
                    All iterations end states: urecv1.loc2 and (usend1.loc2 and urecv2.loc1) and (usend2.loc1 and urecv3.loc1 and (usend3.loc1 and urecv4.loc1)) or (urecv1.loc2 and (usend1.loc2 and urecv2.loc2) and (usend2.loc2 and urecv3.loc1 and (usend3.loc1 and urecv4.loc1)) or urecv1.loc2 and (usend1.loc2 and urecv2.loc2) and (usend2.loc2 and urecv3.loc2 and (usend3.loc2 and urecv4.loc1)))

            Applying event loop for controllable events:
                No controllable events.

    Computing bound for uncontrollable events:
        Iteration 1 (states before iteration: <bdd 12n 2p>):
            Event u_chan: <bdd 12n 2p> -> urecv1.loc2 and (usend1.loc2 and urecv2.loc1) and (usend2.loc1 and urecv3.loc1 and (usend3.loc1 and urecv4.loc1)) or urecv1.loc2 and (usend1.loc2 and urecv2.loc2) and (usend2.loc2 and urecv3.loc2 and (usend3.loc2 and urecv4.loc1))

        Iteration 2 (states before iteration: urecv1.loc2 and (usend1.loc2 and urecv2.loc1) and (usend2.loc1 and urecv3.loc1 and (usend3.loc1 and urecv4.loc1)) or urecv1.loc2 and (usend1.loc2 and urecv2.loc2) and (usend2.loc2 and urecv3.loc2 and (usend3.loc2 and urecv4.loc1))):
            Event u_chan: urecv1.loc2 and (usend1.loc2 and urecv2.loc1) and (usend2.loc1 and urecv3.loc1 and (usend3.loc1 and urecv4.loc1)) or urecv1.loc2 and (usend1.loc2 and urecv2.loc2) and (usend2.loc2 and urecv3.loc2 and (usend3.loc2 and urecv4.loc1)) -> urecv1.loc2 and (usend1.loc2 and urecv2.loc2) and (usend2.loc2 and urecv3.loc1 and (usend3.loc1 and urecv4.loc1)) or urecv1.loc2 and (usend1.loc2 and urecv2.loc2) and (usend2.loc2 and urecv3.loc2 and (usend3.loc2 and urecv4.loc1))

        Iteration 3 (states before iteration: urecv1.loc2 and (usend1.loc2 and urecv2.loc2) and (usend2.loc2 and urecv3.loc1 and (usend3.loc1 and urecv4.loc1)) or urecv1.loc2 and (usend1.loc2 and urecv2.loc2) and (usend2.loc2 and urecv3.loc2 and (usend3.loc2 and urecv4.loc1))):
            Event u_chan: urecv1.loc2 and (usend1.loc2 and urecv2.loc2) and (usend2.loc2 and urecv3.loc1 and (usend3.loc1 and urecv4.loc1)) or urecv1.loc2 and (usend1.loc2 and urecv2.loc2) and (usend2.loc2 and urecv3.loc2 and (usend3.loc2 and urecv4.loc1)) -> urecv1.loc2 and (usend1.loc2 and urecv2.loc2) and (usend2.loc2 and urecv3.loc2 and (usend3.loc2 and urecv4.loc1))

        Iteration 4 (states before iteration: urecv1.loc2 and (usend1.loc2 and urecv2.loc2) and (usend2.loc2 and urecv3.loc2 and (usend3.loc2 and urecv4.loc1))):
            0 edges enabled. No state changes.

        Bound: 3.

    Computing bound for controllable events:
        No controllable events.

        Bound: 0.

    Bounded response check completed.

CONCLUSION:
    [OK] The specification has bounded response:

        - At most 3 iterations are needed for the event loop for uncontrollable events.
        - No transitions are possible for controllable events.

    [UNKNOWN] Non-blocking under control checking was disabled, non-blocking under control property is unknown.
    [UNKNOWN] Finite response checking was disabled, finite response property is unknown.
    [UNKNOWN] Confluence checking was disabled, confluence property is unknown.

The model with the check results has been written to "controllercheck/bounded_response/bounded_channel_non_deterministic_unctrl.Bxxx.out.cif.real".
