Loading CIF specification "controllercheck/finite_response/mult_iterations.cif".
Checking for finite response:
    Converting CIF specification to an MDD representation:
        Analyzing automaton "Actuator2":
            Initializing the automaton data for event "Actuator2.c_on".
            Initializing the automaton data for event "Actuator2.c_off".
            Processing edges from location "Off" of automaton "Actuator2".
            Processing edges from location "On" of automaton "Actuator2".
            Updating global guards for event "Actuator2.c_on".
            Updating global guards for event "Actuator2.c_off".

        Analyzing automaton "Actuator1":
            Initializing the automaton data for event "Actuator1.c_on".
            Initializing the automaton data for event "Actuator1.c_off".
            Processing edges from location "Off" of automaton "Actuator1".
            Processing edges from location "On" of automaton "Actuator1".
            Updating global guards for event "Actuator1.c_on".
            Updating global guards for event "Actuator1.c_off".

        Analyzing automaton "SupervisorStateEvtExcls":
            Initializing the automaton data for event "Actuator1.c_on".
            Initializing the automaton data for event "Actuator1.c_off".
            Initializing the automaton data for event "Actuator2.c_on".
            Initializing the automaton data for event "Actuator2.c_off".
            Processing edges from the location of automaton "SupervisorStateEvtExcls".
            Updating global guards for event "Actuator1.c_on".
            Updating global guards for event "Actuator1.c_off".
            Updating global guards for event "Actuator2.c_on".
            Updating global guards for event "Actuator2.c_off".

    Iteration 1.
        The following events have been encountered in a controllable-event loop of automaton Actuator2:
            (Actuator2.c_on Actuator2.c_off), which is not controllable unconnectable.
        The following events have been encountered in a controllable-event loop of automaton Actuator1:
            (Actuator1.c_on Actuator1.c_off), which is controllable unconnectable.
        The following events have been encountered in a controllable-event loop of automaton SupervisorStateEvtExcls:
            (Actuator2.c_on), which is not controllable unconnectable.
            (Actuator2.c_off), which is not controllable unconnectable.

    Iteration 2.
        The following events have been encountered in a controllable-event loop of automaton Actuator2:
            (Actuator2.c_on Actuator2.c_off), which is controllable unconnectable.

CONCLUSION:
    [UNKNOWN] Bounded response checking was disabled, bounded response property is unknown.
    [UNKNOWN] Non-blocking under control checking was disabled, non-blocking under control property is unknown.
    [OK] The specification has finite response.
    [UNKNOWN] Confluence checking was disabled, confluence property is unknown.

The model with the check results has been written to "controllercheck/finite_response/mult_iterations.xxFx.out.cif.real".
