<?xml version="1.0" encoding="UTF-8"?><svg xmlns="http://www.w3.org/2000/svg" xmlns:xlink="http://www.w3.org/1999/xlink" stroke-dasharray="none" shape-rendering="auto" font-family="'Dialog'" width="531" text-rendering="auto" fill-opacity="1" contentScriptType="text/ecmascript" color-interpolation="auto" color-rendering="auto" preserveAspectRatio="xMidYMid meet" font-size="12" xmlns:diagram="http://www.eclipse.org/sirius/diagram/1.1.0" diagram:semanticRoot="platform:/resource/org.eclipse.app4mc.amalthea.model/model-gen/ecore/amalthea.ecore#/" viewBox="0 0 408 158" fill="black" stroke="black" image-rendering="auto" stroke-miterlimit="10" zoomAndPan="magnify" version="1.0" stroke-linecap="square" stroke-linejoin="miter" contentStyleType="text/css" font-style="normal" height="206" stroke-width="1" stroke-dashoffset="0" font-weight="normal" stroke-opacity="1">
    <!--Generated by the Batik Graphics2D SVG Generator-->
    <defs id="genericDefs"/>
    <g>
        <defs id="defs1">
            <linearGradient x1="10" x2="98" y1="90" gradientUnits="userSpaceOnUse" y2="157" xlink:type="simple" xlink:actuate="onLoad" id="linearGradient1" xlink:show="other" spreadMethod="pad">
                <stop stop-opacity="1" stop-color="white" offset="0%"/>
                <stop stop-opacity="1" stop-color="rgb(255,252,216)" offset="100%"/>
            </linearGradient>
            <linearGradient x1="10" x2="123" y1="-6" gradientUnits="userSpaceOnUse" y2="73" xlink:type="simple" xlink:actuate="onLoad" id="linearGradient2" xlink:show="other" spreadMethod="pad">
                <stop stop-opacity="1" stop-color="white" offset="0%"/>
                <stop stop-opacity="1" stop-color="rgb(228,228,228)" offset="100%"/>
            </linearGradient>
            <linearGradient x1="212" x2="396" y1="-24" gradientUnits="userSpaceOnUse" y2="91" xlink:type="simple" xlink:actuate="onLoad" id="linearGradient3" xlink:show="other" spreadMethod="pad">
                <stop stop-opacity="1" stop-color="white" offset="0%"/>
                <stop stop-opacity="1" stop-color="rgb(228,228,228)" offset="100%"/>
            </linearGradient>
            <linearGradient x1="182" x2="396" y1="58" gradientUnits="userSpaceOnUse" y2="188" xlink:type="simple" xlink:actuate="onLoad" id="linearGradient4" xlink:show="other" spreadMethod="pad">
                <stop stop-opacity="1" stop-color="white" offset="0%"/>
                <stop stop-opacity="1" stop-color="rgb(255,252,216)" offset="100%"/>
            </linearGradient>
            <clipPath clipPathUnits="userSpaceOnUse" id="clipPath1">
                <path d="M9 99 L101 99 L101 149 L9 149 L9 99 Z"/>
            </clipPath>
            <clipPath clipPathUnits="userSpaceOnUse" id="clipPath2">
                <path d="M9 99 L99 99 L99 147 L9 147 L9 99 Z"/>
            </clipPath>
            <clipPath clipPathUnits="userSpaceOnUse" id="clipPath3">
                <path d="M15 104 L92 104 L92 122 L15 122 L15 104 Z"/>
            </clipPath>
            <clipPath clipPathUnits="userSpaceOnUse" id="clipPath4">
                <path d="M15 104 L95 104 L95 122 L15 122 L15 104 Z"/>
            </clipPath>
            <clipPath clipPathUnits="userSpaceOnUse" id="clipPath5">
                <path d="M10 125 L98 125 L98 146 L10 146 L10 125 Z"/>
            </clipPath>
            <clipPath clipPathUnits="userSpaceOnUse" id="clipPath6">
                <path d="M9 9 L126 9 L126 59 L9 59 L9 9 Z"/>
            </clipPath>
            <clipPath clipPathUnits="userSpaceOnUse" id="clipPath7">
                <path d="M9 9 L124 9 L124 57 L9 57 L9 9 Z"/>
            </clipPath>
            <clipPath clipPathUnits="userSpaceOnUse" id="clipPath8">
                <path d="M12 14 L120 14 L120 32 L12 32 L12 14 Z"/>
            </clipPath>
            <clipPath clipPathUnits="userSpaceOnUse" id="clipPath9">
                <path d="M12 14 L122 14 L122 32 L12 32 L12 14 Z"/>
            </clipPath>
            <clipPath clipPathUnits="userSpaceOnUse" id="clipPath10">
                <path d="M10 35 L123 35 L123 56 L10 56 L10 35 Z"/>
            </clipPath>
            <clipPath clipPathUnits="userSpaceOnUse" id="clipPath11">
                <path d="M211 9 L399 9 L399 59 L211 59 L211 9 Z"/>
            </clipPath>
            <clipPath clipPathUnits="userSpaceOnUse" id="clipPath12">
                <path d="M211 9 L397 9 L397 57 L211 57 L211 9 Z"/>
            </clipPath>
            <clipPath clipPathUnits="userSpaceOnUse" id="clipPath13">
                <path d="M225 14 L383 14 L383 32 L225 32 L225 14 Z"/>
            </clipPath>
            <clipPath clipPathUnits="userSpaceOnUse" id="clipPath14">
                <path d="M225 14 L385 14 L385 32 L225 32 L225 14 Z"/>
            </clipPath>
            <clipPath clipPathUnits="userSpaceOnUse" id="clipPath15">
                <path d="M212 35 L396 35 L396 56 L212 56 L212 35 Z"/>
            </clipPath>
            <clipPath clipPathUnits="userSpaceOnUse" id="clipPath16">
                <path d="M181 99 L399 99 L399 149 L181 149 L181 99 Z"/>
            </clipPath>
            <clipPath clipPathUnits="userSpaceOnUse" id="clipPath17">
                <path d="M181 99 L397 99 L397 147 L181 147 L181 99 Z"/>
            </clipPath>
            <clipPath clipPathUnits="userSpaceOnUse" id="clipPath18">
                <path d="M223 104 L355 104 L355 122 L223 122 L223 104 Z"/>
            </clipPath>
            <clipPath clipPathUnits="userSpaceOnUse" id="clipPath19">
                <path d="M223 104 L357 104 L357 122 L223 122 L223 104 Z"/>
            </clipPath>
            <clipPath clipPathUnits="userSpaceOnUse" id="clipPath20">
                <path d="M186 127 L392 127 L392 145 L186 145 L186 127 Z"/>
            </clipPath>
            <clipPath clipPathUnits="userSpaceOnUse" id="clipPath21">
                <path d="M186 127 L394 127 L394 145 L186 145 L186 127 Z"/>
            </clipPath>
            <clipPath clipPathUnits="userSpaceOnUse" id="clipPath22">
                <path d="M182 125 L396 125 L396 146 L182 146 L182 125 Z"/>
            </clipPath>
            <clipPath clipPathUnits="userSpaceOnUse" id="clipPath23">
                <path d="M-1 -1 L409 -1 L409 159 L-1 159 L-1 -1 Z"/>
            </clipPath>
            <clipPath clipPathUnits="userSpaceOnUse" id="clipPath24">
                <path d="M137 22 L194 22 L194 37 L137 37 L137 22 Z"/>
            </clipPath>
            <clipPath clipPathUnits="userSpaceOnUse" id="clipPath25">
                <path d="M199 35 L214 35 L214 44 L199 44 L199 35 Z"/>
            </clipPath>
            <clipPath clipPathUnits="userSpaceOnUse" id="clipPath26">
                <path d="M122 35 L132 35 L132 44 L122 44 L122 35 Z"/>
            </clipPath>
            <clipPath clipPathUnits="userSpaceOnUse" id="clipPath27">
                <path d="M48 55 L59 55 L59 66 L48 66 L48 55 Z"/>
            </clipPath>
            <clipPath clipPathUnits="userSpaceOnUse" id="clipPath28">
                <path d="M286 55 L297 55 L297 66 L286 66 L286 55 Z"/>
            </clipPath>
            <clipPath clipPathUnits="userSpaceOnUse" id="clipPath29">
                <path d="M101 113 L182 113 L182 128 L101 128 L101 113 Z"/>
            </clipPath>
            <clipPath clipPathUnits="userSpaceOnUse" id="clipPath30">
                <path d="M97 126 L112 126 L112 135 L97 135 L97 126 Z"/>
            </clipPath>
            <clipPath clipPathUnits="userSpaceOnUse" id="clipPath31">
                <path d="M174 126 L184 126 L184 135 L174 135 L174 126 Z"/>
            </clipPath>
        </defs>
        <g font-size="10" fill="rgb(131,122,133)" font-family="'Segoe UI'" stroke-linejoin="round" stroke="rgb(131,122,133)" stroke-width="0" stroke-miterlimit="0">
            <rect x="11" y="101" clip-path="url(#clipPath1)" width="88" rx="4" opacity="0.2549" ry="4" height="46" stroke="none"/>
            <rect x="12" y="102" clip-path="url(#clipPath1)" width="88" rx="4" opacity="0.2549" ry="4" height="46" stroke="none"/>
            <rect x="10" y="100" clip-path="url(#clipPath2)" fill="url(#linearGradient1)" width="88" rx="4" ry="4" height="46" stroke="none"/>
        </g>
        <g stroke-width="1.1" font-size="10" font-family="'Segoe UI'" stroke-linecap="butt">
            <rect x="10" y="100" clip-path="url(#clipPath2)" fill="none" width="87" rx="4" ry="4" height="45"/>
            <image x="16" y="105" clip-path="url(#clipPath3)" width="16" xlink:href="data:image/png;base64,iVBORw0KGgoAAAANSUhEUgAAABAAAAAQCAYAAAAf8/9hAAAAvUlEQVR42mP8//8/&#13;&#10;AyWAiYFCwIIuMK/WgKCTkpovMOI0AASiaxfh1Ly0OQ6/F/79Z8RrO7o8hgv+/GVg&#13;&#10;+P+fFcxmhKkFeYoRQoPk8Rvwn4lh1YJpDLgCAiSP14Df/5gYwhNTcXphWs0J/GHw&#13;&#10;+y/+mEWXx3DBr7+MeMMAJI/fC0AF3X2rGXAFwh+CBgDDoKo4AKcXGgt3EgiDfwTC&#13;&#10;4B8ToXTASCAdEPDCX2A8F2dl4nQBMxMBF0yafYCRlNwIAPWTSpioA+oRAAAAAElF&#13;&#10;TkSuQmCC" xlink:type="simple" xlink:actuate="onLoad" height="16" preserveAspectRatio="none" xlink:show="embed"/>
            <text xml:space="preserve" x="35" y="117" clip-path="url(#clipPath4)" stroke="none">WhileLoop</text>
            <line clip-path="url(#clipPath5)" fill="none" x1="11" x2="97" y1="126" y2="126"/>
            <rect x="11" y="11" clip-path="url(#clipPath6)" fill="rgb(131,122,133)" width="113" rx="4" opacity="0.2549" ry="4" height="46" stroke="none"/>
            <rect x="12" y="12" clip-path="url(#clipPath6)" fill="rgb(131,122,133)" width="113" rx="4" opacity="0.2549" ry="4" height="46" stroke="none"/>
            <rect x="10" y="10" clip-path="url(#clipPath7)" fill="url(#linearGradient2)" width="113" rx="4" ry="4" height="46" stroke="none"/>
            <rect x="10" y="10" clip-path="url(#clipPath7)" fill="none" width="112" rx="4" ry="4" height="45" stroke="rgb(125,125,125)"/>
            <image stroke="rgb(125,125,125)" width="16" xlink:show="embed" xlink:type="simple" fill="rgb(125,125,125)" clip-path="url(#clipPath8)" preserveAspectRatio="none" height="16" font-style="italic" x="13" y="15" xlink:href="data:image/png;base64,iVBORw0KGgoAAAANSUhEUgAAABAAAAAQCAYAAAAf8/9hAAAA2UlEQVR42mP8//8/&#13;&#10;AyWABUQwMjKimAI0lJFYAxgh6lFdATSQYW6NPk5NSc0XGFFcANMEtR1MR9cuwqp5&#13;&#10;aXMcpheQNRIC/9B8h9MF//+zMjDC1P6HeZaB4c9f7IEIDzhYgK5cMA2rC/78Z0I1&#13;&#10;AD3E+0pNGLJa5uL0wrSaEyh8JnQFv/8y4Q0DdHkWdAW//jKC/Q/xDmYYgOTxGvAb&#13;&#10;qKC7bzVEE7YwIGjAPyaGquIAnF5oLNxJIAz+EQiDfwTC4A+BMCDohb/AeC7OysTp&#13;&#10;AmYmAi6YNPsAIynZGQCn3VpKGCzVQQAAAABJRU5ErkJggg==" xlink:actuate="onLoad"/>
            <text x="32" y="27" clip-path="url(#clipPath9)" font-style="italic" stroke="none" xml:space="preserve">ActivityGraphItem</text>
            <line clip-path="url(#clipPath10)" fill="none" x1="11" x2="122" y1="36" y2="36" stroke="rgb(125,125,125)"/>
            <rect x="213" y="11" clip-path="url(#clipPath11)" fill="rgb(131,122,133)" width="184" rx="4" opacity="0.2549" ry="4" height="46" stroke="none"/>
            <rect x="214" y="12" clip-path="url(#clipPath11)" fill="rgb(131,122,133)" width="184" rx="4" opacity="0.2549" ry="4" height="46" stroke="none"/>
            <rect x="212" y="10" clip-path="url(#clipPath12)" fill="url(#linearGradient3)" width="184" rx="4" ry="4" height="46" stroke="none"/>
            <rect x="212" y="10" clip-path="url(#clipPath12)" fill="none" width="183" rx="4" ry="4" height="45" stroke="rgb(125,125,125)"/>
            <image stroke="rgb(125,125,125)" width="16" xlink:show="embed" xlink:type="simple" fill="rgb(125,125,125)" clip-path="url(#clipPath13)" preserveAspectRatio="none" height="16" font-style="italic" x="226" y="15" xlink:href="data:image/png;base64,iVBORw0KGgoAAAANSUhEUgAAABAAAAAQCAYAAAAf8/9hAAAA3klEQVR42mP8//8/&#13;&#10;AyWABUQwMjLCTQEayEiKAYwQPQhXAA1jmFujj1dTUvMFuCUsIBtBLgAZAtMcXbsI&#13;&#10;p+alzXEofCZ0Bf8I+ABdnglmO9T/DKmtF4A0KxgzMEDxfwT95y/2QEQRXLVgGgOu&#13;&#10;uPnzH9XRLOih3l9m+j88MRWnF6bVnMAfBr//MuENA3R5FnQFv/4yQv0P8hosccAi&#13;&#10;HCKP14DfQAXdfasZcAXCH4IG/GNiqCoOwOmFxsKdBMLgH4Ew+EcgDP4QCAOCXvgL&#13;&#10;jOfirEycLmBmIuCCSbMPkJQbAUo3Y/K+45+lAAAAAElFTkSuQmCC" xlink:actuate="onLoad"/>
            <text x="245" y="27" clip-path="url(#clipPath14)" font-style="italic" stroke="none" xml:space="preserve">IActivityGraphItemContainer</text>
            <line clip-path="url(#clipPath15)" fill="none" x1="213" x2="395" y1="36" y2="36" stroke="rgb(125,125,125)"/>
            <rect x="183" y="101" clip-path="url(#clipPath16)" fill="rgb(131,122,133)" width="214" rx="4" opacity="0.2549" ry="4" height="46" stroke="none"/>
            <rect x="184" y="102" clip-path="url(#clipPath16)" fill="rgb(131,122,133)" width="214" rx="4" opacity="0.2549" ry="4" height="46" stroke="none"/>
            <rect x="182" y="100" clip-path="url(#clipPath17)" fill="url(#linearGradient4)" width="214" rx="4" ry="4" height="46" stroke="none"/>
            <rect x="182" y="100" clip-path="url(#clipPath17)" fill="none" width="213" rx="4" ry="4" height="45"/>
            <image x="224" y="105" clip-path="url(#clipPath18)" width="16" xlink:href="data:image/png;base64,iVBORw0KGgoAAAANSUhEUgAAABAAAAAQCAYAAAAf8/9hAAAAvUlEQVR42mP8//8/&#13;&#10;AyWAiYFCwIIuMK/WgKCTkpovMOI0AASiaxfh1Ly0OQ6/F/79Z8RrO7o8hgv+/GVg&#13;&#10;+P+fFcxmhKkFeYoRQoPk8Rvwn4lh1YJpDLgCAiSP14Df/5gYwhNTcXphWs0J/GHw&#13;&#10;+y/+mEWXx3DBr7+MeMMAJI/fC0AF3X2rGXAFwh+CBgDDoKo4AKcXGgt3EgiDfwTC&#13;&#10;4B8ToXTASCAdEPDCX2A8F2dl4nQBMxMBF0yafYCRlNwIAPWTSpioA+oRAAAAAElF&#13;&#10;TkSuQmCC" xlink:type="simple" xlink:actuate="onLoad" height="16" preserveAspectRatio="none" xlink:show="embed"/>
            <text xml:space="preserve" x="243" y="117" clip-path="url(#clipPath19)" stroke="none">ConditionDisjunction</text>
            <image width="16" xlink:show="embed" xlink:type="simple" clip-path="url(#clipPath20)" preserveAspectRatio="none" font-weight="bold" height="16" x="187" y="128" xlink:href="data:image/png;base64,iVBORw0KGgoAAAANSUhEUgAAABAAAAAQCAYAAAAf8/9hAAAA00lEQVR42mNgGAWM&#13;&#10;6AJza/T/49OQ3HKR0T8k7v/GNYvAelnQFfz4w8SQ3LgAq+bLR04xMLSkgtnmDk7/&#13;&#10;Tx7Yx4hhwNdfGEIMvm3XwTTzl+8MPgkl/xm+vGKQEJEBG8KErvgz0ID//1nBmIEB&#13;&#10;gjdX6YFxhSsvw5YFPWCnv3jzhAGnC4qzMrF6gYPlH5wN0kzdWJC0L/v//GAXTlNB&#13;&#10;8mtm1oLZIenNDDC1TDBJQjaBNIM0gjDMIKJdgMsCkHomYvwJUohsK4iN1Qu4aJi/&#13;&#10;QRphXqEaAAB8rmU8kMSrLwAAAABJRU5ErkJggg==" xlink:actuate="onLoad"/>
            <text x="206" y="140" clip-path="url(#clipPath21)" stroke="none" font-weight="bold" xml:space="preserve"> entries : ConditionDisjunctionEntry</text>
            <line clip-path="url(#clipPath22)" fill="none" x1="183" x2="395" y1="126" y2="126"/>
            <line clip-path="url(#clipPath23)" fill="none" x1="212" x2="123" y1="39" y2="39"/>
            <text xml:space="preserve" x="138" y="34" clip-path="url(#clipPath24)" stroke="none">[0..*] items</text>
            <polygon clip-path="url(#clipPath25)" points=" 212 39 206 42 200 39 206 36" stroke="none"/>
            <polygon fill="none" clip-path="url(#clipPath25)" points=" 212 39 206 42 200 39 206 36"/>
            <line clip-path="url(#clipPath26)" fill="none" x1="130" x2="123" y1="36" y2="39"/>
            <line clip-path="url(#clipPath26)" fill="none" x1="123" x2="130" y1="39" y2="42"/>
            <line clip-path="url(#clipPath23)" fill="none" x1="53" x2="53" y1="100" y2="56" stroke="rgb(136,136,136)"/>
            <polygon fill="white" clip-path="url(#clipPath27)" points=" 53 56 57 64 49 64" stroke="none"/>
            <polygon fill="none" clip-path="url(#clipPath27)" points=" 53 56 57 64 49 64" stroke="rgb(136,136,136)"/>
            <line clip-path="url(#clipPath23)" fill="none" x1="53" x2="53" y1="100" y2="80" stroke-dasharray="5,5" stroke="rgb(136,136,136)"/>
            <line clip-path="url(#clipPath23)" fill="none" x1="53" x2="291" y1="80" y2="80" stroke-dasharray="5,5" stroke="rgb(136,136,136)"/>
            <line clip-path="url(#clipPath23)" fill="none" x1="291" x2="291" y1="80" y2="56" stroke-dasharray="5,5" stroke="rgb(136,136,136)"/>
            <polygon fill="white" stroke-dasharray="5,5" clip-path="url(#clipPath28)" points=" 291 56 295 64 287 64" stroke="none"/>
            <polygon fill="none" clip-path="url(#clipPath28)" points=" 291 56 295 64 287 64" stroke="rgb(136,136,136)"/>
            <line clip-path="url(#clipPath23)" fill="none" x1="98" x2="182" y1="130" y2="130"/>
            <text xml:space="preserve" x="102" y="125" clip-path="url(#clipPath29)" stroke="none">[1..1] condition</text>
            <polygon clip-path="url(#clipPath30)" points=" 98 130 104 127 110 130 104 133" stroke="none"/>
            <polygon fill="none" clip-path="url(#clipPath30)" points=" 98 130 104 127 110 130 104 133"/>
            <line clip-path="url(#clipPath31)" fill="none" x1="175" x2="182" y1="133" y2="130"/>
            <line clip-path="url(#clipPath31)" fill="none" x1="182" x2="175" y1="130" y2="127"/>
        </g>
    </g>
</svg>
