<?xml version="1.0" encoding="UTF-8"?><svg xmlns="http://www.w3.org/2000/svg" xmlns:xlink="http://www.w3.org/1999/xlink" stroke-dasharray="none" shape-rendering="auto" font-family="'Dialog'" width="984" text-rendering="auto" fill-opacity="1" contentScriptType="text/ecmascript" color-interpolation="auto" color-rendering="auto" preserveAspectRatio="xMidYMid meet" font-size="12" xmlns:diagram="http://www.eclipse.org/sirius/diagram/1.1.0" diagram:semanticRoot="platform:/resource/ModelDiagram-2.1.0/model/amalthea.ecore#/" viewBox="0 0 757 431" fill="black" stroke="black" image-rendering="auto" stroke-miterlimit="10" zoomAndPan="magnify" version="1.0" stroke-linecap="square" stroke-linejoin="miter" contentStyleType="text/css" font-style="normal" height="560" stroke-width="1" stroke-dashoffset="0" font-weight="normal" stroke-opacity="1">
    <!--Generated by the Batik Graphics2D SVG Generator-->
    <defs id="genericDefs"/>
    <!-- Manually increased size by factor 1.3 -->
    <!-- width:  757 => 984 -->
    <!-- height: 431 => 560 -->
    <g>
        <defs id="defs1">
            <linearGradient x1="245" x2="363" y1="-9" gradientUnits="userSpaceOnUse" y2="69" xlink:type="simple" xlink:actuate="onLoad" id="linearGradient1" xlink:show="other" spreadMethod="pad">
                <stop stop-opacity="1" stop-color="white" offset="0%"/>
                <stop stop-opacity="1" stop-color="rgb(228,228,228)" offset="100%"/>
            </linearGradient>
            <linearGradient x1="10" x2="229" y1="50" gradientUnits="userSpaceOnUse" y2="208" xlink:type="simple" xlink:actuate="onLoad" id="linearGradient2" xlink:show="other" spreadMethod="pad">
                <stop stop-opacity="1" stop-color="white" offset="0%"/>
                <stop stop-opacity="1" stop-color="rgb(255,252,216)" offset="100%"/>
            </linearGradient>
            <linearGradient x1="520" x2="745" y1="41" gradientUnits="userSpaceOnUse" y2="186" xlink:type="simple" xlink:actuate="onLoad" id="linearGradient3" xlink:show="other" spreadMethod="pad">
                <stop stop-opacity="1" stop-color="white" offset="0%"/>
                <stop stop-opacity="1" stop-color="rgb(255,252,216)" offset="100%"/>
            </linearGradient>
            <linearGradient x1="140" x2="343" y1="164" gradientUnits="userSpaceOnUse" y2="314" xlink:type="simple" xlink:actuate="onLoad" id="linearGradient4" xlink:show="other" spreadMethod="pad">
                <stop stop-opacity="1" stop-color="white" offset="0%"/>
                <stop stop-opacity="1" stop-color="rgb(255,252,216)" offset="100%"/>
            </linearGradient>
            <linearGradient x1="255" x2="488" y1="46" gradientUnits="userSpaceOnUse" y2="211" xlink:type="simple" xlink:actuate="onLoad" id="linearGradient5" xlink:show="other" spreadMethod="pad">
                <stop stop-opacity="1" stop-color="white" offset="0%"/>
                <stop stop-opacity="1" stop-color="rgb(255,252,216)" offset="100%"/>
            </linearGradient>
            <linearGradient x1="390" x2="616" y1="158" gradientUnits="userSpaceOnUse" y2="320" xlink:type="simple" xlink:actuate="onLoad" id="linearGradient6" xlink:show="other" spreadMethod="pad">
                <stop stop-opacity="1" stop-color="white" offset="0%"/>
                <stop stop-opacity="1" stop-color="rgb(255,252,216)" offset="100%"/>
            </linearGradient>
            <linearGradient x1="40" x2="158" y1="305" gradientUnits="userSpaceOnUse" y2="413" xlink:type="simple" xlink:actuate="onLoad" id="linearGradient7" xlink:show="other" spreadMethod="pad">
                <stop stop-opacity="1" stop-color="white" offset="0%"/>
                <stop stop-opacity="1" stop-color="rgb(221,236,202)" offset="100%"/>
            </linearGradient>
            <linearGradient x1="188" x2="306" y1="305" gradientUnits="userSpaceOnUse" y2="413" xlink:type="simple" xlink:actuate="onLoad" id="linearGradient8" xlink:show="other" spreadMethod="pad">
                <stop stop-opacity="1" stop-color="white" offset="0%"/>
                <stop stop-opacity="1" stop-color="rgb(221,236,202)" offset="100%"/>
            </linearGradient>
            <linearGradient x1="336" x2="465" y1="305" gradientUnits="userSpaceOnUse" y2="424" xlink:type="simple" xlink:actuate="onLoad" id="linearGradient9" xlink:show="other" spreadMethod="pad">
                <stop stop-opacity="1" stop-color="white" offset="0%"/>
                <stop stop-opacity="1" stop-color="rgb(221,236,202)" offset="100%"/>
            </linearGradient>
            <linearGradient x1="494" x2="616" y1="307" gradientUnits="userSpaceOnUse" y2="422" xlink:type="simple" xlink:actuate="onLoad" id="linearGradient10" xlink:show="other" spreadMethod="pad">
                <stop stop-opacity="1" stop-color="white" offset="0%"/>
                <stop stop-opacity="1" stop-color="rgb(221,236,202)" offset="100%"/>
            </linearGradient>
            <clipPath clipPathUnits="userSpaceOnUse" id="clipPath1">
                <path d="M244 9 L366 9 L366 52 L244 52 L244 9 Z"/>
            </clipPath>
            <clipPath clipPathUnits="userSpaceOnUse" id="clipPath2">
                <path d="M244 9 L364 9 L364 50 L244 50 L244 9 Z"/>
            </clipPath>
            <clipPath clipPathUnits="userSpaceOnUse" id="clipPath3">
                <path d="M264 14 L344 14 L344 32 L264 32 L264 14 Z"/>
            </clipPath>
            <clipPath clipPathUnits="userSpaceOnUse" id="clipPath4">
                <path d="M264 14 L346 14 L346 32 L264 32 L264 14 Z"/>
            </clipPath>
            <clipPath clipPathUnits="userSpaceOnUse" id="clipPath5">
                <path d="M245 35 L363 35 L363 49 L245 49 L245 35 Z"/>
            </clipPath>
            <clipPath clipPathUnits="userSpaceOnUse" id="clipPath6">
                <path d="M9 79 L232 79 L232 181 L9 181 L9 79 Z"/>
            </clipPath>
            <clipPath clipPathUnits="userSpaceOnUse" id="clipPath7">
                <path d="M9 79 L230 79 L230 179 L9 179 L9 79 Z"/>
            </clipPath>
            <clipPath clipPathUnits="userSpaceOnUse" id="clipPath8">
                <path d="M73 84 L165 84 L165 102 L73 102 L73 84 Z"/>
            </clipPath>
            <clipPath clipPathUnits="userSpaceOnUse" id="clipPath9">
                <path d="M73 84 L167 84 L167 102 L73 102 L73 84 Z"/>
            </clipPath>
            <clipPath clipPathUnits="userSpaceOnUse" id="clipPath10">
                <path d="M14 107 L225 107 L225 125 L14 125 L14 107 Z"/>
            </clipPath>
            <clipPath clipPathUnits="userSpaceOnUse" id="clipPath11">
                <path d="M14 107 L227 107 L227 125 L14 125 L14 107 Z"/>
            </clipPath>
            <clipPath clipPathUnits="userSpaceOnUse" id="clipPath12">
                <path d="M14 123 L119 123 L119 141 L14 141 L14 123 Z"/>
            </clipPath>
            <clipPath clipPathUnits="userSpaceOnUse" id="clipPath13">
                <path d="M14 123 L121 123 L121 141 L14 141 L14 123 Z"/>
            </clipPath>
            <clipPath clipPathUnits="userSpaceOnUse" id="clipPath14">
                <path d="M14 139 L144 139 L144 157 L14 157 L14 139 Z"/>
            </clipPath>
            <clipPath clipPathUnits="userSpaceOnUse" id="clipPath15">
                <path d="M14 139 L146 139 L146 157 L14 157 L14 139 Z"/>
            </clipPath>
            <clipPath clipPathUnits="userSpaceOnUse" id="clipPath16">
                <path d="M14 155 L124 155 L124 173 L14 173 L14 155 Z"/>
            </clipPath>
            <clipPath clipPathUnits="userSpaceOnUse" id="clipPath17">
                <path d="M14 155 L126 155 L126 173 L14 173 L14 155 Z"/>
            </clipPath>
            <clipPath clipPathUnits="userSpaceOnUse" id="clipPath18">
                <path d="M10 105 L229 105 L229 178 L10 178 L10 105 Z"/>
            </clipPath>
            <clipPath clipPathUnits="userSpaceOnUse" id="clipPath19">
                <path d="M519 79 L748 79 L748 149 L519 149 L519 79 Z"/>
            </clipPath>
            <clipPath clipPathUnits="userSpaceOnUse" id="clipPath20">
                <path d="M519 79 L746 79 L746 147 L519 147 L519 79 Z"/>
            </clipPath>
            <clipPath clipPathUnits="userSpaceOnUse" id="clipPath21">
                <path d="M588 84 L676 84 L676 102 L588 102 L588 84 Z"/>
            </clipPath>
            <clipPath clipPathUnits="userSpaceOnUse" id="clipPath22">
                <path d="M588 84 L679 84 L679 102 L588 102 L588 84 Z"/>
            </clipPath>
            <clipPath clipPathUnits="userSpaceOnUse" id="clipPath23">
                <path d="M524 107 L642 107 L642 125 L524 125 L524 107 Z"/>
            </clipPath>
            <clipPath clipPathUnits="userSpaceOnUse" id="clipPath24">
                <path d="M524 107 L644 107 L644 125 L524 125 L524 107 Z"/>
            </clipPath>
            <clipPath clipPathUnits="userSpaceOnUse" id="clipPath25">
                <path d="M524 123 L741 123 L741 141 L524 141 L524 123 Z"/>
            </clipPath>
            <clipPath clipPathUnits="userSpaceOnUse" id="clipPath26">
                <path d="M524 123 L743 123 L743 141 L524 141 L524 123 Z"/>
            </clipPath>
            <clipPath clipPathUnits="userSpaceOnUse" id="clipPath27">
                <path d="M520 105 L745 105 L745 146 L520 146 L520 105 Z"/>
            </clipPath>
            <clipPath clipPathUnits="userSpaceOnUse" id="clipPath28">
                <path d="M139 189 L346 189 L346 291 L139 291 L139 189 Z"/>
            </clipPath>
            <clipPath clipPathUnits="userSpaceOnUse" id="clipPath29">
                <path d="M139 189 L344 189 L344 289 L139 289 L139 189 Z"/>
            </clipPath>
            <clipPath clipPathUnits="userSpaceOnUse" id="clipPath30">
                <path d="M203 194 L279 194 L279 212 L203 212 L203 194 Z"/>
            </clipPath>
            <clipPath clipPathUnits="userSpaceOnUse" id="clipPath31">
                <path d="M203 194 L281 194 L281 212 L203 212 L203 194 Z"/>
            </clipPath>
            <clipPath clipPathUnits="userSpaceOnUse" id="clipPath32">
                <path d="M144 217 L339 217 L339 235 L144 235 L144 217 Z"/>
            </clipPath>
            <clipPath clipPathUnits="userSpaceOnUse" id="clipPath33">
                <path d="M144 217 L341 217 L341 235 L144 235 L144 217 Z"/>
            </clipPath>
            <clipPath clipPathUnits="userSpaceOnUse" id="clipPath34">
                <path d="M144 233 L233 233 L233 251 L144 251 L144 233 Z"/>
            </clipPath>
            <clipPath clipPathUnits="userSpaceOnUse" id="clipPath35">
                <path d="M144 233 L235 233 L235 251 L144 251 L144 233 Z"/>
            </clipPath>
            <clipPath clipPathUnits="userSpaceOnUse" id="clipPath36">
                <path d="M144 249 L274 249 L274 267 L144 267 L144 249 Z"/>
            </clipPath>
            <clipPath clipPathUnits="userSpaceOnUse" id="clipPath37">
                <path d="M144 249 L276 249 L276 267 L144 267 L144 249 Z"/>
            </clipPath>
            <clipPath clipPathUnits="userSpaceOnUse" id="clipPath38">
                <path d="M144 265 L254 265 L254 283 L144 283 L144 265 Z"/>
            </clipPath>
            <clipPath clipPathUnits="userSpaceOnUse" id="clipPath39">
                <path d="M144 265 L256 265 L256 283 L144 283 L144 265 Z"/>
            </clipPath>
            <clipPath clipPathUnits="userSpaceOnUse" id="clipPath40">
                <path d="M140 215 L343 215 L343 288 L140 288 L140 215 Z"/>
            </clipPath>
            <clipPath clipPathUnits="userSpaceOnUse" id="clipPath41">
                <path d="M254 78 L491 78 L491 180 L254 180 L254 78 Z"/>
            </clipPath>
            <clipPath clipPathUnits="userSpaceOnUse" id="clipPath42">
                <path d="M254 78 L489 78 L489 178 L254 178 L254 78 Z"/>
            </clipPath>
            <clipPath clipPathUnits="userSpaceOnUse" id="clipPath43">
                <path d="M318 83 L424 83 L424 101 L318 101 L318 83 Z"/>
            </clipPath>
            <clipPath clipPathUnits="userSpaceOnUse" id="clipPath44">
                <path d="M318 83 L427 83 L427 101 L318 101 L318 83 Z"/>
            </clipPath>
            <clipPath clipPathUnits="userSpaceOnUse" id="clipPath45">
                <path d="M259 106 L484 106 L484 124 L259 124 L259 106 Z"/>
            </clipPath>
            <clipPath clipPathUnits="userSpaceOnUse" id="clipPath46">
                <path d="M259 106 L486 106 L486 124 L259 124 L259 106 Z"/>
            </clipPath>
            <clipPath clipPathUnits="userSpaceOnUse" id="clipPath47">
                <path d="M259 122 L378 122 L378 140 L259 140 L259 122 Z"/>
            </clipPath>
            <clipPath clipPathUnits="userSpaceOnUse" id="clipPath48">
                <path d="M259 122 L380 122 L380 140 L259 140 L259 122 Z"/>
            </clipPath>
            <clipPath clipPathUnits="userSpaceOnUse" id="clipPath49">
                <path d="M259 138 L389 138 L389 156 L259 156 L259 138 Z"/>
            </clipPath>
            <clipPath clipPathUnits="userSpaceOnUse" id="clipPath50">
                <path d="M259 138 L391 138 L391 156 L259 156 L259 138 Z"/>
            </clipPath>
            <clipPath clipPathUnits="userSpaceOnUse" id="clipPath51">
                <path d="M259 154 L369 154 L369 172 L259 172 L259 154 Z"/>
            </clipPath>
            <clipPath clipPathUnits="userSpaceOnUse" id="clipPath52">
                <path d="M259 154 L371 154 L371 172 L259 172 L259 154 Z"/>
            </clipPath>
            <clipPath clipPathUnits="userSpaceOnUse" id="clipPath53">
                <path d="M255 104 L488 104 L488 177 L255 177 L255 104 Z"/>
            </clipPath>
            <clipPath clipPathUnits="userSpaceOnUse" id="clipPath54">
                <path d="M389 189 L619 189 L619 291 L389 291 L389 189 Z"/>
            </clipPath>
            <clipPath clipPathUnits="userSpaceOnUse" id="clipPath55">
                <path d="M389 189 L617 189 L617 289 L389 289 L389 189 Z"/>
            </clipPath>
            <clipPath clipPathUnits="userSpaceOnUse" id="clipPath56">
                <path d="M453 194 L552 194 L552 212 L453 212 L453 194 Z"/>
            </clipPath>
            <clipPath clipPathUnits="userSpaceOnUse" id="clipPath57">
                <path d="M453 194 L555 194 L555 212 L453 212 L453 194 Z"/>
            </clipPath>
            <clipPath clipPathUnits="userSpaceOnUse" id="clipPath58">
                <path d="M394 217 L612 217 L612 235 L394 235 L394 217 Z"/>
            </clipPath>
            <clipPath clipPathUnits="userSpaceOnUse" id="clipPath59">
                <path d="M394 217 L614 217 L614 235 L394 235 L394 217 Z"/>
            </clipPath>
            <clipPath clipPathUnits="userSpaceOnUse" id="clipPath60">
                <path d="M394 233 L506 233 L506 251 L394 251 L394 233 Z"/>
            </clipPath>
            <clipPath clipPathUnits="userSpaceOnUse" id="clipPath61">
                <path d="M394 233 L508 233 L508 251 L394 251 L394 233 Z"/>
            </clipPath>
            <clipPath clipPathUnits="userSpaceOnUse" id="clipPath62">
                <path d="M394 249 L504 249 L504 267 L394 267 L394 249 Z"/>
            </clipPath>
            <clipPath clipPathUnits="userSpaceOnUse" id="clipPath63">
                <path d="M394 249 L506 249 L506 267 L394 267 L394 249 Z"/>
            </clipPath>
            <clipPath clipPathUnits="userSpaceOnUse" id="clipPath64">
                <path d="M394 265 L582 265 L582 283 L394 283 L394 265 Z"/>
            </clipPath>
            <clipPath clipPathUnits="userSpaceOnUse" id="clipPath65">
                <path d="M394 265 L584 265 L584 283 L394 283 L394 265 Z"/>
            </clipPath>
            <clipPath clipPathUnits="userSpaceOnUse" id="clipPath66">
                <path d="M390 215 L616 215 L616 288 L390 288 L390 215 Z"/>
            </clipPath>
            <clipPath clipPathUnits="userSpaceOnUse" id="clipPath67">
                <path d="M39 309 L161 309 L161 411 L39 411 L39 309 Z"/>
            </clipPath>
            <clipPath clipPathUnits="userSpaceOnUse" id="clipPath68">
                <path d="M39 309 L159 309 L159 409 L39 409 L39 309 Z"/>
            </clipPath>
            <clipPath clipPathUnits="userSpaceOnUse" id="clipPath69">
                <path d="M41 314 L156 314 L156 332 L41 332 L41 314 Z"/>
            </clipPath>
            <clipPath clipPathUnits="userSpaceOnUse" id="clipPath70">
                <path d="M41 314 L158 314 L158 332 L41 332 L41 314 Z"/>
            </clipPath>
            <clipPath clipPathUnits="userSpaceOnUse" id="clipPath71">
                <path d="M44 337 L87 337 L87 355 L44 355 L44 337 Z"/>
            </clipPath>
            <clipPath clipPathUnits="userSpaceOnUse" id="clipPath72">
                <path d="M44 337 L89 337 L89 355 L44 355 L44 337 Z"/>
            </clipPath>
            <clipPath clipPathUnits="userSpaceOnUse" id="clipPath73">
                <path d="M44 353 L90 353 L90 371 L44 371 L44 353 Z"/>
            </clipPath>
            <clipPath clipPathUnits="userSpaceOnUse" id="clipPath74">
                <path d="M44 353 L93 353 L93 371 L44 371 L44 353 Z"/>
            </clipPath>
            <clipPath clipPathUnits="userSpaceOnUse" id="clipPath75">
                <path d="M44 369 L100 369 L100 387 L44 387 L44 369 Z"/>
            </clipPath>
            <clipPath clipPathUnits="userSpaceOnUse" id="clipPath76">
                <path d="M44 369 L102 369 L102 387 L44 387 L44 369 Z"/>
            </clipPath>
            <clipPath clipPathUnits="userSpaceOnUse" id="clipPath77">
                <path d="M40 335 L158 335 L158 408 L40 408 L40 335 Z"/>
            </clipPath>
            <clipPath clipPathUnits="userSpaceOnUse" id="clipPath78">
                <path d="M187 309 L309 309 L309 411 L187 411 L187 309 Z"/>
            </clipPath>
            <clipPath clipPathUnits="userSpaceOnUse" id="clipPath79">
                <path d="M187 309 L307 309 L307 409 L187 409 L187 309 Z"/>
            </clipPath>
            <clipPath clipPathUnits="userSpaceOnUse" id="clipPath80">
                <path d="M197 314 L296 314 L296 332 L197 332 L197 314 Z"/>
            </clipPath>
            <clipPath clipPathUnits="userSpaceOnUse" id="clipPath81">
                <path d="M197 314 L298 314 L298 332 L197 332 L197 314 Z"/>
            </clipPath>
            <clipPath clipPathUnits="userSpaceOnUse" id="clipPath82">
                <path d="M192 337 L235 337 L235 355 L192 355 L192 337 Z"/>
            </clipPath>
            <clipPath clipPathUnits="userSpaceOnUse" id="clipPath83">
                <path d="M192 337 L237 337 L237 355 L192 355 L192 337 Z"/>
            </clipPath>
            <clipPath clipPathUnits="userSpaceOnUse" id="clipPath84">
                <path d="M192 353 L236 353 L236 371 L192 371 L192 353 Z"/>
            </clipPath>
            <clipPath clipPathUnits="userSpaceOnUse" id="clipPath85">
                <path d="M192 353 L238 353 L238 371 L192 371 L192 353 Z"/>
            </clipPath>
            <clipPath clipPathUnits="userSpaceOnUse" id="clipPath86">
                <path d="M192 369 L239 369 L239 387 L192 387 L192 369 Z"/>
            </clipPath>
            <clipPath clipPathUnits="userSpaceOnUse" id="clipPath87">
                <path d="M192 369 L241 369 L241 387 L192 387 L192 369 Z"/>
            </clipPath>
            <clipPath clipPathUnits="userSpaceOnUse" id="clipPath88">
                <path d="M188 335 L306 335 L306 408 L188 408 L188 335 Z"/>
            </clipPath>
            <clipPath clipPathUnits="userSpaceOnUse" id="clipPath89">
                <path d="M335 309 L468 309 L468 422 L335 422 L335 309 Z"/>
            </clipPath>
            <clipPath clipPathUnits="userSpaceOnUse" id="clipPath90">
                <path d="M335 309 L466 309 L466 420 L335 420 L335 309 Z"/>
            </clipPath>
            <clipPath clipPathUnits="userSpaceOnUse" id="clipPath91">
                <path d="M336 314 L465 314 L465 332 L336 332 L336 314 Z"/>
            </clipPath>
            <clipPath clipPathUnits="userSpaceOnUse" id="clipPath92">
                <path d="M336 314 L468 314 L468 332 L336 332 L336 314 Z"/>
            </clipPath>
            <clipPath clipPathUnits="userSpaceOnUse" id="clipPath93">
                <path d="M340 337 L383 337 L383 355 L340 355 L340 337 Z"/>
            </clipPath>
            <clipPath clipPathUnits="userSpaceOnUse" id="clipPath94">
                <path d="M340 337 L385 337 L385 355 L340 355 L340 337 Z"/>
            </clipPath>
            <clipPath clipPathUnits="userSpaceOnUse" id="clipPath95">
                <path d="M340 353 L384 353 L384 371 L340 371 L340 353 Z"/>
            </clipPath>
            <clipPath clipPathUnits="userSpaceOnUse" id="clipPath96">
                <path d="M340 353 L386 353 L386 371 L340 371 L340 353 Z"/>
            </clipPath>
            <clipPath clipPathUnits="userSpaceOnUse" id="clipPath97">
                <path d="M340 369 L387 369 L387 387 L340 387 L340 369 Z"/>
            </clipPath>
            <clipPath clipPathUnits="userSpaceOnUse" id="clipPath98">
                <path d="M340 369 L389 369 L389 387 L340 387 L340 369 Z"/>
            </clipPath>
            <clipPath clipPathUnits="userSpaceOnUse" id="clipPath99">
                <path d="M340 385 L412 385 L412 403 L340 403 L340 385 Z"/>
            </clipPath>
            <clipPath clipPathUnits="userSpaceOnUse" id="clipPath100">
                <path d="M340 385 L414 385 L414 403 L340 403 L340 385 Z"/>
            </clipPath>
            <clipPath clipPathUnits="userSpaceOnUse" id="clipPath101">
                <path d="M340 401 L415 401 L415 419 L340 419 L340 401 Z"/>
            </clipPath>
            <clipPath clipPathUnits="userSpaceOnUse" id="clipPath102">
                <path d="M340 401 L418 401 L418 419 L340 419 L340 401 Z"/>
            </clipPath>
            <clipPath clipPathUnits="userSpaceOnUse" id="clipPath103">
                <path d="M336 335 L465 335 L465 419 L336 419 L336 335 Z"/>
            </clipPath>
            <clipPath clipPathUnits="userSpaceOnUse" id="clipPath104">
                <path d="M493 309 L619 309 L619 422 L493 422 L493 309 Z"/>
            </clipPath>
            <clipPath clipPathUnits="userSpaceOnUse" id="clipPath105">
                <path d="M493 309 L617 309 L617 420 L493 420 L493 309 Z"/>
            </clipPath>
            <clipPath clipPathUnits="userSpaceOnUse" id="clipPath106">
                <path d="M494 314 L616 314 L616 332 L494 332 L494 314 Z"/>
            </clipPath>
            <clipPath clipPathUnits="userSpaceOnUse" id="clipPath107">
                <path d="M494 314 L618 314 L618 332 L494 332 L494 314 Z"/>
            </clipPath>
            <clipPath clipPathUnits="userSpaceOnUse" id="clipPath108">
                <path d="M498 337 L541 337 L541 355 L498 355 L498 337 Z"/>
            </clipPath>
            <clipPath clipPathUnits="userSpaceOnUse" id="clipPath109">
                <path d="M498 337 L543 337 L543 355 L498 355 L498 337 Z"/>
            </clipPath>
            <clipPath clipPathUnits="userSpaceOnUse" id="clipPath110">
                <path d="M498 353 L542 353 L542 371 L498 371 L498 353 Z"/>
            </clipPath>
            <clipPath clipPathUnits="userSpaceOnUse" id="clipPath111">
                <path d="M498 353 L544 353 L544 371 L498 371 L498 353 Z"/>
            </clipPath>
            <clipPath clipPathUnits="userSpaceOnUse" id="clipPath112">
                <path d="M498 369 L563 369 L563 387 L498 387 L498 369 Z"/>
            </clipPath>
            <clipPath clipPathUnits="userSpaceOnUse" id="clipPath113">
                <path d="M498 369 L566 369 L566 387 L498 387 L498 369 Z"/>
            </clipPath>
            <clipPath clipPathUnits="userSpaceOnUse" id="clipPath114">
                <path d="M498 385 L556 385 L556 403 L498 403 L498 385 Z"/>
            </clipPath>
            <clipPath clipPathUnits="userSpaceOnUse" id="clipPath115">
                <path d="M498 385 L559 385 L559 403 L498 403 L498 385 Z"/>
            </clipPath>
            <clipPath clipPathUnits="userSpaceOnUse" id="clipPath116">
                <path d="M498 401 L568 401 L568 419 L498 419 L498 401 Z"/>
            </clipPath>
            <clipPath clipPathUnits="userSpaceOnUse" id="clipPath117">
                <path d="M498 401 L570 401 L570 419 L498 419 L498 401 Z"/>
            </clipPath>
            <clipPath clipPathUnits="userSpaceOnUse" id="clipPath118">
                <path d="M494 335 L616 335 L616 419 L494 419 L494 335 Z"/>
            </clipPath>
            <clipPath clipPathUnits="userSpaceOnUse" id="clipPath119">
                <path d="M-1 -1 L758 -1 L758 432 L-1 432 L-1 -1 Z"/>
            </clipPath>
            <clipPath clipPathUnits="userSpaceOnUse" id="clipPath120">
                <path d="M300 48 L311 48 L311 59 L300 59 L300 48 Z"/>
            </clipPath>
        </defs>
        <g font-size="10" fill="rgb(131,122,133)" font-family="'Segoe UI'" stroke-linejoin="round" font-style="italic" stroke="rgb(131,122,133)" stroke-width="0" stroke-miterlimit="0">
            <rect x="246" y="11" clip-path="url(#clipPath1)" width="118" rx="4" opacity="0.2549" ry="4" height="39" stroke="none"/>
            <rect x="247" y="12" clip-path="url(#clipPath1)" width="118" rx="4" opacity="0.2549" ry="4" height="39" stroke="none"/>
            <rect x="245" y="10" clip-path="url(#clipPath2)" fill="url(#linearGradient1)" width="118" rx="4" ry="4" height="39" stroke="none"/>
        </g>
        <g stroke-linecap="butt" font-size="10" fill="rgb(125,125,125)" font-family="'Segoe UI'" font-style="italic" stroke="rgb(125,125,125)" stroke-width="1.1">
            <rect x="245" y="10" clip-path="url(#clipPath2)" fill="none" width="117" rx="4" ry="4" height="38"/>
            <image x="265" y="15" clip-path="url(#clipPath3)" width="16" xlink:href="data:image/png;base64,iVBORw0KGgoAAAANSUhEUgAAABAAAAAQCAYAAAAf8/9hAAAA2UlEQVR42mP8//8/&#13;&#10;AyWABUQwMjKimAI0lJFYAxgh6lFdATSQYW6NPk5NSc0XGFFcANMEtR1MR9cuwqp5&#13;&#10;aXMcpheQNRIC/9B8h9MF//+zMjDC1P6HeZaB4c9f7IEIDzhYgK5cMA2rC/78Z0I1&#13;&#10;AD3E+0pNGLJa5uL0wrSaEyh8JnQFv/8y4Q0DdHkWdAW//jKC/Q/xDmYYgOTxGvAb&#13;&#10;qKC7bzVEE7YwIGjAPyaGquIAnF5oLNxJIAz+EQiDfwTC4A+BMCDohb/AeC7OysTp&#13;&#10;AmYmAi6YNPsAIynZGQCn3VpKGCzVQQAAAABJRU5ErkJggg==" xlink:type="simple" xlink:actuate="onLoad" height="16" preserveAspectRatio="none" xlink:show="embed"/>
            <text x="284" y="27" clip-path="url(#clipPath4)" fill="black" stroke="none" xml:space="preserve">TriggerEvent</text>
            <line clip-path="url(#clipPath5)" fill="none" x1="246" x2="362" y1="36" y2="36"/>
            <rect x="11" y="81" clip-path="url(#clipPath6)" fill="rgb(131,122,133)" width="219" rx="4" opacity="0.2549" ry="4" height="98" stroke="none"/>
            <rect x="12" y="82" clip-path="url(#clipPath6)" fill="rgb(131,122,133)" width="219" rx="4" opacity="0.2549" ry="4" height="98" stroke="none"/>
            <rect x="10" y="80" clip-path="url(#clipPath7)" fill="url(#linearGradient2)" width="219" rx="4" ry="4" height="98" stroke="none"/>
            <rect x="10" y="80" clip-path="url(#clipPath7)" fill="none" width="218" rx="4" ry="4" height="97" stroke="black"/>
            <image stroke="black" width="16" xlink:show="embed" xlink:type="simple" fill="black" clip-path="url(#clipPath8)" preserveAspectRatio="none" height="16" font-style="normal" x="74" y="85" xlink:href="data:image/png;base64,iVBORw0KGgoAAAANSUhEUgAAABAAAAAQCAYAAAAf8/9hAAAAvUlEQVR42mP8//8/&#13;&#10;AyWAiYFCwIIuMK/WgKCTkpovMOI0AASiaxfh1Ly0OQ6/F/79Z8RrO7o8hgv+/GVg&#13;&#10;+P+fFcxmhKkFeYoRQoPk8Rvwn4lh1YJpDLgCAiSP14Df/5gYwhNTcXphWs0J/GHw&#13;&#10;+y/+mEWXx3DBr7+MeMMAJI/fC0AF3X2rGXAFwh+CBgDDoKo4AKcXGgt3EgiDfwTC&#13;&#10;4B8ToXTASCAdEPDCX2A8F2dl4nQBMxMBF0yafYCRlNwIAPWTSpioA+oRAAAAAElF&#13;&#10;TkSuQmCC" xlink:actuate="onLoad"/>
            <text x="93" y="97" clip-path="url(#clipPath9)" fill="black" font-style="normal" stroke="none" xml:space="preserve">ChannelEvent</text>
            <image stroke="black" width="16" xlink:show="embed" xlink:type="simple" fill="black" clip-path="url(#clipPath10)" preserveAspectRatio="none" height="16" font-style="normal" x="15" y="108" xlink:href="data:image/png;base64,iVBORw0KGgoAAAANSUhEUgAAABAAAAAQCAYAAAAf8/9hAAAAXUlEQVR42mNgGAUD&#13;&#10;DxjRBebW6P8npCm55SJcHwu65I8/TAzJjQtwap5bn4DCZ0JX8PUXC17b0eUxVH8G&#13;&#10;Kvj/nxXiP5hD/0M9+x8ij9cAkA3FWZk4XcDBwjKacqgNALytGBsVIOzJAAAAAElF&#13;&#10;TkSuQmCC" xlink:actuate="onLoad"/>
            <text x="34" y="120" clip-path="url(#clipPath11)" fill="black" font-style="normal" stroke="none" xml:space="preserve">eventType : ChannelEventType = _all_</text>
            <image stroke="black" width="16" xlink:show="embed" xlink:type="simple" fill="black" clip-path="url(#clipPath12)" preserveAspectRatio="none" height="16" font-style="normal" x="15" y="124" xlink:href="data:image/png;base64,iVBORw0KGgoAAAANSUhEUgAAABAAAAAQCAYAAAAf8/9hAAAAlklEQVR42mNgGAUD&#13;&#10;DxjRBebW6P/HpyG55SKjf0jc/41rFoH1sqAr+PGHiSG5cQFWzZePnGJgaEkFs80d&#13;&#10;nP6fPLCPEcOAr78whBh8266DaeYv3xl8Ekr+M3x5xSAhIgM2hAld8WegAf//s4Ix&#13;&#10;AwMEb67SA+MKV16GLQt6wE5/8eYJA04XFGdlYvUCB8s/OBukeTQJUQkAAMYmNUkI&#13;&#10;BAq9AAAAAElFTkSuQmCC" xlink:actuate="onLoad"/>
            <text x="34" y="136" clip-path="url(#clipPath13)" fill="black" font-style="normal" stroke="none" xml:space="preserve"> entity : Channel</text>
            <image stroke="black" width="16" xlink:show="embed" xlink:type="simple" fill="black" clip-path="url(#clipPath14)" preserveAspectRatio="none" height="16" font-style="normal" x="15" y="140" xlink:href="data:image/png;base64,iVBORw0KGgoAAAANSUhEUgAAABAAAAAQCAYAAAAf8/9hAAAAlklEQVR42mNgGAUD&#13;&#10;DxjRBebW6P/HpyG55SKjf0jc/41rFoH1sqAr+PGHiSG5cQFWzZePnGJgaEkFs80d&#13;&#10;nP6fPLCPEcOAr78whBh8266DaeYv3xl8Ekr+M3x5xSAhIgM2hAld8WegAf//s4Ix&#13;&#10;AwMEb67SA+MKV16GLQt6wE5/8eYJA04XFGdlYvUCB8s/OBukeTQJUQkAAMYmNUkI&#13;&#10;BAq9AAAAAElFTkSuQmCC" xlink:actuate="onLoad"/>
            <text x="34" y="152" clip-path="url(#clipPath15)" fill="black" font-style="normal" stroke="none" xml:space="preserve"> runnable : Runnable</text>
            <image stroke="black" width="16" xlink:show="embed" xlink:type="simple" fill="black" clip-path="url(#clipPath16)" preserveAspectRatio="none" height="16" font-style="normal" x="15" y="156" xlink:href="data:image/png;base64,iVBORw0KGgoAAAANSUhEUgAAABAAAAAQCAYAAAAf8/9hAAAAlklEQVR42mNgGAUD&#13;&#10;DxjRBebW6P/HpyG55SKjf0jc/41rFoH1sqAr+PGHiSG5cQFWzZePnGJgaEkFs80d&#13;&#10;nP6fPLCPEcOAr78whBh8266DaeYv3xl8Ekr+M3x5xSAhIgM2hAld8WegAf//s4Ix&#13;&#10;AwMEb67SA+MKV16GLQt6wE5/8eYJA04XFGdlYvUCB8s/OBukeTQJUQkAAMYmNUkI&#13;&#10;BAq9AAAAAElFTkSuQmCC" xlink:actuate="onLoad"/>
            <text x="34" y="168" clip-path="url(#clipPath17)" fill="black" font-style="normal" stroke="none" xml:space="preserve"> process : Process</text>
            <line clip-path="url(#clipPath18)" fill="none" x1="11" x2="228" y1="106" y2="106" stroke="black"/>
            <rect x="521" y="81" clip-path="url(#clipPath19)" fill="rgb(131,122,133)" width="225" rx="4" opacity="0.2549" ry="4" height="66" stroke="none"/>
            <rect x="522" y="82" clip-path="url(#clipPath19)" fill="rgb(131,122,133)" width="225" rx="4" opacity="0.2549" ry="4" height="66" stroke="none"/>
            <rect x="520" y="80" clip-path="url(#clipPath20)" fill="url(#linearGradient3)" width="225" rx="4" ry="4" height="66" stroke="none"/>
            <rect x="520" y="80" clip-path="url(#clipPath20)" fill="none" width="224" rx="4" ry="4" height="65" stroke="black"/>
            <image stroke="black" width="16" xlink:show="embed" xlink:type="simple" fill="black" clip-path="url(#clipPath21)" preserveAspectRatio="none" height="16" font-style="normal" x="589" y="85" xlink:href="data:image/png;base64,iVBORw0KGgoAAAANSUhEUgAAABAAAAAQCAYAAAAf8/9hAAAAvUlEQVR42mP8//8/&#13;&#10;AyWAiYFCwIIuMK/WgKCTkpovMOI0AASiaxfh1Ly0OQ6/F/79Z8RrO7o8hgv+/GVg&#13;&#10;+P+fFcxmhKkFeYoRQoPk8Rvwn4lh1YJpDLgCAiSP14Df/5gYwhNTcXphWs0J/GHw&#13;&#10;+y/+mEWXx3DBr7+MeMMAJI/fC0AF3X2rGXAFwh+CBgDDoKo4AKcXGgt3EgiDfwTC&#13;&#10;4B8ToXTASCAdEPDCX2A8F2dl4nQBMxMBF0yafYCRlNwIAPWTSpioA+oRAAAAAElF&#13;&#10;TkSuQmCC" xlink:actuate="onLoad"/>
            <text x="608" y="97" clip-path="url(#clipPath22)" fill="black" font-style="normal" stroke="none" xml:space="preserve">CustomEvent</text>
            <image stroke="black" width="16" xlink:show="embed" xlink:type="simple" fill="black" clip-path="url(#clipPath23)" preserveAspectRatio="none" height="16" font-style="normal" x="525" y="108" xlink:href="data:image/png;base64,iVBORw0KGgoAAAANSUhEUgAAABAAAAAQCAYAAAAf8/9hAAAAXUlEQVR42mNgGAUD&#13;&#10;DxjRBebW6P8npCm55SJcHwu65I8/TAzJjQtwap5bn4DCZ0JX8PUXC17b0eUxVH8G&#13;&#10;Kvj/nxXiP5hD/0M9+x8ij9cAkA3FWZk4XcDBwjKacqgNALytGBsVIOzJAAAAAElF&#13;&#10;TkSuQmCC" xlink:actuate="onLoad"/>
            <text x="544" y="120" clip-path="url(#clipPath24)" fill="black" font-style="normal" stroke="none" xml:space="preserve">eventType : EString</text>
            <image stroke="black" width="16" xlink:show="embed" xlink:type="simple" fill="black" clip-path="url(#clipPath25)" preserveAspectRatio="none" height="16" font-style="normal" x="525" y="124" xlink:href="data:image/png;base64,iVBORw0KGgoAAAANSUhEUgAAABAAAAAQCAYAAAAf8/9hAAAA90lEQVR42mNgGAWM&#13;&#10;6AJza/T/49OQ3HKR0T8k7v/GNYvAelnQFfz4w8SQ3LgAq+bLR04xMLSkgtnmDk7/&#13;&#10;Tx7Yx4hhwNdfGEIMvm3XwTTzl+8MPgkl/xm+vGKQEJEBG8KErvgz0ID//1nBmIEB&#13;&#10;gjdX6YFxhSsvw5YFPWCnv3jzhAGnC4qzMrF6gYPlH5wN0kzdWJi/7/X/qsZuMLut&#13;&#10;vpQh0UkUwwZJ+7L/a2bWgtkh6c0Mzw92IbwA0gwSgLAZsEYlSDNII4xtrdHFwESs&#13;&#10;U0G2wzTDXAASI9oAkOtgzoe5ACQGNwDkb5CJIAxiw2xFpkG2gjQie4ViAACjS2ze&#13;&#10;Uzm6RQAAAABJRU5ErkJggg==" xlink:actuate="onLoad"/>
            <text x="544" y="136" clip-path="url(#clipPath26)" fill="rgb(39,76,114)" font-style="normal" stroke="none" xml:space="preserve"> /explicitTriggers : CustomEventTrigger</text>
            <line clip-path="url(#clipPath27)" fill="none" x1="521" x2="744" y1="106" y2="106" stroke="black"/>
            <rect x="141" y="191" clip-path="url(#clipPath28)" fill="rgb(131,122,133)" width="203" rx="4" opacity="0.2549" ry="4" height="98" stroke="none"/>
            <rect x="142" y="192" clip-path="url(#clipPath28)" fill="rgb(131,122,133)" width="203" rx="4" opacity="0.2549" ry="4" height="98" stroke="none"/>
            <rect x="140" y="190" clip-path="url(#clipPath29)" fill="url(#linearGradient4)" width="203" rx="4" ry="4" height="98" stroke="none"/>
            <rect x="140" y="190" clip-path="url(#clipPath29)" fill="none" width="202" rx="4" ry="4" height="97" stroke="black"/>
            <image stroke="black" width="16" xlink:show="embed" xlink:type="simple" fill="black" clip-path="url(#clipPath30)" preserveAspectRatio="none" height="16" font-style="normal" x="204" y="195" xlink:href="data:image/png;base64,iVBORw0KGgoAAAANSUhEUgAAABAAAAAQCAYAAAAf8/9hAAAAvUlEQVR42mP8//8/&#13;&#10;AyWAiYFCwIIuMK/WgKCTkpovMOI0AASiaxfh1Ly0OQ6/F/79Z8RrO7o8hgv+/GVg&#13;&#10;+P+fFcxmhKkFeYoRQoPk8Rvwn4lh1YJpDLgCAiSP14Df/5gYwhNTcXphWs0J/GHw&#13;&#10;+y/+mEWXx3DBr7+MeMMAJI/fC0AF3X2rGXAFwh+CBgDDoKo4AKcXGgt3EgiDfwTC&#13;&#10;4B8ToXTASCAdEPDCX2A8F2dl4nQBMxMBF0yafYCRlNwIAPWTSpioA+oRAAAAAElF&#13;&#10;TkSuQmCC" xlink:actuate="onLoad"/>
            <text x="223" y="207" clip-path="url(#clipPath31)" fill="black" font-style="normal" stroke="none" xml:space="preserve">LabelEvent</text>
            <image stroke="black" width="16" xlink:show="embed" xlink:type="simple" fill="black" clip-path="url(#clipPath32)" preserveAspectRatio="none" height="16" font-style="normal" x="145" y="218" xlink:href="data:image/png;base64,iVBORw0KGgoAAAANSUhEUgAAABAAAAAQCAYAAAAf8/9hAAAAXUlEQVR42mNgGAUD&#13;&#10;DxjRBebW6P8npCm55SJcHwu65I8/TAzJjQtwap5bn4DCZ0JX8PUXC17b0eUxVH8G&#13;&#10;Kvj/nxXiP5hD/0M9+x8ij9cAkA3FWZk4XcDBwjKacqgNALytGBsVIOzJAAAAAElF&#13;&#10;TkSuQmCC" xlink:actuate="onLoad"/>
            <text x="164" y="230" clip-path="url(#clipPath33)" fill="black" font-style="normal" stroke="none" xml:space="preserve">eventType : LabelEventType = _all_</text>
            <image stroke="black" width="16" xlink:show="embed" xlink:type="simple" fill="black" clip-path="url(#clipPath34)" preserveAspectRatio="none" height="16" font-style="normal" x="145" y="234" xlink:href="data:image/png;base64,iVBORw0KGgoAAAANSUhEUgAAABAAAAAQCAYAAAAf8/9hAAAAlklEQVR42mNgGAUD&#13;&#10;DxjRBebW6P/HpyG55SKjf0jc/41rFoH1sqAr+PGHiSG5cQFWzZePnGJgaEkFs80d&#13;&#10;nP6fPLCPEcOAr78whBh8266DaeYv3xl8Ekr+M3x5xSAhIgM2hAld8WegAf//s4Ix&#13;&#10;AwMEb67SA+MKV16GLQt6wE5/8eYJA04XFGdlYvUCB8s/OBukeTQJUQkAAMYmNUkI&#13;&#10;BAq9AAAAAElFTkSuQmCC" xlink:actuate="onLoad"/>
            <text x="164" y="246" clip-path="url(#clipPath35)" fill="black" font-style="normal" stroke="none" xml:space="preserve"> entity : Label</text>
            <image stroke="black" width="16" xlink:show="embed" xlink:type="simple" fill="black" clip-path="url(#clipPath36)" preserveAspectRatio="none" height="16" font-style="normal" x="145" y="250" xlink:href="data:image/png;base64,iVBORw0KGgoAAAANSUhEUgAAABAAAAAQCAYAAAAf8/9hAAAAlklEQVR42mNgGAUD&#13;&#10;DxjRBebW6P/HpyG55SKjf0jc/41rFoH1sqAr+PGHiSG5cQFWzZePnGJgaEkFs80d&#13;&#10;nP6fPLCPEcOAr78whBh8266DaeYv3xl8Ekr+M3x5xSAhIgM2hAld8WegAf//s4Ix&#13;&#10;AwMEb67SA+MKV16GLQt6wE5/8eYJA04XFGdlYvUCB8s/OBukeTQJUQkAAMYmNUkI&#13;&#10;BAq9AAAAAElFTkSuQmCC" xlink:actuate="onLoad"/>
            <text x="164" y="262" clip-path="url(#clipPath37)" fill="black" font-style="normal" stroke="none" xml:space="preserve"> runnable : Runnable</text>
            <image stroke="black" width="16" xlink:show="embed" xlink:type="simple" fill="black" clip-path="url(#clipPath38)" preserveAspectRatio="none" height="16" font-style="normal" x="145" y="266" xlink:href="data:image/png;base64,iVBORw0KGgoAAAANSUhEUgAAABAAAAAQCAYAAAAf8/9hAAAAlklEQVR42mNgGAUD&#13;&#10;DxjRBebW6P/HpyG55SKjf0jc/41rFoH1sqAr+PGHiSG5cQFWzZePnGJgaEkFs80d&#13;&#10;nP6fPLCPEcOAr78whBh8266DaeYv3xl8Ekr+M3x5xSAhIgM2hAld8WegAf//s4Ix&#13;&#10;AwMEb67SA+MKV16GLQt6wE5/8eYJA04XFGdlYvUCB8s/OBukeTQJUQkAAMYmNUkI&#13;&#10;BAq9AAAAAElFTkSuQmCC" xlink:actuate="onLoad"/>
            <text x="164" y="278" clip-path="url(#clipPath39)" fill="black" font-style="normal" stroke="none" xml:space="preserve"> process : Process</text>
            <line clip-path="url(#clipPath40)" fill="none" x1="141" x2="342" y1="216" y2="216" stroke="black"/>
            <rect x="256" y="80" clip-path="url(#clipPath41)" fill="rgb(131,122,133)" width="233" rx="4" opacity="0.2549" ry="4" height="98" stroke="none"/>
            <rect x="257" y="81" clip-path="url(#clipPath41)" fill="rgb(131,122,133)" width="233" rx="4" opacity="0.2549" ry="4" height="98" stroke="none"/>
            <rect x="255" y="79" clip-path="url(#clipPath42)" fill="url(#linearGradient5)" width="233" rx="4" ry="4" height="98" stroke="none"/>
            <rect x="255" y="79" clip-path="url(#clipPath42)" fill="none" width="232" rx="4" ry="4" height="97" stroke="black"/>
            <image stroke="black" width="16" xlink:show="embed" xlink:type="simple" fill="black" clip-path="url(#clipPath43)" preserveAspectRatio="none" height="16" font-style="normal" x="319" y="84" xlink:href="data:image/png;base64,iVBORw0KGgoAAAANSUhEUgAAABAAAAAQCAYAAAAf8/9hAAAAvUlEQVR42mP8//8/&#13;&#10;AyWAiYFCwIIuMK/WgKCTkpovMOI0AASiaxfh1Ly0OQ6/F/79Z8RrO7o8hgv+/GVg&#13;&#10;+P+fFcxmhKkFeYoRQoPk8Rvwn4lh1YJpDLgCAiSP14Df/5gYwhNTcXphWs0J/GHw&#13;&#10;+y/+mEWXx3DBr7+MeMMAJI/fC0AF3X2rGXAFwh+CBgDDoKo4AKcXGgt3EgiDfwTC&#13;&#10;4B8ToXTASCAdEPDCX2A8F2dl4nQBMxMBF0yafYCRlNwIAPWTSpioA+oRAAAAAElF&#13;&#10;TkSuQmCC" xlink:actuate="onLoad"/>
            <text x="338" y="96" clip-path="url(#clipPath44)" fill="black" font-style="normal" stroke="none" xml:space="preserve">ModeLabelEvent</text>
            <image stroke="black" width="16" xlink:show="embed" xlink:type="simple" fill="black" clip-path="url(#clipPath45)" preserveAspectRatio="none" height="16" font-style="normal" x="260" y="107" xlink:href="data:image/png;base64,iVBORw0KGgoAAAANSUhEUgAAABAAAAAQCAYAAAAf8/9hAAAAXUlEQVR42mNgGAUD&#13;&#10;DxjRBebW6P8npCm55SJcHwu65I8/TAzJjQtwap5bn4DCZ0JX8PUXC17b0eUxVH8G&#13;&#10;Kvj/nxXiP5hD/0M9+x8ij9cAkA3FWZk4XcDBwjKacqgNALytGBsVIOzJAAAAAElF&#13;&#10;TkSuQmCC" xlink:actuate="onLoad"/>
            <text x="279" y="119" clip-path="url(#clipPath46)" fill="black" font-style="normal" stroke="none" xml:space="preserve">eventType : ModeLabelEventType = _all_</text>
            <image stroke="black" width="16" xlink:show="embed" xlink:type="simple" fill="black" clip-path="url(#clipPath47)" preserveAspectRatio="none" height="16" font-style="normal" x="260" y="123" xlink:href="data:image/png;base64,iVBORw0KGgoAAAANSUhEUgAAABAAAAAQCAYAAAAf8/9hAAAAlklEQVR42mNgGAUD&#13;&#10;DxjRBebW6P/HpyG55SKjf0jc/41rFoH1sqAr+PGHiSG5cQFWzZePnGJgaEkFs80d&#13;&#10;nP6fPLCPEcOAr78whBh8266DaeYv3xl8Ekr+M3x5xSAhIgM2hAld8WegAf//s4Ix&#13;&#10;AwMEb67SA+MKV16GLQt6wE5/8eYJA04XFGdlYvUCB8s/OBukeTQJUQkAAMYmNUkI&#13;&#10;BAq9AAAAAElFTkSuQmCC" xlink:actuate="onLoad"/>
            <text x="279" y="135" clip-path="url(#clipPath48)" fill="black" font-style="normal" stroke="none" xml:space="preserve"> entity : ModeLabel</text>
            <image stroke="black" width="16" xlink:show="embed" xlink:type="simple" fill="black" clip-path="url(#clipPath49)" preserveAspectRatio="none" height="16" font-style="normal" x="260" y="139" xlink:href="data:image/png;base64,iVBORw0KGgoAAAANSUhEUgAAABAAAAAQCAYAAAAf8/9hAAAAlklEQVR42mNgGAUD&#13;&#10;DxjRBebW6P/HpyG55SKjf0jc/41rFoH1sqAr+PGHiSG5cQFWzZePnGJgaEkFs80d&#13;&#10;nP6fPLCPEcOAr78whBh8266DaeYv3xl8Ekr+M3x5xSAhIgM2hAld8WegAf//s4Ix&#13;&#10;AwMEb67SA+MKV16GLQt6wE5/8eYJA04XFGdlYvUCB8s/OBukeTQJUQkAAMYmNUkI&#13;&#10;BAq9AAAAAElFTkSuQmCC" xlink:actuate="onLoad"/>
            <text x="279" y="151" clip-path="url(#clipPath50)" fill="black" font-style="normal" stroke="none" xml:space="preserve"> runnable : Runnable</text>
            <image stroke="black" width="16" xlink:show="embed" xlink:type="simple" fill="black" clip-path="url(#clipPath51)" preserveAspectRatio="none" height="16" font-style="normal" x="260" y="155" xlink:href="data:image/png;base64,iVBORw0KGgoAAAANSUhEUgAAABAAAAAQCAYAAAAf8/9hAAAAlklEQVR42mNgGAUD&#13;&#10;DxjRBebW6P/HpyG55SKjf0jc/41rFoH1sqAr+PGHiSG5cQFWzZePnGJgaEkFs80d&#13;&#10;nP6fPLCPEcOAr78whBh8266DaeYv3xl8Ekr+M3x5xSAhIgM2hAld8WegAf//s4Ix&#13;&#10;AwMEb67SA+MKV16GLQt6wE5/8eYJA04XFGdlYvUCB8s/OBukeTQJUQkAAMYmNUkI&#13;&#10;BAq9AAAAAElFTkSuQmCC" xlink:actuate="onLoad"/>
            <text x="279" y="167" clip-path="url(#clipPath52)" fill="black" font-style="normal" stroke="none" xml:space="preserve"> process : Process</text>
            <line clip-path="url(#clipPath53)" fill="none" x1="256" x2="487" y1="105" y2="105" stroke="black"/>
            <rect x="391" y="191" clip-path="url(#clipPath54)" fill="rgb(131,122,133)" width="226" rx="4" opacity="0.2549" ry="4" height="98" stroke="none"/>
            <rect x="392" y="192" clip-path="url(#clipPath54)" fill="rgb(131,122,133)" width="226" rx="4" opacity="0.2549" ry="4" height="98" stroke="none"/>
            <rect x="390" y="190" clip-path="url(#clipPath55)" fill="url(#linearGradient6)" width="226" rx="4" ry="4" height="98" stroke="none"/>
            <rect x="390" y="190" clip-path="url(#clipPath55)" fill="none" width="225" rx="4" ry="4" height="97" stroke="black"/>
            <image stroke="black" width="16" xlink:show="embed" xlink:type="simple" fill="black" clip-path="url(#clipPath56)" preserveAspectRatio="none" height="16" font-style="normal" x="454" y="195" xlink:href="data:image/png;base64,iVBORw0KGgoAAAANSUhEUgAAABAAAAAQCAYAAAAf8/9hAAAAvUlEQVR42mP8//8/&#13;&#10;AyWAiYFCwIIuMK/WgKCTkpovMOI0AASiaxfh1Ly0OQ6/F/79Z8RrO7o8hgv+/GVg&#13;&#10;+P+fFcxmhKkFeYoRQoPk8Rvwn4lh1YJpDLgCAiSP14Df/5gYwhNTcXphWs0J/GHw&#13;&#10;+y/+mEWXx3DBr7+MeMMAJI/fC0AF3X2rGXAFwh+CBgDDoKo4AKcXGgt3EgiDfwTC&#13;&#10;4B8ToXTASCAdEPDCX2A8F2dl4nQBMxMBF0yafYCRlNwIAPWTSpioA+oRAAAAAElF&#13;&#10;TkSuQmCC" xlink:actuate="onLoad"/>
            <text x="473" y="207" clip-path="url(#clipPath57)" fill="black" font-style="normal" stroke="none" xml:space="preserve">RunnableEvent</text>
            <image stroke="black" width="16" xlink:show="embed" xlink:type="simple" fill="black" clip-path="url(#clipPath58)" preserveAspectRatio="none" height="16" font-style="normal" x="395" y="218" xlink:href="data:image/png;base64,iVBORw0KGgoAAAANSUhEUgAAABAAAAAQCAYAAAAf8/9hAAAAXUlEQVR42mNgGAUD&#13;&#10;DxjRBebW6P8npCm55SJcHwu65I8/TAzJjQtwap5bn4DCZ0JX8PUXC17b0eUxVH8G&#13;&#10;Kvj/nxXiP5hD/0M9+x8ij9cAkA3FWZk4XcDBwjKacqgNALytGBsVIOzJAAAAAElF&#13;&#10;TkSuQmCC" xlink:actuate="onLoad"/>
            <text x="414" y="230" clip-path="url(#clipPath59)" fill="black" font-style="normal" stroke="none" xml:space="preserve">eventType : RunnableEventType = _all_</text>
            <image stroke="black" width="16" xlink:show="embed" xlink:type="simple" fill="black" clip-path="url(#clipPath60)" preserveAspectRatio="none" height="16" font-style="normal" x="395" y="234" xlink:href="data:image/png;base64,iVBORw0KGgoAAAANSUhEUgAAABAAAAAQCAYAAAAf8/9hAAAAlklEQVR42mNgGAUD&#13;&#10;DxjRBebW6P/HpyG55SKjf0jc/41rFoH1sqAr+PGHiSG5cQFWzZePnGJgaEkFs80d&#13;&#10;nP6fPLCPEcOAr78whBh8266DaeYv3xl8Ekr+M3x5xSAhIgM2hAld8WegAf//s4Ix&#13;&#10;AwMEb67SA+MKV16GLQt6wE5/8eYJA04XFGdlYvUCB8s/OBukeTQJUQkAAMYmNUkI&#13;&#10;BAq9AAAAAElFTkSuQmCC" xlink:actuate="onLoad"/>
            <text x="414" y="246" clip-path="url(#clipPath61)" fill="black" font-style="normal" stroke="none" xml:space="preserve"> entity : Runnable</text>
            <image stroke="black" width="16" xlink:show="embed" xlink:type="simple" fill="black" clip-path="url(#clipPath62)" preserveAspectRatio="none" height="16" font-style="normal" x="395" y="250" xlink:href="data:image/png;base64,iVBORw0KGgoAAAANSUhEUgAAABAAAAAQCAYAAAAf8/9hAAAAlklEQVR42mNgGAUD&#13;&#10;DxjRBebW6P/HpyG55SKjf0jc/41rFoH1sqAr+PGHiSG5cQFWzZePnGJgaEkFs80d&#13;&#10;nP6fPLCPEcOAr78whBh8266DaeYv3xl8Ekr+M3x5xSAhIgM2hAld8WegAf//s4Ix&#13;&#10;AwMEb67SA+MKV16GLQt6wE5/8eYJA04XFGdlYvUCB8s/OBukeTQJUQkAAMYmNUkI&#13;&#10;BAq9AAAAAElFTkSuQmCC" xlink:actuate="onLoad"/>
            <text x="414" y="262" clip-path="url(#clipPath63)" fill="black" font-style="normal" stroke="none" xml:space="preserve"> process : Process</text>
            <image stroke="black" width="16" xlink:show="embed" xlink:type="simple" fill="black" clip-path="url(#clipPath64)" preserveAspectRatio="none" height="16" font-style="normal" x="395" y="266" xlink:href="data:image/png;base64,iVBORw0KGgoAAAANSUhEUgAAABAAAAAQCAYAAAAf8/9hAAAAlklEQVR42mNgGAUD&#13;&#10;DxjRBebW6P/HpyG55SKjf0jc/41rFoH1sqAr+PGHiSG5cQFWzZePnGJgaEkFs80d&#13;&#10;nP6fPLCPEcOAr78whBh8266DaeYv3xl8Ekr+M3x5xSAhIgM2hAld8WegAf//s4Ix&#13;&#10;AwMEb67SA+MKV16GLQt6wE5/8eYJA04XFGdlYvUCB8s/OBukeTQJUQkAAMYmNUkI&#13;&#10;BAq9AAAAAElFTkSuQmCC" xlink:actuate="onLoad"/>
            <text x="414" y="278" clip-path="url(#clipPath65)" fill="black" font-style="normal" stroke="none" xml:space="preserve"> processingUnit : ProcessingUnit</text>
            <line clip-path="url(#clipPath66)" fill="none" x1="391" x2="615" y1="216" y2="216" stroke="black"/>
            <rect x="41" y="311" clip-path="url(#clipPath67)" fill="rgb(131,122,133)" width="118" rx="0" opacity="0.2549" ry="0" height="98" stroke="none"/>
            <rect x="42" y="312" clip-path="url(#clipPath67)" fill="rgb(131,122,133)" width="118" rx="0" opacity="0.2549" ry="0" height="98" stroke="none"/>
            <rect x="40" y="310" clip-path="url(#clipPath68)" fill="url(#linearGradient7)" width="118" rx="0" ry="0" height="98" stroke="none"/>
            <rect x="40" y="310" clip-path="url(#clipPath68)" fill="none" width="117" rx="0" ry="0" height="97"/>
            <image width="16" xlink:show="embed" xlink:type="simple" clip-path="url(#clipPath69)" preserveAspectRatio="none" height="16" font-style="normal" x="42" y="315" xlink:href="data:image/png;base64,iVBORw0KGgoAAAANSUhEUgAAABAAAAAQCAYAAAAf8/9hAAAAuElEQVR42mP8//8/&#13;&#10;AyWAiYFCQBsDytpP/te2yEDxG4gPEkdXy9zQ0ICheevG+QxXT8xgBLELSlsaHr4W&#13;&#10;bdiwMIMRxna1lWnE6gJkzSA+iI1Mg8RBbGSXoBjQVWnO6O2fyABzPoiNTIPEQWyQ&#13;&#10;OpgeRmzRuHnvw/8V1e1wl8A0d7RWMvg6yzMiq2WkNB2wYBPMTnYAm8rO8o+Bh+0P&#13;&#10;Ay8QcwMxB5Cf1HyBkaABU+ceYBx1AfEuoDgzAQDdSHDLTl+jJgAAAABJRU5ErkJg&#13;&#10;gg==" xlink:actuate="onLoad"/>
            <text x="61" y="327" clip-path="url(#clipPath70)" fill="black" font-style="normal" stroke="none" xml:space="preserve">ChannelEventType</text>
            <image stroke="black" width="16" xlink:show="embed" xlink:type="simple" fill="black" clip-path="url(#clipPath71)" preserveAspectRatio="none" height="16" font-style="normal" x="45" y="338" xlink:href="data:image/png;base64,iVBORw0KGgoAAAANSUhEUgAAABAAAAAQCAYAAAAf8/9hAAAASklEQVR42mP8//8/&#13;&#10;AyWAiYFCMGoAFQxgwSaYnewAjlt2lr8MPKx/GXjZ/zBws/1h4GD5x5DUfIGRBBcw&#13;&#10;ghHJLpg69wDjaDQOJQMA/OUOFnOMypIAAAAASUVORK5CYII=" xlink:actuate="onLoad"/>
            <text x="64" y="350" clip-path="url(#clipPath72)" fill="black" font-style="normal" stroke="none" xml:space="preserve">_all_</text>
            <image stroke="black" width="16" xlink:show="embed" xlink:type="simple" fill="black" clip-path="url(#clipPath73)" preserveAspectRatio="none" height="16" font-style="normal" x="45" y="354" xlink:href="data:image/png;base64,iVBORw0KGgoAAAANSUhEUgAAABAAAAAQCAYAAAAf8/9hAAAASklEQVR42mP8//8/&#13;&#10;AyWAiYFCMGoAFQxgwSaYnewAjlt2lr8MPKx/GXjZ/zBws/1h4GD5x5DUfIGRBBcw&#13;&#10;ghHJLpg69wDjaDQOJQMA/OUOFnOMypIAAAAASUVORK5CYII=" xlink:actuate="onLoad"/>
            <text x="64" y="366" clip-path="url(#clipPath74)" fill="black" font-style="normal" stroke="none" xml:space="preserve">send</text>
            <image stroke="black" width="16" xlink:show="embed" xlink:type="simple" fill="black" clip-path="url(#clipPath75)" preserveAspectRatio="none" height="16" font-style="normal" x="45" y="370" xlink:href="data:image/png;base64,iVBORw0KGgoAAAANSUhEUgAAABAAAAAQCAYAAAAf8/9hAAAASklEQVR42mP8//8/&#13;&#10;AyWAiYFCMGoAFQxgwSaYnewAjlt2lr8MPKx/GXjZ/zBws/1h4GD5x5DUfIGRBBcw&#13;&#10;ghHJLpg69wDjaDQOJQMA/OUOFnOMypIAAAAASUVORK5CYII=" xlink:actuate="onLoad"/>
            <text x="64" y="382" clip-path="url(#clipPath76)" fill="black" font-style="normal" stroke="none" xml:space="preserve">receive</text>
            <line clip-path="url(#clipPath77)" fill="none" x1="41" x2="157" y1="336" y2="336"/>
            <rect x="189" y="311" clip-path="url(#clipPath78)" fill="rgb(131,122,133)" width="118" rx="0" opacity="0.2549" ry="0" height="98" stroke="none"/>
            <rect x="190" y="312" clip-path="url(#clipPath78)" fill="rgb(131,122,133)" width="118" rx="0" opacity="0.2549" ry="0" height="98" stroke="none"/>
            <rect x="188" y="310" clip-path="url(#clipPath79)" fill="url(#linearGradient8)" width="118" rx="0" ry="0" height="98" stroke="none"/>
            <rect x="188" y="310" clip-path="url(#clipPath79)" fill="none" width="117" rx="0" ry="0" height="97"/>
            <image width="16" xlink:show="embed" xlink:type="simple" clip-path="url(#clipPath80)" preserveAspectRatio="none" height="16" font-style="normal" x="198" y="315" xlink:href="data:image/png;base64,iVBORw0KGgoAAAANSUhEUgAAABAAAAAQCAYAAAAf8/9hAAAAuElEQVR42mP8//8/&#13;&#10;AyWAiYFCQBsDytpP/te2yEDxG4gPEkdXy9zQ0ICheevG+QxXT8xgBLELSlsaHr4W&#13;&#10;bdiwMIMRxna1lWnE6gJkzSA+iI1Mg8RBbGSXoBjQVWnO6O2fyABzPoiNTIPEQWyQ&#13;&#10;OpgeRmzRuHnvw/8V1e1wl8A0d7RWMvg6yzMiq2WkNB2wYBPMTnYAm8rO8o+Bh+0P&#13;&#10;Ay8QcwMxB5Cf1HyBkaABU+ceYBx1AfEuoDgzAQDdSHDLTl+jJgAAAABJRU5ErkJg&#13;&#10;gg==" xlink:actuate="onLoad"/>
            <text x="217" y="327" clip-path="url(#clipPath81)" fill="black" font-style="normal" stroke="none" xml:space="preserve">LabelEventType</text>
            <image stroke="black" width="16" xlink:show="embed" xlink:type="simple" fill="black" clip-path="url(#clipPath82)" preserveAspectRatio="none" height="16" font-style="normal" x="193" y="338" xlink:href="data:image/png;base64,iVBORw0KGgoAAAANSUhEUgAAABAAAAAQCAYAAAAf8/9hAAAASklEQVR42mP8//8/&#13;&#10;AyWAiYFCMGoAFQxgwSaYnewAjlt2lr8MPKx/GXjZ/zBws/1h4GD5x5DUfIGRBBcw&#13;&#10;ghHJLpg69wDjaDQOJQMA/OUOFnOMypIAAAAASUVORK5CYII=" xlink:actuate="onLoad"/>
            <text x="212" y="350" clip-path="url(#clipPath83)" fill="black" font-style="normal" stroke="none" xml:space="preserve">_all_</text>
            <image stroke="black" width="16" xlink:show="embed" xlink:type="simple" fill="black" clip-path="url(#clipPath84)" preserveAspectRatio="none" height="16" font-style="normal" x="193" y="354" xlink:href="data:image/png;base64,iVBORw0KGgoAAAANSUhEUgAAABAAAAAQCAYAAAAf8/9hAAAASklEQVR42mP8//8/&#13;&#10;AyWAiYFCMGoAFQxgwSaYnewAjlt2lr8MPKx/GXjZ/zBws/1h4GD5x5DUfIGRBBcw&#13;&#10;ghHJLpg69wDjaDQOJQMA/OUOFnOMypIAAAAASUVORK5CYII=" xlink:actuate="onLoad"/>
            <text x="212" y="366" clip-path="url(#clipPath85)" fill="black" font-style="normal" stroke="none" xml:space="preserve">read</text>
            <image stroke="black" width="16" xlink:show="embed" xlink:type="simple" fill="black" clip-path="url(#clipPath86)" preserveAspectRatio="none" height="16" font-style="normal" x="193" y="370" xlink:href="data:image/png;base64,iVBORw0KGgoAAAANSUhEUgAAABAAAAAQCAYAAAAf8/9hAAAASklEQVR42mP8//8/&#13;&#10;AyWAiYFCMGoAFQxgwSaYnewAjlt2lr8MPKx/GXjZ/zBws/1h4GD5x5DUfIGRBBcw&#13;&#10;ghHJLpg69wDjaDQOJQMA/OUOFnOMypIAAAAASUVORK5CYII=" xlink:actuate="onLoad"/>
            <text x="212" y="382" clip-path="url(#clipPath87)" fill="black" font-style="normal" stroke="none" xml:space="preserve">write</text>
            <line clip-path="url(#clipPath88)" fill="none" x1="189" x2="305" y1="336" y2="336"/>
            <rect x="337" y="311" clip-path="url(#clipPath89)" fill="rgb(131,122,133)" width="129" rx="0" opacity="0.2549" ry="0" height="109" stroke="none"/>
            <rect x="338" y="312" clip-path="url(#clipPath89)" fill="rgb(131,122,133)" width="129" rx="0" opacity="0.2549" ry="0" height="109" stroke="none"/>
            <rect x="336" y="310" clip-path="url(#clipPath90)" fill="url(#linearGradient9)" width="129" rx="0" ry="0" height="109" stroke="none"/>
            <rect x="336" y="310" clip-path="url(#clipPath90)" fill="none" width="128" rx="0" ry="0" height="108"/>
            <image width="16" xlink:show="embed" xlink:type="simple" clip-path="url(#clipPath91)" preserveAspectRatio="none" height="16" font-style="normal" x="337" y="315" xlink:href="data:image/png;base64,iVBORw0KGgoAAAANSUhEUgAAABAAAAAQCAYAAAAf8/9hAAAAuElEQVR42mP8//8/&#13;&#10;AyWAiYFCQBsDytpP/te2yEDxG4gPEkdXy9zQ0ICheevG+QxXT8xgBLELSlsaHr4W&#13;&#10;bdiwMIMRxna1lWnE6gJkzSA+iI1Mg8RBbGSXoBjQVWnO6O2fyABzPoiNTIPEQWyQ&#13;&#10;OpgeRmzRuHnvw/8V1e1wl8A0d7RWMvg6yzMiq2WkNB2wYBPMTnYAm8rO8o+Bh+0P&#13;&#10;Ay8QcwMxB5Cf1HyBkaABU+ceYBx1AfEuoDgzAQDdSHDLTl+jJgAAAABJRU5ErkJg&#13;&#10;gg==" xlink:actuate="onLoad"/>
            <text x="356" y="327" clip-path="url(#clipPath92)" fill="black" font-style="normal" stroke="none" xml:space="preserve">ModeLabelEventType</text>
            <image stroke="black" width="16" xlink:show="embed" xlink:type="simple" fill="black" clip-path="url(#clipPath93)" preserveAspectRatio="none" height="16" font-style="normal" x="341" y="338" xlink:href="data:image/png;base64,iVBORw0KGgoAAAANSUhEUgAAABAAAAAQCAYAAAAf8/9hAAAASklEQVR42mP8//8/&#13;&#10;AyWAiYFCMGoAFQxgwSaYnewAjlt2lr8MPKx/GXjZ/zBws/1h4GD5x5DUfIGRBBcw&#13;&#10;ghHJLpg69wDjaDQOJQMA/OUOFnOMypIAAAAASUVORK5CYII=" xlink:actuate="onLoad"/>
            <text x="360" y="350" clip-path="url(#clipPath94)" fill="black" font-style="normal" stroke="none" xml:space="preserve">_all_</text>
            <image stroke="black" width="16" xlink:show="embed" xlink:type="simple" fill="black" clip-path="url(#clipPath95)" preserveAspectRatio="none" height="16" font-style="normal" x="341" y="354" xlink:href="data:image/png;base64,iVBORw0KGgoAAAANSUhEUgAAABAAAAAQCAYAAAAf8/9hAAAASklEQVR42mP8//8/&#13;&#10;AyWAiYFCMGoAFQxgwSaYnewAjlt2lr8MPKx/GXjZ/zBws/1h4GD5x5DUfIGRBBcw&#13;&#10;ghHJLpg69wDjaDQOJQMA/OUOFnOMypIAAAAASUVORK5CYII=" xlink:actuate="onLoad"/>
            <text x="360" y="366" clip-path="url(#clipPath96)" fill="black" font-style="normal" stroke="none" xml:space="preserve">read</text>
            <image stroke="black" width="16" xlink:show="embed" xlink:type="simple" fill="black" clip-path="url(#clipPath97)" preserveAspectRatio="none" height="16" font-style="normal" x="341" y="370" xlink:href="data:image/png;base64,iVBORw0KGgoAAAANSUhEUgAAABAAAAAQCAYAAAAf8/9hAAAASklEQVR42mP8//8/&#13;&#10;AyWAiYFCMGoAFQxgwSaYnewAjlt2lr8MPKx/GXjZ/zBws/1h4GD5x5DUfIGRBBcw&#13;&#10;ghHJLpg69wDjaDQOJQMA/OUOFnOMypIAAAAASUVORK5CYII=" xlink:actuate="onLoad"/>
            <text x="360" y="382" clip-path="url(#clipPath98)" fill="black" font-style="normal" stroke="none" xml:space="preserve">write</text>
            <image stroke="black" width="16" xlink:show="embed" xlink:type="simple" fill="black" clip-path="url(#clipPath99)" preserveAspectRatio="none" height="16" font-style="normal" x="341" y="386" xlink:href="data:image/png;base64,iVBORw0KGgoAAAANSUhEUgAAABAAAAAQCAYAAAAf8/9hAAAASklEQVR42mP8//8/&#13;&#10;AyWAiYFCMGoAFQxgwSaYnewAjlt2lr8MPKx/GXjZ/zBws/1h4GD5x5DUfIGRBBcw&#13;&#10;ghHJLpg69wDjaDQOJQMA/OUOFnOMypIAAAAASUVORK5CYII=" xlink:actuate="onLoad"/>
            <text x="360" y="398" clip-path="url(#clipPath100)" fill="black" font-style="normal" stroke="none" xml:space="preserve">increment</text>
            <image stroke="black" width="16" xlink:show="embed" xlink:type="simple" fill="black" clip-path="url(#clipPath101)" preserveAspectRatio="none" height="16" font-style="normal" x="341" y="402" xlink:href="data:image/png;base64,iVBORw0KGgoAAAANSUhEUgAAABAAAAAQCAYAAAAf8/9hAAAASklEQVR42mP8//8/&#13;&#10;AyWAiYFCMGoAFQxgwSaYnewAjlt2lr8MPKx/GXjZ/zBws/1h4GD5x5DUfIGRBBcw&#13;&#10;ghHJLpg69wDjaDQOJQMA/OUOFnOMypIAAAAASUVORK5CYII=" xlink:actuate="onLoad"/>
            <text x="360" y="414" clip-path="url(#clipPath102)" fill="black" font-style="normal" stroke="none" xml:space="preserve">decrement</text>
            <line clip-path="url(#clipPath103)" fill="none" x1="337" x2="464" y1="336" y2="336"/>
            <rect x="495" y="311" clip-path="url(#clipPath104)" fill="rgb(131,122,133)" width="122" rx="0" opacity="0.2549" ry="0" height="109" stroke="none"/>
            <rect x="496" y="312" clip-path="url(#clipPath104)" fill="rgb(131,122,133)" width="122" rx="0" opacity="0.2549" ry="0" height="109" stroke="none"/>
            <rect x="494" y="310" clip-path="url(#clipPath105)" fill="url(#linearGradient10)" width="122" rx="0" ry="0" height="109" stroke="none"/>
            <rect x="494" y="310" clip-path="url(#clipPath105)" fill="none" width="121" rx="0" ry="0" height="108"/>
            <image width="16" xlink:show="embed" xlink:type="simple" clip-path="url(#clipPath106)" preserveAspectRatio="none" height="16" font-style="normal" x="495" y="315" xlink:href="data:image/png;base64,iVBORw0KGgoAAAANSUhEUgAAABAAAAAQCAYAAAAf8/9hAAAAuElEQVR42mP8//8/&#13;&#10;AyWAiYFCQBsDytpP/te2yEDxG4gPEkdXy9zQ0ICheevG+QxXT8xgBLELSlsaHr4W&#13;&#10;bdiwMIMRxna1lWnE6gJkzSA+iI1Mg8RBbGSXoBjQVWnO6O2fyABzPoiNTIPEQWyQ&#13;&#10;OpgeRmzRuHnvw/8V1e1wl8A0d7RWMvg6yzMiq2WkNB2wYBPMTnYAm8rO8o+Bh+0P&#13;&#10;Ay8QcwMxB5Cf1HyBkaABU+ceYBx1AfEuoDgzAQDdSHDLTl+jJgAAAABJRU5ErkJg&#13;&#10;gg==" xlink:actuate="onLoad"/>
            <text x="514" y="327" clip-path="url(#clipPath107)" fill="black" font-style="normal" stroke="none" xml:space="preserve">RunnableEventType</text>
            <image stroke="black" width="16" xlink:show="embed" xlink:type="simple" fill="black" clip-path="url(#clipPath108)" preserveAspectRatio="none" height="16" font-style="normal" x="499" y="338" xlink:href="data:image/png;base64,iVBORw0KGgoAAAANSUhEUgAAABAAAAAQCAYAAAAf8/9hAAAASklEQVR42mP8//8/&#13;&#10;AyWAiYFCMGoAFQxgwSaYnewAjlt2lr8MPKx/GXjZ/zBws/1h4GD5x5DUfIGRBBcw&#13;&#10;ghHJLpg69wDjaDQOJQMA/OUOFnOMypIAAAAASUVORK5CYII=" xlink:actuate="onLoad"/>
            <text x="518" y="350" clip-path="url(#clipPath109)" fill="black" font-style="normal" stroke="none" xml:space="preserve">_all_</text>
            <image stroke="black" width="16" xlink:show="embed" xlink:type="simple" fill="black" clip-path="url(#clipPath110)" preserveAspectRatio="none" height="16" font-style="normal" x="499" y="354" xlink:href="data:image/png;base64,iVBORw0KGgoAAAANSUhEUgAAABAAAAAQCAYAAAAf8/9hAAAASklEQVR42mP8//8/&#13;&#10;AyWAiYFCMGoAFQxgwSaYnewAjlt2lr8MPKx/GXjZ/zBws/1h4GD5x5DUfIGRBBcw&#13;&#10;ghHJLpg69wDjaDQOJQMA/OUOFnOMypIAAAAASUVORK5CYII=" xlink:actuate="onLoad"/>
            <text x="518" y="366" clip-path="url(#clipPath111)" fill="black" font-style="normal" stroke="none" xml:space="preserve">start</text>
            <image stroke="black" width="16" xlink:show="embed" xlink:type="simple" fill="black" clip-path="url(#clipPath112)" preserveAspectRatio="none" height="16" font-style="normal" x="499" y="370" xlink:href="data:image/png;base64,iVBORw0KGgoAAAANSUhEUgAAABAAAAAQCAYAAAAf8/9hAAAASklEQVR42mP8//8/&#13;&#10;AyWAiYFCMGoAFQxgwSaYnewAjlt2lr8MPKx/GXjZ/zBws/1h4GD5x5DUfIGRBBcw&#13;&#10;ghHJLpg69wDjaDQOJQMA/OUOFnOMypIAAAAASUVORK5CYII=" xlink:actuate="onLoad"/>
            <text x="518" y="382" clip-path="url(#clipPath113)" fill="black" font-style="normal" stroke="none" xml:space="preserve">suspend</text>
            <image stroke="black" width="16" xlink:show="embed" xlink:type="simple" fill="black" clip-path="url(#clipPath114)" preserveAspectRatio="none" height="16" font-style="normal" x="499" y="386" xlink:href="data:image/png;base64,iVBORw0KGgoAAAANSUhEUgAAABAAAAAQCAYAAAAf8/9hAAAASklEQVR42mP8//8/&#13;&#10;AyWAiYFCMGoAFQxgwSaYnewAjlt2lr8MPKx/GXjZ/zBws/1h4GD5x5DUfIGRBBcw&#13;&#10;ghHJLpg69wDjaDQOJQMA/OUOFnOMypIAAAAASUVORK5CYII=" xlink:actuate="onLoad"/>
            <text x="518" y="398" clip-path="url(#clipPath115)" fill="black" font-style="normal" stroke="none" xml:space="preserve">resume</text>
            <image stroke="black" width="16" xlink:show="embed" xlink:type="simple" fill="black" clip-path="url(#clipPath116)" preserveAspectRatio="none" height="16" font-style="normal" x="499" y="402" xlink:href="data:image/png;base64,iVBORw0KGgoAAAANSUhEUgAAABAAAAAQCAYAAAAf8/9hAAAASklEQVR42mP8//8/&#13;&#10;AyWAiYFCMGoAFQxgwSaYnewAjlt2lr8MPKx/GXjZ/zBws/1h4GD5x5DUfIGRBBcw&#13;&#10;ghHJLpg69wDjaDQOJQMA/OUOFnOMypIAAAAASUVORK5CYII=" xlink:actuate="onLoad"/>
            <text x="518" y="414" clip-path="url(#clipPath117)" fill="black" font-style="normal" stroke="none" xml:space="preserve">terminate</text>
            <line clip-path="url(#clipPath118)" fill="none" x1="495" x2="615" y1="336" y2="336"/>
            <line clip-path="url(#clipPath119)" fill="none" x1="119" x2="119" y1="80" y2="67" stroke="rgb(136,136,136)"/>
            <line clip-path="url(#clipPath119)" fill="none" x1="119" x2="305" y1="67" y2="67" stroke="rgb(136,136,136)"/>
            <line clip-path="url(#clipPath119)" fill="none" x1="305" x2="305" y1="67" y2="49" stroke="rgb(136,136,136)"/>
            <polygon fill="white" clip-path="url(#clipPath120)" points=" 305 49 309 57 301 57" stroke="none"/>
            <polygon fill="none" clip-path="url(#clipPath120)" points=" 305 49 309 57 301 57" stroke="rgb(136,136,136)"/>
            <line clip-path="url(#clipPath119)" fill="none" x1="632" x2="632" y1="80" y2="67" stroke="rgb(136,136,136)"/>
            <line clip-path="url(#clipPath119)" fill="none" x1="632" x2="305" y1="67" y2="67" stroke="rgb(136,136,136)"/>
            <line clip-path="url(#clipPath119)" fill="none" x1="305" x2="305" y1="67" y2="49" stroke="rgb(136,136,136)"/>
            <polygon fill="white" clip-path="url(#clipPath120)" points=" 305 49 309 57 301 57" stroke="none"/>
            <polygon fill="none" clip-path="url(#clipPath120)" points=" 305 49 309 57 301 57" stroke="rgb(136,136,136)"/>
            <line clip-path="url(#clipPath119)" fill="none" x1="241" x2="241" y1="190" y2="67" stroke="rgb(136,136,136)"/>
            <line clip-path="url(#clipPath119)" fill="none" x1="241" x2="305" y1="67" y2="67" stroke="rgb(136,136,136)"/>
            <line clip-path="url(#clipPath119)" fill="none" x1="305" x2="305" y1="67" y2="49" stroke="rgb(136,136,136)"/>
            <polygon fill="white" clip-path="url(#clipPath120)" points=" 305 49 309 57 301 57" stroke="none"/>
            <polygon fill="none" clip-path="url(#clipPath120)" points=" 305 49 309 57 301 57" stroke="rgb(136,136,136)"/>
            <line clip-path="url(#clipPath119)" fill="none" x1="371" x2="371" y1="79" y2="67" stroke="rgb(136,136,136)"/>
            <line clip-path="url(#clipPath119)" fill="none" x1="371" x2="305" y1="67" y2="67" stroke="rgb(136,136,136)"/>
            <line clip-path="url(#clipPath119)" fill="none" x1="305" x2="305" y1="67" y2="49" stroke="rgb(136,136,136)"/>
            <polygon fill="white" clip-path="url(#clipPath120)" points=" 305 49 309 57 301 57" stroke="none"/>
            <polygon fill="none" clip-path="url(#clipPath120)" points=" 305 49 309 57 301 57" stroke="rgb(136,136,136)"/>
            <line clip-path="url(#clipPath119)" fill="none" x1="503" x2="503" y1="190" y2="67" stroke="rgb(136,136,136)"/>
            <line clip-path="url(#clipPath119)" fill="none" x1="503" x2="305" y1="67" y2="67" stroke="rgb(136,136,136)"/>
            <line clip-path="url(#clipPath119)" fill="none" x1="305" x2="305" y1="67" y2="49" stroke="rgb(136,136,136)"/>
            <polygon fill="white" clip-path="url(#clipPath120)" points=" 305 49 309 57 301 57" stroke="none"/>
            <polygon fill="none" clip-path="url(#clipPath120)" points=" 305 49 309 57 301 57" stroke="rgb(136,136,136)"/>
        </g>
    </g>
</svg>
