<svg width="155" height="27" viewBox="0 0 155 27" fill="none" xmlns="http://www.w3.org/2000/svg">
<path d="M20.1553 15.3358C20.8898 15.342 21.606 15.566 22.2132 15.9795C22.8204 16.393 23.2912 16.9773 23.5661 17.6585C23.841 18.3398 23.9076 19.0872 23.7575 19.8063C23.6073 20.5254 23.2472 21.1837 22.7227 21.6981C22.1982 22.2124 21.5329 22.5595 20.811 22.6955C20.0891 22.8315 19.3431 22.7502 18.6674 22.462C17.9917 22.1738 17.4167 21.6915 17.0153 21.0764C16.6138 20.4612 16.4039 19.7407 16.4121 19.0062V15.3358H20.1553ZM14.0788 2.85646C14.0735 2.85618 14.0681 2.857 14.0631 2.85885C14.058 2.86071 14.0534 2.86358 14.0495 2.86728C14.0456 2.87097 14.0425 2.87542 14.0404 2.88036C14.0383 2.88529 14.0372 2.8906 14.0372 2.89597L11.8766 5.0587C11.5085 5.4247 11.5501 5.302 11.7934 5.70959C12.185 6.30314 12.3973 6.99698 12.4048 7.70804V19.1289C12.3887 20.6729 12.8319 22.1869 13.678 23.4786C14.5242 24.7703 15.7351 25.7814 17.157 26.3834C18.579 26.9855 20.1478 27.1514 21.6642 26.86C23.1806 26.5687 24.5762 25.8332 25.6738 24.7471C26.7714 23.6609 27.5214 22.2731 27.8286 20.7598C28.1358 19.2465 27.9863 17.6761 27.3992 16.2479C26.812 14.8198 25.8137 13.5983 24.5309 12.7387C23.2482 11.8791 21.7389 11.4201 20.1948 11.42C17.9073 11.3556 16.6595 11.3431 16.4017 11.3389V7.62693C16.4104 5.91069 15.8355 4.24245 14.7713 2.89597C14.5842 2.66722 14.5239 2.55493 14.4511 2.55493C14.3783 2.55493 14.2972 2.65683 14.0788 2.85646Z" fill="white"/>
<path d="M0.904298 7.74968C0.903751 8.76736 1.1038 9.77518 1.49299 10.7155C1.88219 11.6558 2.45291 12.5102 3.17252 13.2298C3.89214 13.9494 4.74653 14.5202 5.68685 14.9094C6.62717 15.2986 7.63499 15.4986 8.65267 15.4981H11.3852V11.5012H8.65267C7.65992 11.5012 6.70783 11.1068 6.00585 10.4048C5.30386 9.70284 4.9095 8.75075 4.9095 7.758C4.92295 6.76943 5.32164 5.82514 6.02072 5.12605C6.71981 4.42696 7.6641 4.02827 8.65267 4.01482C9.42525 3.99267 10.1842 4.2218 10.8154 4.6678L13.629 1.83546C12.2591 0.621389 10.4828 -0.0332966 8.65267 0.00130477C6.59953 0.00733942 4.63221 0.82562 3.18041 2.27742C1.72861 3.72921 0.910333 5.69653 0.904298 7.74968Z" fill="white"/>
<path d="M20.3567 11.3806H16.4014V15.3775H20.3567V11.3806Z" fill="white"/>
<path d="M152.372 17.5379C152.727 17.5379 153.074 17.6431 153.369 17.8403C153.664 18.0375 153.894 18.3178 154.03 18.6458C154.166 18.9737 154.201 19.3345 154.132 19.6827C154.063 20.0308 153.892 20.3506 153.641 20.6015C153.39 20.8525 153.07 21.0235 152.722 21.0927C152.374 21.1619 152.013 21.1264 151.685 20.9906C151.357 20.8547 151.077 20.6247 150.88 20.3296C150.682 20.0345 150.577 19.6875 150.577 19.3325C150.581 18.8577 150.771 18.4035 151.107 18.0677C151.443 17.732 151.897 17.5417 152.372 17.5379ZM152.372 17.9039C152.183 17.9048 151.996 17.9439 151.823 18.0191C151.65 18.0942 151.494 18.2037 151.364 18.341C151.234 18.4782 151.134 18.6404 151.069 18.8176C151.003 18.9949 150.975 19.1835 150.985 19.3721C150.978 19.5598 151.009 19.7469 151.076 19.9226C151.142 20.0983 151.243 20.2591 151.372 20.3957C151.501 20.5322 151.656 20.6418 151.827 20.7181C151.999 20.7944 152.184 20.8359 152.372 20.8402C152.561 20.8393 152.747 20.8002 152.921 20.725C153.094 20.6499 153.25 20.5404 153.38 20.4031C153.509 20.2659 153.61 20.1037 153.675 19.9265C153.74 19.7492 153.769 19.5606 153.759 19.3721C153.759 18.5153 153.187 17.9039 152.372 17.9039ZM152.453 18.3531C152.62 18.3486 152.783 18.4102 152.905 18.5247C153.027 18.6391 153.099 18.7971 153.106 18.9645C153.11 19.0974 153.068 19.2276 152.985 19.3321C152.903 19.4367 152.787 19.509 152.657 19.5363L153.106 20.3099H152.69L152.274 19.5758H152.11V20.3099H151.744V18.3531H152.453ZM152.413 18.6796H152.168V19.2514H152.413C152.454 19.2564 152.496 19.2527 152.535 19.2406C152.574 19.2285 152.61 19.2082 152.641 19.1811C152.672 19.154 152.697 19.1207 152.714 19.0834C152.731 19.046 152.74 19.0055 152.74 18.9645C152.74 18.7565 152.617 18.6796 152.413 18.6796ZM132.756 9.34034C136.671 9.34034 138.466 12.3993 138.466 15.7432V16.6H130.308C130.634 18.1077 131.695 18.9249 133.163 18.9249C134.265 18.9249 135.035 18.5985 135.937 17.7812L136.018 17.7001L137.936 19.4136C136.834 20.7591 135.284 21.6159 133.153 21.6159C129.686 21.6159 127.076 19.1683 127.035 15.6206V15.3357C127.035 12.0729 129.401 9.34034 132.745 9.34034H132.756ZM119.613 9.34034C123.529 9.34034 125.323 12.3993 125.323 15.7432V16.6H117.176C117.502 18.1077 118.563 18.9249 120.031 18.9249C121.133 18.9249 121.902 18.5985 122.805 17.7812L122.886 17.7001L124.803 19.4136C123.701 20.7591 122.152 21.6159 120.031 21.6159C116.564 21.6159 113.954 19.1683 113.913 15.6206V15.3357C113.913 12.0729 116.279 9.34034 119.623 9.34034H119.613ZM63.9539 9.34034C67.5432 9.34034 70.1925 11.9918 70.2757 15.3357V15.579C70.2362 18.925 67.5432 21.6096 63.9144 21.6096C60.3251 21.6096 57.6758 18.9582 57.5926 15.6143V15.3689C57.6342 12.025 60.3251 9.33826 63.9539 9.33826V9.34034ZM45.1944 5.70738C48.0496 5.70738 49.7693 6.64733 51.1481 8.03231L51.2313 8.11549L49.1101 10.6109C47.9269 9.55037 46.7436 8.85789 45.1944 8.85789C42.6261 8.85789 40.7899 10.9769 40.7483 13.5868V13.7947C40.7899 16.4066 42.5845 18.5673 45.1944 18.5673C46.8268 18.5673 47.8853 17.9559 48.9874 16.9764L49.0685 16.8953L49.2328 16.7726L51.3519 18.9353C49.7631 20.6468 48.0496 21.6679 45.0717 21.6679C40.6277 21.6679 37.2817 18.2408 37.2422 13.8779V13.5909C37.2817 9.22388 40.5445 5.71986 45.1944 5.71986V5.70738ZM144.339 9.39025C145.894 9.4094 147.41 9.87733 148.706 10.7378L147.441 13.0627C146.3 12.3682 145.116 11.9606 144.26 11.9606C143.444 11.9606 143.037 12.3286 143.037 12.7757V12.8173C143.037 13.4703 144.139 13.7947 145.401 14.2439L145.609 14.325L145.817 14.4082C147.325 14.9385 148.916 15.7536 148.957 17.671V17.7854C148.957 20.3973 146.998 21.5784 144.47 21.5784C142.641 21.5722 140.871 20.9387 139.454 19.7838L140.872 17.5774C142.136 18.5153 143.482 19.006 144.542 19.006C145.52 19.006 145.927 18.638 145.927 18.1077V18.0682C145.927 17.3736 144.827 17.1303 143.563 16.7227L143.236 16.6395L143.114 16.6C141.606 16.1092 140.015 15.2941 139.974 13.2561V13.1334C140.055 10.7274 141.972 9.37985 144.341 9.37985L144.339 9.39025ZM96.4987 5.30811V21.3767H93.1964V19.6569C92.3812 20.757 91.2791 21.5722 89.5655 21.5722C86.8746 21.5722 84.3043 19.4531 84.2232 15.6185V15.3336C84.2648 11.4594 86.7935 9.37777 89.5655 9.37777C90.2318 9.36558 90.8923 9.50205 91.4992 9.77724C92.1061 10.0524 92.6439 10.4594 93.0737 10.9686L93.1153 11.0102L93.1964 11.1329V5.30811H96.4987ZM75.171 9.59196V16.1571C75.171 17.7479 75.905 18.5631 77.1673 18.5631C78.4296 18.5631 79.2073 17.7874 79.2469 16.2382V9.58364H82.5492V21.3684H79.2489V19.7048C78.4733 20.6842 77.4938 21.5764 75.8218 21.5764C73.3264 21.5764 71.8707 19.946 71.8707 17.2946V9.58573L75.171 9.59196ZM106.533 5.96108C108.286 5.96108 109.673 6.44977 110.529 7.30654C111.204 7.97587 111.585 8.88522 111.59 9.83527V10.0432C111.548 11.7069 110.65 12.653 109.592 13.2665L109.754 13.3476C111.386 14.0006 112.405 15.0112 112.445 16.9764V17.1844C112.405 19.9169 110.203 21.3039 106.817 21.3039H99.4351V5.95484L106.533 5.96108ZM56.0828 21.3767H52.7888V5.30811H56.0912L56.0828 21.3767ZM90.3828 12.2018C88.8731 12.2018 87.5671 13.4246 87.5276 15.3814V15.5894C87.5671 17.5067 88.8731 18.7711 90.3828 18.7711C91.8925 18.7711 93.1964 17.5067 93.2359 15.5894V15.4687C93.2359 13.5098 91.9321 12.2059 90.3828 12.2059V12.2018ZM63.9144 12.2455C62.0428 12.2455 60.897 13.6741 60.897 15.3856V15.5935C60.9365 17.3071 62.1593 18.7752 63.9539 18.7752C65.8255 18.7752 66.9734 17.3487 66.9734 15.6351V15.4272C66.9318 13.7136 65.709 12.2455 63.9144 12.2455ZM106.572 15.0196H102.698V18.4051H106.695C108.163 18.4051 109.061 17.9143 109.061 16.7726V16.6499C109.061 15.631 108.286 15.0196 106.566 15.0196H106.572ZM132.749 12.0417C131.404 12.0417 130.505 12.9795 130.221 14.4893V14.5704H135.243C135.035 13.0627 134.182 12.0417 132.747 12.0417H132.749ZM119.615 12.0417C118.269 12.0417 117.371 12.9795 117.086 14.4893V14.5704H122.102C121.894 13.0627 121.041 12.0417 119.607 12.0417H119.615ZM105.986 8.94315H102.698V12.2059H105.798C107.267 12.2059 108.204 11.7568 108.204 10.6546V10.5735C108.204 9.51294 107.429 8.94315 106.002 8.94315" fill="white"/>
</svg>
