<svg width="97" height="128" viewBox="0 0 97 128" fill="none" xmlns="http://www.w3.org/2000/svg">
<path fill-rule="evenodd" clip-rule="evenodd" d="M8.12793 0C3.70966 0 0.12793 3.58173 0.12793 8V120C0.12793 124.418 3.70966 128 8.12793 128H88.1279C92.5462 128 96.1279 124.418 96.1279 120V32L64.1279 0H8.12793ZM80.1279 84C80.1279 85.4448 80.0185 86.864 79.8075 88.2497H47.6949L29.1979 56.0123C29.3196 56.0042 29.4424 56 29.5662 56H52.1279C67.5919 56 80.1279 68.536 80.1279 84ZM24.1279 66.3291V88.2497H36.7054L24.1279 66.3291ZM24.1279 106.562V97.7816H42.1746L50.3327 112H29.5662C26.5627 112 24.1279 109.565 24.1279 106.562ZM53.164 97.7816L60.5777 110.702C67.3759 108.553 73.0524 103.88 76.507 97.7816H53.164Z" fill="#1F8197"/>
</svg>
