{
    "@context": [
      "https://www.w3.org/2019/wot/td/v1",
      {
        "saref": "https://saref.etsi.org/core/",
        "saref4envi": "https://saref.etsi.org/saref4envi/",
        "saref4ener": "https://saref.etsi.org/saref4ener/",
        "saref4bldg": "https://saref.etsi.org/saref4bldg/",
        "om": "http://www.ontology-of-units-of-measure.org/resource/om-2/"
      }
    ],
    "title": "Smart Light Bulb",
    "@type": [
      "saref4envi:LightSwitch"
    ],
    "description": "A smart light bulb that allows control over brightness, color, energy consumption, and operational status. Ideal for smart home and energy-efficient systems.",
    "properties": {
      "brightness": {
        "title": "brightness",
        "@type": "saref4envi:Light",
        "type": "number",
        "om:hasUnit": "om:percent",
        "description": "Adjust or retrieve the brightness level of the light bulb, expressed as a percentage.",
        "readOnly": false
      },
      "color": {
        "title": "color",
        "@type": "saref:Property",
        "type": "string",
        "description": "Set or retrieve the color of the light emitted by the bulb. Colors can be specified using standard color names or HEX codes.",
        "readOnly": false
      },
      "powerConsumption": {
        "title": "powerConsumption",
        "@type": "saref4ener:Power",
        "type": "number",
        "om:hasUnit": "om:watt",
        "description": "Retrieve the current power consumption of the light bulb, measured in watts.",
        "readOnly": true
      },
      "status": {
        "title": "status",
        "@type": "saref:OnOffState",
        "type": "boolean",
        "description": "Turn the light bulb on or off, or retrieve its current operational status (true for on, false for off).",
        "readOnly": false
      },
      "colorTemperature": {
        "title": "colorTemperature",
        "@type": "saref4envi:Light",
        "type": "number",
        "om:hasUnit": "om:kelvin",
        "description": "Set or retrieve the color temperature of the light bulb, measured in Kelvin, ranging from warm to cool light.",
        "readOnly": false
      }
    }
  }
  