{
  "@id": "{{{id}}}",
  "group": "interactionRouteGroup",
  "handle": [
    {
      "handler": "subroute",
      "routes": [
        {
          "handle": [
            {
              "handler": "reverse_proxy",
              "upstreams": [
                {
                  "dial": "{{{sbUpstream}}}"
                }
              ]
            }
          ]
        }
      ]
    }
  ],
  "match": [
    {
      "path": [
        "/",
        "/api/sb/",
        "/api/sb/*",
        "/doc/sb",
        "/doc/sb/*"
      ]
    }
  ]
}
