{
  "admin": {
    "listen": "0.0.0.0:2019"
  },
  "logging": {
    "logs": {
      "default": {
        "level": "{{{proxyLogLevel}}}"
      }
    }
  },
  "apps": {
    "tls": {
      "certificates": {
        "load_pem": [
          {
            "certificate": "{{{cert}}}",
            "key": "{{{key}}}",
            "tags": [
              "selfSignedNode"
            ]
          }
        ]
      }
    },
    "http": {
      "servers": {
        "northbound": {
          "listen": [
            ":443"
          ],
          "automatic_https": {
            "disable": true
          },
          "tls_connection_policies": [
            {
              "certificate_selection": {
                "any_tag": [
                  "selfSignedNode"
                ]
              }
            }
          ],
          "routes": [
            {
              "match": [
                {
                  "path": [
                    "/api/nb/dnscheck"
                  ]
                }
              ],
              "handle": [
                {
                  "handler": "subroute",
                  "routes": [
                    {
                      "handle": [
                        {
                          "handler": "reverse_proxy",
                          "upstreams": [
                            {
                              "dial": "{{{nbUpstream}}}"
                            }
                          ]
                        }
                      ]
                    }
                  ]
                }
              ]
            },
            {
              "handle": [
                {
                  "handler": "subroute",
                  "@id": "NorthBoundHandler",
                  "routes": [
                    {
                      "@id": "nb:404",
                      "group": "interactionRouteGroup",
                      "handle": [
                        {
                          "handler": "subroute",
                          "routes": [
                            {
                              "handle": [
                                {
                                  "body": "NOT FOUND",
                                  "handler": "static_response",
                                  "status_code": 404
                                }
                              ]
                            }
                          ]
                        }
                      ]
                    }
                  ]
                }
              ],
              "terminal": true
            }
          ]
        },
        "southbound": {
          "listen": [
            ":444"
          ],
          "automatic_https": {
            "disable": true
          },
          "tls_connection_policies": [
            {
              "certificate_selection": {
                "any_tag": [
                  "selfSignedNode"
                ]
              }
            }
          ],
          "routes": [
            {
              "handle": [
                {
                  "handler": "subroute",
                  "@id": "SouthBoundHandler",
                  "routes": [
                  ]
                }
              ],
              "terminal": true
            }
          ]
        }
      }
    }
  }
}
