{
  "type" : [ "VerifiableCredential", "VerifiableAttestation", "demoTemplate" ],
  "@context" : [ "https://www.w3.org/2018/credentials/v1", "https://w3id.org/security/suites/jws-2020/v1" ],
  "id" : "urn:uuid:00bf408e-4b81-4c1c-b1fe-c9af86b9ab17",
  "issuer" : "did:ebsi:zzeZ3Q66wkVz7c7AMhxgxcu",
  "issuanceDate" : "2023-10-06T12:22:29Z",
  "issued" : "2023-10-06T12:22:29Z",
  "validFrom" : "2023-10-06T12:22:29Z",
  "credentialSchema" : {
    "id" : "https://raw.githubusercontent.com/walt-id/waltid-ssikit-vclib/master/src/test/resources/schemas/VerifiableId.json",
    "type" : "FullJsonSchemaValidator2021"
  },
  "credentialSubject" : {
    "id" : "did:ebsi:zzeZ3Q66wkVz7c7AMhxgxcu",
    "component" : "Composite Virtual Object",
    "deployed" : "docker",
    "voId" : "cV01"
  },
  "evidence" : [ {
    "type" : [ "DocumentVerification" ],
    "verifier" : "did:ebsi:2A9BZ9SUe6BatacSpvs1V5CdjHvLpQ7bEsi2Jb6LdHKnQxaN"
  } ],
  "proof" : {
    "type" : "JsonWebSignature2020",
    "creator" : "did:ebsi:zzeZ3Q66wkVz7c7AMhxgxcu",
    "created" : "2023-10-06T12:22:29Z",
    "proofPurpose" : "assertionMethod",
    "verificationMethod" : "did:ebsi:zzeZ3Q66wkVz7c7AMhxgxcu#9fe8ad3ef1cb435f99957b4413c82e69",
    "jws" : "eyJiNjQiOmZhbHNlLCJjcml0IjpbImI2NCJdLCJhbGciOiJFZERTQSJ9..9iyLEJeJxsnGyaECXmW5zGl3uStJuBswdijb8M9LulzzWVoFAVGb4ssqAl46ql2vc0fDK7R2GSz0fhy-LDLIDA"
  }
}