{
    "display": [
      {
        "name": "VerifiableId"
      }
    ],
    "formats": {
      "ldp_vc": {
        "cryptographic_binding_methods_supported": [
          "did"
        ],
        "cryptographic_suites_supported": [
          "Ed25519Signature2018",
          "Ed25519Signature2020",
          "EcdsaSecp256k1Signature2019",
          "RsaSignature2018",
          "JsonWebSignature2020",
          "JcsEd25519Signature2020"
        ],
        "types": [
          "VerifiableCredential",
          "VerifiableAttestation",
          "VerifiableId"
        ]
      },
      "jwt_vc": {
        "cryptographic_binding_methods_supported": [
          "did"
        ],
        "cryptographic_suites_supported": [
          "ES256",
          "ES256K",
          "EdDSA",
          "RS256",
          "PS256"
        ],
        "types": [
          "VerifiableCredential",
          "VerifiableAttestation",
          "VerifiableId"
        ]
      }
    }
}