{
    "title": "test",
    "id": "urn:dev:wot:example:sdn test",
    "description": "SDN test.",
    "@context": [
        "https://www.w3.org/2019/wot/td/v1"
    ],
    "securityDefinitions": {
        "nosec_sc":{
            "scheme":"nosec"
        }
    },
    "security": "nosec_sc",
    "properties": {
        "sdn_configuration": {
            "type": "string"
        },
	"sdn_topology": {
            "type": "string"
        },
        "sdn_flows": {
            "type": "string"
        }
    }
}

