<?xml version="1.0" encoding="UTF-8" standalone="no"?>
<svg 
   width="451.91998pt"
   height="258.95999pt"
   viewBox="0 0 451.91998 258.95999"
   version="1.1"
   id="svg662"
   xmlns:xlink="http://www.w3.org/1999/xlink"
   xmlns="http://www.w3.org/2000/svg"
   xmlns:svg="http://www.w3.org/2000/svg" content="%3Cmxfile%20host%3D%22app.diagrams.net%22%20modified%3D%222023-08-16T09%3A09%3A26.668Z%22%20agent%3D%22Mozilla%2F5.0%20(Windows%20NT%2010.0%3B%20Win64%3B%20x64)%20AppleWebKit%2F537.36%20(KHTML%2C%20like%20Gecko)%20Chrome%2F115.0.0.0%20Safari%2F537.36%20Edg%2F115.0.1901.203%22%20etag%3D%22sKGO6A_LueSh3xcp21iC%22%20version%3D%2221.3.6%22%20type%3D%22onedrive%22%3E%20%20%20%3Cdiagram%20name%3D%22Page-1%22%20id%3D%22qs5r0kmperqOYuCvLqb9%22%3E%20%20%20%20%20%3CmxGraphModel%20dx%3D%221386%22%20dy%3D%22806%22%20grid%3D%221%22%20gridSize%3D%2210%22%20guides%3D%221%22%20tooltips%3D%221%22%20connect%3D%221%22%20arrows%3D%221%22%20fold%3D%221%22%20page%3D%220%22%20pageScale%3D%221%22%20pageWidth%3D%221169%22%20pageHeight%3D%22827%22%20math%3D%220%22%20shadow%3D%220%22%3E%20%20%20%20%20%20%20%3Croot%3E%20%20%20%20%20%20%20%20%20%3CmxCell%20id%3D%220%22%20%2F%3E%20%20%20%20%20%20%20%20%20%3CmxCell%20id%3D%221%22%20parent%3D%220%22%20%2F%3E%20%20%20%20%20%20%20%20%20%3CmxCell%20id%3D%22IZZwdZoLT-4YcpWHDSY7-1%22%20value%3D%22%22%20style%3D%22rounded%3D0%3BwhiteSpace%3Dwrap%3Bhtml%3D1%3BfillColor%3D%23f8cecc%3Bdashed%3D1%3BstrokeColor%3D%23b85450%3B%22%20parent%3D%221%22%20vertex%3D%221%22%3E%20%20%20%20%20%20%20%20%20%20%20%3CmxGeometry%20x%3D%22200%22%20y%3D%2280%22%20width%3D%22600%22%20height%3D%22270%22%20as%3D%22geometry%22%20%2F%3E%20%20%20%20%20%20%20%20%20%3C%2FmxCell%3E%20%20%20%20%20%20%20%20%20%3CmxCell%20id%3D%22IZZwdZoLT-4YcpWHDSY7-2%22%20value%3D%22meta-Orchestrator%22%20style%3D%22text%3Bhtml%3D1%3BstrokeColor%3D%236F0000%3BfillColor%3D%23a20025%3Balign%3Dcenter%3BverticalAlign%3Dmiddle%3BwhiteSpace%3Dwrap%3Brounded%3D0%3BfontColor%3D%23ffffff%3Bglass%3D0%3Bshadow%3D0%3Bdashed%3D1%3Bopacity%3D70%3B%22%20parent%3D%221%22%20vertex%3D%221%22%3E%20%20%20%20%20%20%20%20%20%20%20%3CmxGeometry%20x%3D%22200%22%20y%3D%2280%22%20width%3D%22110%22%20height%3D%2230%22%20as%3D%22geometry%22%20%2F%3E%20%20%20%20%20%20%20%20%20%3C%2FmxCell%3E%20%20%20%20%20%20%20%20%20%3CmxCell%20id%3D%22IZZwdZoLT-4YcpWHDSY7-5%22%20value%3D%22%22%20style%3D%22edgeStyle%3DorthogonalEdgeStyle%3Brounded%3D0%3BorthogonalLoop%3D1%3BjettySize%3Dauto%3Bhtml%3D1%3BstartArrow%3Dclassic%3BstartFill%3D1%3B%22%20parent%3D%221%22%20source%3D%22IZZwdZoLT-4YcpWHDSY7-3%22%20target%3D%22IZZwdZoLT-4YcpWHDSY7-4%22%20edge%3D%221%22%3E%20%20%20%20%20%20%20%20%20%20%20%3CmxGeometry%20relative%3D%221%22%20as%3D%22geometry%22%20%2F%3E%20%20%20%20%20%20%20%20%20%3C%2FmxCell%3E%20%20%20%20%20%20%20%20%20%3CmxCell%20id%3D%22IZZwdZoLT-4YcpWHDSY7-9%22%20value%3D%22%22%20style%3D%22edgeStyle%3DorthogonalEdgeStyle%3Brounded%3D0%3BorthogonalLoop%3D1%3BjettySize%3Dauto%3Bhtml%3D1%3BendArrow%3Dclassic%3BendFill%3D1%3BstartArrow%3Dclassic%3BstartFill%3D1%3B%22%20parent%3D%221%22%20source%3D%22IZZwdZoLT-4YcpWHDSY7-3%22%20target%3D%22IZZwdZoLT-4YcpWHDSY7-8%22%20edge%3D%221%22%3E%20%20%20%20%20%20%20%20%20%20%20%3CmxGeometry%20relative%3D%221%22%20as%3D%22geometry%22%20%2F%3E%20%20%20%20%20%20%20%20%20%3C%2FmxCell%3E%20%20%20%20%20%20%20%20%20%3CmxCell%20id%3D%22IZZwdZoLT-4YcpWHDSY7-11%22%20value%3D%22%22%20style%3D%22edgeStyle%3DorthogonalEdgeStyle%3Brounded%3D0%3BorthogonalLoop%3D1%3BjettySize%3Dauto%3Bhtml%3D1%3BstartArrow%3Dclassic%3BstartFill%3D1%3B%22%20parent%3D%221%22%20source%3D%22IZZwdZoLT-4YcpWHDSY7-3%22%20target%3D%22IZZwdZoLT-4YcpWHDSY7-10%22%20edge%3D%221%22%3E%20%20%20%20%20%20%20%20%20%20%20%3CmxGeometry%20relative%3D%221%22%20as%3D%22geometry%22%20%2F%3E%20%20%20%20%20%20%20%20%20%3C%2FmxCell%3E%20%20%20%20%20%20%20%20%20%3CmxCell%20id%3D%22IZZwdZoLT-4YcpWHDSY7-14%22%20style%3D%22edgeStyle%3DorthogonalEdgeStyle%3Brounded%3D0%3BorthogonalLoop%3D1%3BjettySize%3Dauto%3Bhtml%3D1%3BentryX%3D0.5%3BentryY%3D0%3BentryDx%3D0%3BentryDy%3D0%3BstartArrow%3Dclassic%3BstartFill%3D1%3B%22%20parent%3D%221%22%20source%3D%22IZZwdZoLT-4YcpWHDSY7-3%22%20target%3D%22IZZwdZoLT-4YcpWHDSY7-12%22%20edge%3D%221%22%3E%20%20%20%20%20%20%20%20%20%20%20%3CmxGeometry%20relative%3D%221%22%20as%3D%22geometry%22%20%2F%3E%20%20%20%20%20%20%20%20%20%3C%2FmxCell%3E%20%20%20%20%20%20%20%20%20%3CmxCell%20id%3D%22IZZwdZoLT-4YcpWHDSY7-3%22%20value%3D%22Orchestration%20Engine%22%20style%3D%22rounded%3D0%3BwhiteSpace%3Dwrap%3Bhtml%3D1%3BfillColor%3D%23a20025%3BstrokeColor%3D%236F0000%3BfontColor%3D%23ffffff%3Bglass%3D0%3B%22%20parent%3D%221%22%20vertex%3D%221%22%3E%20%20%20%20%20%20%20%20%20%20%20%3CmxGeometry%20x%3D%22420%22%20y%3D%22195%22%20width%3D%22160%22%20height%3D%22110%22%20as%3D%22geometry%22%20%2F%3E%20%20%20%20%20%20%20%20%20%3C%2FmxCell%3E%20%20%20%20%20%20%20%20%20%3CmxCell%20id%3D%22IZZwdZoLT-4YcpWHDSY7-4%22%20value%3D%22Analytics%20Engine%22%20style%3D%22rounded%3D0%3BwhiteSpace%3Dwrap%3Bhtml%3D1%3BfillColor%3D%23a20025%3BstrokeColor%3D%236F0000%3BfontColor%3D%23ffffff%3Bglass%3D0%3B%22%20parent%3D%221%22%20vertex%3D%221%22%3E%20%20%20%20%20%20%20%20%20%20%20%3CmxGeometry%20x%3D%22420%22%20y%3D%2290%22%20width%3D%22160%22%20height%3D%2240%22%20as%3D%22geometry%22%20%2F%3E%20%20%20%20%20%20%20%20%20%3C%2FmxCell%3E%20%20%20%20%20%20%20%20%20%3CmxCell%20id%3D%22IZZwdZoLT-4YcpWHDSY7-8%22%20value%3D%22Decision%20Engine%22%20style%3D%22rounded%3D0%3BwhiteSpace%3Dwrap%3Bhtml%3D1%3BfillColor%3D%23a20025%3BstrokeColor%3D%236F0000%3BfontColor%3D%23ffffff%3Bglass%3D0%3B%22%20parent%3D%221%22%20vertex%3D%221%22%3E%20%20%20%20%20%20%20%20%20%20%20%3CmxGeometry%20x%3D%22210%22%20y%3D%22230%22%20width%3D%22160%22%20height%3D%2240%22%20as%3D%22geometry%22%20%2F%3E%20%20%20%20%20%20%20%20%20%3C%2FmxCell%3E%20%20%20%20%20%20%20%20%20%3CmxCell%20id%3D%22IZZwdZoLT-4YcpWHDSY7-10%22%20value%3D%22Resources%20Manager%20Engine%22%20style%3D%22rounded%3D0%3BwhiteSpace%3Dwrap%3Bhtml%3D1%3BfillColor%3D%23a20025%3BstrokeColor%3D%236F0000%3BfontColor%3D%23ffffff%3Bglass%3D0%3B%22%20parent%3D%221%22%20vertex%3D%221%22%3E%20%20%20%20%20%20%20%20%20%20%20%3CmxGeometry%20x%3D%22630%22%20y%3D%22230%22%20width%3D%22160%22%20height%3D%2240%22%20as%3D%22geometry%22%20%2F%3E%20%20%20%20%20%20%20%20%20%3C%2FmxCell%3E%20%20%20%20%20%20%20%20%20%3CmxCell%20id%3D%22IZZwdZoLT-4YcpWHDSY7-12%22%20value%3D%22API%20%2F%20Other%20Components%22%20style%3D%22rounded%3D0%3BwhiteSpace%3Dwrap%3Bhtml%3D1%3BfillColor%3D%23a20025%3BstrokeColor%3D%236F0000%3BfontColor%3D%23ffffff%3Bglass%3D0%3B%22%20parent%3D%221%22%20vertex%3D%221%22%3E%20%20%20%20%20%20%20%20%20%20%20%3CmxGeometry%20x%3D%22200%22%20y%3D%22380%22%20width%3D%22600%22%20height%3D%2240%22%20as%3D%22geometry%22%20%2F%3E%20%20%20%20%20%20%20%20%20%3C%2FmxCell%3E%20%20%20%20%20%20%20%20%20%3CmxCell%20id%3D%22IZZwdZoLT-4YcpWHDSY7-15%22%20value%3D%22Policies%2C%20metrics%2C%20resources%20analytics%22%20style%3D%22text%3Bhtml%3D1%3BstrokeColor%3Dnone%3BfillColor%3Dnone%3Balign%3Dcenter%3BverticalAlign%3Dmiddle%3BwhiteSpace%3Dwrap%3Brounded%3D0%3B%22%20parent%3D%221%22%20vertex%3D%221%22%3E%20%20%20%20%20%20%20%20%20%20%20%3CmxGeometry%20x%3D%22400%22%20y%3D%22140%22%20width%3D%22100%22%20height%3D%2230%22%20as%3D%22geometry%22%20%2F%3E%20%20%20%20%20%20%20%20%20%3C%2FmxCell%3E%20%20%20%20%20%20%20%20%20%3CmxCell%20id%3D%22IZZwdZoLT-4YcpWHDSY7-16%22%20value%3D%22Workload%20placement%2C%20migration%22%20style%3D%22text%3Bhtml%3D1%3BstrokeColor%3Dnone%3BfillColor%3Dnone%3Balign%3Dcenter%3BverticalAlign%3Dmiddle%3BwhiteSpace%3Dwrap%3Brounded%3D0%3B%22%20parent%3D%221%22%20vertex%3D%221%22%3E%20%20%20%20%20%20%20%20%20%20%20%3CmxGeometry%20x%3D%22350%22%20y%3D%22190%22%20width%3D%2260%22%20height%3D%2230%22%20as%3D%22geometry%22%20%2F%3E%20%20%20%20%20%20%20%20%20%3C%2FmxCell%3E%20%20%20%20%20%20%20%20%20%3CmxCell%20id%3D%22IZZwdZoLT-4YcpWHDSY7-17%22%20value%3D%22Resource%2C%20allocation%2C%20scalling%22%20style%3D%22text%3Bhtml%3D1%3BstrokeColor%3Dnone%3BfillColor%3Dnone%3Balign%3Dcenter%3BverticalAlign%3Dmiddle%3BwhiteSpace%3Dwrap%3Brounded%3D0%3B%22%20parent%3D%221%22%20vertex%3D%221%22%3E%20%20%20%20%20%20%20%20%20%20%20%3CmxGeometry%20x%3D%22590%22%20y%3D%22190%22%20width%3D%2260%22%20height%3D%2230%22%20as%3D%22geometry%22%20%2F%3E%20%20%20%20%20%20%20%20%20%3C%2FmxCell%3E%20%20%20%20%20%20%20%20%20%3CmxCell%20id%3D%22IZZwdZoLT-4YcpWHDSY7-18%22%20value%3D%22Inputs%2FOutputs%20external%20APIs%22%20style%3D%22text%3Bhtml%3D1%3BstrokeColor%3Dnone%3BfillColor%3Dnone%3Balign%3Dcenter%3BverticalAlign%3Dmiddle%3BwhiteSpace%3Dwrap%3Brounded%3D0%3B%22%20parent%3D%221%22%20vertex%3D%221%22%3E%20%20%20%20%20%20%20%20%20%20%20%3CmxGeometry%20x%3D%22520%22%20y%3D%22320%22%20width%3D%2260%22%20height%3D%2230%22%20as%3D%22geometry%22%20%2F%3E%20%20%20%20%20%20%20%20%20%3C%2FmxCell%3E%20%20%20%20%20%20%20%3C%2Froot%3E%20%20%20%20%20%3C%2FmxGraphModel%3E%20%20%20%3C%2Fdiagram%3E%20%3C%2Fmxfile%3E%20">
  <defs
     id="defs110">
    <g
       id="g102">
      <g
         id="glyph-0-0">
        <path
           d="M 1.125 0 L 1.125 -5.625 L 5.625 -5.625 L 5.625 0 Z M 1.265625 -0.140625 L 5.484375 -0.140625 L 5.484375 -5.484375 L 1.265625 -5.484375 Z M 1.265625 -0.140625 "
           id="path2" />
      </g>
      <g
         id="glyph-0-1">
        <path
           d="M 0.59375 0 L 0.59375 -4.671875 L 1.296875 -4.671875 L 1.296875 -4.015625 C 1.441406 -4.242188 1.632813 -4.425781 1.875 -4.5625 C 2.125 -4.695313 2.40625 -4.765625 2.71875 -4.765625 C 3.0625 -4.765625 3.34375 -4.691406 3.5625 -4.546875 C 3.78125 -4.410156 3.9375 -4.210938 4.03125 -3.953125 C 4.40625 -4.492188 4.882813 -4.765625 5.46875 -4.765625 C 5.9375 -4.765625 6.296875 -4.632813 6.546875 -4.375 C 6.796875 -4.125 6.921875 -3.734375 6.921875 -3.203125 L 6.921875 0 L 6.125 0 L 6.125 -2.9375 C 6.125 -3.257813 6.097656 -3.488281 6.046875 -3.625 C 6.003906 -3.757813 5.914063 -3.867188 5.78125 -3.953125 C 5.644531 -4.046875 5.484375 -4.09375 5.296875 -4.09375 C 4.972656 -4.09375 4.703125 -3.984375 4.484375 -3.765625 C 4.265625 -3.546875 4.15625 -3.195313 4.15625 -2.71875 L 4.15625 0 L 3.359375 0 L 3.359375 -3.03125 C 3.359375 -3.382813 3.296875 -3.648438 3.171875 -3.828125 C 3.046875 -4.003906 2.835938 -4.09375 2.546875 -4.09375 C 2.316406 -4.09375 2.109375 -4.03125 1.921875 -3.90625 C 1.734375 -3.789063 1.597656 -3.617188 1.515625 -3.390625 C 1.429688 -3.171875 1.390625 -2.847656 1.390625 -2.421875 L 1.390625 0 Z M 0.59375 0 "
           id="path5" />
      </g>
      <g
         id="glyph-0-2">
        <path
           d="M 3.78125 -1.5 L 4.609375 -1.40625 C 4.472656 -0.925781 4.226563 -0.550781 3.875 -0.28125 C 3.53125 -0.0195313 3.085938 0.109375 2.546875 0.109375 C 1.867188 0.109375 1.328125 -0.0976563 0.921875 -0.515625 C 0.523438 -0.941406 0.328125 -1.535156 0.328125 -2.296875 C 0.328125 -3.078125 0.53125 -3.679688 0.9375 -4.109375 C 1.34375 -4.546875 1.867188 -4.765625 2.515625 -4.765625 C 3.140625 -4.765625 3.644531 -4.550781 4.03125 -4.125 C 4.425781 -3.707031 4.625 -3.113281 4.625 -2.34375 C 4.625 -2.289063 4.625 -2.21875 4.625 -2.125 L 1.140625 -2.125 C 1.171875 -1.613281 1.316406 -1.222656 1.578125 -0.953125 C 1.835938 -0.679688 2.164063 -0.546875 2.5625 -0.546875 C 2.851563 -0.546875 3.097656 -0.617188 3.296875 -0.765625 C 3.503906 -0.921875 3.664063 -1.164063 3.78125 -1.5 Z M 1.1875 -2.78125 L 3.796875 -2.78125 C 3.765625 -3.175781 3.664063 -3.472656 3.5 -3.671875 C 3.25 -3.972656 2.921875 -4.125 2.515625 -4.125 C 2.148438 -4.125 1.84375 -4 1.59375 -3.75 C 1.351563 -3.507813 1.21875 -3.1875 1.1875 -2.78125 Z M 1.1875 -2.78125 "
           id="path8" />
      </g>
      <g
         id="glyph-0-3">
        <path
           d="M 2.328125 -0.703125 L 2.4375 -0.015625 C 2.207031 0.0351563 2.007813 0.0625 1.84375 0.0625 C 1.550781 0.0625 1.328125 0.015625 1.171875 -0.078125 C 1.015625 -0.171875 0.898438 -0.289063 0.828125 -0.4375 C 0.765625 -0.582031 0.734375 -0.890625 0.734375 -1.359375 L 0.734375 -4.046875 L 0.15625 -4.046875 L 0.15625 -4.671875 L 0.734375 -4.671875 L 0.734375 -5.828125 L 1.53125 -6.296875 L 1.53125 -4.671875 L 2.328125 -4.671875 L 2.328125 -4.046875 L 1.53125 -4.046875 L 1.53125 -1.328125 C 1.53125 -1.097656 1.539063 -0.953125 1.5625 -0.890625 C 1.59375 -0.828125 1.640625 -0.773438 1.703125 -0.734375 C 1.765625 -0.691406 1.851563 -0.671875 1.96875 -0.671875 C 2.0625 -0.671875 2.179688 -0.679688 2.328125 -0.703125 Z M 2.328125 -0.703125 "
           id="path11" />
      </g>
      <g
         id="glyph-0-4">
        <path
           d="M 3.640625 -0.578125 C 3.347656 -0.328125 3.066406 -0.148438 2.796875 -0.046875 C 2.523438 0.0546875 2.234375 0.109375 1.921875 0.109375 C 1.410156 0.109375 1.015625 -0.015625 0.734375 -0.265625 C 0.460938 -0.515625 0.328125 -0.835938 0.328125 -1.234375 C 0.328125 -1.460938 0.378906 -1.671875 0.484375 -1.859375 C 0.585938 -2.046875 0.722656 -2.195313 0.890625 -2.3125 C 1.054688 -2.425781 1.242188 -2.515625 1.453125 -2.578125 C 1.609375 -2.609375 1.84375 -2.644531 2.15625 -2.6875 C 2.800781 -2.757813 3.273438 -2.851563 3.578125 -2.96875 C 3.578125 -3.070313 3.578125 -3.140625 3.578125 -3.171875 C 3.578125 -3.492188 3.503906 -3.71875 3.359375 -3.84375 C 3.148438 -4.03125 2.847656 -4.125 2.453125 -4.125 C 2.078125 -4.125 1.800781 -4.054688 1.625 -3.921875 C 1.445313 -3.796875 1.316406 -3.566406 1.234375 -3.234375 L 0.46875 -3.328125 C 0.53125 -3.660156 0.640625 -3.925781 0.796875 -4.125 C 0.960938 -4.332031 1.195313 -4.488281 1.5 -4.59375 C 1.8125 -4.707031 2.164063 -4.765625 2.5625 -4.765625 C 2.96875 -4.765625 3.289063 -4.71875 3.53125 -4.625 C 3.78125 -4.53125 3.960938 -4.410156 4.078125 -4.265625 C 4.203125 -4.128906 4.285156 -3.953125 4.328125 -3.734375 C 4.359375 -3.597656 4.375 -3.359375 4.375 -3.015625 L 4.375 -1.953125 C 4.375 -1.222656 4.390625 -0.757813 4.421875 -0.5625 C 4.453125 -0.363281 4.519531 -0.175781 4.625 0 L 3.796875 0 C 3.710938 -0.164063 3.660156 -0.359375 3.640625 -0.578125 Z M 3.578125 -2.34375 C 3.285156 -2.226563 2.851563 -2.128906 2.28125 -2.046875 C 1.957031 -1.992188 1.726563 -1.9375 1.59375 -1.875 C 1.457031 -1.820313 1.351563 -1.738281 1.28125 -1.625 C 1.207031 -1.507813 1.171875 -1.382813 1.171875 -1.25 C 1.171875 -1.039063 1.25 -0.863281 1.40625 -0.71875 C 1.5625 -0.582031 1.796875 -0.515625 2.109375 -0.515625 C 2.410156 -0.515625 2.679688 -0.582031 2.921875 -0.71875 C 3.160156 -0.851563 3.335938 -1.035156 3.453125 -1.265625 C 3.535156 -1.441406 3.578125 -1.703125 3.578125 -2.046875 Z M 3.578125 -2.34375 "
           id="path14" />
      </g>
      <g
         id="glyph-0-5">
        <path
           d="M 0.28125 -1.9375 L 0.28125 -2.734375 L 2.71875 -2.734375 L 2.71875 -1.9375 Z M 0.28125 -1.9375 "
           id="path17" />
      </g>
      <g
         id="glyph-0-6">
        <path
           d="M 0.4375 -3.140625 C 0.4375 -4.203125 0.722656 -5.035156 1.296875 -5.640625 C 1.867188 -6.253906 2.609375 -6.5625 3.515625 -6.5625 C 4.109375 -6.5625 4.644531 -6.414063 5.125 -6.125 C 5.601563 -5.84375 5.96875 -5.445313 6.21875 -4.9375 C 6.46875 -4.425781 6.59375 -3.851563 6.59375 -3.21875 C 6.59375 -2.5625 6.460938 -1.972656 6.203125 -1.453125 C 5.941406 -0.941406 5.566406 -0.550781 5.078125 -0.28125 C 4.597656 -0.0195313 4.078125 0.109375 3.515625 0.109375 C 2.910156 0.109375 2.367188 -0.0351563 1.890625 -0.328125 C 1.410156 -0.617188 1.046875 -1.019531 0.796875 -1.53125 C 0.554688 -2.039063 0.4375 -2.578125 0.4375 -3.140625 Z M 1.3125 -3.125 C 1.3125 -2.34375 1.519531 -1.726563 1.9375 -1.28125 C 2.351563 -0.84375 2.878906 -0.625 3.515625 -0.625 C 4.148438 -0.625 4.675781 -0.847656 5.09375 -1.296875 C 5.507813 -1.742188 5.71875 -2.382813 5.71875 -3.21875 C 5.71875 -3.738281 5.628906 -4.191406 5.453125 -4.578125 C 5.273438 -4.972656 5.015625 -5.28125 4.671875 -5.5 C 4.328125 -5.71875 3.945313 -5.828125 3.53125 -5.828125 C 2.925781 -5.828125 2.40625 -5.617188 1.96875 -5.203125 C 1.53125 -4.785156 1.3125 -4.09375 1.3125 -3.125 Z M 1.3125 -3.125 "
           id="path20" />
      </g>
      <g
         id="glyph-0-7">
        <path
           d="M 0.578125 0 L 0.578125 -4.671875 L 1.296875 -4.671875 L 1.296875 -3.953125 C 1.472656 -4.285156 1.640625 -4.503906 1.796875 -4.609375 C 1.953125 -4.710938 2.125 -4.765625 2.3125 -4.765625 C 2.570313 -4.765625 2.84375 -4.679688 3.125 -4.515625 L 2.84375 -3.78125 C 2.65625 -3.894531 2.460938 -3.953125 2.265625 -3.953125 C 2.097656 -3.953125 1.941406 -3.898438 1.796875 -3.796875 C 1.660156 -3.691406 1.5625 -3.546875 1.5 -3.359375 C 1.414063 -3.078125 1.375 -2.769531 1.375 -2.4375 L 1.375 0 Z M 0.578125 0 "
           id="path23" />
      </g>
      <g
         id="glyph-0-8">
        <path
           d="M 3.640625 -1.703125 L 4.421875 -1.609375 C 4.335938 -1.066406 4.117188 -0.644531 3.765625 -0.34375 C 3.410156 -0.0390625 2.976563 0.109375 2.46875 0.109375 C 1.832031 0.109375 1.320313 -0.0976563 0.9375 -0.515625 C 0.550781 -0.929688 0.359375 -1.53125 0.359375 -2.3125 C 0.359375 -2.820313 0.441406 -3.265625 0.609375 -3.640625 C 0.773438 -4.015625 1.023438 -4.296875 1.359375 -4.484375 C 1.703125 -4.671875 2.078125 -4.765625 2.484375 -4.765625 C 2.984375 -4.765625 3.394531 -4.632813 3.71875 -4.375 C 4.039063 -4.125 4.25 -3.765625 4.34375 -3.296875 L 3.578125 -3.171875 C 3.503906 -3.484375 3.375 -3.71875 3.1875 -3.875 C 3 -4.039063 2.773438 -4.125 2.515625 -4.125 C 2.109375 -4.125 1.78125 -3.976563 1.53125 -3.6875 C 1.289063 -3.40625 1.171875 -2.957031 1.171875 -2.34375 C 1.171875 -1.707031 1.289063 -1.25 1.53125 -0.96875 C 1.769531 -0.6875 2.082031 -0.546875 2.46875 -0.546875 C 2.78125 -0.546875 3.039063 -0.640625 3.25 -0.828125 C 3.457031 -1.015625 3.585938 -1.304688 3.640625 -1.703125 Z M 3.640625 -1.703125 "
           id="path26" />
      </g>
      <g
         id="glyph-0-9">
        <path
           d="M 0.59375 0 L 0.59375 -6.4375 L 1.390625 -6.4375 L 1.390625 -4.125 C 1.753906 -4.550781 2.21875 -4.765625 2.78125 -4.765625 C 3.125 -4.765625 3.421875 -4.695313 3.671875 -4.5625 C 3.929688 -4.425781 4.113281 -4.238281 4.21875 -4 C 4.332031 -3.757813 4.390625 -3.410156 4.390625 -2.953125 L 4.390625 0 L 3.609375 0 L 3.609375 -2.953125 C 3.609375 -3.347656 3.519531 -3.632813 3.34375 -3.8125 C 3.175781 -4 2.9375 -4.09375 2.625 -4.09375 C 2.382813 -4.09375 2.160156 -4.03125 1.953125 -3.90625 C 1.742188 -3.789063 1.597656 -3.628906 1.515625 -3.421875 C 1.429688 -3.210938 1.390625 -2.921875 1.390625 -2.546875 L 1.390625 0 Z M 0.59375 0 "
           id="path29" />
      </g>
      <g
         id="glyph-0-10">
        <path
           d="M 0.28125 -1.390625 L 1.0625 -1.515625 C 1.101563 -1.203125 1.222656 -0.960938 1.421875 -0.796875 C 1.628906 -0.628906 1.910156 -0.546875 2.265625 -0.546875 C 2.628906 -0.546875 2.898438 -0.617188 3.078125 -0.765625 C 3.253906 -0.910156 3.34375 -1.082031 3.34375 -1.28125 C 3.34375 -1.46875 3.265625 -1.609375 3.109375 -1.703125 C 2.992188 -1.773438 2.722656 -1.867188 2.296875 -1.984375 C 1.710938 -2.128906 1.304688 -2.253906 1.078125 -2.359375 C 0.859375 -2.460938 0.691406 -2.609375 0.578125 -2.796875 C 0.460938 -2.984375 0.40625 -3.191406 0.40625 -3.421875 C 0.40625 -3.628906 0.453125 -3.820313 0.546875 -4 C 0.640625 -4.175781 0.769531 -4.328125 0.9375 -4.453125 C 1.0625 -4.535156 1.226563 -4.609375 1.4375 -4.671875 C 1.65625 -4.734375 1.882813 -4.765625 2.125 -4.765625 C 2.488281 -4.765625 2.804688 -4.710938 3.078125 -4.609375 C 3.359375 -4.503906 3.566406 -4.363281 3.703125 -4.1875 C 3.835938 -4.007813 3.929688 -3.769531 3.984375 -3.46875 L 3.203125 -3.359375 C 3.171875 -3.597656 3.066406 -3.785156 2.890625 -3.921875 C 2.722656 -4.054688 2.488281 -4.125 2.1875 -4.125 C 1.820313 -4.125 1.5625 -4.0625 1.40625 -3.9375 C 1.25 -3.820313 1.171875 -3.679688 1.171875 -3.515625 C 1.171875 -3.410156 1.203125 -3.320313 1.265625 -3.25 C 1.328125 -3.15625 1.429688 -3.082031 1.578125 -3.03125 C 1.648438 -3 1.878906 -2.929688 2.265625 -2.828125 C 2.828125 -2.679688 3.21875 -2.5625 3.4375 -2.46875 C 3.664063 -2.375 3.84375 -2.234375 3.96875 -2.046875 C 4.09375 -1.867188 4.15625 -1.644531 4.15625 -1.375 C 4.15625 -1.101563 4.078125 -0.851563 3.921875 -0.625 C 3.765625 -0.394531 3.539063 -0.210938 3.25 -0.078125 C 2.96875 0.046875 2.640625 0.109375 2.265625 0.109375 C 1.660156 0.109375 1.195313 -0.015625 0.875 -0.265625 C 0.5625 -0.523438 0.363281 -0.898438 0.28125 -1.390625 Z M 0.28125 -1.390625 "
           id="path32" />
      </g>
      <g
         id="glyph-0-11">
        <path
           d="M 0.296875 -2.328125 C 0.296875 -3.191406 0.535156 -3.832031 1.015625 -4.25 C 1.421875 -4.59375 1.910156 -4.765625 2.484375 -4.765625 C 3.128906 -4.765625 3.65625 -4.554688 4.0625 -4.140625 C 4.46875 -3.722656 4.671875 -3.144531 4.671875 -2.40625 C 4.671875 -1.800781 4.578125 -1.328125 4.390625 -0.984375 C 4.210938 -0.640625 3.953125 -0.367188 3.609375 -0.171875 C 3.265625 0.015625 2.890625 0.109375 2.484375 0.109375 C 1.828125 0.109375 1.296875 -0.0976563 0.890625 -0.515625 C 0.492188 -0.941406 0.296875 -1.546875 0.296875 -2.328125 Z M 1.109375 -2.328125 C 1.109375 -1.734375 1.238281 -1.285156 1.5 -0.984375 C 1.757813 -0.691406 2.085938 -0.546875 2.484375 -0.546875 C 2.878906 -0.546875 3.207031 -0.691406 3.46875 -0.984375 C 3.726563 -1.285156 3.859375 -1.742188 3.859375 -2.359375 C 3.859375 -2.929688 3.726563 -3.367188 3.46875 -3.671875 C 3.207031 -3.972656 2.878906 -4.125 2.484375 -4.125 C 2.085938 -4.125 1.757813 -3.972656 1.5 -3.671875 C 1.238281 -3.378906 1.109375 -2.929688 1.109375 -2.328125 Z M 1.109375 -2.328125 "
           id="path35" />
      </g>
      <g
         id="glyph-0-12">
        <path
           d="M 0.59375 -5.53125 L 0.59375 -6.4375 L 1.390625 -6.4375 L 1.390625 -5.53125 Z M 0.59375 0 L 0.59375 -4.671875 L 1.390625 -4.671875 L 1.390625 0 Z M 0.59375 0 "
           id="path38" />
      </g>
      <g
         id="glyph-0-13">
        <path
           d="M 0.59375 0 L 0.59375 -4.671875 L 1.3125 -4.671875 L 1.3125 -4 C 1.644531 -4.507813 2.140625 -4.765625 2.796875 -4.765625 C 3.078125 -4.765625 3.332031 -4.710938 3.5625 -4.609375 C 3.800781 -4.515625 3.976563 -4.382813 4.09375 -4.21875 C 4.207031 -4.0625 4.289063 -3.867188 4.34375 -3.640625 C 4.375 -3.492188 4.390625 -3.238281 4.390625 -2.875 L 4.390625 0 L 3.59375 0 L 3.59375 -2.84375 C 3.59375 -3.164063 3.5625 -3.40625 3.5 -3.5625 C 3.4375 -3.71875 3.328125 -3.84375 3.171875 -3.9375 C 3.015625 -4.039063 2.832031 -4.09375 2.625 -4.09375 C 2.289063 -4.09375 2 -3.984375 1.75 -3.765625 C 1.507813 -3.554688 1.390625 -3.148438 1.390625 -2.546875 L 1.390625 0 Z M 0.59375 0 "
           id="path41" />
      </g>
      <g
         id="glyph-0-14" />
      <g
         id="glyph-0-15">
        <path
           d="M 0.71875 0 L 0.71875 -6.4375 L 5.375 -6.4375 L 5.375 -5.6875 L 1.5625 -5.6875 L 1.5625 -3.703125 L 5.125 -3.703125 L 5.125 -2.953125 L 1.5625 -2.953125 L 1.5625 -0.765625 L 5.515625 -0.765625 L 5.515625 0 Z M 0.71875 0 "
           id="path45" />
      </g>
      <g
         id="glyph-0-16">
        <path
           d="M 0.453125 0.390625 L 1.21875 0.5 C 1.25 0.738281 1.335938 0.910156 1.484375 1.015625 C 1.679688 1.160156 1.953125 1.234375 2.296875 1.234375 C 2.660156 1.234375 2.941406 1.160156 3.140625 1.015625 C 3.335938 0.867188 3.472656 0.664063 3.546875 0.40625 C 3.585938 0.238281 3.601563 -0.0976563 3.59375 -0.609375 C 3.25 -0.203125 2.820313 0 2.3125 0 C 1.664063 0 1.164063 -0.226563 0.8125 -0.6875 C 0.46875 -1.15625 0.296875 -1.710938 0.296875 -2.359375 C 0.296875 -2.804688 0.375 -3.21875 0.53125 -3.59375 C 0.695313 -3.96875 0.929688 -4.253906 1.234375 -4.453125 C 1.535156 -4.660156 1.894531 -4.765625 2.3125 -4.765625 C 2.863281 -4.765625 3.316406 -4.546875 3.671875 -4.109375 L 3.671875 -4.671875 L 4.40625 -4.671875 L 4.40625 -0.640625 C 4.40625 0.0859375 4.328125 0.601563 4.171875 0.90625 C 4.023438 1.207031 3.789063 1.445313 3.46875 1.625 C 3.15625 1.800781 2.765625 1.890625 2.296875 1.890625 C 1.734375 1.890625 1.28125 1.765625 0.9375 1.515625 C 0.601563 1.265625 0.441406 0.890625 0.453125 0.390625 Z M 1.109375 -2.421875 C 1.109375 -1.804688 1.226563 -1.359375 1.46875 -1.078125 C 1.707031 -0.796875 2.007813 -0.65625 2.375 -0.65625 C 2.738281 -0.65625 3.046875 -0.796875 3.296875 -1.078125 C 3.546875 -1.359375 3.671875 -1.796875 3.671875 -2.390625 C 3.671875 -2.960938 3.539063 -3.394531 3.28125 -3.6875 C 3.03125 -3.976563 2.726563 -4.125 2.375 -4.125 C 2.019531 -4.125 1.71875 -3.976563 1.46875 -3.6875 C 1.226563 -3.40625 1.109375 -2.984375 1.109375 -2.421875 Z M 1.109375 -2.421875 "
           id="path48" />
      </g>
      <g
         id="glyph-0-17">
        <path
           d="M -0.015625 0 L 2.46875 -6.4375 L 3.375 -6.4375 L 6.015625 0 L 5.046875 0 L 4.296875 -1.953125 L 1.59375 -1.953125 L 0.890625 0 Z M 1.84375 -2.640625 L 4.03125 -2.640625 L 3.359375 -4.4375 C 3.148438 -4.976563 3 -5.421875 2.90625 -5.765625 C 2.820313 -5.347656 2.703125 -4.9375 2.546875 -4.53125 Z M 1.84375 -2.640625 "
           id="path51" />
      </g>
      <g
         id="glyph-0-18">
        <path
           d="M 0.578125 0 L 0.578125 -6.4375 L 1.359375 -6.4375 L 1.359375 0 Z M 0.578125 0 "
           id="path54" />
      </g>
      <g
         id="glyph-0-19">
        <path
           d="M 0.5625 1.796875 L 0.46875 1.0625 C 0.644531 1.101563 0.796875 1.125 0.921875 1.125 C 1.097656 1.125 1.238281 1.09375 1.34375 1.03125 C 1.445313 0.976563 1.535156 0.898438 1.609375 0.796875 C 1.648438 0.710938 1.726563 0.515625 1.84375 0.203125 C 1.863281 0.160156 1.890625 0.0976563 1.921875 0.015625 L 0.140625 -4.671875 L 1 -4.671875 L 1.96875 -1.96875 C 2.09375 -1.625 2.207031 -1.265625 2.3125 -0.890625 C 2.394531 -1.242188 2.5 -1.597656 2.625 -1.953125 L 3.625 -4.671875 L 4.421875 -4.671875 L 2.640625 0.078125 C 2.453125 0.585938 2.304688 0.941406 2.203125 1.140625 C 2.054688 1.398438 1.894531 1.585938 1.71875 1.703125 C 1.539063 1.828125 1.320313 1.890625 1.0625 1.890625 C 0.914063 1.890625 0.75 1.859375 0.5625 1.796875 Z M 0.5625 1.796875 "
           id="path57" />
      </g>
      <g
         id="glyph-0-20">
        <path
           d="M 0.6875 0 L 0.6875 -6.4375 L 2.90625 -6.4375 C 3.414063 -6.4375 3.800781 -6.40625 4.0625 -6.34375 C 4.425781 -6.257813 4.738281 -6.109375 5 -5.890625 C 5.34375 -5.597656 5.597656 -5.226563 5.765625 -4.78125 C 5.929688 -4.34375 6.015625 -3.832031 6.015625 -3.25 C 6.015625 -2.757813 5.957031 -2.328125 5.84375 -1.953125 C 5.726563 -1.578125 5.582031 -1.265625 5.40625 -1.015625 C 5.226563 -0.765625 5.03125 -0.566406 4.8125 -0.421875 C 4.601563 -0.285156 4.347656 -0.179688 4.046875 -0.109375 C 3.753906 -0.0351563 3.410156 0 3.015625 0 Z M 1.546875 -0.765625 L 2.921875 -0.765625 C 3.347656 -0.765625 3.679688 -0.800781 3.921875 -0.875 C 4.160156 -0.957031 4.351563 -1.070313 4.5 -1.21875 C 4.695313 -1.414063 4.851563 -1.6875 4.96875 -2.03125 C 5.082031 -2.375 5.140625 -2.785156 5.140625 -3.265625 C 5.140625 -3.941406 5.03125 -4.457031 4.8125 -4.8125 C 4.59375 -5.175781 4.320313 -5.421875 4 -5.546875 C 3.769531 -5.640625 3.40625 -5.6875 2.90625 -5.6875 L 1.546875 -5.6875 Z M 1.546875 -0.765625 "
           id="path60" />
      </g>
      <g
         id="glyph-0-21">
        <path
           d="M 0.703125 0 L 0.703125 -6.4375 L 3.5625 -6.4375 C 4.132813 -6.4375 4.570313 -6.378906 4.875 -6.265625 C 5.175781 -6.148438 5.414063 -5.945313 5.59375 -5.65625 C 5.769531 -5.363281 5.859375 -5.039063 5.859375 -4.6875 C 5.859375 -4.226563 5.707031 -3.84375 5.40625 -3.53125 C 5.113281 -3.21875 4.660156 -3.019531 4.046875 -2.9375 C 4.265625 -2.820313 4.4375 -2.710938 4.5625 -2.609375 C 4.8125 -2.378906 5.046875 -2.09375 5.265625 -1.75 L 6.390625 0 L 5.3125 0 L 4.453125 -1.34375 C 4.210938 -1.726563 4.007813 -2.019531 3.84375 -2.21875 C 3.6875 -2.425781 3.539063 -2.570313 3.40625 -2.65625 C 3.28125 -2.738281 3.15625 -2.796875 3.03125 -2.828125 C 2.925781 -2.847656 2.765625 -2.859375 2.546875 -2.859375 L 1.5625 -2.859375 L 1.5625 0 Z M 1.5625 -3.59375 L 3.390625 -3.59375 C 3.785156 -3.59375 4.09375 -3.632813 4.3125 -3.71875 C 4.53125 -3.800781 4.695313 -3.929688 4.8125 -4.109375 C 4.925781 -4.285156 4.984375 -4.476563 4.984375 -4.6875 C 4.984375 -4.988281 4.867188 -5.238281 4.640625 -5.4375 C 4.421875 -5.632813 4.070313 -5.734375 3.59375 -5.734375 L 1.5625 -5.734375 Z M 1.5625 -3.59375 "
           id="path63" />
      </g>
      <g
         id="glyph-0-22">
        <path
           d="M 3.65625 0 L 3.65625 -0.6875 C 3.289063 -0.15625 2.796875 0.109375 2.171875 0.109375 C 1.898438 0.109375 1.644531 0.0546875 1.40625 -0.046875 C 1.164063 -0.160156 0.984375 -0.296875 0.859375 -0.453125 C 0.742188 -0.609375 0.664063 -0.800781 0.625 -1.03125 C 0.59375 -1.1875 0.578125 -1.4375 0.578125 -1.78125 L 0.578125 -4.671875 L 1.359375 -4.671875 L 1.359375 -2.078125 C 1.359375 -1.660156 1.378906 -1.382813 1.421875 -1.25 C 1.460938 -1.039063 1.5625 -0.875 1.71875 -0.75 C 1.882813 -0.632813 2.085938 -0.578125 2.328125 -0.578125 C 2.566406 -0.578125 2.789063 -0.632813 3 -0.75 C 3.207031 -0.875 3.351563 -1.039063 3.4375 -1.25 C 3.519531 -1.457031 3.5625 -1.765625 3.5625 -2.171875 L 3.5625 -4.671875 L 4.359375 -4.671875 L 4.359375 0 Z M 3.65625 0 "
           id="path66" />
      </g>
      <g
         id="glyph-0-23">
        <path
           d="M 0.671875 0 L 0.671875 -6.4375 L 1.953125 -6.4375 L 3.46875 -1.875 C 3.613281 -1.457031 3.71875 -1.140625 3.78125 -0.921875 C 3.851563 -1.160156 3.96875 -1.503906 4.125 -1.953125 L 5.671875 -6.4375 L 6.8125 -6.4375 L 6.8125 0 L 6 0 L 6 -5.390625 L 4.125 0 L 3.359375 0 L 1.484375 -5.484375 L 1.484375 0 Z M 0.671875 0 "
           id="path69" />
      </g>
      <g
         id="glyph-0-24">
        <path
           d="M 0.6875 0 L 0.6875 -6.4375 L 3.125 -6.4375 C 3.550781 -6.4375 3.878906 -6.414063 4.109375 -6.375 C 4.421875 -6.320313 4.679688 -6.222656 4.890625 -6.078125 C 5.109375 -5.929688 5.28125 -5.722656 5.40625 -5.453125 C 5.539063 -5.191406 5.609375 -4.898438 5.609375 -4.578125 C 5.609375 -4.023438 5.429688 -3.5625 5.078125 -3.1875 C 4.734375 -2.8125 4.109375 -2.625 3.203125 -2.625 L 1.546875 -2.625 L 1.546875 0 Z M 1.546875 -3.375 L 3.21875 -3.375 C 3.757813 -3.375 4.144531 -3.476563 4.375 -3.6875 C 4.613281 -3.894531 4.734375 -4.179688 4.734375 -4.546875 C 4.734375 -4.816406 4.664063 -5.046875 4.53125 -5.234375 C 4.394531 -5.429688 4.210938 -5.5625 3.984375 -5.625 C 3.847656 -5.664063 3.582031 -5.6875 3.1875 -5.6875 L 1.546875 -5.6875 Z M 1.546875 -3.375 "
           id="path72" />
      </g>
      <g
         id="glyph-0-25">
        <path
           d="M 0.84375 0 L 0.84375 -6.4375 L 1.6875 -6.4375 L 1.6875 0 Z M 0.84375 0 "
           id="path75" />
      </g>
      <g
         id="glyph-0-26">
        <path
           d="M 0 0.109375 L 1.875 -6.546875 L 2.5 -6.546875 L 0.640625 0.109375 Z M 0 0.109375 "
           id="path78" />
      </g>
      <g
         id="glyph-0-27">
        <path
           d="M 5.296875 -2.265625 L 6.140625 -2.046875 C 5.960938 -1.347656 5.640625 -0.8125 5.171875 -0.4375 C 4.710938 -0.0703125 4.144531 0.109375 3.46875 0.109375 C 2.78125 0.109375 2.21875 -0.03125 1.78125 -0.3125 C 1.34375 -0.59375 1.007813 -1 0.78125 -1.53125 C 0.5625 -2.070313 0.453125 -2.648438 0.453125 -3.265625 C 0.453125 -3.941406 0.578125 -4.53125 0.828125 -5.03125 C 1.085938 -5.53125 1.453125 -5.90625 1.921875 -6.15625 C 2.398438 -6.414063 2.921875 -6.546875 3.484375 -6.546875 C 4.128906 -6.546875 4.671875 -6.378906 5.109375 -6.046875 C 5.554688 -5.722656 5.863281 -5.265625 6.03125 -4.671875 L 5.1875 -4.484375 C 5.039063 -4.953125 4.828125 -5.289063 4.546875 -5.5 C 4.265625 -5.71875 3.90625 -5.828125 3.46875 -5.828125 C 2.976563 -5.828125 2.566406 -5.707031 2.234375 -5.46875 C 1.898438 -5.226563 1.664063 -4.90625 1.53125 -4.5 C 1.394531 -4.101563 1.328125 -3.695313 1.328125 -3.28125 C 1.328125 -2.726563 1.40625 -2.242188 1.5625 -1.828125 C 1.726563 -1.421875 1.976563 -1.117188 2.3125 -0.921875 C 2.644531 -0.722656 3.007813 -0.625 3.40625 -0.625 C 3.882813 -0.625 4.285156 -0.757813 4.609375 -1.03125 C 4.941406 -1.3125 5.171875 -1.722656 5.296875 -2.265625 Z M 5.296875 -2.265625 "
           id="path81" />
      </g>
      <g
         id="glyph-0-28">
        <path
           d="M 0.59375 1.78125 L 0.59375 -4.671875 L 1.3125 -4.671875 L 1.3125 -4.0625 C 1.476563 -4.300781 1.664063 -4.476563 1.875 -4.59375 C 2.09375 -4.707031 2.359375 -4.765625 2.671875 -4.765625 C 3.066406 -4.765625 3.414063 -4.660156 3.71875 -4.453125 C 4.019531 -4.253906 4.25 -3.96875 4.40625 -3.59375 C 4.5625 -3.21875 4.640625 -2.8125 4.640625 -2.375 C 4.640625 -1.894531 4.550781 -1.460938 4.375 -1.078125 C 4.207031 -0.691406 3.960938 -0.394531 3.640625 -0.1875 C 3.316406 0.0078125 2.972656 0.109375 2.609375 0.109375 C 2.347656 0.109375 2.113281 0.0507813 1.90625 -0.0625 C 1.695313 -0.175781 1.523438 -0.316406 1.390625 -0.484375 L 1.390625 1.78125 Z M 1.3125 -2.3125 C 1.3125 -1.707031 1.429688 -1.257813 1.671875 -0.96875 C 1.921875 -0.6875 2.21875 -0.546875 2.5625 -0.546875 C 2.90625 -0.546875 3.203125 -0.691406 3.453125 -0.984375 C 3.710938 -1.285156 3.84375 -1.75 3.84375 -2.375 C 3.84375 -2.96875 3.71875 -3.410156 3.46875 -3.703125 C 3.226563 -4.003906 2.9375 -4.15625 2.59375 -4.15625 C 2.257813 -4.15625 1.960938 -3.992188 1.703125 -3.671875 C 1.441406 -3.359375 1.3125 -2.90625 1.3125 -2.3125 Z M 1.3125 -2.3125 "
           id="path84" />
      </g>
      <g
         id="glyph-0-29">
        <path
           d="M 0.796875 0 L 0.796875 -0.90625 L 1.703125 -0.90625 L 1.703125 0 C 1.703125 0.332031 1.640625 0.597656 1.515625 0.796875 C 1.398438 1.003906 1.21875 1.164063 0.96875 1.28125 L 0.75 0.9375 C 0.914063 0.863281 1.035156 0.753906 1.109375 0.609375 C 1.191406 0.472656 1.238281 0.269531 1.25 0 Z M 0.796875 0 "
           id="path87" />
      </g>
      <g
         id="glyph-0-30">
        <path
           d="M 1.8125 0 L 0.109375 -6.4375 L 0.984375 -6.4375 L 1.96875 -2.21875 C 2.070313 -1.78125 2.160156 -1.34375 2.234375 -0.90625 C 2.398438 -1.59375 2.5 -1.988281 2.53125 -2.09375 L 3.75 -6.4375 L 4.78125 -6.4375 L 5.703125 -3.1875 C 5.929688 -2.375 6.097656 -1.613281 6.203125 -0.90625 C 6.285156 -1.3125 6.394531 -1.773438 6.53125 -2.296875 L 7.53125 -6.4375 L 8.390625 -6.4375 L 6.625 0 L 5.8125 0 L 4.453125 -4.90625 C 4.335938 -5.320313 4.269531 -5.578125 4.25 -5.671875 C 4.175781 -5.367188 4.113281 -5.113281 4.0625 -4.90625 L 2.6875 0 Z M 1.8125 0 "
           id="path90" />
      </g>
      <g
         id="glyph-0-31">
        <path
           d="M 0.59375 0 L 0.59375 -6.4375 L 1.390625 -6.4375 L 1.390625 -2.765625 L 3.265625 -4.671875 L 4.28125 -4.671875 L 2.5 -2.9375 L 4.46875 0 L 3.484375 0 L 1.953125 -2.390625 L 1.390625 -1.84375 L 1.390625 0 Z M 0.59375 0 "
           id="path93" />
      </g>
      <g
         id="glyph-0-32">
        <path
           d="M 3.625 0 L 3.625 -0.59375 C 3.320313 -0.125 2.882813 0.109375 2.3125 0.109375 C 1.945313 0.109375 1.609375 0.00390625 1.296875 -0.203125 C 0.984375 -0.410156 0.738281 -0.695313 0.5625 -1.0625 C 0.394531 -1.425781 0.3125 -1.847656 0.3125 -2.328125 C 0.3125 -2.796875 0.390625 -3.21875 0.546875 -3.59375 C 0.703125 -3.976563 0.929688 -4.269531 1.234375 -4.46875 C 1.546875 -4.664063 1.894531 -4.765625 2.28125 -4.765625 C 2.5625 -4.765625 2.8125 -4.707031 3.03125 -4.59375 C 3.25 -4.476563 3.425781 -4.320313 3.5625 -4.125 L 3.5625 -6.4375 L 4.359375 -6.4375 L 4.359375 0 Z M 1.125 -2.328125 C 1.125 -1.734375 1.25 -1.285156 1.5 -0.984375 C 1.75 -0.691406 2.046875 -0.546875 2.390625 -0.546875 C 2.734375 -0.546875 3.023438 -0.6875 3.265625 -0.96875 C 3.515625 -1.25 3.640625 -1.679688 3.640625 -2.265625 C 3.640625 -2.898438 3.515625 -3.367188 3.265625 -3.671875 C 3.015625 -3.972656 2.710938 -4.125 2.359375 -4.125 C 2.003906 -4.125 1.707031 -3.976563 1.46875 -3.6875 C 1.238281 -3.394531 1.125 -2.941406 1.125 -2.328125 Z M 1.125 -2.328125 "
           id="path96" />
      </g>
      <g
         id="glyph-0-33">
        <path
           d="M 0.0625 0 L 1.765625 -2.421875 L 0.1875 -4.671875 L 1.1875 -4.671875 L 1.90625 -3.578125 C 2.03125 -3.367188 2.132813 -3.191406 2.21875 -3.046875 C 2.351563 -3.242188 2.472656 -3.414063 2.578125 -3.5625 L 3.359375 -4.671875 L 4.3125 -4.671875 L 2.703125 -2.46875 L 4.4375 0 L 3.46875 0 L 2.5 -1.453125 L 2.25 -1.84375 L 1.03125 0 Z M 0.0625 0 "
           id="path99" />
      </g>
    </g>
    <clipPath
       id="clip-0">
      <path
         clip-rule="nonzero"
         d="M 0 0 L 451.921875 0 L 451.921875 204 L 0 204 Z M 0 0 "
         id="path104" />
    </clipPath>
    <clipPath
       id="clip-1">
      <path
         clip-rule="nonzero"
         d="M 0 225 L 451.921875 225 L 451.921875 257 L 0 257 Z M 0 225 "
         id="path107" />
    </clipPath>
  </defs>
  <path
     fill-rule="nonzero"
     fill="rgb(97.24884%, 80.778503%, 79.998779%)"
     fill-opacity="1"
     d="M 1.125 1.125 L 450.875 1.125 L 450.875 203.511719 L 1.125 203.511719 Z M 1.125 1.125 "
     id="path112" />
  <g
     clip-path="url(#clip-0)"
     id="g116">
    <path
       fill-rule="nonzero"
       fill="#b85450"
       fill-opacity="1"
       d="m 5.621094,0.75 h 2.25 V 1.5 h -2.25 z m 4.5,0 h 2.246094 V 1.5 h -2.246094 z m 4.496094,0 h 2.25 V 1.5 h -2.25 z m 4.496093,0 h 2.25 V 1.5 h -2.25 z m 4.5,0 h 2.246094 V 1.5 h -2.246094 z m 4.496094,0 h 2.25 V 1.5 h -2.25 z m 4.496094,0 h 2.25 V 1.5 h -2.25 z m 4.5,0 h 2.246094 V 1.5 h -2.246094 z m 4.496094,0 h 2.25 V 1.5 h -2.25 z m 4.496093,0 h 2.25 V 1.5 h -2.25 z m 4.5,0 h 2.25 V 1.5 h -2.25 z m 4.496094,0 h 2.25 V 1.5 h -2.25 z m 4.5,0 h 2.246094 V 1.5 H 59.59375 Z m 4.496094,0 h 2.25 V 1.5 h -2.25 z m 4.496094,0 h 2.25 V 1.5 h -2.25 z m 4.5,0 h 2.246093 V 1.5 h -2.246093 z m 4.496093,0 h 2.25 V 1.5 h -2.25 z m 4.496094,0 h 2.25 V 1.5 h -2.25 z m 4.5,0 h 2.246094 V 1.5 h -2.246094 z m 4.496094,0 h 2.25 V 1.5 h -2.25 z m 4.496094,0 h 2.25 V 1.5 h -2.25 z m 4.499997,0 h 2.25 V 1.5 h -2.25 z m 4.4961,0 h 2.25 V 1.5 h -2.25 z m 4.5,0 h 2.24609 V 1.5 h -2.24609 z m 4.49609,0 h 2.25 V 1.5 h -2.25 z m 4.49609,0 h 2.25 V 1.5 h -2.25 z m 4.5,0 h 2.2461 V 1.5 h -2.2461 z m 4.4961,0 h 2.25 V 1.5 h -2.25 z m 4.49609,0 h 2.25 V 1.5 h -2.25 z m 4.5,0 h 2.24609 V 1.5 h -2.24609 z m 4.49609,0 h 2.25 V 1.5 h -2.25 z m 4.4961,0 h 2.25 V 1.5 h -2.25 z m 4.5,0 h 2.25 V 1.5 h -2.25 z m 4.49609,0 h 2.25 V 1.5 h -2.25 z m 4.5,0 h 2.2461 V 1.5 h -2.2461 z m 4.4961,0 h 2.25 V 1.5 h -2.25 z m 4.49609,0 h 2.25 V 1.5 h -2.25 z m 4.5,0 h 2.24609 V 1.5 h -2.24609 z m 4.49609,0 h 2.25 V 1.5 h -2.25 z m 4.4961,0 h 2.25 V 1.5 h -2.25 z m 4.5,0 h 2.24609 V 1.5 h -2.24609 z m 4.49609,0 h 2.25 V 1.5 h -2.25 z m 4.49609,0 h 2.25 V 1.5 h -2.25 z m 4.5,0 h 2.2461 V 1.5 h -2.2461 z m 4.4961,0 h 2.25 V 1.5 h -2.25 z m 4.5,0 h 2.24609 V 1.5 h -2.24609 z m 4.49609,0 h 2.25 V 1.5 h -2.25 z m 4.4961,0 h 2.25 V 1.5 h -2.25 z m 4.5,0 H 223.75 V 1.5 h -2.24609 z M 226,0.75 h 2.25 V 1.5 H 226 Z m 4.49609,0 h 2.25 V 1.5 h -2.25 z m 4.5,0 h 2.2461 V 1.5 h -2.2461 z m 4.4961,0 h 2.25 V 1.5 h -2.25 z m 4.49609,0 h 2.25 V 1.5 h -2.25 z m 4.5,0 h 2.24609 V 1.5 h -2.24609 z m 4.49609,0 h 2.25 V 1.5 h -2.25 z m 4.5,0 h 2.2461 V 1.5 h -2.2461 z m 4.4961,0 h 2.25 V 1.5 h -2.25 z m 4.49609,0 h 2.25 V 1.5 h -2.25 z m 4.5,0 h 2.2461 V 1.5 h -2.2461 z m 4.4961,0 h 2.25 V 1.5 h -2.25 z m 4.49609,0 h 2.25 V 1.5 h -2.25 z m 4.5,0 h 2.24609 V 1.5 h -2.24609 z m 4.49609,0 h 2.25 V 1.5 h -2.25 z m 4.4961,0 h 2.25 V 1.5 h -2.25 z m 4.5,0 h 2.24609 V 1.5 h -2.24609 z m 4.49609,0 h 2.25 V 1.5 h -2.25 z m 4.5,0 h 2.24609 V 1.5 h -2.24609 z m 4.49609,0 h 2.25 V 1.5 h -2.25 z m 4.4961,0 h 2.25 V 1.5 h -2.25 z m 4.5,0 h 2.24609 V 1.5 h -2.24609 z m 4.49609,0 h 2.25 V 1.5 h -2.25 z m 4.4961,0 h 2.25 V 1.5 h -2.25 z m 4.5,0 h 2.24609 V 1.5 h -2.24609 z m 4.49609,0 h 2.25 V 1.5 h -2.25 z m 4.49609,0 h 2.25 V 1.5 h -2.25 z m 4.5,0 h 2.2461 V 1.5 h -2.2461 z m 4.4961,0 h 2.25 V 1.5 h -2.25 z m 4.5,0 h 2.24609 V 1.5 h -2.24609 z m 4.49609,0 h 2.25 V 1.5 h -2.25 z m 4.49609,0 h 2.25 V 1.5 h -2.25 z m 4.5,0 h 2.2461 V 1.5 h -2.2461 z m 4.4961,0 h 2.25 V 1.5 h -2.25 z m 4.49609,0 h 2.25 V 1.5 h -2.25 z m 4.5,0 h 2.2461 V 1.5 h -2.2461 z m 4.4961,0 h 2.25 V 1.5 h -2.25 z m 4.49609,0 h 2.25 V 1.5 h -2.25 z m 4.5,0 h 2.24609 V 1.5 h -2.24609 z m 4.49609,0 h 2.25 V 1.5 h -2.25 z m 4.5,0 h 2.2461 V 1.5 h -2.2461 z m 4.4961,0 h 2.25 V 1.5 h -2.25 z m 4.49609,0 h 2.25 V 1.5 h -2.25 z m 4.5,0 h 2.24609 V 1.5 h -2.24609 z m 4.49609,0 h 2.25 V 1.5 h -2.25 z m 4.4961,0 h 2.25 V 1.5 h -2.25 z m 4.5,0 h 2.24609 V 1.5 h -2.24609 z m 4.49609,0 h 2.25 V 1.5 h -2.25 z m 4.4961,0 h 2.25 V 1.5 h -2.25 z m 4.5,0 H 448.625 V 1.5 h -2.24609 z M 451.25,1.125 v 2.25 h -0.75 v -2.25 z m 0,4.496094 v 2.25 h -0.75 v -2.25 z m 0,4.5 v 2.246094 h -0.75 v -2.246094 z m 0,4.496094 v 2.25 h -0.75 v -2.25 z m 0,4.496093 v 2.25 h -0.75 v -2.25 z m 0,4.5 v 2.246094 h -0.75 v -2.246094 z m 0,4.496094 v 2.25 h -0.75 v -2.25 z m 0,4.496094 v 2.25 h -0.75 v -2.25 z m 0,4.5 v 2.246094 h -0.75 v -2.246094 z m 0,4.496094 v 2.25 h -0.75 v -2.25 z m 0,4.496093 v 2.25 h -0.75 v -2.25 z m 0,4.5 v 2.25 h -0.75 v -2.25 z m 0,4.496094 v 2.25 h -0.75 v -2.25 z m 0,4.5 v 2.246094 H 450.5 V 59.59375 Z m 0,4.496094 v 2.25 h -0.75 v -2.25 z m 0,4.496094 v 2.25 h -0.75 v -2.25 z m 0,4.5 v 2.246093 h -0.75 v -2.246093 z m 0,4.496093 v 2.25 h -0.75 v -2.25 z m 0,4.496094 v 2.25 h -0.75 v -2.25 z m 0,4.5 v 2.246094 h -0.75 v -2.246094 z m 0,4.496094 v 2.25 h -0.75 v -2.25 z m 0,4.496094 v 2.25 h -0.75 v -2.25 z m 0,4.499997 v 2.25 h -0.75 v -2.25 z m 0,4.4961 v 2.25 h -0.75 v -2.25 z m 0,4.5 v 2.24609 h -0.75 v -2.24609 z m 0,4.49609 v 2.25 h -0.75 v -2.25 z m 0,4.49609 v 2.25 h -0.75 v -2.25 z m 0,4.5 v 2.2461 h -0.75 v -2.2461 z m 0,4.4961 v 2.25 h -0.75 v -2.25 z m 0,4.49609 v 2.25 h -0.75 v -2.25 z m 0,4.5 v 2.24609 h -0.75 v -2.24609 z m 0,4.49609 v 2.25 h -0.75 v -2.25 z m 0,4.4961 v 2.25 h -0.75 v -2.25 z m 0,4.5 v 2.25 h -0.75 v -2.25 z m 0,4.49609 v 2.25 h -0.75 v -2.25 z m 0,4.5 v 2.2461 h -0.75 v -2.2461 z m 0,4.4961 v 2.25 h -0.75 v -2.25 z m 0,4.49609 v 2.25 h -0.75 v -2.25 z m 0,4.5 v 2.24609 h -0.75 v -2.24609 z m 0,4.49609 v 2.25 h -0.75 v -2.25 z m 0,4.4961 v 2.25 h -0.75 v -2.25 z m 0,4.5 v 2.24609 h -0.75 v -2.24609 z m 0,4.49609 v 2.25 h -0.75 v -2.25 z m 0,4.49609 v 2.25 h -0.75 v -2.25 z m 0,4.5 v 2.2461 h -0.75 v -2.2461 z m -0.375,4.8711 h -2.25 v -0.75 h 2.25 z m -4.49609,0 h -2.25 v -0.75 h 2.25 z m -4.5,0 h -2.2461 v -0.75 h 2.2461 z m -4.4961,0 h -2.25 v -0.75 h 2.25 z m -4.49609,0 h -2.25 v -0.75 h 2.25 z m -4.5,0 h -2.2461 v -0.75 h 2.2461 z m -4.4961,0 h -2.25 v -0.75 h 2.25 z m -4.49609,0 h -2.25 v -0.75 h 2.25 z m -4.5,0 h -2.24609 v -0.75 h 2.24609 z m -4.49609,0 h -2.25 v -0.75 h 2.25 z m -4.4961,0 h -2.25 v -0.75 h 2.25 z m -4.5,0 h -2.25 v -0.75 h 2.25 z m -4.49609,0 h -2.25 v -0.75 h 2.25 z m -4.5,0 h -2.24609 v -0.75 h 2.24609 z m -4.49609,0 h -2.25 v -0.75 h 2.25 z m -4.4961,0 h -2.25 v -0.75 h 2.25 z m -4.5,0 h -2.24609 v -0.75 h 2.24609 z m -4.49609,0 h -2.25 v -0.75 h 2.25 z m -4.4961,0 h -2.25 v -0.75 h 2.25 z m -4.5,0 h -2.24609 v -0.75 h 2.24609 z m -4.49609,0 h -2.25 v -0.75 h 2.25 z m -4.49609,0 h -2.25 v -0.75 h 2.25 z m -4.5,0 h -2.25 v -0.75 h 2.25 z m -4.4961,0 h -2.25 v -0.75 h 2.25 z m -4.5,0 h -2.24609 v -0.75 h 2.24609 z m -4.49609,0 h -2.25 v -0.75 h 2.25 z m -4.49609,0 h -2.25 v -0.75 h 2.25 z m -4.5,0 h -2.2461 v -0.75 h 2.2461 z m -4.4961,0 h -2.25 v -0.75 h 2.25 z m -4.49609,0 h -2.25 v -0.75 h 2.25 z m -4.5,0 h -2.2461 v -0.75 h 2.2461 z m -4.4961,0 h -2.25 v -0.75 h 2.25 z m -4.49609,0 h -2.25 v -0.75 h 2.25 z m -4.5,0 h -2.25 v -0.75 h 2.25 z m -4.49609,0 h -2.25 v -0.75 h 2.25 z m -4.5,0 h -2.2461 v -0.75 h 2.2461 z m -4.4961,0 h -2.25 v -0.75 h 2.25 z m -4.49609,0 h -2.25 v -0.75 h 2.25 z m -4.5,0 h -2.24609 v -0.75 h 2.24609 z m -4.49609,0 h -2.25 v -0.75 h 2.25 z m -4.4961,0 h -2.25 v -0.75 h 2.25 z m -4.5,0 h -2.24609 v -0.75 h 2.24609 z m -4.49609,0 h -2.25 v -0.75 h 2.25 z m -4.4961,0 h -2.25 v -0.75 h 2.25 z m -4.5,0 h -2.25 v -0.75 h 2.25 z m -4.49609,0 h -2.25 v -0.75 h 2.25 z m -4.5,0 h -2.24609 v -0.75 h 2.24609 z m -4.49609,0 h -2.25 v -0.75 h 2.25 z m -4.4961,0 h -2.25 v -0.75 h 2.25 z m -4.5,0 H 228.25 v -0.75 h 2.24609 z m -4.49609,0 h -2.25 v -0.75 H 226 Z m -4.49609,0 h -2.25 v -0.75 h 2.25 z m -4.5,0 h -2.2461 v -0.75 h 2.2461 z m -4.4961,0 h -2.25 v -0.75 h 2.25 z m -4.49609,0 h -2.25 v -0.75 h 2.25 z m -4.5,0 h -2.25 v -0.75 h 2.25 z m -4.4961,0 h -2.25 v -0.75 h 2.25 z m -4.5,0 h -2.24609 v -0.75 h 2.24609 z m -4.49609,0 h -2.25 v -0.75 h 2.25 z m -4.49609,0 h -2.25 v -0.75 h 2.25 z m -4.5,0 h -2.2461 v -0.75 h 2.2461 z m -4.4961,0 h -2.25 v -0.75 h 2.25 z m -4.49609,0 h -2.25 v -0.75 h 2.25 z m -4.5,0 h -2.24609 v -0.75 h 2.24609 z m -4.49609,0 h -2.25 v -0.75 h 2.25 z m -4.4961,0 h -2.25 v -0.75 h 2.25 z m -4.5,0 h -2.24609 v -0.75 h 2.24609 z m -4.49609,0 h -2.25 v -0.75 h 2.25 z m -4.5,0 h -2.2461 v -0.75 h 2.2461 z m -4.4961,0 h -2.25 v -0.75 h 2.25 z m -4.49609,0 h -2.25 v -0.75 h 2.25 z m -4.5,0 h -2.24609 v -0.75 h 2.24609 z m -4.49609,0 h -2.25 v -0.75 h 2.25 z m -4.4961,0 h -2.25 v -0.75 h 2.25 z m -4.5,0 h -2.24609 v -0.75 h 2.24609 z m -4.49609,0 h -2.25 v -0.75 h 2.25 z m -4.49609,0 h -2.25 v -0.75 h 2.25 z m -4.5,0 h -2.2461 v -0.75 h 2.2461 z m -4.4961,0 h -2.249997 v -0.75 h 2.249997 z m -4.499997,0 h -2.246094 v -0.75 h 2.246094 z m -4.496094,0 h -2.25 v -0.75 h 2.25 z m -4.496094,0 h -2.25 v -0.75 h 2.25 z m -4.5,0 h -2.246094 v -0.75 h 2.246094 z m -4.496094,0 h -2.25 v -0.75 h 2.25 z m -4.496093,0 h -2.25 v -0.75 h 2.25 z m -4.5,0 h -2.246094 v -0.75 h 2.246094 z m -4.496094,0 h -2.25 v -0.75 h 2.25 z m -4.496094,0 h -2.25 v -0.75 h 2.25 z m -4.5,0 h -2.246094 v -0.75 h 2.246094 z m -4.496094,0 h -2.25 v -0.75 h 2.25 z m -4.5,0 h -2.246093 v -0.75 h 2.246093 z m -4.496093,0 h -2.25 v -0.75 h 2.25 z m -4.496094,0 h -2.25 v -0.75 h 2.25 z m -4.5,0 h -2.246094 v -0.75 h 2.246094 z m -4.496094,0 h -2.25 v -0.75 h 2.25 z m -4.496094,0 h -2.25 v -0.75 h 2.25 z m -4.5,0 h -2.246093 v -0.75 h 2.246093 z m -4.496093,0 h -2.25 v -0.75 h 2.25 z m -4.496094,0 h -2.25 v -0.75 h 2.25 z m -4.5,0 H 3.375 v -0.75 H 5.621094 Z M 0.75,203.51172 v -2.25 H 1.5 v 2.25 z m 0,-4.4961 v -2.25 H 1.5 v 2.25 z m 0,-4.5 v -2.24609 H 1.5 v 2.24609 z m 0,-4.49609 v -2.25 H 1.5 v 2.25 z m 0,-4.49609 v -2.25 H 1.5 v 2.25 z m 0,-4.5 v -2.2461 H 1.5 v 2.2461 z m 0,-4.4961 v -2.25 H 1.5 v 2.25 z m 0,-4.49609 v -2.25 H 1.5 v 2.25 z m 0,-4.5 v -2.24609 H 1.5 v 2.24609 z m 0,-4.49609 v -2.25 H 1.5 v 2.25 z m 0,-4.4961 v -2.25 H 1.5 v 2.25 z m 0,-4.5 v -2.24609 H 1.5 v 2.24609 z m 0,-4.49609 v -2.25 H 1.5 v 2.25 z m 0,-4.5 v -2.2461 H 1.5 v 2.2461 z m 0,-4.4961 v -2.25 H 1.5 v 2.25 z m 0,-4.49609 v -2.25 H 1.5 v 2.25 z m 0,-4.5 v -2.24609 H 1.5 v 2.24609 z m 0,-4.49609 v -2.25 H 1.5 v 2.25 z m 0,-4.4961 v -2.25 H 1.5 v 2.25 z m 0,-4.5 V 115.8125 H 1.5 v 2.24609 z m 0,-4.49609 v -2.25 H 1.5 v 2.25 z m 0,-4.49609 v -2.25 H 1.5 v 2.25 z m 0,-4.5 v -2.2461 H 1.5 v 2.2461 z m 0,-4.4961 V 97.820313 H 1.5 v 2.249997 z m 0,-4.499997 V 93.324219 H 1.5 v 2.246094 z m 0,-4.496094 v -2.25 H 1.5 v 2.25 z m 0,-4.496094 v -2.25 H 1.5 v 2.25 z m 0,-4.5 V 79.832031 H 1.5 v 2.246094 z m 0,-4.496094 v -2.25 H 1.5 v 2.25 z m 0,-4.496093 v -2.25 H 1.5 v 2.25 z m 0,-4.5 V 66.339844 H 1.5 v 2.246094 z m 0,-4.496094 v -2.25 H 1.5 v 2.25 z m 0,-4.496094 v -2.25 H 1.5 v 2.25 z m 0,-4.5 V 52.847656 H 1.5 v 2.246094 z m 0,-4.496094 v -2.25 H 1.5 v 2.25 z m 0,-4.5 V 43.851563 H 1.5 v 2.246093 z m 0,-4.496093 v -2.25 H 1.5 v 2.25 z m 0,-4.496094 v -2.25 H 1.5 v 2.25 z m 0,-4.5 V 30.359375 H 1.5 v 2.246094 z m 0,-4.496094 v -2.25 H 1.5 v 2.25 z m 0,-4.496094 v -2.25 H 1.5 v 2.25 z m 0,-4.5 V 16.867188 H 1.5 v 2.246093 z m 0,-4.496093 v -2.25 H 1.5 v 2.25 z m 0,-4.496094 v -2.25 H 1.5 v 2.25 z m 0,-4.5 V 3.375 H 1.5 V 5.621094 Z M 1.125,0.75 h 2.25 V 1.5 h -2.25 z m 0,0"
       id="path114" />
  </g>
  <path
     fill-rule="nonzero"
     fill="rgb(63.529968%, 0%, 14.509583%)"
     fill-opacity="0.702"
     d="M 1.125 1.125 L 83.578125 1.125 L 83.578125 23.613281 L 1.125 23.613281 Z M 1.125 1.125 "
     id="path118" />
  <path
     fill-rule="nonzero"
     fill="rgb(43.528748%, 0%, 0%)"
     fill-opacity="0.702"
     d="M 5.621094 0.75 L 7.871094 0.75 L 7.871094 1.5 L 5.621094 1.5 Z M 10.121094 0.75 L 12.367188 0.75 L 12.367188 1.5 L 10.121094 1.5 Z M 14.617188 0.75 L 16.867188 0.75 L 16.867188 1.5 L 14.617188 1.5 Z M 19.113281 0.75 L 21.363281 0.75 L 21.363281 1.5 L 19.113281 1.5 Z M 23.613281 0.75 L 25.859375 0.75 L 25.859375 1.5 L 23.613281 1.5 Z M 28.109375 0.75 L 30.359375 0.75 L 30.359375 1.5 L 28.109375 1.5 Z M 32.605469 0.75 L 34.855469 0.75 L 34.855469 1.5 L 32.605469 1.5 Z M 37.105469 0.75 L 39.351563 0.75 L 39.351563 1.5 L 37.105469 1.5 Z M 41.601563 0.75 L 43.851563 0.75 L 43.851563 1.5 L 41.601563 1.5 Z M 46.097656 0.75 L 48.347656 0.75 L 48.347656 1.5 L 46.097656 1.5 Z M 50.597656 0.75 L 52.847656 0.75 L 52.847656 1.5 L 50.597656 1.5 Z M 55.09375 0.75 L 57.34375 0.75 L 57.34375 1.5 L 55.09375 1.5 Z M 59.59375 0.75 L 61.839844 0.75 L 61.839844 1.5 L 59.59375 1.5 Z M 64.089844 0.75 L 66.339844 0.75 L 66.339844 1.5 L 64.089844 1.5 Z M 68.585938 0.75 L 70.835938 0.75 L 70.835938 1.5 L 68.585938 1.5 Z M 73.085938 0.75 L 75.332031 0.75 L 75.332031 1.5 L 73.085938 1.5 Z M 77.582031 0.75 L 79.832031 0.75 L 79.832031 1.5 L 77.582031 1.5 Z M 82.078125 0.75 L 83.953125 0.75 L 83.953125 1.875 L 83.203125 1.875 L 83.203125 1.125 L 83.578125 1.125 L 83.578125 1.5 L 82.078125 1.5 Z M 83.953125 4.121094 L 83.953125 6.371094 L 83.203125 6.371094 L 83.203125 4.121094 Z M 83.953125 8.621094 L 83.953125 10.867188 L 83.203125 10.867188 L 83.203125 8.621094 Z M 83.953125 13.117188 L 83.953125 15.367188 L 83.203125 15.367188 L 83.203125 13.117188 Z M 83.953125 17.617188 L 83.953125 19.863281 L 83.203125 19.863281 L 83.203125 17.617188 Z M 83.953125 22.113281 L 83.953125 23.988281 L 82.828125 23.988281 L 82.828125 23.238281 L 83.578125 23.238281 L 83.578125 23.613281 L 83.203125 23.613281 L 83.203125 22.113281 Z M 80.582031 23.988281 L 78.332031 23.988281 L 78.332031 23.238281 L 80.582031 23.238281 Z M 76.082031 23.988281 L 73.835938 23.988281 L 73.835938 23.238281 L 76.082031 23.238281 Z M 71.585938 23.988281 L 69.335938 23.988281 L 69.335938 23.238281 L 71.585938 23.238281 Z M 67.085938 23.988281 L 64.839844 23.988281 L 64.839844 23.238281 L 67.085938 23.238281 Z M 62.589844 23.988281 L 60.339844 23.988281 L 60.339844 23.238281 L 62.589844 23.238281 Z M 58.09375 23.988281 L 55.84375 23.988281 L 55.84375 23.238281 L 58.09375 23.238281 Z M 53.59375 23.988281 L 51.347656 23.988281 L 51.347656 23.238281 L 53.59375 23.238281 Z M 49.097656 23.988281 L 46.847656 23.988281 L 46.847656 23.238281 L 49.097656 23.238281 Z M 44.601563 23.988281 L 42.351563 23.988281 L 42.351563 23.238281 L 44.601563 23.238281 Z M 40.101563 23.988281 L 37.855469 23.988281 L 37.855469 23.238281 L 40.101563 23.238281 Z M 35.605469 23.988281 L 33.355469 23.988281 L 33.355469 23.238281 L 35.605469 23.238281 Z M 31.109375 23.988281 L 28.859375 23.988281 L 28.859375 23.238281 L 31.109375 23.238281 Z M 26.609375 23.988281 L 24.363281 23.988281 L 24.363281 23.238281 L 26.609375 23.238281 Z M 22.113281 23.988281 L 19.863281 23.988281 L 19.863281 23.238281 L 22.113281 23.238281 Z M 17.617188 23.988281 L 15.367188 23.988281 L 15.367188 23.238281 L 17.617188 23.238281 Z M 13.117188 23.988281 L 10.867188 23.988281 L 10.867188 23.238281 L 13.117188 23.238281 Z M 8.621094 23.988281 L 6.371094 23.988281 L 6.371094 23.238281 L 8.621094 23.238281 Z M 4.121094 23.988281 L 1.875 23.988281 L 1.875 23.238281 L 4.121094 23.238281 Z M 0.75 22.113281 L 0.75 19.863281 L 1.5 19.863281 L 1.5 22.113281 Z M 0.75 17.617188 L 0.75 15.367188 L 1.5 15.367188 L 1.5 17.617188 Z M 0.75 13.117188 L 0.75 10.867188 L 1.5 10.867188 L 1.5 13.117188 Z M 0.75 8.621094 L 0.75 6.371094 L 1.5 6.371094 L 1.5 8.621094 Z M 0.75 4.121094 L 0.75 1.875 L 1.5 1.875 L 1.5 4.121094 Z M 1.125 0.75 L 3.375 0.75 L 3.375 1.5 L 1.125 1.5 Z M 1.125 0.75 "
     id="path120" />
  <g
     fill="#ffffff"
     fill-opacity="1"
     id="g156">
    <use
       xlink:href="#glyph-0-1"
       x="5.4813428"
       y="14.991707"
       id="use122" />
    <use
       xlink:href="#glyph-0-2"
       x="12.974268"
       y="14.991707"
       id="use124" />
    <use
       xlink:href="#glyph-0-3"
       x="17.976871"
       y="14.991707"
       id="use126" />
    <use
       xlink:href="#glyph-0-4"
       x="20.475979"
       y="14.991707"
       id="use128" />
    <use
       xlink:href="#glyph-0-5"
       x="25.47858"
       y="14.991707"
       id="use130" />
    <use
       xlink:href="#glyph-0-6"
       x="28.473995"
       y="14.991707"
       id="use132" />
    <use
       xlink:href="#glyph-0-7"
       x="35.470612"
       y="14.991707"
       id="use134" />
    <use
       xlink:href="#glyph-0-8"
       x="38.466026"
       y="14.991707"
       id="use136" />
    <use
       xlink:href="#glyph-0-9"
       x="42.963539"
       y="14.991707"
       id="use138" />
    <use
       xlink:href="#glyph-0-2"
       x="47.966141"
       y="14.991707"
       id="use140" />
    <use
       xlink:href="#glyph-0-10"
       x="52.968746"
       y="14.991707"
       id="use142" />
    <use
       xlink:href="#glyph-0-3"
       x="57.466255"
       y="14.991707"
       id="use144" />
    <use
       xlink:href="#glyph-0-7"
       x="59.965363"
       y="14.991707"
       id="use146" />
    <use
       xlink:href="#glyph-0-4"
       x="62.960777"
       y="14.991707"
       id="use148" />
    <use
       xlink:href="#glyph-0-3"
       x="67.963379"
       y="14.991707"
       id="use150" />
    <use
       xlink:href="#glyph-0-11"
       x="70.462486"
       y="14.991707"
       id="use152" />
    <use
       xlink:href="#glyph-0-7"
       x="75.465088"
       y="14.991707"
       id="use154" />
  </g>
  <path
     fill="none"
     stroke-width="1"
     stroke-linecap="butt"
     stroke-linejoin="miter"
     stroke="rgb(0%, 0%, 0%)"
     stroke-opacity="1"
     stroke-miterlimit="10"
     d="M 301.000025 109.628596 L 301.000025 57.370537 "
     transform="matrix(0.749585, 0, 0, 0.749585, 0.374793, 0.374793)"
     id="path158" />
  <path
     fill-rule="nonzero"
     fill="rgb(0%, 0%, 0%)"
     fill-opacity="1"
     stroke-width="1"
     stroke-linecap="butt"
     stroke-linejoin="miter"
     stroke="rgb(0%, 0%, 0%)"
     stroke-opacity="1"
     stroke-miterlimit="10"
     d="M 301.000025 114.8815 L 297.498089 107.877627 L 301.000025 109.628596 L 304.501961 107.877627 Z M 301.000025 114.8815 "
     transform="matrix(0.749585, 0, 0, 0.749585, 0.374793, 0.374793)"
     id="path160" />
  <path
     fill-rule="nonzero"
     fill="rgb(0%, 0%, 0%)"
     fill-opacity="1"
     stroke-width="1"
     stroke-linecap="butt"
     stroke-linejoin="miter"
     stroke="rgb(0%, 0%, 0%)"
     stroke-opacity="1"
     stroke-miterlimit="10"
     d="M 301.000025 52.117633 L 304.501961 59.121505 L 301.000025 57.370537 L 297.498089 59.121505 Z M 301.000025 52.117633 "
     transform="matrix(0.749585, 0, 0, 0.749585, 0.374793, 0.374793)"
     id="path162" />
  <path
     fill="none"
     stroke-width="1"
     stroke-linecap="butt"
     stroke-linejoin="miter"
     stroke="rgb(0%, 0%, 0%)"
     stroke-opacity="1"
     stroke-miterlimit="10"
     d="M 214.629356 171.001068 L 177.369173 171.001068 "
     transform="matrix(0.749585, 0, 0, 0.749585, 0.374793, 0.374793)"
     id="path164" />
  <path
     fill-rule="nonzero"
     fill="rgb(0%, 0%, 0%)"
     fill-opacity="1"
     stroke-width="1"
     stroke-linecap="butt"
     stroke-linejoin="miter"
     stroke="rgb(0%, 0%, 0%)"
     stroke-opacity="1"
     stroke-miterlimit="10"
     d="M 219.88226 171.001068 L 212.878388 174.497793 L 214.629356 171.001068 L 212.878388 167.499132 Z M 219.88226 171.001068 "
     transform="matrix(0.749585, 0, 0, 0.749585, 0.374793, 0.374793)"
     id="path166" />
  <path
     fill-rule="nonzero"
     fill="rgb(0%, 0%, 0%)"
     fill-opacity="1"
     stroke-width="1"
     stroke-linecap="butt"
     stroke-linejoin="miter"
     stroke="rgb(0%, 0%, 0%)"
     stroke-opacity="1"
     stroke-miterlimit="10"
     d="M 172.12148 171.001068 L 179.120141 167.499132 L 177.369173 171.001068 L 179.120141 174.497793 Z M 172.12148 171.001068 "
     transform="matrix(0.749585, 0, 0, 0.749585, 0.374793, 0.374793)"
     id="path168" />
  <path
     fill="none"
     stroke-width="1"
     stroke-linecap="butt"
     stroke-linejoin="miter"
     stroke="rgb(0%, 0%, 0%)"
     stroke-opacity="1"
     stroke-miterlimit="10"
     d="M 387.370693 171.001068 L 424.630877 171.001068 "
     transform="matrix(0.749585, 0, 0, 0.749585, 0.374793, 0.374793)"
     id="path170" />
  <path
     fill-rule="nonzero"
     fill="rgb(0%, 0%, 0%)"
     fill-opacity="1"
     stroke-width="1"
     stroke-linecap="butt"
     stroke-linejoin="miter"
     stroke="rgb(0%, 0%, 0%)"
     stroke-opacity="1"
     stroke-miterlimit="10"
     d="M 382.117789 171.001068 L 389.121662 167.499132 L 387.370693 171.001068 L 389.121662 174.497793 Z M 382.117789 171.001068 "
     transform="matrix(0.749585, 0, 0, 0.749585, 0.374793, 0.374793)"
     id="path172" />
  <path
     fill-rule="nonzero"
     fill="rgb(0%, 0%, 0%)"
     fill-opacity="1"
     stroke-width="1"
     stroke-linecap="butt"
     stroke-linejoin="miter"
     stroke="rgb(0%, 0%, 0%)"
     stroke-opacity="1"
     stroke-miterlimit="10"
     d="M 429.87857 171.001068 L 422.879909 174.497793 L 424.630877 171.001068 L 422.879909 167.499132 Z M 429.87857 171.001068 "
     transform="matrix(0.749585, 0, 0, 0.749585, 0.374793, 0.374793)"
     id="path174" />
  <path
     fill="none"
     stroke-width="1"
     stroke-linecap="butt"
     stroke-linejoin="miter"
     stroke="rgb(0%, 0%, 0%)"
     stroke-opacity="1"
     stroke-miterlimit="10"
     d="M 301.000025 232.36833 L 301.000025 294.631921 "
     transform="matrix(0.749585, 0, 0, 0.749585, 0.374793, 0.374793)"
     id="path176" />
  <path
     fill-rule="nonzero"
     fill="rgb(0%, 0%, 0%)"
     fill-opacity="1"
     stroke-width="1"
     stroke-linecap="butt"
     stroke-linejoin="miter"
     stroke="rgb(0%, 0%, 0%)"
     stroke-opacity="1"
     stroke-miterlimit="10"
     d="M 301.000025 227.120637 L 304.501961 234.119298 L 301.000025 232.36833 L 297.498089 234.119298 Z M 301.000025 227.120637 "
     transform="matrix(0.749585, 0, 0, 0.749585, 0.374793, 0.374793)"
     id="path178" />
  <path
     fill-rule="nonzero"
     fill="rgb(0%, 0%, 0%)"
     fill-opacity="1"
     stroke-width="1"
     stroke-linecap="butt"
     stroke-linejoin="miter"
     stroke="rgb(0%, 0%, 0%)"
     stroke-opacity="1"
     stroke-miterlimit="10"
     d="M 301.000025 299.879614 L 297.498089 292.880953 L 301.000025 294.631921 L 304.501961 292.880953 Z M 301.000025 299.879614 "
     transform="matrix(0.749585, 0, 0, 0.749585, 0.374793, 0.374793)"
     id="path180" />
  <path
     fill-rule="nonzero"
     fill="rgb(63.529968%, 0%, 14.509583%)"
     fill-opacity="1"
     stroke-width="1"
     stroke-linecap="butt"
     stroke-linejoin="miter"
     stroke="rgb(43.528748%, 0%, 0%)"
     stroke-opacity="1"
     stroke-miterlimit="4"
     d="M 220.99746 116.001911 L 381.002589 116.001911 L 381.002589 226.000226 L 220.99746 226.000226 Z M 220.99746 116.001911 "
     transform="matrix(0.749585, 0, 0, 0.749585, 0.374793, 0.374793)"
     id="path182" />
  <g
     fill="#ffffff"
     fill-opacity="1"
     id="g224">
    <use
       xlink:href="#glyph-0-6"
       x="183.36731"
       y="131.17743"
       id="use184" />
    <use
       xlink:href="#glyph-0-7"
       x="190.36394"
       y="131.17743"
       id="use186" />
    <use
       xlink:href="#glyph-0-8"
       x="193.35934"
       y="131.17743"
       id="use188" />
    <use
       xlink:href="#glyph-0-9"
       x="197.85686"
       y="131.17743"
       id="use190" />
    <use
       xlink:href="#glyph-0-2"
       x="202.85947"
       y="131.17743"
       id="use192" />
    <use
       xlink:href="#glyph-0-10"
       x="207.86206"
       y="131.17743"
       id="use194" />
    <use
       xlink:href="#glyph-0-3"
       x="212.35957"
       y="131.17743"
       id="use196" />
    <use
       xlink:href="#glyph-0-7"
       x="214.85869"
       y="131.17743"
       id="use198" />
    <use
       xlink:href="#glyph-0-4"
       x="217.8541"
       y="131.17743"
       id="use200" />
    <use
       xlink:href="#glyph-0-3"
       x="222.8567"
       y="131.17743"
       id="use202" />
    <use
       xlink:href="#glyph-0-12"
       x="225.3558"
       y="131.17743"
       id="use204" />
    <use
       xlink:href="#glyph-0-11"
       x="227.35422"
       y="131.17743"
       id="use206" />
    <use
       xlink:href="#glyph-0-13"
       x="232.35681"
       y="131.17743"
       id="use208" />
    <use
       xlink:href="#glyph-0-14"
       x="237.35942"
       y="131.17743"
       id="use210" />
    <use
       xlink:href="#glyph-0-15"
       x="239.85852"
       y="131.17743"
       id="use212" />
    <use
       xlink:href="#glyph-0-13"
       x="245.85814"
       y="131.17743"
       id="use214" />
    <use
       xlink:href="#glyph-0-16"
       x="250.86073"
       y="131.17743"
       id="use216" />
    <use
       xlink:href="#glyph-0-12"
       x="255.86334"
       y="131.17743"
       id="use218" />
    <use
       xlink:href="#glyph-0-13"
       x="257.86176"
       y="131.17743"
       id="use220" />
    <use
       xlink:href="#glyph-0-2"
       x="262.86435"
       y="131.17743"
       id="use222" />
  </g>
  <path
     fill-rule="nonzero"
     fill="rgb(63.529968%, 0%, 14.509583%)"
     fill-opacity="1"
     stroke-width="1"
     stroke-linecap="butt"
     stroke-linejoin="miter"
     stroke="rgb(43.528748%, 0%, 0%)"
     stroke-opacity="1"
     stroke-miterlimit="4"
     d="M 220.99746 11.00115 L 381.002589 11.00115 L 381.002589 51.002433 L 220.99746 51.002433 Z M 220.99746 11.00115 "
     transform="matrix(0.749585, 0, 0, 0.749585, 0.374793, 0.374793)"
     id="path226" />
  <g
     fill="#ffffff"
     fill-opacity="1"
     id="g260">
    <use
       xlink:href="#glyph-0-17"
       x="192.37405"
       y="26.235487"
       id="use228" />
    <use
       xlink:href="#glyph-0-13"
       x="198.37367"
       y="26.235487"
       id="use230" />
    <use
       xlink:href="#glyph-0-4"
       x="203.37627"
       y="26.235487"
       id="use232" />
    <use
       xlink:href="#glyph-0-18"
       x="208.37888"
       y="26.235487"
       id="use234" />
    <use
       xlink:href="#glyph-0-19"
       x="210.37727"
       y="26.235487"
       id="use236" />
    <use
       xlink:href="#glyph-0-3"
       x="214.87479"
       y="26.235487"
       id="use238" />
    <use
       xlink:href="#glyph-0-12"
       x="217.3739"
       y="26.235487"
       id="use240" />
    <use
       xlink:href="#glyph-0-8"
       x="219.3723"
       y="26.235487"
       id="use242" />
    <use
       xlink:href="#glyph-0-10"
       x="223.86981"
       y="26.235487"
       id="use244" />
    <use
       xlink:href="#glyph-0-14"
       x="228.36732"
       y="26.235487"
       id="use246" />
    <use
       xlink:href="#glyph-0-15"
       x="230.86644"
       y="26.235487"
       id="use248" />
    <use
       xlink:href="#glyph-0-13"
       x="236.86604"
       y="26.235487"
       id="use250" />
    <use
       xlink:href="#glyph-0-16"
       x="241.86865"
       y="26.235487"
       id="use252" />
    <use
       xlink:href="#glyph-0-12"
       x="246.87125"
       y="26.235487"
       id="use254" />
    <use
       xlink:href="#glyph-0-13"
       x="248.86966"
       y="26.235487"
       id="use256" />
    <use
       xlink:href="#glyph-0-2"
       x="253.87227"
       y="26.235487"
       id="use258" />
  </g>
  <path
     fill-rule="nonzero"
     fill="rgb(63.529968%, 0%, 14.509583%)"
     fill-opacity="1"
     stroke-width="1"
     stroke-linecap="butt"
     stroke-linejoin="miter"
     stroke="rgb(43.528748%, 0%, 0%)"
     stroke-opacity="1"
     stroke-miterlimit="4"
     d="M 11.00115 151.000427 L 171.001068 151.000427 L 171.001068 191.00171 L 11.00115 191.00171 Z M 11.00115 151.000427 "
     transform="matrix(0.749585, 0, 0, 0.749585, 0.374793, 0.374793)"
     id="path262" />
  <g
     fill="#ffffff"
     fill-opacity="1"
     id="g294">
    <use
       xlink:href="#glyph-0-20"
       x="35.710712"
       y="131.17743"
       id="use264" />
    <use
       xlink:href="#glyph-0-2"
       x="42.206635"
       y="131.17743"
       id="use266" />
    <use
       xlink:href="#glyph-0-8"
       x="47.209236"
       y="131.17743"
       id="use268" />
    <use
       xlink:href="#glyph-0-12"
       x="51.706749"
       y="131.17743"
       id="use270" />
    <use
       xlink:href="#glyph-0-10"
       x="53.705154"
       y="131.17743"
       id="use272" />
    <use
       xlink:href="#glyph-0-12"
       x="58.202667"
       y="131.17743"
       id="use274" />
    <use
       xlink:href="#glyph-0-11"
       x="60.201073"
       y="131.17743"
       id="use276" />
    <use
       xlink:href="#glyph-0-13"
       x="65.203674"
       y="131.17743"
       id="use278" />
    <use
       xlink:href="#glyph-0-14"
       x="70.206284"
       y="131.17743"
       id="use280" />
    <use
       xlink:href="#glyph-0-15"
       x="72.705383"
       y="131.17743"
       id="use282" />
    <use
       xlink:href="#glyph-0-13"
       x="78.704994"
       y="131.17743"
       id="use284" />
    <use
       xlink:href="#glyph-0-16"
       x="83.707603"
       y="131.17743"
       id="use286" />
    <use
       xlink:href="#glyph-0-12"
       x="88.710205"
       y="131.17743"
       id="use288" />
    <use
       xlink:href="#glyph-0-13"
       x="90.708611"
       y="131.17743"
       id="use290" />
    <use
       xlink:href="#glyph-0-2"
       x="95.711212"
       y="131.17743"
       id="use292" />
  </g>
  <path
     fill-rule="nonzero"
     fill="rgb(63.529968%, 0%, 14.509583%)"
     fill-opacity="1"
     stroke-width="1"
     stroke-linecap="butt"
     stroke-linejoin="miter"
     stroke="rgb(43.528748%, 0%, 0%)"
     stroke-opacity="1"
     stroke-miterlimit="4"
     d="M 430.998981 151.000427 L 590.998899 151.000427 L 590.998899 191.00171 L 430.998981 191.00171 Z M 430.998981 151.000427 "
     transform="matrix(0.749585, 0, 0, 0.749585, 0.374793, 0.374793)"
     id="path296" />
  <g
     fill="#ffffff"
     fill-opacity="1"
     id="g346">
    <use
       xlink:href="#glyph-0-21"
       x="327.276"
       y="131.17743"
       id="use298" />
    <use
       xlink:href="#glyph-0-2"
       x="333.77191"
       y="131.17743"
       id="use300" />
    <use
       xlink:href="#glyph-0-10"
       x="338.77451"
       y="131.17743"
       id="use302" />
    <use
       xlink:href="#glyph-0-11"
       x="343.27203"
       y="131.17743"
       id="use304" />
    <use
       xlink:href="#glyph-0-22"
       x="348.27463"
       y="131.17743"
       id="use306" />
    <use
       xlink:href="#glyph-0-7"
       x="353.27722"
       y="131.17743"
       id="use308" />
    <use
       xlink:href="#glyph-0-8"
       x="356.27264"
       y="131.17743"
       id="use310" />
    <use
       xlink:href="#glyph-0-2"
       x="360.77017"
       y="131.17743"
       id="use312" />
    <use
       xlink:href="#glyph-0-10"
       x="365.77277"
       y="131.17743"
       id="use314" />
    <use
       xlink:href="#glyph-0-14"
       x="370.27026"
       y="131.17743"
       id="use316" />
    <use
       xlink:href="#glyph-0-23"
       x="372.76938"
       y="131.17743"
       id="use318" />
    <use
       xlink:href="#glyph-0-4"
       x="380.2623"
       y="131.17743"
       id="use320" />
    <use
       xlink:href="#glyph-0-13"
       x="385.26492"
       y="131.17743"
       id="use322" />
    <use
       xlink:href="#glyph-0-4"
       x="390.26752"
       y="131.17743"
       id="use324" />
    <use
       xlink:href="#glyph-0-16"
       x="395.27011"
       y="131.17743"
       id="use326" />
    <use
       xlink:href="#glyph-0-2"
       x="400.27274"
       y="131.17743"
       id="use328" />
    <use
       xlink:href="#glyph-0-7"
       x="405.27533"
       y="131.17743"
       id="use330" />
    <use
       xlink:href="#glyph-0-14"
       x="408.27075"
       y="131.17743"
       id="use332" />
    <use
       xlink:href="#glyph-0-15"
       x="410.76984"
       y="131.17743"
       id="use334" />
    <use
       xlink:href="#glyph-0-13"
       x="416.76947"
       y="131.17743"
       id="use336" />
    <use
       xlink:href="#glyph-0-16"
       x="421.77206"
       y="131.17743"
       id="use338" />
    <use
       xlink:href="#glyph-0-12"
       x="426.77466"
       y="131.17743"
       id="use340" />
    <use
       xlink:href="#glyph-0-13"
       x="428.77307"
       y="131.17743"
       id="use342" />
    <use
       xlink:href="#glyph-0-2"
       x="433.77567"
       y="131.17743"
       id="use344" />
  </g>
  <path
     fill-rule="nonzero"
     fill="rgb(63.529968%, 0%, 14.509583%)"
     fill-opacity="1"
     d="M 1.125 226 L 450.875 226 L 450.875 255.984375 L 1.125 255.984375 Z M 1.125 226 "
     id="path348" />
  <g
     clip-path="url(#clip-1)"
     id="g352">
    <path
       fill="none"
       stroke-width="1"
       stroke-linecap="butt"
       stroke-linejoin="miter"
       stroke="#6f0000"
       stroke-opacity="1"
       stroke-miterlimit="4"
       d="m 1.00083,301.00002 h 599.99839 v 40.00129 H 1.00083 Z m 0,0"
       transform="matrix(0.749585,0,0,0.749585,0.374793,0.374793)"
       id="path350" />
  </g>
  <g
     fill="#ffffff"
     fill-opacity="1"
     id="g398">
    <use
       xlink:href="#glyph-0-17"
       x="176.62105"
       y="243.61523"
       id="use354" />
    <use
       xlink:href="#glyph-0-24"
       x="182.62065"
       y="243.61523"
       id="use356" />
    <use
       xlink:href="#glyph-0-25"
       x="188.62027"
       y="243.61523"
       id="use358" />
    <use
       xlink:href="#glyph-0-14"
       x="191.11937"
       y="243.61523"
       id="use360" />
    <use
       xlink:href="#glyph-0-26"
       x="193.61848"
       y="243.61523"
       id="use362" />
    <use
       xlink:href="#glyph-0-14"
       x="196.11758"
       y="243.61523"
       id="use364" />
    <use
       xlink:href="#glyph-0-6"
       x="198.6167"
       y="243.61523"
       id="use366" />
    <use
       xlink:href="#glyph-0-3"
       x="205.61331"
       y="243.61523"
       id="use368" />
    <use
       xlink:href="#glyph-0-9"
       x="208.11241"
       y="243.61523"
       id="use370" />
    <use
       xlink:href="#glyph-0-2"
       x="213.11502"
       y="243.61523"
       id="use372" />
    <use
       xlink:href="#glyph-0-7"
       x="218.11763"
       y="243.61523"
       id="use374" />
    <use
       xlink:href="#glyph-0-14"
       x="221.11304"
       y="243.61523"
       id="use376" />
    <use
       xlink:href="#glyph-0-27"
       x="223.61214"
       y="243.61523"
       id="use378" />
    <use
       xlink:href="#glyph-0-11"
       x="230.10806"
       y="243.61523"
       id="use380" />
    <use
       xlink:href="#glyph-0-1"
       x="235.11066"
       y="243.61523"
       id="use382" />
    <use
       xlink:href="#glyph-0-28"
       x="242.60359"
       y="243.61523"
       id="use384" />
    <use
       xlink:href="#glyph-0-11"
       x="247.60619"
       y="243.61523"
       id="use386" />
    <use
       xlink:href="#glyph-0-13"
       x="252.6088"
       y="243.61523"
       id="use388" />
    <use
       xlink:href="#glyph-0-2"
       x="257.61139"
       y="243.61523"
       id="use390" />
    <use
       xlink:href="#glyph-0-13"
       x="262.61401"
       y="243.61523"
       id="use392" />
    <use
       xlink:href="#glyph-0-3"
       x="267.61661"
       y="243.61523"
       id="use394" />
    <use
       xlink:href="#glyph-0-10"
       x="270.11572"
       y="243.61523"
       id="use396" />
  </g>
  <g
     fill="#000000"
     fill-opacity="1"
     id="g436">
    <use
       xlink:href="#glyph-0-24"
       x="154.40288"
       y="49.472633"
       id="use400" />
    <use
       xlink:href="#glyph-0-11"
       x="160.40248"
       y="49.472633"
       id="use402" />
    <use
       xlink:href="#glyph-0-18"
       x="165.40509"
       y="49.472633"
       id="use404" />
    <use
       xlink:href="#glyph-0-12"
       x="167.40349"
       y="49.472633"
       id="use406" />
    <use
       xlink:href="#glyph-0-8"
       x="169.4019"
       y="49.472633"
       id="use408" />
    <use
       xlink:href="#glyph-0-12"
       x="173.89941"
       y="49.472633"
       id="use410" />
    <use
       xlink:href="#glyph-0-2"
       x="175.89781"
       y="49.472633"
       id="use412" />
    <use
       xlink:href="#glyph-0-10"
       x="180.90042"
       y="49.472633"
       id="use414" />
    <use
       xlink:href="#glyph-0-29"
       x="185.39793"
       y="49.472633"
       id="use416" />
    <use
       xlink:href="#glyph-0-14"
       x="187.89703"
       y="49.472633"
       id="use418" />
    <use
       xlink:href="#glyph-0-1"
       x="190.39615"
       y="49.472633"
       id="use420" />
    <use
       xlink:href="#glyph-0-2"
       x="197.88907"
       y="49.472633"
       id="use422" />
    <use
       xlink:href="#glyph-0-3"
       x="202.89168"
       y="49.472633"
       id="use424" />
    <use
       xlink:href="#glyph-0-7"
       x="205.39078"
       y="49.472633"
       id="use426" />
    <use
       xlink:href="#glyph-0-12"
       x="208.3862"
       y="49.472633"
       id="use428" />
    <use
       xlink:href="#glyph-0-8"
       x="210.3846"
       y="49.472633"
       id="use430" />
    <use
       xlink:href="#glyph-0-10"
       x="214.88211"
       y="49.472633"
       id="use432" />
    <use
       xlink:href="#glyph-0-29"
       x="219.37962"
       y="49.472633"
       id="use434" />
  </g>
  <g
     fill="#000000"
     fill-opacity="1"
     id="g456">
    <use
       xlink:href="#glyph-0-7"
       x="168.39903"
       y="59.966827"
       id="use438" />
    <use
       xlink:href="#glyph-0-2"
       x="171.39444"
       y="59.966827"
       id="use440" />
    <use
       xlink:href="#glyph-0-10"
       x="176.39705"
       y="59.966827"
       id="use442" />
    <use
       xlink:href="#glyph-0-11"
       x="180.89456"
       y="59.966827"
       id="use444" />
    <use
       xlink:href="#glyph-0-22"
       x="185.89717"
       y="59.966827"
       id="use446" />
    <use
       xlink:href="#glyph-0-7"
       x="190.89977"
       y="59.966827"
       id="use448" />
    <use
       xlink:href="#glyph-0-8"
       x="193.89519"
       y="59.966827"
       id="use450" />
    <use
       xlink:href="#glyph-0-2"
       x="198.3927"
       y="59.966827"
       id="use452" />
    <use
       xlink:href="#glyph-0-10"
       x="203.39529"
       y="59.966827"
       id="use454" />
  </g>
  <g
     fill="#000000"
     fill-opacity="1"
     id="g476">
    <use
       xlink:href="#glyph-0-4"
       x="170.64778"
       y="71.210609"
       id="use458" />
    <use
       xlink:href="#glyph-0-13"
       x="175.65039"
       y="71.210609"
       id="use460" />
    <use
       xlink:href="#glyph-0-4"
       x="180.653"
       y="71.210609"
       id="use462" />
    <use
       xlink:href="#glyph-0-18"
       x="185.65559"
       y="71.210609"
       id="use464" />
    <use
       xlink:href="#glyph-0-19"
       x="187.65401"
       y="71.210609"
       id="use466" />
    <use
       xlink:href="#glyph-0-3"
       x="192.15152"
       y="71.210609"
       id="use468" />
    <use
       xlink:href="#glyph-0-12"
       x="194.65062"
       y="71.210609"
       id="use470" />
    <use
       xlink:href="#glyph-0-8"
       x="196.64903"
       y="71.210609"
       id="use472" />
    <use
       xlink:href="#glyph-0-10"
       x="201.14655"
       y="71.210609"
       id="use474" />
  </g>
  <g
     fill="#000000"
     fill-opacity="1"
     id="g480">
    <use
       xlink:href="#glyph-0-30"
       x="116.75963"
       y="86.951897"
       id="use478" />
  </g>
  <g
     fill="#000000"
     fill-opacity="1"
     id="g496">
    <use
       xlink:href="#glyph-0-11"
       x="125.08705"
       y="86.951897"
       id="use482" />
    <use
       xlink:href="#glyph-0-7"
       x="130.08966"
       y="86.951897"
       id="use484" />
    <use
       xlink:href="#glyph-0-31"
       x="133.08507"
       y="86.951897"
       id="use486" />
    <use
       xlink:href="#glyph-0-18"
       x="137.58258"
       y="86.951897"
       id="use488" />
    <use
       xlink:href="#glyph-0-11"
       x="139.58099"
       y="86.951897"
       id="use490" />
    <use
       xlink:href="#glyph-0-4"
       x="144.58359"
       y="86.951897"
       id="use492" />
    <use
       xlink:href="#glyph-0-32"
       x="149.5862"
       y="86.951897"
       id="use494" />
  </g>
  <g
     fill="#000000"
     fill-opacity="1"
     id="g518">
    <use
       xlink:href="#glyph-0-28"
       x="113.6793"
       y="97.446098"
       id="use498" />
    <use
       xlink:href="#glyph-0-18"
       x="118.68191"
       y="97.446098"
       id="use500" />
    <use
       xlink:href="#glyph-0-4"
       x="120.68031"
       y="97.446098"
       id="use502" />
    <use
       xlink:href="#glyph-0-8"
       x="125.68291"
       y="97.446098"
       id="use504" />
    <use
       xlink:href="#glyph-0-2"
       x="130.18044"
       y="97.446098"
       id="use506" />
    <use
       xlink:href="#glyph-0-1"
       x="135.18303"
       y="97.446098"
       id="use508" />
    <use
       xlink:href="#glyph-0-2"
       x="142.67596"
       y="97.446098"
       id="use510" />
    <use
       xlink:href="#glyph-0-13"
       x="147.67856"
       y="97.446098"
       id="use512" />
    <use
       xlink:href="#glyph-0-3"
       x="152.68117"
       y="97.446098"
       id="use514" />
    <use
       xlink:href="#glyph-0-29"
       x="155.18027"
       y="97.446098"
       id="use516" />
  </g>
  <g
     fill="#000000"
     fill-opacity="1"
     id="g538">
    <use
       xlink:href="#glyph-0-1"
       x="117.18127"
       y="108.68987"
       id="use520" />
    <use
       xlink:href="#glyph-0-12"
       x="124.67419"
       y="108.68987"
       id="use522" />
    <use
       xlink:href="#glyph-0-16"
       x="126.6726"
       y="108.68987"
       id="use524" />
    <use
       xlink:href="#glyph-0-7"
       x="131.6752"
       y="108.68987"
       id="use526" />
    <use
       xlink:href="#glyph-0-4"
       x="134.67062"
       y="108.68987"
       id="use528" />
    <use
       xlink:href="#glyph-0-3"
       x="139.67322"
       y="108.68987"
       id="use530" />
    <use
       xlink:href="#glyph-0-12"
       x="142.17233"
       y="108.68987"
       id="use532" />
    <use
       xlink:href="#glyph-0-11"
       x="144.17073"
       y="108.68987"
       id="use534" />
    <use
       xlink:href="#glyph-0-13"
       x="149.17334"
       y="108.68987"
       id="use536" />
  </g>
  <g
     fill="#000000"
     fill-opacity="1"
     id="g558">
    <use
       xlink:href="#glyph-0-21"
       x="295.06726"
       y="86.951897"
       id="use540" />
    <use
       xlink:href="#glyph-0-2"
       x="301.56317"
       y="86.951897"
       id="use542" />
    <use
       xlink:href="#glyph-0-10"
       x="306.56577"
       y="86.951897"
       id="use544" />
    <use
       xlink:href="#glyph-0-11"
       x="311.06329"
       y="86.951897"
       id="use546" />
    <use
       xlink:href="#glyph-0-22"
       x="316.06589"
       y="86.951897"
       id="use548" />
    <use
       xlink:href="#glyph-0-7"
       x="321.06848"
       y="86.951897"
       id="use550" />
    <use
       xlink:href="#glyph-0-8"
       x="324.0639"
       y="86.951897"
       id="use552" />
    <use
       xlink:href="#glyph-0-2"
       x="328.5614"
       y="86.951897"
       id="use554" />
    <use
       xlink:href="#glyph-0-29"
       x="333.56403"
       y="86.951897"
       id="use556" />
  </g>
  <g
     fill="#000000"
     fill-opacity="1"
     id="g582">
    <use
       xlink:href="#glyph-0-4"
       x="295.3132"
       y="97.446098"
       id="use560" />
    <use
       xlink:href="#glyph-0-18"
       x="300.3158"
       y="97.446098"
       id="use562" />
    <use
       xlink:href="#glyph-0-18"
       x="302.31421"
       y="97.446098"
       id="use564" />
    <use
       xlink:href="#glyph-0-11"
       x="304.31262"
       y="97.446098"
       id="use566" />
    <use
       xlink:href="#glyph-0-8"
       x="309.31522"
       y="97.446098"
       id="use568" />
    <use
       xlink:href="#glyph-0-4"
       x="313.81274"
       y="97.446098"
       id="use570" />
    <use
       xlink:href="#glyph-0-3"
       x="318.81534"
       y="97.446098"
       id="use572" />
    <use
       xlink:href="#glyph-0-12"
       x="321.31445"
       y="97.446098"
       id="use574" />
    <use
       xlink:href="#glyph-0-11"
       x="323.31284"
       y="97.446098"
       id="use576" />
    <use
       xlink:href="#glyph-0-13"
       x="328.31546"
       y="97.446098"
       id="use578" />
    <use
       xlink:href="#glyph-0-29"
       x="333.31805"
       y="97.446098"
       id="use580" />
  </g>
  <g
     fill="#000000"
     fill-opacity="1"
     id="g600">
    <use
       xlink:href="#glyph-0-10"
       x="300.57202"
       y="108.68987"
       id="use584" />
    <use
       xlink:href="#glyph-0-8"
       x="305.06952"
       y="108.68987"
       id="use586" />
    <use
       xlink:href="#glyph-0-4"
       x="309.56705"
       y="108.68987"
       id="use588" />
    <use
       xlink:href="#glyph-0-18"
       x="314.56964"
       y="108.68987"
       id="use590" />
    <use
       xlink:href="#glyph-0-18"
       x="316.56805"
       y="108.68987"
       id="use592" />
    <use
       xlink:href="#glyph-0-12"
       x="318.56647"
       y="108.68987"
       id="use594" />
    <use
       xlink:href="#glyph-0-13"
       x="320.56485"
       y="108.68987"
       id="use596" />
    <use
       xlink:href="#glyph-0-16"
       x="325.56747"
       y="108.68987"
       id="use598" />
  </g>
  <g
     fill="#000000"
     fill-opacity="1"
     id="g630">
    <use
       xlink:href="#glyph-0-25"
       x="233.85892"
       y="189.6451"
       id="use602" />
    <use
       xlink:href="#glyph-0-13"
       x="236.35803"
       y="189.6451"
       id="use604" />
    <use
       xlink:href="#glyph-0-28"
       x="241.36063"
       y="189.6451"
       id="use606" />
    <use
       xlink:href="#glyph-0-22"
       x="246.36324"
       y="189.6451"
       id="use608" />
    <use
       xlink:href="#glyph-0-3"
       x="251.36583"
       y="189.6451"
       id="use610" />
    <use
       xlink:href="#glyph-0-10"
       x="253.86494"
       y="189.6451"
       id="use612" />
    <use
       xlink:href="#glyph-0-26"
       x="258.36246"
       y="189.6451"
       id="use614" />
    <use
       xlink:href="#glyph-0-6"
       x="260.86157"
       y="189.6451"
       id="use616" />
    <use
       xlink:href="#glyph-0-22"
       x="267.85818"
       y="189.6451"
       id="use618" />
    <use
       xlink:href="#glyph-0-3"
       x="272.86078"
       y="189.6451"
       id="use620" />
    <use
       xlink:href="#glyph-0-28"
       x="275.35989"
       y="189.6451"
       id="use622" />
    <use
       xlink:href="#glyph-0-22"
       x="280.36249"
       y="189.6451"
       id="use624" />
    <use
       xlink:href="#glyph-0-3"
       x="285.36508"
       y="189.6451"
       id="use626" />
    <use
       xlink:href="#glyph-0-10"
       x="287.8642"
       y="189.6451"
       id="use628" />
  </g>
  <g
     fill="#000000"
     fill-opacity="1"
     id="g650">
    <use
       xlink:href="#glyph-0-2"
       x="236.59959"
       y="200.88887"
       id="use632" />
    <use
       xlink:href="#glyph-0-33"
       x="241.60219"
       y="200.88887"
       id="use634" />
    <use
       xlink:href="#glyph-0-3"
       x="246.0997"
       y="200.88887"
       id="use636" />
    <use
       xlink:href="#glyph-0-2"
       x="248.59882"
       y="200.88887"
       id="use638" />
    <use
       xlink:href="#glyph-0-7"
       x="253.60141"
       y="200.88887"
       id="use640" />
    <use
       xlink:href="#glyph-0-13"
       x="256.59683"
       y="200.88887"
       id="use642" />
    <use
       xlink:href="#glyph-0-4"
       x="261.59943"
       y="200.88887"
       id="use644" />
    <use
       xlink:href="#glyph-0-18"
       x="266.60205"
       y="200.88887"
       id="use646" />
    <use
       xlink:href="#glyph-0-14"
       x="268.60043"
       y="200.88887"
       id="use648" />
  </g>
  <g
     fill="#000000"
     fill-opacity="1"
     id="g660">
    <use
       xlink:href="#glyph-0-17"
       x="270.60324"
       y="200.88887"
       id="use652" />
    <use
       xlink:href="#glyph-0-24"
       x="276.60284"
       y="200.88887"
       id="use654" />
    <use
       xlink:href="#glyph-0-25"
       x="282.60248"
       y="200.88887"
       id="use656" />
    <use
       xlink:href="#glyph-0-10"
       x="285.10156"
       y="200.88887"
       id="use658" />
  </g>
</svg>
