{
"id": 6,
"instance_id": "936623ae-8969-4d73-8c04-527d1cb815ac",
"workload_document_id": 9,
"release_name": "test-release",
"status": "rendered",
"manifests": [
    {
    "kind": "ServiceAccount",
    "metadata": {
        "name": "workload-echo-server",
        "labels": {
        "helm.sh/chart": "echo-server-0.5.5",
        "app.kubernetes.io/name": "echo-server",
        "app.kubernetes.io/version": "0.6.0",
        "app.kubernetes.io/instance": "workload",
        "app.kubernetes.io/managed-by": "Helm"
        }
    },
    "apiVersion": "v1"
    },
    {
    "data": {
        "PORT": "80",
        "ENABLE__FILE": "true",
        "ENABLE__HOST": "true",
        "ENABLE__HTTP": "true",
        "ENABLE__HEADER": "true",
        "ENABLE__COOKIES": "true",
        "ENABLE__REQUEST": "true",
        "LOGS__IGNORE__PING": "false",
        "ENABLE__ENVIRONMENT": "true"
    },
    "kind": "ConfigMap",
    "metadata": {
        "name": "workload-echo-server"
    },
    "apiVersion": "v1"
    },
    {
    "kind": "Service",
    "spec": {
        "type": "ClusterIP",
        "ports": [
        {
            "name": "http",
            "port": 80,
            "protocol": "TCP",
            "targetPort": "http"
        }
        ],
        "selector": {
        "app.kubernetes.io/name": "echo-server",
        "app.kubernetes.io/instance": "workload"
        }
    },
    "metadata": {
        "name": "workload-echo-server",
        "labels": {
        "helm.sh/chart": "echo-server-0.5.5",
        "app.kubernetes.io/name": "echo-server",
        "app.kubernetes.io/version": "0.6.0",
        "app.kubernetes.io/instance": "workload",
        "app.kubernetes.io/managed-by": "Helm"
        }
    },
    "apiVersion": "v1"
    },
    {
    "kind": "Deployment",
    "spec": {
        "replicas": 1,
        "selector": {
        "matchLabels": {
            "app.kubernetes.io/name": "echo-server",
            "app.kubernetes.io/instance": "workload"
        }
        },
        "template": {
        "spec": {
            "containers": [
            {
                "name": "echo-server",
                "image": "ealen/echo-server:0.6.0",
                "ports": [
                {
                    "name": "http",
                    "protocol": "TCP",
                    "containerPort": 80
                }
                ],
                "envFrom": [
                {
                    "configMapRef": {
                    "name": "workload-echo-server"
                    }
                }
                ],
                "resources": {
                "limits": {
                    "cpu": "50m",
                    "memory": "128Mi"
                },
                "requests": {
                    "cpu": "50m",
                    "memory": "128Mi"
                }
                },
                "livenessProbe": {
                "httpGet": {
                    "path": "/ping",
                    "port": "http",
                    "httpHeaders": [
                    {
                        "name": "x-echo-code",
                        "value": "200"
                    }
                    ]
                },
                "periodSeconds": 10,
                "timeoutSeconds": 2,
                "failureThreshold": 3,
                "successThreshold": 1,
                "initialDelaySeconds": 5
                },
                "imagePullPolicy": "IfNotPresent",
                "securityContext": {}
            }
            ],
            "securityContext": {},
            "serviceAccountName": "workload-echo-server"
        },
        "metadata": {
            "labels": {
            "app.kubernetes.io/name": "echo-server",
            "app.kubernetes.io/instance": "workload"
            },
            "annotations": {
            "checksum/config": "9c7f22c29e8ec1b52f3488ed3fcd3574887f1b114bb225499900a5bb5a265bed"
            }
        }
        }
    },
    "metadata": {
        "name": "workload-echo-server",
        "labels": {
        "helm.sh/chart": "echo-server-0.5.5",
        "app.kubernetes.io/name": "echo-server",
        "app.kubernetes.io/version": "0.6.0",
        "app.kubernetes.io/instance": "workload",
        "app.kubernetes.io/managed-by": "Helm"
        }
    },
    "apiVersion": "apps/v1"
    },
    {
    "kind": "Pod",
    "spec": {
        "containers": [
        {
            "args": [
            "workload-echo-server:80"
            ],
            "name": "wget",
            "image": "busybox",
            "command": [
            "wget"
            ],
            "resources": {
            "limits": {
                "cpu": "100m",
                "memory": "10Mi"
            },
            "requests": {
                "cpu": "10m",
                "memory": "50Ki"
            }
            }
        }
        ],
        "restartPolicy": "Never"
    },
    "metadata": {
        "name": "workload-echo-server-test-connection",
        "labels": {
        "helm.sh/chart": "echo-server-0.5.5",
        "app.kubernetes.io/name": "echo-server",
        "app.kubernetes.io/version": "0.6.0",
        "app.kubernetes.io/instance": "workload",
        "app.kubernetes.io/managed-by": "Helm"
        },
        "annotations": {
        "helm.sh/hook": "test-success"
        }
    },
    "apiVersion": "v1"
    }
],
  "cluster_name": null
}