{
  "--batch_size": 64,
  "--budget": 1000,
  "--buffer_size": 1e6,
  "--env_name": "Acrobot-v1",
  "--description": "FederatedLearning",
  "--gamma": 0.99,
  "--hidden": 64,
  "--exp": "experiment_outputs",
  "--lr": 0.001,
  "--epsilon_start": 1.0,
  "--epsilon_final": 0.01,
  "--epsilon_decay": 30000,
  "--target_net_steps_delay": 1,
  "--save_interval": 3000,
  "--number_clients": 2,
  "--federated_learning": true,
  "--port": 7536,
  "--no_target": false,
  "--scenario": "attack",
  "--aggregation": "krum",
  "--use_per": true
}
