{
    "entityDefs": [
        {
            "name": "Common",
            "superTypes": [
                "DataSet"
            ],
            "serviceType": "datamite",
            "description": "Entity with common attributes for entity and metadata objects",
            "typeVersion": "1.0",
            "attributeDefs": [
                {
                    "name": "identifier",
                    "typeName": "string",
                    "cardinality": "SINGLE",
                    "isIndexable": true,
                    "isOptional": true,
                    "isUnique": false
                },
                {
                    "name": "created",
                    "typeName": "date",
                    "cardinality": "SINGLE",
                    "isIndexable": false,
                    "isOptional": true,
                    "isUnique": false
                },
                {
                    "name": "entityOwnerName",
                    "typeName": "string",
                    "cardinality": "SINGLE",
                    "isIndexable": false,
                    "isOptional": true,
                    "isUnique": false
                },
                {
                    "name": "entityOwner",
                    "typeName": "string",
                    "cardinality": "SINGLE",
                    "isIndexable": true,
                    "isOptional": true,
                    "isUnique": false
                },
                {
                    "name": "entityUpdatedBy",
                    "typeName": "string",
                    "cardinality": "SINGLE",
                    "isIndexable": false,
                    "isOptional": true,
                    "isUnique": false
                },
                {
                    "name": "entitySummary",
                    "typeName": "string",
                    "cardinality": "SINGLE",
                    "isIndexable": false,
                    "isOptional": true,
                    "isUnique": false
                }
            ]
        },
        {
            "name": "DcatDataset",
            "superTypes": [
                "Common"
            ],
            "serviceType": "datamite",
            "description": "Representation of dcat:dataset",
            "typeVersion": "1.0"
        },
        {
            "name": "Distribution",
            "superTypes": [
                "DataSet"
            ],
            "serviceType": "datamite",
            "description": "Representation of dcat:distribution",
            "typeVersion": "1.0",
            "attributeDefs": [
                {
                    "name": "accessUrl",
                    "typeName": "string",
                    "cardinality": "SINGLE",
                    "isIndexable": false,
                    "isOptional": true,
                    "isUnique": false
                },
                {
                    "name": "byteSize",
                    "typeName": "int",
                    "cardinality": "SINGLE",
                    "isIndexable": false,
                    "isOptional": true,
                    "isUnique": false
                },
                {
                    "name": "mediaType",
                    "typeName": "string",
                    "cardinality": "SINGLE",
                    "isIndexable": false,
                    "isOptional": true,
                    "isUnique": false
                },
                {
                    "name": "format",
                    "typeName": "string",
                    "cardinality": "SINGLE",
                    "isIndexable": false,
                    "isOptional": true,
                    "isUnique": false
                },
                {
                    "name": "conformsTo",
                    "typeName": "string",
                    "cardinality": "SINGLE",
                    "isIndexable": false,
                    "isOptional": true,
                    "isUnique": false
                },
                {
                    "name": "checksum",
                    "typeName": "string",
                    "cardinality": "SINGLE",
                    "isIndexable": false,
                    "isOptional": true,
                    "isUnique": false
                }
            ]
        },
        {
            "name": "Catalog",
            "superTypes": [
                "DcatDataset"
            ],
            "serviceType": "datamite",
            "description": "Representation of dcat:catalog",
            "typeVersion": "1.0",
            "attributeDefs": [
                {
                    "name": "byteSize",
                    "typeName": "int",
                    "cardinality": "SINGLE",
                    "isIndexable": false,
                    "isOptional": true,
                    "isUnique": false
                }
            ]
        },
        {
            "name": "DatasetDatabase",
            "superTypes": [
                "DcatDataset"
            ],
            "serviceType": "datamite",
            "description": "Representation of datasets that are databases",
            "typeVersion": "1.0",
            "attributeDefs": [
                {
                    "name": "dbType",
                    "typeName": "string",
                    "cardinality": "SINGLE",
                    "isIndexable": false,
                    "isOptional": true,
                    "isUnique": false
                }
            ]
        },
        {
            "name": "StructuredDataset",
            "superTypes": [
                "DcatDataset"
            ],
            "serviceType": "datamite",
            "description": "Representation of structured datasets",
            "typeVersion": "1.0"
        },
        {
            "name": "DatasetTable",
            "superTypes": [
                "StructuredDataset"
            ],
            "serviceType": "datamite",
            "description": "Representation of datasets that are database tables",
            "typeVersion": "1.0",
            "attributeDefs": [
                {
                    "name": "dbSchema",
                    "typeName": "string",
                    "cardinality": "SINGLE",
                    "isIndexable": false,
                    "isOptional": true,
                    "isUnique": false
                },
                {
                    "name": "isPrivate",
                    "typeName": "boolean",
                    "cardinality": "SINGLE",
                    "isIndexable": false,
                    "isOptional": true,
                    "isUnique": false
                }
            ]
        },
        {
            "name": "DatasetColumn",
            "superTypes": [
                "DcatDataset"
            ],
            "serviceType": "datamite",
            "description": "Representation of datasets that are columns",
            "typeVersion": "1.0",
            "attributeDefs": [
                {
                    "name": "dataType",
                    "typeName": "string",
                    "cardinality": "SINGLE",
                    "isIndexable": false,
                    "isOptional": true,
                    "isUnique": false
                },
                {
                    "name": "position",
                    "typeName": "int",
                    "cardinality": "SINGLE",
                    "isIndexable": false,
                    "isOptional": true,
                    "isUnique": false
                },
                {
                    "name": "numRecords",
                    "typeName": "int",
                    "cardinality": "SINGLE",
                    "isIndexable": false,
                    "isOptional": true,
                    "isUnique": false
                },
                {
                    "name": "isPrivate",
                    "typeName": "boolean",
                    "cardinality": "SINGLE",
                    "isIndexable": false,
                    "isOptional": true,
                    "isUnique": false
                }
            ]
        },
        {
            "name": "QualityMeasurement",
            "serviceType": "datamite",
            "description": "Representation of data quality measurements",
            "typeVersion": "1.0",
            "attributeDefs": [
                {
                    "name": "name",
                    "typeName": "string",
                    "cardinality": "SINGLE",
                    "isIndexable": false,
                    "isOptional": false,
                    "isUnique": false
                },
                {
                    "name": "qualifiedName",
                    "typeName": "string",
                    "cardinality": "SINGLE",
                    "isIndexable": true,
                    "isOptional": false,
                    "isUnique": true
                },
                {
                    "name": "value",
                    "typeName": "string",
                    "cardinality": "SINGLE",
                    "isIndexable": false,
                    "isOptional": false,
                    "isUnique": false
                },
                {
                    "name": "created",
                    "typeName": "date",
                    "cardinality": "SINGLE",
                    "isIndexable": false,
                    "isOptional": false,
                    "isUnique": false
                },
                {
                    "name": "createdBy",
                    "typeName": "string",
                    "cardinality": "SINGLE",
                    "isIndexable": false,
                    "isOptional": false,
                    "isUnique": false
                },
                {
                    "name": "metric",
                    "typeName": "string",
                    "cardinality": "SINGLE",
                    "isIndexable": false,
                    "isOptional": false,
                    "isUnique": false
                },
                {
                    "name": "parameters",
                    "typeName": "array<string>",
                    "cardinality": "SET",
                    "isIndexable": false,
                    "isOptional": true,
                    "isUnique": false
                }
            ]
        }
    ],
    "relationshipDefs": [
        {
            "name": "Catalog_Datasets",
            "description": "Relationship to contain datasets in a catalog",
            "serviceType": "datamite",
            "typeVersion": "1.0",
            "relationshipCategory": "AGGREGATION",
            "relationshipLabel": "__catalog.datasets",
            "endDef1": {
                "type": "Catalog",
                "name": "datasets",
                "isContainer": true,
                "cardinality": "SET",
                "isLegacyAttribute": true
            },
            "endDef2": {
                "type": "DcatDataset",
                "name": "catalog",
                "isContainer": false,
                "cardinality": "SINGLE",
                "isLegacyAttribute": true
            },
            "propagateTags": "NONE"
        },
        {
            "name": "DatasetDatabase_DatasetTables",
            "description": "Relationship to contain tables in a database",
            "serviceType": "datamite",
            "typeVersion": "1.0",
            "relationshipCategory": "COMPOSITION",
            "relationshipLabel": "__database.tables",
            "endDef1": {
                "type": "DatasetDatabase",
                "name": "tables",
                "isContainer": true,
                "cardinality": "SET",
                "isLegacyAttribute": true
            },
            "endDef2": {
                "type": "DatasetTable",
                "name": "database",
                "isContainer": false,
                "cardinality": "SINGLE",
                "isLegacyAttribute": true
            },
            "propagateTags": "NONE"
        },
        {
            "name": "StructuredDataset_DatasetColumns",
            "description": "Relationship to contain columns in a structured dataset",
            "serviceType": "datamite",
            "typeVersion": "1.0",
            "relationshipCategory": "COMPOSITION",
            "relationshipLabel": "__dataset.columns",
            "endDef1": {
                "type": "StructuredDataset",
                "name": "columns",
                "isContainer": true,
                "cardinality": "SET",
                "isLegacyAttribute": true
            },
            "endDef2": {
                "type": "DatasetColumn",
                "name": "dataset",
                "isContainer": false,
                "cardinality": "SINGLE",
                "isLegacyAttribute": true
            },
            "propagateTags": "NONE"
        },
        {
            "name": "Datasets_Distributions",
            "description": "Relationship to distributions in a dataset",
            "serviceType": "datamite",
            "typeVersion": "1.0",
            "relationshipCategory": "COMPOSITION",
            "relationshipLabel": "__dataset.distributions",
            "endDef1": {
                "type": "DcatDataset",
                "name": "distributions",
                "isContainer": true,
                "cardinality": "SET",
                "isLegacyAttribute": true
            },
            "endDef2": {
                "type": "Distribution",
                "name": "dataset",
                "isContainer": false,
                "cardinality": "SINGLE",
                "isLegacyAttribute": true
            },
            "propagateTags": "NONE"
        },
        {
            "name": "Dataset_QualityMeasurement",
            "description": "Relationship to contain quality measurements in a dataset",
            "serviceType": "datamite",
            "typeVersion": "1.0",
            "relationshipCategory": "COMPOSITION",
            "relationshipLabel": "__dataset.qualityMeasurements",
            "endDef1": {
                "type": "DcatDataset",
                "name": "qualityMeasurements",
                "isContainer": true,
                "cardinality": "SET",
                "isLegacyAttribute": true
            },
            "endDef2": {
                "type": "QualityMeasurement",
                "name": "dataset",
                "isContainer": false,
                "cardinality": "SINGLE",
                "isLegacyAttribute": true
            }
        }
    ]
}
