{
  "$id": "urn:eu.codecohe:ai_model:1.0.0",
  "$schema": "https://json-schema.org/draft/2020-12/schema",
  "description": "AI model entity",
  "type": "object",
  "unevaluatedProperties": false,
  "properties": {
    "algorithm": {
      "type": "string",
      "default": null,
      "description": "Description of training algorithm(s) such as DNN, random forest, gradient boost, etc."
    },
    "build_type": {
      "type": "string",
      "default": null,
      "description": "Description reflecting the build environment. Examples are 'IBM autoai', 'custom', ' Azure ML', etc."
    },
    "factsheet_url": {
      "type": "string",
      "default": null,
      "description": "URL of additional descriptive information or metadata, such as a factsheet, relating to the model."
    },
    "metrics": {
      "type": "array",
      "default": [],
      "description": "model metrics",
      "items": {
        "type": "object",
        "$ref": "#/$defs/metrics"
      }
    }
  },
  "required": [],
  "allOf": [
    {"$ref": "urn:com.ibm.pathfinder.system:entity:1.0.0"},
    {"$ref": "urn:eu.codecohe.shared:entity_details:1.0.0"},
    {"$ref": "urn:eu.codecohe.shared:geography:1.0.0"},
    {"$ref": "urn:eu.codecohe.shared:tag:1.0.0"}
  ],
  "$defs": {
    "metrics": {
      "description": "A set of metrics",
      "type": "object",
      "unevaluatedProperties": false,
      "properties": {
        "name": {
          "type": "string",
          "description": "A name reflecting the category of metrics. For example, 'performance', 'quality', 'fairness', or 'drift'."
        },
        "metrics": {
          "type": "object",
          "default": null,
          "description": "An array of name/value pairs, each pair a metric."
        }
      },
      "required": ["name"]
    }
  }
}