{
  "$id": "urn:eu.codecohe:data_asset:1.1.0",
  "$schema": "https://json-schema.org/draft/2020-12/schema",
  "description": "data asset entity",
  "type": "object",
  "unevaluatedProperties": false,
  "properties": {
    "change_rate": {
      "type": "integer",
      "description": "The rate of change of a data asset, e.g. in records/sec",
      "default": 0
    }
  },
  "required": [],
  "allOf": [
    {"$ref": "urn:com.ibm.pathfinder.system:entity:1.0.0"},
    {"$ref": "urn:eu.codecohe.shared:entity_details:1.0.0"},
    {"$ref": "urn:eu.codecohe.shared:classification:1.0.0"},
    {"$ref": "urn:eu.codecohe.shared:geography:1.0.0"},
    {"$ref": "urn:eu.codecohe.shared:purpose:1.0.0"},
    {"$ref": "urn:eu.codecohe.shared:regulation:1.0.0"},
    {"$ref": "urn:eu.codecohe.shared:tag:1.0.0"},
    {"$ref": "urn:eu.codecohe.shared:technical_meta_data:1.0.0"}
  ],
  "$defs": {}
}