{
  "github_id": "eclipse-cdt-cloud",
  "repositories": [
    {
      "allow_auto_merge": false,
      "allow_forking": true,
      "allow_merge_commit": false,
      "allow_rebase_merge": true,
      "allow_squash_merge": true,
      "allow_update_branch": true,
      "archived": false,
      "auto_init": true,
      "branch_protection_rules": [
        {
          "allows_deletions": false,
          "allows_force_pushes": false,
          "blocks_creations": false,
          "bypass_force_push_allowances": [],
          "bypass_pull_request_allowances": [
            "@eclipse-cdt-cloud/eclipsefdn-releng",
            "@eclipse-cdt-cloud/eclipsefdn-security"
          ],
          "dismisses_stale_reviews": false,
          "is_admin_enforced": false,
          "lock_allows_fetch_and_merge": false,
          "lock_branch": false,
          "pattern": "main",
          "push_restrictions": [],
          "require_last_push_approval": false,
          "required_approving_review_count": 1,
          "required_deployment_environments": [],
          "required_status_checks": [],
          "requires_code_owner_reviews": true,
          "requires_commit_signatures": false,
          "requires_conversation_resolution": false,
          "requires_deployments": false,
          "requires_linear_history": false,
          "requires_pull_request": true,
          "requires_status_checks": false,
          "requires_strict_status_checks": false,
          "restricts_pushes": false,
          "restricts_review_dismissals": false,
          "review_dismissal_allowances": []
        }
      ],
      "default_branch": "main",
      "delete_branch_on_merge": true,
      "dependabot_alerts_enabled": true,
      "dependabot_security_updates_enabled": false,
      "description": "Repository to host configurations related to the Eclipse Foundation.",
      "environments": [
        {
          "branch_policies": [
            "main"
          ],
          "deployment_branch_policy": "selected",
          "name": "github-pages",
          "reviewers": [],
          "wait_timer": 0
        }
      ],
      "gh_pages_build_type": "workflow",
      "gh_pages_source_branch": null,
      "gh_pages_source_path": null,
      "has_discussions": false,
      "has_issues": true,
      "has_projects": false,
      "has_wiki": false,
      "homepage": "https://eclipse-cdt-cloud.github.io/.eclipsefdn/",
      "is_template": false,
      "merge_commit_message": "PR_TITLE",
      "merge_commit_title": "MERGE_MESSAGE",
      "name": ".eclipsefdn",
      "post_process_template_content": [
        ".github/CODEOWNERS",
        "README.md",
        "mkdocs.yml"
      ],
      "private": false,
      "secret_scanning": "enabled",
      "secret_scanning_push_protection": "enabled",
      "squash_merge_commit_message": "COMMIT_MESSAGES",
      "squash_merge_commit_title": "COMMIT_OR_PR_TITLE",
      "template_repository": "EclipseFdn/.eclipsefdn-template",
      "topics": [],
      "web_commit_signoff_required": true,
      "webhooks": [],
      "default_branch_protection": "protected"
    },
    {
      "allow_auto_merge": false,
      "allow_forking": true,
      "allow_merge_commit": false,
      "allow_rebase_merge": true,
      "allow_squash_merge": true,
      "allow_update_branch": false,
      "archived": false,
      "auto_init": true,
      "branch_protection_rules": [
        {
          "allows_deletions": false,
          "allows_force_pushes": false,
          "blocks_creations": false,
          "bypass_force_push_allowances": [],
          "bypass_pull_request_allowances": [],
          "dismisses_stale_reviews": false,
          "is_admin_enforced": false,
          "lock_allows_fetch_and_merge": false,
          "lock_branch": false,
          "pattern": "main",
          "push_restrictions": [],
          "require_last_push_approval": false,
          "required_approving_review_count": 0,
          "required_deployment_environments": [],
          "required_status_checks": [
            "eclipse-eca-validation:eclipsefdn/eca"
          ],
          "requires_code_owner_reviews": false,
          "requires_commit_signatures": false,
          "requires_conversation_resolution": false,
          "requires_deployments": false,
          "requires_linear_history": false,
          "requires_pull_request": true,
          "requires_status_checks": true,
          "requires_strict_status_checks": false,
          "restricts_pushes": false,
          "restricts_review_dismissals": false,
          "review_dismissal_allowances": []
        }
      ],
      "default_branch": "main",
      "delete_branch_on_merge": false,
      "dependabot_alerts_enabled": true,
      "dependabot_security_updates_enabled": false,
      "description": null,
      "environments": [],
      "gh_pages_build_type": "disabled",
      "gh_pages_source_branch": null,
      "gh_pages_source_path": null,
      "has_discussions": false,
      "has_issues": true,
      "has_projects": true,
      "has_wiki": true,
      "homepage": null,
      "is_template": false,
      "merge_commit_message": "PR_TITLE",
      "merge_commit_title": "MERGE_MESSAGE",
      "name": "cdt-amalgamator",
      "private": false,
      "secret_scanning": "enabled",
      "secret_scanning_push_protection": "enabled",
      "squash_merge_commit_message": "COMMIT_MESSAGES",
      "squash_merge_commit_title": "COMMIT_OR_PR_TITLE",
      "template_repository": null,
      "topics": [],
      "web_commit_signoff_required": false,
      "webhooks": [],
      "default_branch_protection": "protected"
    },
    {
      "allow_auto_merge": false,
      "allow_forking": true,
      "allow_merge_commit": true,
      "allow_rebase_merge": true,
      "allow_squash_merge": true,
      "allow_update_branch": false,
      "archived": false,
      "auto_init": true,
      "branch_protection_rules": [],
      "default_branch": "main",
      "delete_branch_on_merge": false,
      "dependabot_alerts_enabled": true,
      "dependabot_security_updates_enabled": false,
      "description": "Components for web-based C/C++ tools",
      "environments": [],
      "gh_pages_build_type": "disabled",
      "gh_pages_source_branch": null,
      "gh_pages_source_path": null,
      "has_discussions": true,
      "has_issues": true,
      "has_projects": true,
      "has_wiki": true,
      "homepage": "https://www.eclipse.org/cdt-cloud",
      "is_template": false,
      "merge_commit_message": "PR_TITLE",
      "merge_commit_title": "MERGE_MESSAGE",
      "name": "cdt-cloud",
      "private": false,
      "secret_scanning": "enabled",
      "secret_scanning_push_protection": "enabled",
      "squash_merge_commit_message": "COMMIT_MESSAGES",
      "squash_merge_commit_title": "COMMIT_OR_PR_TITLE",
      "template_repository": null,
      "topics": [
        "clangd",
        "cloud-ide",
        "cpp",
        "debugging-tools",
        "eclipse-cdt",
        "eclipse-theia",
        "embedded",
        "theia-extension",
        "vscode"
      ],
      "web_commit_signoff_required": false,
      "webhooks": [],
      "default_branch_protection": "not_protected"
    },
    {
      "allow_auto_merge": false,
      "allow_forking": true,
      "allow_merge_commit": true,
      "allow_rebase_merge": true,
      "allow_squash_merge": true,
      "allow_update_branch": false,
      "archived": false,
      "auto_init": true,
      "branch_protection_rules": [],
      "default_branch": "master",
      "delete_branch_on_merge": false,
      "dependabot_alerts_enabled": true,
      "dependabot_security_updates_enabled": false,
      "description": "CDT Cloud Blueprint is a template for building custom web-based C/C++ tools. It is made up of existing open source components and can be easily downloaded and installed on all major operating system platforms.",
      "environments": [],
      "gh_pages_build_type": "disabled",
      "gh_pages_source_branch": null,
      "gh_pages_source_path": null,
      "has_discussions": false,
      "has_issues": true,
      "has_projects": true,
      "has_wiki": true,
      "homepage": "",
      "is_template": false,
      "merge_commit_message": "PR_TITLE",
      "merge_commit_title": "MERGE_MESSAGE",
      "name": "cdt-cloud-blueprint",
      "private": false,
      "secret_scanning": "enabled",
      "secret_scanning_push_protection": "enabled",
      "squash_merge_commit_message": "COMMIT_MESSAGES",
      "squash_merge_commit_title": "COMMIT_OR_PR_TITLE",
      "template_repository": null,
      "topics": [],
      "web_commit_signoff_required": false,
      "webhooks": [],
      "default_branch_protection": "not_protected"
    },
    {
      "allow_auto_merge": false,
      "allow_forking": true,
      "allow_merge_commit": false,
      "allow_rebase_merge": true,
      "allow_squash_merge": true,
      "allow_update_branch": false,
      "archived": false,
      "auto_init": true,
      "branch_protection_rules": [
        {
          "allows_deletions": false,
          "allows_force_pushes": false,
          "blocks_creations": false,
          "bypass_force_push_allowances": [],
          "bypass_pull_request_allowances": [],
          "dismisses_stale_reviews": false,
          "is_admin_enforced": false,
          "lock_allows_fetch_and_merge": false,
          "lock_branch": false,
          "pattern": "main",
          "push_restrictions": [],
          "require_last_push_approval": false,
          "required_approving_review_count": 0,
          "required_deployment_environments": [],
          "required_status_checks": [
            "eclipse-eca-validation:eclipsefdn/eca"
          ],
          "requires_code_owner_reviews": false,
          "requires_commit_signatures": false,
          "requires_conversation_resolution": false,
          "requires_deployments": false,
          "requires_linear_history": false,
          "requires_pull_request": true,
          "requires_status_checks": true,
          "requires_strict_status_checks": false,
          "restricts_pushes": false,
          "restricts_review_dismissals": false,
          "review_dismissal_allowances": []
        }
      ],
      "default_branch": "main",
      "delete_branch_on_merge": false,
      "dependabot_alerts_enabled": true,
      "dependabot_security_updates_enabled": true,
      "description": "CDT GDB Debug Adapter",
      "environments": [],
      "gh_pages_build_type": "disabled",
      "gh_pages_source_branch": null,
      "gh_pages_source_path": null,
      "has_discussions": false,
      "has_issues": true,
      "has_projects": true,
      "has_wiki": true,
      "homepage": "",
      "is_template": false,
      "merge_commit_message": "PR_TITLE",
      "merge_commit_title": "MERGE_MESSAGE",
      "name": "cdt-gdb-adapter",
      "private": false,
      "secret_scanning": "enabled",
      "secret_scanning_push_protection": "enabled",
      "squash_merge_commit_message": "COMMIT_MESSAGES",
      "squash_merge_commit_title": "COMMIT_OR_PR_TITLE",
      "template_repository": null,
      "topics": [
        "cdt",
        "debug",
        "gdb"
      ],
      "web_commit_signoff_required": false,
      "webhooks": [],
      "default_branch_protection": "protected"
    },
    {
      "allow_auto_merge": false,
      "allow_forking": true,
      "allow_merge_commit": false,
      "allow_rebase_merge": true,
      "allow_squash_merge": true,
      "allow_update_branch": false,
      "archived": false,
      "auto_init": true,
      "branch_protection_rules": [
        {
          "allows_deletions": false,
          "allows_force_pushes": false,
          "blocks_creations": false,
          "bypass_force_push_allowances": [],
          "bypass_pull_request_allowances": [],
          "dismisses_stale_reviews": false,
          "is_admin_enforced": false,
          "lock_allows_fetch_and_merge": false,
          "lock_branch": false,
          "pattern": "main",
          "push_restrictions": [],
          "require_last_push_approval": false,
          "required_approving_review_count": 0,
          "required_deployment_environments": [],
          "required_status_checks": [
            "eclipse-eca-validation:eclipsefdn/eca"
          ],
          "requires_code_owner_reviews": false,
          "requires_commit_signatures": false,
          "requires_conversation_resolution": false,
          "requires_deployments": false,
          "requires_linear_history": false,
          "requires_pull_request": true,
          "requires_status_checks": true,
          "requires_strict_status_checks": false,
          "restricts_pushes": false,
          "restricts_review_dismissals": false,
          "review_dismissal_allowances": []
        }
      ],
      "default_branch": "main",
      "delete_branch_on_merge": false,
      "dependabot_alerts_enabled": true,
      "dependabot_security_updates_enabled": true,
      "description": "CDT GDB Visual Studio Code Extension",
      "environments": [],
      "gh_pages_build_type": "disabled",
      "gh_pages_source_branch": null,
      "gh_pages_source_path": null,
      "has_discussions": false,
      "has_issues": true,
      "has_projects": true,
      "has_wiki": true,
      "homepage": "",
      "is_template": false,
      "merge_commit_message": "PR_TITLE",
      "merge_commit_title": "MERGE_MESSAGE",
      "name": "cdt-gdb-vscode",
      "private": false,
      "secret_scanning": "enabled",
      "secret_scanning_push_protection": "enabled",
      "squash_merge_commit_message": "COMMIT_MESSAGES",
      "squash_merge_commit_title": "COMMIT_OR_PR_TITLE",
      "template_repository": null,
      "topics": [
        "cdt",
        "gdb",
        "visual-studio-code-extension"
      ],
      "web_commit_signoff_required": false,
      "webhooks": [],
      "default_branch_protection": "protected"
    },
    {
      "allow_auto_merge": false,
      "allow_forking": true,
      "allow_merge_commit": true,
      "allow_rebase_merge": true,
      "allow_squash_merge": true,
      "allow_update_branch": false,
      "archived": false,
      "auto_init": true,
      "branch_protection_rules": [],
      "default_branch": "main",
      "delete_branch_on_merge": false,
      "dependabot_alerts_enabled": true,
      "dependabot_security_updates_enabled": false,
      "description": "API for management of clangd configuration files in C/C++ projects using contexts.",
      "environments": [],
      "gh_pages_build_type": "disabled",
      "gh_pages_source_branch": null,
      "gh_pages_source_path": null,
      "has_discussions": false,
      "has_issues": true,
      "has_projects": true,
      "has_wiki": false,
      "homepage": "",
      "is_template": false,
      "merge_commit_message": "PR_TITLE",
      "merge_commit_title": "MERGE_MESSAGE",
      "name": "clangd-contexts",
      "private": false,
      "secret_scanning": "enabled",
      "secret_scanning_push_protection": "enabled",
      "secrets": [
        {
          "name": "NPM_AUTH_TOKEN",
          "value": "pass:bots/ecd.cdt-cloud/npmjs.com/token"
        }
      ],
      "squash_merge_commit_message": "COMMIT_MESSAGES",
      "squash_merge_commit_title": "COMMIT_OR_PR_TITLE",
      "template_repository": null,
      "topics": [
        "clangd",
        "cpp",
        "theia",
        "vscode-extension"
      ],
      "web_commit_signoff_required": false,
      "webhooks": [],
      "default_branch_protection": "not_protected"
    },
    {
      "allow_auto_merge": false,
      "allow_forking": true,
      "allow_merge_commit": true,
      "allow_rebase_merge": true,
      "allow_squash_merge": true,
      "allow_update_branch": false,
      "archived": false,
      "auto_init": true,
      "branch_protection_rules": [
        {
          "allows_deletions": false,
          "allows_force_pushes": false,
          "blocks_creations": false,
          "bypass_force_push_allowances": [],
          "bypass_pull_request_allowances": [],
          "dismisses_stale_reviews": true,
          "is_admin_enforced": true,
          "lock_allows_fetch_and_merge": false,
          "lock_branch": false,
          "pattern": "master",
          "push_restrictions": [],
          "require_last_push_approval": false,
          "required_approving_review_count": 1,
          "required_deployment_environments": [],
          "required_status_checks": [
            "eclipse-eca-validation:eclipsefdn/eca"
          ],
          "requires_code_owner_reviews": false,
          "requires_commit_signatures": false,
          "requires_conversation_resolution": false,
          "requires_deployments": false,
          "requires_linear_history": false,
          "requires_pull_request": true,
          "requires_status_checks": false,
          "requires_strict_status_checks": true,
          "restricts_pushes": false,
          "restricts_review_dismissals": false,
          "review_dismissal_allowances": []
        }
      ],
      "default_branch": "master",
      "delete_branch_on_merge": false,
      "dependabot_alerts_enabled": true,
      "dependabot_security_updates_enabled": true,
      "description": "Theia trace viewer extension using the tsp-typescript-client (https://github.com/theia-ide/tsp-typescript-client) and Trace Server Protocol (https://github.com/theia-ide/trace-server-protocol).",
      "environments": [],
      "gh_pages_build_type": "disabled",
      "gh_pages_source_branch": null,
      "gh_pages_source_path": null,
      "has_discussions": false,
      "has_issues": true,
      "has_projects": true,
      "has_wiki": true,
      "homepage": "",
      "is_template": false,
      "merge_commit_message": "PR_TITLE",
      "merge_commit_title": "MERGE_MESSAGE",
      "name": "theia-trace-extension",
      "private": false,
      "secret_scanning": "enabled",
      "secret_scanning_push_protection": "enabled",
      "secrets": [
        {
          "name": "NPM_AUTH_TOKEN",
          "value": "pass:bots/ecd.cdt-cloud/npmjs.com/token"
        }
      ],
      "squash_merge_commit_message": "COMMIT_MESSAGES",
      "squash_merge_commit_title": "COMMIT_OR_PR_TITLE",
      "template_repository": null,
      "topics": [
        "theia-extension",
        "trace",
        "trace-viewer",
        "trace-visualization",
        "tsp"
      ],
      "web_commit_signoff_required": false,
      "webhooks": [
        {
          "active": true,
          "content_type": "json",
          "events": [
            "push"
          ],
          "insecure_ssl": "0",
          "secret": null,
          "url": "https://discordapp.com/api/webhooks/732801241565888642/k8i2zzlYPFJjgMBKXM-zm4gMPdpWQln3RDvJ6jcUugNUbgRZyOVXEe0FTVCPFQeSjAGW/github"
        }
      ],
      "default_branch_protection": "protected"
    },
    {
      "allow_auto_merge": false,
      "allow_forking": true,
      "allow_merge_commit": true,
      "allow_rebase_merge": true,
      "allow_squash_merge": true,
      "allow_update_branch": false,
      "archived": false,
      "auto_init": true,
      "branch_protection_rules": [
        {
          "allows_deletions": false,
          "allows_force_pushes": false,
          "blocks_creations": false,
          "bypass_force_push_allowances": [],
          "bypass_pull_request_allowances": [],
          "dismisses_stale_reviews": false,
          "is_admin_enforced": true,
          "lock_allows_fetch_and_merge": false,
          "lock_branch": false,
          "pattern": "master",
          "push_restrictions": [],
          "require_last_push_approval": false,
          "required_approving_review_count": 1,
          "required_deployment_environments": [],
          "required_status_checks": [
            "eclipse-eca-validation:eclipsefdn/eca"
          ],
          "requires_code_owner_reviews": false,
          "requires_commit_signatures": false,
          "requires_conversation_resolution": false,
          "requires_deployments": false,
          "requires_linear_history": false,
          "requires_pull_request": true,
          "requires_status_checks": false,
          "requires_strict_status_checks": true,
          "restricts_pushes": false,
          "restricts_review_dismissals": false,
          "review_dismissal_allowances": []
        }
      ],
      "default_branch": "master",
      "delete_branch_on_merge": false,
      "dependabot_alerts_enabled": true,
      "dependabot_security_updates_enabled": true,
      "description": "A timeline / gantt chart library for large data (e.g. traces)",
      "environments": [],
      "gh_pages_build_type": "disabled",
      "gh_pages_source_branch": null,
      "gh_pages_source_path": null,
      "has_discussions": false,
      "has_issues": true,
      "has_projects": true,
      "has_wiki": true,
      "homepage": null,
      "is_template": false,
      "merge_commit_message": "PR_TITLE",
      "merge_commit_title": "MERGE_MESSAGE",
      "name": "timeline-chart",
      "private": false,
      "secret_scanning": "enabled",
      "secret_scanning_push_protection": "enabled",
      "secrets": [
        {
          "name": "NPM_AUTH_TOKEN",
          "value": "pass:bots/ecd.cdt-cloud/npmjs.com/token"
        }
      ],
      "squash_merge_commit_message": "COMMIT_MESSAGES",
      "squash_merge_commit_title": "COMMIT_OR_PR_TITLE",
      "template_repository": null,
      "topics": [],
      "web_commit_signoff_required": false,
      "webhooks": [
        {
          "active": true,
          "content_type": "form",
          "events": [
            "create",
            "delete",
            "issue_comment",
            "member",
            "public",
            "pull_request",
            "push",
            "repository"
          ],
          "insecure_ssl": "0",
          "secret": null,
          "url": "https://notify.travis-ci.org"
        }
      ],
      "default_branch_protection": "protected"
    },
    {
      "allow_auto_merge": false,
      "allow_forking": true,
      "allow_merge_commit": true,
      "allow_rebase_merge": true,
      "allow_squash_merge": true,
      "allow_update_branch": false,
      "archived": false,
      "auto_init": true,
      "branch_protection_rules": [
        {
          "allows_deletions": false,
          "allows_force_pushes": false,
          "blocks_creations": false,
          "bypass_force_push_allowances": [],
          "bypass_pull_request_allowances": [],
          "dismisses_stale_reviews": false,
          "is_admin_enforced": true,
          "lock_allows_fetch_and_merge": false,
          "lock_branch": false,
          "pattern": "master",
          "push_restrictions": [],
          "require_last_push_approval": false,
          "required_approving_review_count": 1,
          "required_deployment_environments": [],
          "required_status_checks": [
            "eclipse-eca-validation:eclipsefdn/eca"
          ],
          "requires_code_owner_reviews": false,
          "requires_commit_signatures": false,
          "requires_conversation_resolution": false,
          "requires_deployments": false,
          "requires_linear_history": false,
          "requires_pull_request": true,
          "requires_status_checks": false,
          "requires_strict_status_checks": true,
          "restricts_pushes": false,
          "restricts_review_dismissals": false,
          "review_dismissal_allowances": []
        }
      ],
      "default_branch": "master",
      "delete_branch_on_merge": false,
      "dependabot_alerts_enabled": true,
      "dependabot_security_updates_enabled": true,
      "description": "Specification of the Trace Server Protocol",
      "environments": [
        {
          "branch_policies": [],
          "deployment_branch_policy": "all",
          "name": "github-pages",
          "reviewers": [],
          "wait_timer": 0
        }
      ],
      "gh_pages_build_type": "legacy",
      "gh_pages_source_branch": "gh-pages",
      "gh_pages_source_path": "/",
      "has_discussions": false,
      "has_issues": true,
      "has_projects": true,
      "has_wiki": true,
      "homepage": "https://eclipse-cdt-cloud.github.io/trace-server-protocol/",
      "is_template": false,
      "merge_commit_message": "PR_TITLE",
      "merge_commit_title": "MERGE_MESSAGE",
      "name": "trace-server-protocol",
      "private": false,
      "secret_scanning": "enabled",
      "secret_scanning_push_protection": "enabled",
      "squash_merge_commit_message": "COMMIT_MESSAGES",
      "squash_merge_commit_title": "COMMIT_OR_PR_TITLE",
      "template_repository": null,
      "topics": [],
      "web_commit_signoff_required": false,
      "webhooks": [],
      "default_branch_protection": "protected"
    },
    {
      "allow_auto_merge": false,
      "allow_forking": true,
      "allow_merge_commit": true,
      "allow_rebase_merge": true,
      "allow_squash_merge": true,
      "allow_update_branch": false,
      "archived": false,
      "auto_init": true,
      "branch_protection_rules": [
        {
          "allows_deletions": false,
          "allows_force_pushes": false,
          "blocks_creations": false,
          "bypass_force_push_allowances": [],
          "bypass_pull_request_allowances": [],
          "dismisses_stale_reviews": false,
          "is_admin_enforced": true,
          "lock_allows_fetch_and_merge": false,
          "lock_branch": false,
          "pattern": "master",
          "push_restrictions": [],
          "require_last_push_approval": false,
          "required_approving_review_count": 1,
          "required_deployment_environments": [],
          "required_status_checks": [
            "eclipse-eca-validation:eclipsefdn/eca"
          ],
          "requires_code_owner_reviews": false,
          "requires_commit_signatures": false,
          "requires_conversation_resolution": false,
          "requires_deployments": false,
          "requires_linear_history": false,
          "requires_pull_request": true,
          "requires_status_checks": false,
          "requires_strict_status_checks": true,
          "restricts_pushes": false,
          "restricts_review_dismissals": false,
          "review_dismissal_allowances": []
        }
      ],
      "default_branch": "master",
      "delete_branch_on_merge": false,
      "dependabot_alerts_enabled": true,
      "dependabot_security_updates_enabled": true,
      "description": "Client-side implementation, in Python, of the Trace Server Protocol (TSP) (https://github.com/theia-ide/trace-server-protocol)",
      "environments": [],
      "gh_pages_build_type": "disabled",
      "gh_pages_source_branch": null,
      "gh_pages_source_path": null,
      "has_discussions": false,
      "has_issues": true,
      "has_projects": true,
      "has_wiki": true,
      "homepage": null,
      "is_template": false,
      "merge_commit_message": "PR_TITLE",
      "merge_commit_title": "MERGE_MESSAGE",
      "name": "tsp-python-client",
      "private": false,
      "secret_scanning": "enabled",
      "secret_scanning_push_protection": "enabled",
      "squash_merge_commit_message": "COMMIT_MESSAGES",
      "squash_merge_commit_title": "COMMIT_OR_PR_TITLE",
      "template_repository": null,
      "topics": [],
      "web_commit_signoff_required": false,
      "webhooks": [],
      "default_branch_protection": "protected"
    },
    {
      "allow_auto_merge": false,
      "allow_forking": true,
      "allow_merge_commit": true,
      "allow_rebase_merge": true,
      "allow_squash_merge": true,
      "allow_update_branch": false,
      "archived": false,
      "auto_init": true,
      "branch_protection_rules": [
        {
          "allows_deletions": false,
          "allows_force_pushes": false,
          "blocks_creations": false,
          "bypass_force_push_allowances": [],
          "bypass_pull_request_allowances": [],
          "dismisses_stale_reviews": false,
          "is_admin_enforced": true,
          "lock_allows_fetch_and_merge": false,
          "lock_branch": false,
          "pattern": "master",
          "push_restrictions": [],
          "require_last_push_approval": false,
          "required_approving_review_count": 1,
          "required_deployment_environments": [],
          "required_status_checks": [
            "eclipse-eca-validation:eclipsefdn/eca"
          ],
          "requires_code_owner_reviews": false,
          "requires_commit_signatures": false,
          "requires_conversation_resolution": false,
          "requires_deployments": false,
          "requires_linear_history": false,
          "requires_pull_request": true,
          "requires_status_checks": false,
          "requires_strict_status_checks": true,
          "restricts_pushes": false,
          "restricts_review_dismissals": false,
          "review_dismissal_allowances": []
        }
      ],
      "default_branch": "master",
      "delete_branch_on_merge": false,
      "dependabot_alerts_enabled": true,
      "dependabot_security_updates_enabled": true,
      "description": "Client-side implementation, in typescript, of the Trace Server Protocol (https://github.com/theia-ide/trace-server-protocol).",
      "environments": [],
      "gh_pages_build_type": "disabled",
      "gh_pages_source_branch": null,
      "gh_pages_source_path": null,
      "has_discussions": false,
      "has_issues": true,
      "has_projects": true,
      "has_wiki": true,
      "homepage": "",
      "is_template": false,
      "merge_commit_message": "PR_TITLE",
      "merge_commit_title": "MERGE_MESSAGE",
      "name": "tsp-typescript-client",
      "private": false,
      "secret_scanning": "enabled",
      "secret_scanning_push_protection": "enabled",
      "secrets": [
        {
          "name": "NPM_AUTH_TOKEN",
          "value": "pass:bots/ecd.cdt-cloud/npmjs.com/token"
        }
      ],
      "squash_merge_commit_message": "COMMIT_MESSAGES",
      "squash_merge_commit_title": "COMMIT_OR_PR_TITLE",
      "template_repository": null,
      "topics": [],
      "web_commit_signoff_required": false,
      "webhooks": [
        {
          "active": true,
          "content_type": "form",
          "events": [
            "create",
            "delete",
            "issue_comment",
            "member",
            "public",
            "pull_request",
            "push",
            "repository"
          ],
          "insecure_ssl": "0",
          "secret": null,
          "url": "https://notify.travis-ci.org"
        }
      ],
      "default_branch_protection": "protected"
    },
    {
      "allow_auto_merge": false,
      "allow_forking": true,
      "allow_merge_commit": true,
      "allow_rebase_merge": true,
      "allow_squash_merge": true,
      "allow_update_branch": false,
      "archived": false,
      "auto_init": true,
      "branch_protection_rules": [],
      "default_branch": "main",
      "delete_branch_on_merge": false,
      "dependabot_alerts_enabled": true,
      "dependabot_security_updates_enabled": false,
      "description": "vscode memory inspector",
      "environments": [],
      "gh_pages_build_type": "disabled",
      "gh_pages_source_branch": null,
      "gh_pages_source_path": null,
      "has_discussions": false,
      "has_issues": true,
      "has_projects": true,
      "has_wiki": true,
      "homepage": null,
      "is_template": false,
      "merge_commit_message": "PR_TITLE",
      "merge_commit_title": "MERGE_MESSAGE",
      "name": "vscode-memory-inspector",
      "private": false,
      "secret_scanning": "enabled",
      "secret_scanning_push_protection": "enabled",
      "squash_merge_commit_message": "COMMIT_MESSAGES",
      "squash_merge_commit_title": "COMMIT_OR_PR_TITLE",
      "template_repository": null,
      "topics": [],
      "web_commit_signoff_required": false,
      "webhooks": [],
      "default_branch_protection": "not_protected"
    },
    {
      "allow_auto_merge": false,
      "allow_forking": true,
      "allow_merge_commit": true,
      "allow_rebase_merge": true,
      "allow_squash_merge": true,
      "allow_update_branch": false,
      "archived": false,
      "auto_init": true,
      "branch_protection_rules": [],
      "default_branch": "main",
      "delete_branch_on_merge": false,
      "dependabot_alerts_enabled": true,
      "dependabot_security_updates_enabled": false,
      "description": "vscode memory inspector",
      "environments": [],
      "gh_pages_build_type": "disabled",
      "gh_pages_source_branch": null,
      "gh_pages_source_path": null,
      "has_discussions": false,
      "has_issues": true,
      "has_projects": true,
      "has_wiki": true,
      "homepage": null,
      "is_template": false,
      "merge_commit_message": "PR_TITLE",
      "merge_commit_title": "MERGE_MESSAGE",
      "name": "vscode-svd-viewer",
      "private": false,
      "secret_scanning": "enabled",
      "secret_scanning_push_protection": "enabled",
      "squash_merge_commit_message": "COMMIT_MESSAGES",
      "squash_merge_commit_title": "COMMIT_OR_PR_TITLE",
      "template_repository": null,
      "topics": [],
      "web_commit_signoff_required": false,
      "webhooks": [],
      "default_branch_protection": "not_protected"
    },
    {
      "allow_auto_merge": false,
      "allow_forking": true,
      "allow_merge_commit": true,
      "allow_rebase_merge": true,
      "allow_squash_merge": true,
      "allow_update_branch": false,
      "archived": false,
      "auto_init": true,
      "branch_protection_rules": [
        {
          "allows_deletions": false,
          "allows_force_pushes": false,
          "blocks_creations": false,
          "bypass_force_push_allowances": [],
          "bypass_pull_request_allowances": [],
          "dismisses_stale_reviews": false,
          "is_admin_enforced": true,
          "lock_allows_fetch_and_merge": false,
          "lock_branch": false,
          "pattern": "master",
          "push_restrictions": [],
          "require_last_push_approval": false,
          "required_approving_review_count": 1,
          "required_deployment_environments": [],
          "required_status_checks": [
            "eclipse-eca-validation:eclipsefdn/eca"
          ],
          "requires_code_owner_reviews": false,
          "requires_commit_signatures": false,
          "requires_conversation_resolution": false,
          "requires_deployments": false,
          "requires_linear_history": false,
          "requires_pull_request": true,
          "requires_status_checks": false,
          "requires_strict_status_checks": true,
          "restricts_pushes": false,
          "restricts_review_dismissals": false,
          "review_dismissal_allowances": []
        }
      ],
      "default_branch": "master",
      "delete_branch_on_merge": false,
      "dependabot_alerts_enabled": true,
      "dependabot_security_updates_enabled": true,
      "description": "Trace viewer extension for Theia applications and VSCode compatible applications",
      "environments": [],
      "gh_pages_build_type": "disabled",
      "gh_pages_source_branch": null,
      "gh_pages_source_path": null,
      "has_discussions": true,
      "has_issues": true,
      "has_projects": true,
      "has_wiki": true,
      "homepage": "",
      "is_template": false,
      "merge_commit_message": "PR_TITLE",
      "merge_commit_title": "MERGE_MESSAGE",
      "name": "vscode-trace-extension",
      "private": false,
      "secret_scanning": "enabled",
      "secret_scanning_push_protection": "enabled",
      "squash_merge_commit_message": "COMMIT_MESSAGES",
      "squash_merge_commit_title": "COMMIT_OR_PR_TITLE",
      "template_repository": null,
      "topics": [
        "theia",
        "trace",
        "trace-viewer",
        "trace-visualization",
        "tsp",
        "typescript",
        "vscode",
        "vscode-extension"
      ],
      "web_commit_signoff_required": false,
      "webhooks": [],
      "default_branch_protection": "protected"
    },
    {
      "allow_auto_merge": false,
      "allow_forking": true,
      "allow_merge_commit": true,
      "allow_rebase_merge": true,
      "allow_squash_merge": true,
      "allow_update_branch": false,
      "archived": false,
      "auto_init": true,
      "branch_protection_rules": [],
      "default_branch": "main",
      "delete_branch_on_merge": false,
      "dependabot_alerts_enabled": true,
      "dependabot_security_updates_enabled": false,
      "description": "Extension to start and stop a trace server used by the vscode-trace-extension. This extension can run in Theia and VSCode compatible applications",
      "environments": [],
      "gh_pages_build_type": "disabled",
      "gh_pages_source_branch": null,
      "gh_pages_source_path": null,
      "has_discussions": false,
      "has_issues": true,
      "has_projects": true,
      "has_wiki": true,
      "homepage": "",
      "is_template": false,
      "merge_commit_message": "PR_TITLE",
      "merge_commit_title": "MERGE_MESSAGE",
      "name": "vscode-trace-server",
      "private": false,
      "secret_scanning": "enabled",
      "secret_scanning_push_protection": "enabled",
      "squash_merge_commit_message": "COMMIT_MESSAGES",
      "squash_merge_commit_title": "COMMIT_OR_PR_TITLE",
      "template_repository": null,
      "topics": [
        "theia",
        "trace",
        "trace-viewer",
        "trace-visualization",
        "tsp",
        "typescript",
        "vscode",
        "vscode-extension"
      ],
      "web_commit_signoff_required": false,
      "webhooks": [],
      "default_branch_protection": "not_protected"
    },
    {
      "allow_auto_merge": false,
      "allow_forking": true,
      "allow_merge_commit": true,
      "allow_rebase_merge": true,
      "allow_squash_merge": true,
      "allow_update_branch": false,
      "archived": false,
      "auto_init": true,
      "branch_protection_rules": [],
      "default_branch": "main",
      "delete_branch_on_merge": false,
      "dependabot_alerts_enabled": true,
      "dependabot_security_updates_enabled": false,
      "description": null,
      "environments": [],
      "gh_pages_build_type": "disabled",
      "gh_pages_source_branch": null,
      "gh_pages_source_path": null,
      "has_discussions": false,
      "has_issues": true,
      "has_projects": true,
      "has_wiki": false,
      "homepage": "https://open-vsx.org/extension/eclipse-cdt/websocket-adapter",
      "is_template": false,
      "merge_commit_message": "PR_TITLE",
      "merge_commit_title": "MERGE_MESSAGE",
      "name": "vscode-websocket-adapter",
      "private": false,
      "secret_scanning": "enabled",
      "secret_scanning_push_protection": "enabled",
      "squash_merge_commit_message": "COMMIT_MESSAGES",
      "squash_merge_commit_title": "COMMIT_OR_PR_TITLE",
      "template_repository": null,
      "topics": [],
      "web_commit_signoff_required": false,
      "webhooks": [],
      "default_branch_protection": "not_protected"
    },
    {
      "allow_auto_merge": false,
      "allow_forking": true,
      "allow_merge_commit": true,
      "allow_rebase_merge": true,
      "allow_squash_merge": true,
      "allow_update_branch": false,
      "archived": false,
      "auto_init": true,
      "branch_protection_rules": [],
      "default_branch": "main",
      "delete_branch_on_merge": false,
      "dependabot_alerts_enabled": true,
      "dependabot_security_updates_enabled": false,
      "description": null,
      "environments": [],
      "gh_pages_build_type": "disabled",
      "gh_pages_source_branch": null,
      "gh_pages_source_path": null,
      "has_discussions": false,
      "has_issues": true,
      "has_projects": true,
      "has_wiki": true,
      "homepage": null,
      "is_template": false,
      "merge_commit_message": "PR_TITLE",
      "merge_commit_title": "MERGE_MESSAGE",
      "name": "website",
      "private": false,
      "secret_scanning": "enabled",
      "secret_scanning_push_protection": "enabled",
      "secrets": [
        {
          "name": "GH_ACTION_TOKEN",
          "value": "pass:bots/ecd.cdt-cloud/github.com/api-token"
        }
      ],
      "squash_merge_commit_message": "COMMIT_MESSAGES",
      "squash_merge_commit_title": "COMMIT_OR_PR_TITLE",
      "template_repository": null,
      "topics": [],
      "web_commit_signoff_required": false,
      "webhooks": [],
      "default_branch_protection": "not_protected"
    },
    {
      "allow_auto_merge": false,
      "allow_forking": true,
      "allow_merge_commit": true,
      "allow_rebase_merge": true,
      "allow_squash_merge": true,
      "allow_update_branch": false,
      "archived": false,
      "auto_init": true,
      "branch_protection_rules": [],
      "default_branch": "main",
      "delete_branch_on_merge": false,
      "dependabot_alerts_enabled": true,
      "dependabot_security_updates_enabled": false,
      "description": "The acutal published webiste content",
      "environments": [],
      "gh_pages_build_type": "disabled",
      "gh_pages_source_branch": null,
      "gh_pages_source_path": null,
      "has_discussions": false,
      "has_issues": true,
      "has_projects": true,
      "has_wiki": true,
      "homepage": null,
      "is_template": false,
      "merge_commit_message": "PR_TITLE",
      "merge_commit_title": "MERGE_MESSAGE",
      "name": "website-publish",
      "private": false,
      "secret_scanning": "enabled",
      "secret_scanning_push_protection": "enabled",
      "squash_merge_commit_message": "COMMIT_MESSAGES",
      "squash_merge_commit_title": "COMMIT_OR_PR_TITLE",
      "template_repository": null,
      "topics": [],
      "web_commit_signoff_required": false,
      "webhooks": [],
      "default_branch_protection": "not_protected"
    }
  ],
  "secrets": [
    {
      "name": "OPEN_VSX_TOKEN",
      "selected_repositories": [],
      "value": "pass:bots/ecd.cdt-cloud/open-vsx.org/token",
      "visibility": "public"
    },
    {
      "name": "VS_MARKETPLACE_TOKEN",
      "selected_repositories": [],
      "value": "pass:bots/ecd.cdt-cloud/marketplace.visualstudio.com/token",
      "visibility": "public"
    }
  ],
  "settings": {
    "billing_email": "webmaster@eclipse-foundation.org",
    "blog": null,
    "company": null,
    "default_branch_name": "main",
    "default_repository_permission": "none",
    "dependabot_alerts_enabled_for_new_repositories": true,
    "dependabot_security_updates_enabled_for_new_repositories": false,
    "dependency_graph_enabled_for_new_repositories": true,
    "description": "",
    "discussion_source_repository": null,
    "email": null,
    "has_discussions": false,
    "has_organization_projects": true,
    "has_repository_projects": true,
    "location": null,
    "members_can_change_project_visibility": true,
    "members_can_change_repo_visibility": false,
    "members_can_create_private_repositories": false,
    "members_can_create_public_pages": true,
    "members_can_create_public_repositories": false,
    "members_can_create_teams": false,
    "members_can_delete_issues": false,
    "members_can_delete_repositories": false,
    "members_can_fork_private_repositories": false,
    "name": "Eclipse CDT Cloud",
    "packages_containers_internal": false,
    "packages_containers_public": false,
    "plan": "free",
    "readers_can_create_discussions": true,
    "security_managers": [
      "eclipsefdn-security"
    ],
    "twitter_username": null,
    "two_factor_requirement": false,
    "web_commit_signoff_required": false,
    "workflows": {
      "actions_can_approve_pull_request_reviews": true,
      "allow_action_patterns": [],
      "allow_github_owned_actions": true,
      "allow_verified_creator_actions": true,
      "allowed_actions": "all",
      "default_workflow_permissions": "write",
      "enabled_repositories": "all",
      "selected_repositories": []
    }
  },
  "webhooks": [],
  "@timestamp": "2023-10-17T06:49:45Z",
  "sha_commit": "25d0fedd9d655f7413cce15099232b1ceceac94d"
}