{
  "github_id": "eclipse-edc",
  "repositories": [
    {
      "allow_auto_merge": false,
      "allow_forking": true,
      "allow_merge_commit": false,
      "allow_rebase_merge": true,
      "allow_squash_merge": true,
      "allow_update_branch": true,
      "archived": false,
      "auto_init": true,
      "branch_protection_rules": [
        {
          "allows_deletions": false,
          "allows_force_pushes": false,
          "blocks_creations": false,
          "bypass_force_push_allowances": [],
          "bypass_pull_request_allowances": [
            "@eclipse-edc/eclipsefdn-releng",
            "@eclipse-edc/eclipsefdn-security"
          ],
          "dismisses_stale_reviews": false,
          "is_admin_enforced": false,
          "lock_allows_fetch_and_merge": false,
          "lock_branch": false,
          "pattern": "main",
          "push_restrictions": [],
          "require_last_push_approval": false,
          "required_approving_review_count": 1,
          "required_deployment_environments": [],
          "required_status_checks": [],
          "requires_code_owner_reviews": true,
          "requires_commit_signatures": false,
          "requires_conversation_resolution": false,
          "requires_deployments": false,
          "requires_linear_history": false,
          "requires_pull_request": true,
          "requires_status_checks": false,
          "requires_strict_status_checks": false,
          "restricts_pushes": false,
          "restricts_review_dismissals": false,
          "review_dismissal_allowances": []
        }
      ],
      "default_branch": "main",
      "delete_branch_on_merge": true,
      "dependabot_alerts_enabled": true,
      "dependabot_security_updates_enabled": false,
      "description": "Repository to host configurations related to the Eclipse Foundation.",
      "environments": [
        {
          "branch_policies": [
            "main"
          ],
          "deployment_branch_policy": "selected",
          "name": "github-pages",
          "reviewers": [],
          "wait_timer": 0
        }
      ],
      "gh_pages_build_type": "workflow",
      "gh_pages_source_branch": null,
      "gh_pages_source_path": null,
      "has_discussions": false,
      "has_issues": true,
      "has_projects": false,
      "has_wiki": false,
      "homepage": "https://eclipse-edc.github.io/.eclipsefdn/",
      "is_template": false,
      "merge_commit_message": "PR_TITLE",
      "merge_commit_title": "MERGE_MESSAGE",
      "name": ".eclipsefdn",
      "post_process_template_content": [
        ".github/CODEOWNERS",
        "README.md",
        "mkdocs.yml"
      ],
      "private": false,
      "secret_scanning": "enabled",
      "secret_scanning_push_protection": "enabled",
      "squash_merge_commit_message": "COMMIT_MESSAGES",
      "squash_merge_commit_title": "COMMIT_OR_PR_TITLE",
      "template_repository": "EclipseFdn/.eclipsefdn-template",
      "topics": [],
      "web_commit_signoff_required": true,
      "webhooks": [],
      "default_branch_protection": "protected"
    },
    {
      "allow_auto_merge": false,
      "allow_forking": true,
      "allow_merge_commit": false,
      "allow_rebase_merge": false,
      "allow_squash_merge": true,
      "allow_update_branch": false,
      "archived": false,
      "auto_init": true,
      "branch_protection_rules": [],
      "default_branch": "main",
      "delete_branch_on_merge": false,
      "dependabot_alerts_enabled": true,
      "dependabot_security_updates_enabled": false,
      "description": null,
      "environments": [],
      "gh_pages_build_type": "disabled",
      "gh_pages_source_branch": null,
      "gh_pages_source_path": null,
      "has_discussions": true,
      "has_issues": true,
      "has_projects": true,
      "has_wiki": false,
      "homepage": null,
      "is_template": false,
      "merge_commit_message": "PR_TITLE",
      "merge_commit_title": "MERGE_MESSAGE",
      "name": ".github",
      "private": false,
      "secret_scanning": "enabled",
      "secret_scanning_push_protection": "enabled",
      "secrets": [
        {
          "name": "DISCORD_WEBHOOK_GITHUB",
          "value": "********"
        }
      ],
      "squash_merge_commit_message": "COMMIT_MESSAGES",
      "squash_merge_commit_title": "PR_TITLE",
      "template_repository": null,
      "topics": [],
      "web_commit_signoff_required": false,
      "webhooks": [],
      "default_branch_protection": "not_protected"
    },
    {
      "allow_auto_merge": false,
      "allow_forking": true,
      "allow_merge_commit": false,
      "allow_rebase_merge": false,
      "allow_squash_merge": true,
      "allow_update_branch": false,
      "archived": false,
      "auto_init": true,
      "branch_protection_rules": [],
      "default_branch": "main",
      "delete_branch_on_merge": false,
      "dependabot_alerts_enabled": true,
      "dependabot_security_updates_enabled": false,
      "description": "EDC Presentations and Working Documents",
      "environments": [],
      "gh_pages_build_type": "disabled",
      "gh_pages_source_branch": null,
      "gh_pages_source_path": null,
      "has_discussions": false,
      "has_issues": true,
      "has_projects": true,
      "has_wiki": true,
      "homepage": "",
      "is_template": false,
      "merge_commit_message": "PR_TITLE",
      "merge_commit_title": "MERGE_MESSAGE",
      "name": "Collateral",
      "private": false,
      "secret_scanning": "enabled",
      "secret_scanning_push_protection": "enabled",
      "secrets": [
        {
          "name": "DISCORD_WEBHOOK_GITHUB",
          "value": "********"
        }
      ],
      "squash_merge_commit_message": "COMMIT_MESSAGES",
      "squash_merge_commit_title": "PR_TITLE",
      "template_repository": null,
      "topics": [],
      "web_commit_signoff_required": false,
      "webhooks": [],
      "default_branch_protection": "not_protected"
    },
    {
      "allow_auto_merge": false,
      "allow_forking": true,
      "allow_merge_commit": false,
      "allow_rebase_merge": false,
      "allow_squash_merge": true,
      "allow_update_branch": false,
      "archived": false,
      "auto_init": true,
      "branch_protection_rules": [],
      "default_branch": "main",
      "delete_branch_on_merge": false,
      "dependabot_alerts_enabled": true,
      "dependabot_security_updates_enabled": false,
      "description": "EDC core services including data plane and control plane",
      "environments": [
        {
          "branch_policies": [],
          "deployment_branch_policy": "all",
          "name": "Azure-dev",
          "reviewers": [],
          "wait_timer": 0
        },
        {
          "branch_policies": [
            "gh-pages"
          ],
          "deployment_branch_policy": "selected",
          "name": "github-pages",
          "reviewers": [],
          "wait_timer": 0
        }
      ],
      "gh_pages_build_type": "legacy",
      "gh_pages_source_branch": "gh-pages",
      "gh_pages_source_path": "/",
      "has_discussions": true,
      "has_issues": true,
      "has_projects": true,
      "has_wiki": false,
      "homepage": "",
      "is_template": false,
      "merge_commit_message": "PR_TITLE",
      "merge_commit_title": "MERGE_MESSAGE",
      "name": "Connector",
      "private": false,
      "secret_scanning": "enabled",
      "secret_scanning_push_protection": "enabled",
      "secrets": [
        {
          "name": "DISCORD_WEBHOOK_GITHUB",
          "value": "********"
        },
        {
          "name": "EF_JENKINS_TOKEN",
          "value": "********"
        },
        {
          "name": "EF_JENKINS_USER",
          "value": "********"
        }
      ],
      "squash_merge_commit_message": "COMMIT_MESSAGES",
      "squash_merge_commit_title": "PR_TITLE",
      "template_repository": null,
      "topics": [],
      "web_commit_signoff_required": false,
      "webhooks": [],
      "default_branch_protection": "not_protected"
    },
    {
      "allow_auto_merge": false,
      "allow_forking": true,
      "allow_merge_commit": false,
      "allow_rebase_merge": false,
      "allow_squash_merge": true,
      "allow_update_branch": false,
      "archived": false,
      "auto_init": true,
      "branch_protection_rules": [],
      "default_branch": "main",
      "delete_branch_on_merge": false,
      "dependabot_alerts_enabled": true,
      "dependabot_security_updates_enabled": false,
      "description": "DataDashboard",
      "environments": [],
      "gh_pages_build_type": "disabled",
      "gh_pages_source_branch": null,
      "gh_pages_source_path": null,
      "has_discussions": true,
      "has_issues": true,
      "has_projects": true,
      "has_wiki": false,
      "homepage": null,
      "is_template": false,
      "merge_commit_message": "PR_TITLE",
      "merge_commit_title": "MERGE_MESSAGE",
      "name": "DataDashboard",
      "private": false,
      "secret_scanning": "enabled",
      "secret_scanning_push_protection": "enabled",
      "secrets": [
        {
          "name": "DISCORD_WEBHOOK_GITHUB",
          "value": "********"
        }
      ],
      "squash_merge_commit_message": "COMMIT_MESSAGES",
      "squash_merge_commit_title": "PR_TITLE",
      "template_repository": null,
      "topics": [],
      "web_commit_signoff_required": false,
      "webhooks": [],
      "default_branch_protection": "not_protected"
    },
    {
      "allow_auto_merge": false,
      "allow_forking": true,
      "allow_merge_commit": false,
      "allow_rebase_merge": false,
      "allow_squash_merge": true,
      "allow_update_branch": false,
      "archived": false,
      "auto_init": true,
      "branch_protection_rules": [],
      "default_branch": "main",
      "delete_branch_on_merge": false,
      "dependabot_alerts_enabled": true,
      "dependabot_security_updates_enabled": false,
      "description": "FederatedCatalog",
      "environments": [],
      "gh_pages_build_type": "disabled",
      "gh_pages_source_branch": null,
      "gh_pages_source_path": null,
      "has_discussions": true,
      "has_issues": true,
      "has_projects": true,
      "has_wiki": false,
      "homepage": null,
      "is_template": false,
      "merge_commit_message": "PR_TITLE",
      "merge_commit_title": "MERGE_MESSAGE",
      "name": "FederatedCatalog",
      "private": false,
      "secret_scanning": "enabled",
      "secret_scanning_push_protection": "enabled",
      "secrets": [
        {
          "name": "DISCORD_WEBHOOK_GITHUB",
          "value": "********"
        },
        {
          "name": "EF_JENKINS_TOKEN",
          "value": "********"
        },
        {
          "name": "EF_JENKINS_USER",
          "value": "********"
        }
      ],
      "squash_merge_commit_message": "COMMIT_MESSAGES",
      "squash_merge_commit_title": "PR_TITLE",
      "template_repository": null,
      "topics": [],
      "web_commit_signoff_required": false,
      "webhooks": [],
      "default_branch_protection": "not_protected"
    },
    {
      "allow_auto_merge": false,
      "allow_forking": true,
      "allow_merge_commit": false,
      "allow_rebase_merge": false,
      "allow_squash_merge": true,
      "allow_update_branch": false,
      "archived": false,
      "auto_init": true,
      "branch_protection_rules": [],
      "default_branch": "main",
      "delete_branch_on_merge": false,
      "dependabot_alerts_enabled": true,
      "dependabot_security_updates_enabled": false,
      "description": null,
      "environments": [],
      "gh_pages_build_type": "disabled",
      "gh_pages_source_branch": null,
      "gh_pages_source_path": null,
      "has_discussions": true,
      "has_issues": true,
      "has_projects": true,
      "has_wiki": false,
      "homepage": null,
      "is_template": false,
      "merge_commit_message": "PR_TITLE",
      "merge_commit_title": "MERGE_MESSAGE",
      "name": "GradlePlugins",
      "private": false,
      "secret_scanning": "enabled",
      "secret_scanning_push_protection": "enabled",
      "secrets": [
        {
          "name": "DISCORD_WEBHOOK_GITHUB",
          "value": "********"
        },
        {
          "name": "EF_JENKINS_TOKEN",
          "value": "********"
        },
        {
          "name": "EF_JENKINS_USER",
          "value": "********"
        },
        {
          "name": "GRADLE_PUBLISH_KEY",
          "value": "********"
        },
        {
          "name": "GRADLE_PUBLISH_SECRET",
          "value": "********"
        }
      ],
      "squash_merge_commit_message": "COMMIT_MESSAGES",
      "squash_merge_commit_title": "PR_TITLE",
      "template_repository": null,
      "topics": [],
      "web_commit_signoff_required": false,
      "webhooks": [],
      "default_branch_protection": "not_protected"
    },
    {
      "allow_auto_merge": false,
      "allow_forking": true,
      "allow_merge_commit": true,
      "allow_rebase_merge": true,
      "allow_squash_merge": true,
      "allow_update_branch": false,
      "archived": false,
      "auto_init": true,
      "branch_protection_rules": [],
      "default_branch": "main",
      "delete_branch_on_merge": false,
      "dependabot_alerts_enabled": true,
      "dependabot_security_updates_enabled": false,
      "description": "IDS-CodeGeneration",
      "environments": [],
      "gh_pages_build_type": "disabled",
      "gh_pages_source_branch": null,
      "gh_pages_source_path": null,
      "has_discussions": false,
      "has_issues": true,
      "has_projects": true,
      "has_wiki": true,
      "homepage": null,
      "is_template": false,
      "merge_commit_message": "PR_TITLE",
      "merge_commit_title": "MERGE_MESSAGE",
      "name": "IDS-CodeGeneration",
      "private": false,
      "secret_scanning": "enabled",
      "secret_scanning_push_protection": "enabled",
      "squash_merge_commit_message": "COMMIT_MESSAGES",
      "squash_merge_commit_title": "COMMIT_OR_PR_TITLE",
      "template_repository": null,
      "topics": [],
      "web_commit_signoff_required": false,
      "webhooks": [],
      "default_branch_protection": "not_protected"
    },
    {
      "allow_auto_merge": false,
      "allow_forking": true,
      "allow_merge_commit": true,
      "allow_rebase_merge": true,
      "allow_squash_merge": true,
      "allow_update_branch": false,
      "archived": false,
      "auto_init": true,
      "branch_protection_rules": [],
      "default_branch": "main",
      "delete_branch_on_merge": false,
      "dependabot_alerts_enabled": true,
      "dependabot_security_updates_enabled": false,
      "description": "IDS-Serializer",
      "environments": [],
      "gh_pages_build_type": "disabled",
      "gh_pages_source_branch": null,
      "gh_pages_source_path": null,
      "has_discussions": false,
      "has_issues": true,
      "has_projects": true,
      "has_wiki": true,
      "homepage": null,
      "is_template": false,
      "merge_commit_message": "PR_TITLE",
      "merge_commit_title": "MERGE_MESSAGE",
      "name": "IDS-Serializer",
      "private": false,
      "secret_scanning": "enabled",
      "secret_scanning_push_protection": "enabled",
      "squash_merge_commit_message": "COMMIT_MESSAGES",
      "squash_merge_commit_title": "COMMIT_OR_PR_TITLE",
      "template_repository": null,
      "topics": [],
      "web_commit_signoff_required": false,
      "webhooks": [],
      "default_branch_protection": "not_protected"
    },
    {
      "allow_auto_merge": false,
      "allow_forking": true,
      "allow_merge_commit": false,
      "allow_rebase_merge": false,
      "allow_squash_merge": true,
      "allow_update_branch": false,
      "archived": false,
      "auto_init": true,
      "branch_protection_rules": [],
      "default_branch": "main",
      "delete_branch_on_merge": false,
      "dependabot_alerts_enabled": true,
      "dependabot_security_updates_enabled": false,
      "description": "IdentityHub",
      "environments": [],
      "gh_pages_build_type": "disabled",
      "gh_pages_source_branch": null,
      "gh_pages_source_path": null,
      "has_discussions": true,
      "has_issues": true,
      "has_projects": true,
      "has_wiki": false,
      "homepage": null,
      "is_template": false,
      "merge_commit_message": "PR_TITLE",
      "merge_commit_title": "MERGE_MESSAGE",
      "name": "IdentityHub",
      "private": false,
      "secret_scanning": "enabled",
      "secret_scanning_push_protection": "enabled",
      "secrets": [
        {
          "name": "DISCORD_WEBHOOK_GITHUB",
          "value": "********"
        },
        {
          "name": "EF_JENKINS_TOKEN",
          "value": "********"
        },
        {
          "name": "EF_JENKINS_USER",
          "value": "********"
        }
      ],
      "squash_merge_commit_message": "COMMIT_MESSAGES",
      "squash_merge_commit_title": "PR_TITLE",
      "template_repository": null,
      "topics": [],
      "web_commit_signoff_required": false,
      "webhooks": [],
      "default_branch_protection": "not_protected"
    },
    {
      "allow_auto_merge": false,
      "allow_forking": true,
      "allow_merge_commit": false,
      "allow_rebase_merge": false,
      "allow_squash_merge": true,
      "allow_update_branch": false,
      "archived": false,
      "auto_init": true,
      "branch_protection_rules": [],
      "default_branch": "main",
      "delete_branch_on_merge": false,
      "dependabot_alerts_enabled": true,
      "dependabot_security_updates_enabled": false,
      "description": null,
      "environments": [],
      "gh_pages_build_type": "disabled",
      "gh_pages_source_branch": null,
      "gh_pages_source_path": null,
      "has_discussions": true,
      "has_issues": true,
      "has_projects": true,
      "has_wiki": false,
      "homepage": null,
      "is_template": false,
      "merge_commit_message": "PR_TITLE",
      "merge_commit_title": "MERGE_MESSAGE",
      "name": "JenkinsPipelines",
      "private": false,
      "secret_scanning": "enabled",
      "secret_scanning_push_protection": "enabled",
      "secrets": [
        {
          "name": "DISCORD_WEBHOOK_GITHUB",
          "value": "********"
        }
      ],
      "squash_merge_commit_message": "COMMIT_MESSAGES",
      "squash_merge_commit_title": "PR_TITLE",
      "template_repository": null,
      "topics": [],
      "web_commit_signoff_required": false,
      "webhooks": [],
      "default_branch_protection": "not_protected"
    },
    {
      "allow_auto_merge": false,
      "allow_forking": true,
      "allow_merge_commit": false,
      "allow_rebase_merge": false,
      "allow_squash_merge": true,
      "allow_update_branch": false,
      "archived": false,
      "auto_init": true,
      "branch_protection_rules": [],
      "default_branch": "main",
      "delete_branch_on_merge": false,
      "dependabot_alerts_enabled": true,
      "dependabot_security_updates_enabled": false,
      "description": "Guidance on documentation, scripts and integration steps on using the EDC project results",
      "environments": [],
      "gh_pages_build_type": "disabled",
      "gh_pages_source_branch": null,
      "gh_pages_source_path": null,
      "has_discussions": true,
      "has_issues": true,
      "has_projects": true,
      "has_wiki": true,
      "homepage": null,
      "is_template": false,
      "merge_commit_message": "PR_TITLE",
      "merge_commit_title": "MERGE_MESSAGE",
      "name": "MinimumViableDataspace",
      "private": false,
      "secret_scanning": "enabled",
      "secret_scanning_push_protection": "enabled",
      "secrets": [
        {
          "name": "ACR_NAME",
          "value": "********"
        },
        {
          "name": "APP_CLIENT_ID",
          "value": "********"
        },
        {
          "name": "APP_CLIENT_SECRET",
          "value": "********"
        },
        {
          "name": "APP_OBJECT_ID",
          "value": "********"
        },
        {
          "name": "ARM_CLIENT_ID",
          "value": "********"
        },
        {
          "name": "ARM_CLIENT_SECRET",
          "value": "********"
        },
        {
          "name": "ARM_SUBSCRIPTION_ID",
          "value": "********"
        },
        {
          "name": "ARM_TENANT_ID",
          "value": "********"
        },
        {
          "name": "COMMON_RESOURCE_GROUP",
          "value": "********"
        },
        {
          "name": "COMMON_RESOURCE_GROUP_LOCATION",
          "value": "********"
        },
        {
          "name": "DISCORD_WEBHOOK_GITHUB",
          "value": "********"
        },
        {
          "name": "REGISTRY_SHARE",
          "value": "********"
        },
        {
          "name": "REGISTRY_STORAGE_ACCOUNT",
          "value": "********"
        },
        {
          "name": "TERRAFORM_STATE_CONTAINER",
          "value": "********"
        },
        {
          "name": "TERRAFORM_STATE_STORAGE_ACCOUNT",
          "value": "********"
        }
      ],
      "squash_merge_commit_message": "COMMIT_MESSAGES",
      "squash_merge_commit_title": "PR_TITLE",
      "template_repository": null,
      "topics": [],
      "web_commit_signoff_required": false,
      "webhooks": [],
      "default_branch_protection": "not_protected"
    },
    {
      "allow_auto_merge": false,
      "allow_forking": true,
      "allow_merge_commit": false,
      "allow_rebase_merge": false,
      "allow_squash_merge": true,
      "allow_update_branch": false,
      "archived": false,
      "auto_init": true,
      "branch_protection_rules": [],
      "default_branch": "main",
      "delete_branch_on_merge": false,
      "dependabot_alerts_enabled": true,
      "dependabot_security_updates_enabled": false,
      "description": "EDC publications",
      "environments": [],
      "gh_pages_build_type": "disabled",
      "gh_pages_source_branch": null,
      "gh_pages_source_path": null,
      "has_discussions": true,
      "has_issues": true,
      "has_projects": true,
      "has_wiki": true,
      "homepage": "",
      "is_template": false,
      "merge_commit_message": "PR_TITLE",
      "merge_commit_title": "MERGE_MESSAGE",
      "name": "Publications",
      "private": false,
      "secret_scanning": "enabled",
      "secret_scanning_push_protection": "enabled",
      "secrets": [
        {
          "name": "DISCORD_WEBHOOK_GITHUB",
          "value": "********"
        }
      ],
      "squash_merge_commit_message": "COMMIT_MESSAGES",
      "squash_merge_commit_title": "PR_TITLE",
      "template_repository": null,
      "topics": [],
      "web_commit_signoff_required": false,
      "webhooks": [],
      "default_branch_protection": "not_protected"
    },
    {
      "allow_auto_merge": false,
      "allow_forking": true,
      "allow_merge_commit": false,
      "allow_rebase_merge": false,
      "allow_squash_merge": true,
      "allow_update_branch": false,
      "archived": false,
      "auto_init": true,
      "branch_protection_rules": [],
      "default_branch": "main",
      "delete_branch_on_merge": false,
      "dependabot_alerts_enabled": true,
      "dependabot_security_updates_enabled": false,
      "description": "RegistrationService",
      "environments": [],
      "gh_pages_build_type": "disabled",
      "gh_pages_source_branch": null,
      "gh_pages_source_path": null,
      "has_discussions": true,
      "has_issues": true,
      "has_projects": true,
      "has_wiki": false,
      "homepage": null,
      "is_template": false,
      "merge_commit_message": "PR_TITLE",
      "merge_commit_title": "MERGE_MESSAGE",
      "name": "RegistrationService",
      "private": false,
      "secret_scanning": "enabled",
      "secret_scanning_push_protection": "enabled",
      "secrets": [
        {
          "name": "DISCORD_WEBHOOK_GITHUB",
          "value": "********"
        },
        {
          "name": "EF_JENKINS_TOKEN",
          "value": "********"
        },
        {
          "name": "EF_JENKINS_USER",
          "value": "********"
        }
      ],
      "squash_merge_commit_message": "COMMIT_MESSAGES",
      "squash_merge_commit_title": "PR_TITLE",
      "template_repository": null,
      "topics": [],
      "web_commit_signoff_required": false,
      "webhooks": [],
      "default_branch_protection": "not_protected"
    },
    {
      "allow_auto_merge": false,
      "allow_forking": true,
      "allow_merge_commit": false,
      "allow_rebase_merge": false,
      "allow_squash_merge": true,
      "allow_update_branch": false,
      "archived": false,
      "auto_init": true,
      "branch_protection_rules": [],
      "default_branch": "main",
      "delete_branch_on_merge": false,
      "dependabot_alerts_enabled": true,
      "dependabot_security_updates_enabled": false,
      "description": null,
      "environments": [],
      "gh_pages_build_type": "disabled",
      "gh_pages_source_branch": null,
      "gh_pages_source_path": null,
      "has_discussions": true,
      "has_issues": true,
      "has_projects": true,
      "has_wiki": false,
      "homepage": null,
      "is_template": false,
      "merge_commit_message": "PR_TITLE",
      "merge_commit_title": "MERGE_MESSAGE",
      "name": "Release",
      "private": false,
      "secret_scanning": "enabled",
      "secret_scanning_push_protection": "enabled",
      "secrets": [
        {
          "name": "DISCORD_WEBHOOK_GITHUB",
          "value": "********"
        }
      ],
      "squash_merge_commit_message": "COMMIT_MESSAGES",
      "squash_merge_commit_title": "PR_TITLE",
      "template_repository": null,
      "topics": [],
      "web_commit_signoff_required": false,
      "webhooks": [],
      "default_branch_protection": "not_protected"
    },
    {
      "allow_auto_merge": false,
      "allow_forking": true,
      "allow_merge_commit": false,
      "allow_rebase_merge": false,
      "allow_squash_merge": true,
      "allow_update_branch": false,
      "archived": false,
      "auto_init": true,
      "branch_protection_rules": [],
      "default_branch": "main",
      "delete_branch_on_merge": false,
      "dependabot_alerts_enabled": true,
      "dependabot_security_updates_enabled": false,
      "description": "Runtime-Metamodel",
      "environments": [],
      "gh_pages_build_type": "disabled",
      "gh_pages_source_branch": null,
      "gh_pages_source_path": null,
      "has_discussions": false,
      "has_issues": true,
      "has_projects": true,
      "has_wiki": false,
      "homepage": null,
      "is_template": false,
      "merge_commit_message": "PR_TITLE",
      "merge_commit_title": "MERGE_MESSAGE",
      "name": "Runtime-Metamodel",
      "private": false,
      "secret_scanning": "enabled",
      "secret_scanning_push_protection": "enabled",
      "secrets": [
        {
          "name": "DISCORD_WEBHOOK_GITHUB",
          "value": "********"
        },
        {
          "name": "EF_JENKINS_TOKEN",
          "value": "********"
        },
        {
          "name": "EF_JENKINS_USER",
          "value": "********"
        }
      ],
      "squash_merge_commit_message": "COMMIT_MESSAGES",
      "squash_merge_commit_title": "PR_TITLE",
      "template_repository": null,
      "topics": [],
      "web_commit_signoff_required": false,
      "webhooks": [],
      "default_branch_protection": "not_protected"
    },
    {
      "allow_auto_merge": false,
      "allow_forking": true,
      "allow_merge_commit": false,
      "allow_rebase_merge": false,
      "allow_squash_merge": true,
      "allow_update_branch": false,
      "archived": false,
      "auto_init": true,
      "branch_protection_rules": [],
      "default_branch": "main",
      "delete_branch_on_merge": false,
      "dependabot_alerts_enabled": true,
      "dependabot_security_updates_enabled": false,
      "description": null,
      "environments": [],
      "gh_pages_build_type": "disabled",
      "gh_pages_source_branch": null,
      "gh_pages_source_path": null,
      "has_discussions": true,
      "has_issues": true,
      "has_projects": true,
      "has_wiki": true,
      "homepage": null,
      "is_template": false,
      "merge_commit_message": "PR_TITLE",
      "merge_commit_title": "MERGE_MESSAGE",
      "name": "Samples",
      "private": false,
      "secret_scanning": "enabled",
      "secret_scanning_push_protection": "enabled",
      "secrets": [
        {
          "name": "DISCORD_WEBHOOK_GITHUB",
          "value": "********"
        }
      ],
      "squash_merge_commit_message": "COMMIT_MESSAGES",
      "squash_merge_commit_title": "PR_TITLE",
      "template_repository": null,
      "topics": [],
      "web_commit_signoff_required": false,
      "webhooks": [],
      "default_branch_protection": "not_protected"
    },
    {
      "allow_auto_merge": false,
      "allow_forking": true,
      "allow_merge_commit": false,
      "allow_rebase_merge": false,
      "allow_squash_merge": true,
      "allow_update_branch": false,
      "archived": false,
      "auto_init": true,
      "branch_protection_rules": [],
      "default_branch": "main",
      "delete_branch_on_merge": false,
      "dependabot_alerts_enabled": true,
      "dependabot_security_updates_enabled": false,
      "description": null,
      "environments": [],
      "gh_pages_build_type": "disabled",
      "gh_pages_source_branch": null,
      "gh_pages_source_path": null,
      "has_discussions": false,
      "has_issues": true,
      "has_projects": true,
      "has_wiki": false,
      "homepage": null,
      "is_template": false,
      "merge_commit_message": "PR_TITLE",
      "merge_commit_title": "MERGE_MESSAGE",
      "name": "Technology-Aws",
      "private": false,
      "secret_scanning": "enabled",
      "secret_scanning_push_protection": "enabled",
      "secrets": [
        {
          "name": "DISCORD_WEBHOOK_GITHUB",
          "value": "********"
        },
        {
          "name": "EF_JENKINS_TOKEN",
          "value": "********"
        },
        {
          "name": "EF_JENKINS_USER",
          "value": "********"
        }
      ],
      "squash_merge_commit_message": "COMMIT_MESSAGES",
      "squash_merge_commit_title": "PR_TITLE",
      "template_repository": null,
      "topics": [],
      "web_commit_signoff_required": false,
      "webhooks": [],
      "default_branch_protection": "not_protected"
    },
    {
      "allow_auto_merge": false,
      "allow_forking": true,
      "allow_merge_commit": false,
      "allow_rebase_merge": false,
      "allow_squash_merge": true,
      "allow_update_branch": false,
      "archived": false,
      "auto_init": true,
      "branch_protection_rules": [],
      "default_branch": "main",
      "delete_branch_on_merge": false,
      "dependabot_alerts_enabled": true,
      "dependabot_security_updates_enabled": false,
      "description": null,
      "environments": [],
      "gh_pages_build_type": "disabled",
      "gh_pages_source_branch": null,
      "gh_pages_source_path": null,
      "has_discussions": false,
      "has_issues": true,
      "has_projects": true,
      "has_wiki": false,
      "homepage": null,
      "is_template": false,
      "merge_commit_message": "PR_TITLE",
      "merge_commit_title": "MERGE_MESSAGE",
      "name": "Technology-Azure",
      "private": false,
      "secret_scanning": "enabled",
      "secret_scanning_push_protection": "enabled",
      "secrets": [
        {
          "name": "DISCORD_WEBHOOK_GITHUB",
          "value": "********"
        },
        {
          "name": "EF_JENKINS_TOKEN",
          "value": "********"
        },
        {
          "name": "EF_JENKINS_USER",
          "value": "********"
        },
        {
          "name": "PG_CONNECTION_STRING",
          "value": "********"
        }
      ],
      "squash_merge_commit_message": "COMMIT_MESSAGES",
      "squash_merge_commit_title": "PR_TITLE",
      "template_repository": null,
      "topics": [],
      "web_commit_signoff_required": false,
      "webhooks": [],
      "default_branch_protection": "not_protected"
    },
    {
      "allow_auto_merge": false,
      "allow_forking": true,
      "allow_merge_commit": false,
      "allow_rebase_merge": false,
      "allow_squash_merge": true,
      "allow_update_branch": false,
      "archived": false,
      "auto_init": true,
      "branch_protection_rules": [],
      "default_branch": "main",
      "delete_branch_on_merge": false,
      "dependabot_alerts_enabled": true,
      "dependabot_security_updates_enabled": false,
      "description": null,
      "environments": [],
      "gh_pages_build_type": "disabled",
      "gh_pages_source_branch": null,
      "gh_pages_source_path": null,
      "has_discussions": false,
      "has_issues": true,
      "has_projects": true,
      "has_wiki": false,
      "homepage": null,
      "is_template": false,
      "merge_commit_message": "PR_TITLE",
      "merge_commit_title": "MERGE_MESSAGE",
      "name": "Technology-Gcp",
      "private": false,
      "secret_scanning": "enabled",
      "secret_scanning_push_protection": "enabled",
      "secrets": [
        {
          "name": "DISCORD_WEBHOOK_GITHUB",
          "value": "********"
        },
        {
          "name": "EF_JENKINS_TOKEN",
          "value": "********"
        },
        {
          "name": "EF_JENKINS_USER",
          "value": "********"
        }
      ],
      "squash_merge_commit_message": "COMMIT_MESSAGES",
      "squash_merge_commit_title": "PR_TITLE",
      "template_repository": null,
      "topics": [],
      "web_commit_signoff_required": false,
      "webhooks": [],
      "default_branch_protection": "not_protected"
    },
    {
      "allow_auto_merge": false,
      "allow_forking": true,
      "allow_merge_commit": false,
      "allow_rebase_merge": false,
      "allow_squash_merge": true,
      "allow_update_branch": false,
      "archived": false,
      "auto_init": true,
      "branch_protection_rules": [],
      "default_branch": "main",
      "delete_branch_on_merge": false,
      "dependabot_alerts_enabled": true,
      "dependabot_security_updates_enabled": false,
      "description": null,
      "environments": [],
      "gh_pages_build_type": "disabled",
      "gh_pages_source_branch": null,
      "gh_pages_source_path": null,
      "has_discussions": false,
      "has_issues": true,
      "has_projects": true,
      "has_wiki": false,
      "homepage": null,
      "is_template": true,
      "merge_commit_message": "PR_TITLE",
      "merge_commit_title": "MERGE_MESSAGE",
      "name": "Template-Basic",
      "private": false,
      "secret_scanning": "enabled",
      "secret_scanning_push_protection": "enabled",
      "secrets": [
        {
          "name": "DISCORD_WEBHOOK_GITHUB",
          "value": "********"
        }
      ],
      "squash_merge_commit_message": "COMMIT_MESSAGES",
      "squash_merge_commit_title": "PR_TITLE",
      "template_repository": null,
      "topics": [],
      "web_commit_signoff_required": false,
      "webhooks": [],
      "default_branch_protection": "not_protected"
    },
    {
      "allow_auto_merge": false,
      "allow_forking": true,
      "allow_merge_commit": false,
      "allow_rebase_merge": false,
      "allow_squash_merge": true,
      "allow_update_branch": false,
      "archived": false,
      "auto_init": true,
      "branch_protection_rules": [],
      "default_branch": "main",
      "delete_branch_on_merge": false,
      "dependabot_alerts_enabled": true,
      "dependabot_security_updates_enabled": false,
      "description": null,
      "environments": [],
      "gh_pages_build_type": "disabled",
      "gh_pages_source_branch": null,
      "gh_pages_source_path": null,
      "has_discussions": true,
      "has_issues": true,
      "has_projects": false,
      "has_wiki": false,
      "homepage": null,
      "is_template": false,
      "merge_commit_message": "PR_TITLE",
      "merge_commit_title": "MERGE_MESSAGE",
      "name": "TrustFrameworkAdoption",
      "private": false,
      "secret_scanning": "enabled",
      "secret_scanning_push_protection": "enabled",
      "secrets": [
        {
          "name": "DISCORD_WEBHOOK_GITHUB",
          "value": "********"
        }
      ],
      "squash_merge_commit_message": "COMMIT_MESSAGES",
      "squash_merge_commit_title": "PR_TITLE",
      "template_repository": null,
      "topics": [],
      "web_commit_signoff_required": false,
      "webhooks": [],
      "default_branch_protection": "not_protected"
    },
    {
      "allow_auto_merge": false,
      "allow_forking": true,
      "allow_merge_commit": false,
      "allow_rebase_merge": false,
      "allow_squash_merge": true,
      "allow_update_branch": false,
      "archived": false,
      "auto_init": true,
      "branch_protection_rules": [],
      "default_branch": "main",
      "delete_branch_on_merge": false,
      "dependabot_alerts_enabled": true,
      "dependabot_security_updates_enabled": false,
      "description": "EDC documentation",
      "environments": [
        {
          "branch_policies": [
            "main"
          ],
          "deployment_branch_policy": "selected",
          "name": "github-pages",
          "reviewers": [],
          "wait_timer": 0
        }
      ],
      "gh_pages_build_type": "legacy",
      "gh_pages_source_branch": "main",
      "gh_pages_source_path": "/docs",
      "has_discussions": false,
      "has_issues": true,
      "has_projects": true,
      "has_wiki": true,
      "homepage": "",
      "is_template": false,
      "merge_commit_message": "PR_TITLE",
      "merge_commit_title": "MERGE_MESSAGE",
      "name": "docs",
      "private": false,
      "secret_scanning": "enabled",
      "secret_scanning_push_protection": "enabled",
      "secrets": [
        {
          "name": "DISCORD_WEBHOOK_GITHUB",
          "value": "********"
        }
      ],
      "squash_merge_commit_message": "COMMIT_MESSAGES",
      "squash_merge_commit_title": "PR_TITLE",
      "template_repository": null,
      "topics": [],
      "web_commit_signoff_required": false,
      "webhooks": [],
      "default_branch_protection": "not_protected"
    },
    {
      "allow_auto_merge": false,
      "allow_forking": true,
      "allow_merge_commit": true,
      "allow_rebase_merge": true,
      "allow_squash_merge": true,
      "allow_update_branch": false,
      "archived": false,
      "auto_init": true,
      "branch_protection_rules": [],
      "default_branch": "main",
      "delete_branch_on_merge": false,
      "dependabot_alerts_enabled": true,
      "dependabot_security_updates_enabled": false,
      "description": null,
      "environments": [
        {
          "branch_policies": [
            "gh-pages"
          ],
          "deployment_branch_policy": "selected",
          "name": "github-pages",
          "reviewers": [],
          "wait_timer": 0
        }
      ],
      "gh_pages_build_type": "legacy",
      "gh_pages_source_branch": "gh-pages",
      "gh_pages_source_path": "/",
      "has_discussions": false,
      "has_issues": true,
      "has_projects": true,
      "has_wiki": true,
      "homepage": null,
      "is_template": false,
      "merge_commit_message": "PR_TITLE",
      "merge_commit_title": "MERGE_MESSAGE",
      "name": "json-ld-context",
      "private": false,
      "secret_scanning": "enabled",
      "secret_scanning_push_protection": "enabled",
      "squash_merge_commit_message": "COMMIT_MESSAGES",
      "squash_merge_commit_title": "COMMIT_OR_PR_TITLE",
      "template_repository": null,
      "topics": [],
      "web_commit_signoff_required": false,
      "webhooks": [],
      "default_branch_protection": "not_protected"
    }
  ],
  "secrets": [
    {
      "name": "ORGANIZATION_PROJECT",
      "selected_repositories": [],
      "value": "********",
      "visibility": "public"
    },
    {
      "name": "ORG_GITHUB_BOT_TOKEN",
      "selected_repositories": [],
      "value": "pass:bots/technology.edc/github.com/api-token",
      "visibility": "public"
    },
    {
      "name": "ORG_GITHUB_BOT_USER",
      "selected_repositories": [],
      "value": "pass:bots/technology.edc/github.com/username",
      "visibility": "public"
    },
    {
      "name": "ORG_GPG_PASSPHRASE",
      "selected_repositories": [],
      "value": "pass:bots/technology.edc/gpg/passphrase",
      "visibility": "public"
    },
    {
      "name": "ORG_GPG_PRIVATE_KEY",
      "selected_repositories": [],
      "value": "pass:bots/technology.edc/gpg/secret-subkeys.asc",
      "visibility": "public"
    },
    {
      "name": "ORG_OSSRH_PASSWORD",
      "selected_repositories": [],
      "value": "pass:bots/technology.edc/oss.sonatype.org/password",
      "visibility": "public"
    },
    {
      "name": "ORG_OSSRH_USERNAME",
      "selected_repositories": [],
      "value": "pass:bots/technology.edc/oss.sonatype.org/username",
      "visibility": "public"
    },
    {
      "name": "SWAGGERHUB_TOKEN",
      "selected_repositories": [],
      "value": "********",
      "visibility": "public"
    },
    {
      "name": "SWAGGERHUB_USER",
      "selected_repositories": [],
      "value": "********",
      "visibility": "public"
    }
  ],
  "settings": {
    "billing_email": "wemaster@eclipse.org",
    "blog": null,
    "company": null,
    "default_branch_name": "main",
    "default_repository_permission": "none",
    "dependabot_alerts_enabled_for_new_repositories": true,
    "dependabot_security_updates_enabled_for_new_repositories": false,
    "dependency_graph_enabled_for_new_repositories": true,
    "description": "",
    "discussion_source_repository": "eclipse-edc/.github",
    "email": null,
    "has_discussions": true,
    "has_organization_projects": true,
    "has_repository_projects": true,
    "location": null,
    "members_can_change_project_visibility": false,
    "members_can_change_repo_visibility": false,
    "members_can_create_private_repositories": false,
    "members_can_create_public_pages": true,
    "members_can_create_public_repositories": false,
    "members_can_create_teams": false,
    "members_can_delete_issues": false,
    "members_can_delete_repositories": false,
    "members_can_fork_private_repositories": false,
    "name": "Eclipse Dataspace Components",
    "packages_containers_internal": false,
    "packages_containers_public": false,
    "plan": "free",
    "readers_can_create_discussions": true,
    "security_managers": [
      "eclipsefdn-security"
    ],
    "twitter_username": null,
    "two_factor_requirement": false,
    "web_commit_signoff_required": false,
    "workflows": {
      "actions_can_approve_pull_request_reviews": true,
      "allow_action_patterns": [],
      "allow_github_owned_actions": true,
      "allow_verified_creator_actions": true,
      "allowed_actions": "all",
      "default_workflow_permissions": "write",
      "enabled_repositories": "all",
      "selected_repositories": []
    }
  },
  "webhooks": [],
  "@timestamp": "2023-10-17T06:50:10Z",
  "sha_commit": "772b75296f66c3639cc75523f41e0f140b81d23a"
}