{
  "github_id": "jetty",
  "repositories": [
    {
      "allow_auto_merge": false,
      "allow_forking": true,
      "allow_merge_commit": false,
      "allow_rebase_merge": true,
      "allow_squash_merge": true,
      "allow_update_branch": true,
      "archived": false,
      "auto_init": true,
      "branch_protection_rules": [
        {
          "allows_deletions": false,
          "allows_force_pushes": false,
          "blocks_creations": false,
          "bypass_force_push_allowances": [],
          "bypass_pull_request_allowances": [
            "@jetty/eclipsefdn-releng",
            "@jetty/eclipsefdn-security"
          ],
          "dismisses_stale_reviews": false,
          "is_admin_enforced": false,
          "lock_allows_fetch_and_merge": false,
          "lock_branch": false,
          "pattern": "main",
          "push_restrictions": [],
          "require_last_push_approval": false,
          "required_approving_review_count": 1,
          "required_deployment_environments": [],
          "required_status_checks": [],
          "requires_code_owner_reviews": true,
          "requires_commit_signatures": false,
          "requires_conversation_resolution": false,
          "requires_deployments": false,
          "requires_linear_history": false,
          "requires_pull_request": true,
          "requires_status_checks": false,
          "requires_strict_status_checks": false,
          "restricts_pushes": false,
          "restricts_review_dismissals": false,
          "review_dismissal_allowances": []
        }
      ],
      "default_branch": "main",
      "delete_branch_on_merge": true,
      "dependabot_alerts_enabled": true,
      "dependabot_security_updates_enabled": false,
      "description": "Repository to host configurations related to the Eclipse Foundation.",
      "environments": [
        {
          "branch_policies": [
            "main"
          ],
          "deployment_branch_policy": "selected",
          "name": "github-pages",
          "reviewers": [],
          "wait_timer": 0
        }
      ],
      "gh_pages_build_type": "workflow",
      "gh_pages_source_branch": null,
      "gh_pages_source_path": null,
      "has_discussions": false,
      "has_issues": true,
      "has_projects": false,
      "has_wiki": false,
      "homepage": "https://jetty.github.io/.eclipsefdn/",
      "is_template": false,
      "merge_commit_message": "PR_TITLE",
      "merge_commit_title": "MERGE_MESSAGE",
      "name": ".eclipsefdn",
      "post_process_template_content": [
        ".github/CODEOWNERS",
        "README.md",
        "mkdocs.yml"
      ],
      "private": false,
      "secret_scanning": "enabled",
      "secret_scanning_push_protection": "enabled",
      "squash_merge_commit_message": "COMMIT_MESSAGES",
      "squash_merge_commit_title": "COMMIT_OR_PR_TITLE",
      "template_repository": "EclipseFdn/.eclipsefdn-template",
      "topics": [],
      "web_commit_signoff_required": true,
      "webhooks": [],
      "default_branch_protection": "protected"
    },
    {
      "allow_auto_merge": false,
      "allow_forking": true,
      "allow_merge_commit": true,
      "allow_rebase_merge": true,
      "allow_squash_merge": true,
      "allow_update_branch": false,
      "archived": false,
      "auto_init": true,
      "branch_protection_rules": [],
      "default_branch": "main",
      "delete_branch_on_merge": false,
      "dependabot_alerts_enabled": true,
      "dependabot_security_updates_enabled": false,
      "description": null,
      "environments": [],
      "gh_pages_build_type": "disabled",
      "gh_pages_source_branch": null,
      "gh_pages_source_path": null,
      "has_discussions": false,
      "has_issues": true,
      "has_projects": true,
      "has_wiki": true,
      "homepage": null,
      "is_template": false,
      "merge_commit_message": "PR_TITLE",
      "merge_commit_title": "MERGE_MESSAGE",
      "name": ".github",
      "private": false,
      "secret_scanning": "enabled",
      "secret_scanning_push_protection": "enabled",
      "squash_merge_commit_message": "COMMIT_MESSAGES",
      "squash_merge_commit_title": "COMMIT_OR_PR_TITLE",
      "template_repository": null,
      "topics": [],
      "web_commit_signoff_required": false,
      "webhooks": [],
      "default_branch_protection": "not_protected"
    },
    {
      "allow_auto_merge": false,
      "allow_forking": true,
      "allow_merge_commit": true,
      "allow_rebase_merge": true,
      "allow_squash_merge": true,
      "allow_update_branch": false,
      "archived": false,
      "auto_init": true,
      "branch_protection_rules": [],
      "default_branch": "master",
      "delete_branch_on_merge": false,
      "dependabot_alerts_enabled": true,
      "dependabot_security_updates_enabled": false,
      "description": "Contents and release generation for display on https://eclipse.dev/jetty",
      "environments": [],
      "gh_pages_build_type": "disabled",
      "gh_pages_source_branch": null,
      "gh_pages_source_path": null,
      "has_discussions": false,
      "has_issues": true,
      "has_projects": true,
      "has_wiki": true,
      "homepage": "https://eclipse.dev/jetty",
      "is_template": false,
      "merge_commit_message": "PR_TITLE",
      "merge_commit_title": "MERGE_MESSAGE",
      "name": "jetty-website",
      "private": false,
      "secret_scanning": "enabled",
      "secret_scanning_push_protection": "enabled",
      "squash_merge_commit_message": "COMMIT_MESSAGES",
      "squash_merge_commit_title": "COMMIT_OR_PR_TITLE",
      "template_repository": null,
      "topics": [],
      "web_commit_signoff_required": false,
      "webhooks": [
        {
          "active": true,
          "content_type": "json",
          "events": [
            "pull_request",
            "push"
          ],
          "insecure_ssl": "0",
          "secret": null,
          "url": "https://jenkins.webtide.net/github-webhook/"
        }
      ],
      "default_branch_protection": "not_protected"
    },
    {
      "allow_auto_merge": false,
      "allow_forking": true,
      "allow_merge_commit": true,
      "allow_rebase_merge": true,
      "allow_squash_merge": true,
      "allow_update_branch": false,
      "archived": false,
      "auto_init": true,
      "branch_protection_rules": [],
      "default_branch": "master",
      "delete_branch_on_merge": false,
      "dependabot_alerts_enabled": true,
      "dependabot_security_updates_enabled": true,
      "description": "Eclipse Jetty\u00ae ALPN API - See https://github.com/jetty-project/jetty-alpn for the implementation",
      "environments": [],
      "gh_pages_build_type": "disabled",
      "gh_pages_source_branch": null,
      "gh_pages_source_path": null,
      "has_discussions": false,
      "has_issues": false,
      "has_projects": false,
      "has_wiki": false,
      "homepage": "http://www.eclipse.org/jetty",
      "is_template": false,
      "merge_commit_message": "PR_TITLE",
      "merge_commit_title": "MERGE_MESSAGE",
      "name": "jetty.alpn.api",
      "private": false,
      "secret_scanning": "enabled",
      "secret_scanning_push_protection": "enabled",
      "squash_merge_commit_message": "COMMIT_MESSAGES",
      "squash_merge_commit_title": "COMMIT_OR_PR_TITLE",
      "template_repository": null,
      "topics": [],
      "web_commit_signoff_required": false,
      "webhooks": [
        {
          "active": true,
          "content_type": "json",
          "events": [
            "pull_request",
            "push"
          ],
          "insecure_ssl": "0",
          "secret": null,
          "url": "https://jenkins.webtide.net/github-webhook/"
        }
      ],
      "default_branch_protection": "not_protected"
    },
    {
      "allow_auto_merge": false,
      "allow_forking": true,
      "allow_merge_commit": true,
      "allow_rebase_merge": true,
      "allow_squash_merge": true,
      "allow_update_branch": false,
      "archived": false,
      "auto_init": true,
      "branch_protection_rules": [],
      "default_branch": "master",
      "delete_branch_on_merge": false,
      "dependabot_alerts_enabled": true,
      "dependabot_security_updates_enabled": true,
      "description": "jetty docker",
      "environments": [],
      "gh_pages_build_type": "disabled",
      "gh_pages_source_branch": null,
      "gh_pages_source_path": null,
      "has_discussions": false,
      "has_issues": true,
      "has_projects": true,
      "has_wiki": false,
      "homepage": null,
      "is_template": false,
      "merge_commit_message": "PR_TITLE",
      "merge_commit_title": "MERGE_MESSAGE",
      "name": "jetty.docker",
      "private": false,
      "secret_scanning": "enabled",
      "secret_scanning_push_protection": "enabled",
      "squash_merge_commit_message": "COMMIT_MESSAGES",
      "squash_merge_commit_title": "COMMIT_OR_PR_TITLE",
      "template_repository": null,
      "topics": [],
      "web_commit_signoff_required": false,
      "webhooks": [
        {
          "active": true,
          "content_type": "form",
          "events": [
            "pull_request",
            "push"
          ],
          "insecure_ssl": "0",
          "secret": null,
          "url": "https://jenkins.webtide.net/github-webhook/"
        }
      ],
      "default_branch_protection": "not_protected"
    },
    {
      "allow_auto_merge": false,
      "allow_forking": true,
      "allow_merge_commit": true,
      "allow_rebase_merge": true,
      "allow_squash_merge": true,
      "allow_update_branch": false,
      "archived": false,
      "auto_init": true,
      "branch_protection_rules": [],
      "default_branch": "master",
      "delete_branch_on_merge": false,
      "dependabot_alerts_enabled": true,
      "dependabot_security_updates_enabled": false,
      "description": "Eclipse Jetty\u00ae - Servlet Engine and Http Server project repository (jetty.parent)",
      "environments": [],
      "gh_pages_build_type": "disabled",
      "gh_pages_source_branch": null,
      "gh_pages_source_path": null,
      "has_discussions": false,
      "has_issues": false,
      "has_projects": true,
      "has_wiki": true,
      "homepage": "http://www.eclipse.org/jetty",
      "is_template": false,
      "merge_commit_message": "PR_TITLE",
      "merge_commit_title": "MERGE_MESSAGE",
      "name": "jetty.parent",
      "private": false,
      "secret_scanning": "enabled",
      "secret_scanning_push_protection": "enabled",
      "squash_merge_commit_message": "COMMIT_MESSAGES",
      "squash_merge_commit_title": "COMMIT_OR_PR_TITLE",
      "template_repository": null,
      "topics": [],
      "web_commit_signoff_required": false,
      "webhooks": [],
      "default_branch_protection": "not_protected"
    },
    {
      "allow_auto_merge": false,
      "allow_forking": true,
      "allow_merge_commit": true,
      "allow_rebase_merge": true,
      "allow_squash_merge": true,
      "allow_update_branch": false,
      "archived": false,
      "auto_init": true,
      "branch_protection_rules": [],
      "default_branch": "jetty-10.0.x",
      "delete_branch_on_merge": false,
      "dependabot_alerts_enabled": true,
      "dependabot_security_updates_enabled": false,
      "description": "Eclipse Jetty\u00ae - Web Container & Clients - supports HTTP/2, HTTP/1.1, HTTP/1.0, websocket, servlets, and more",
      "environments": [],
      "gh_pages_build_type": "disabled",
      "gh_pages_source_branch": null,
      "gh_pages_source_path": null,
      "has_discussions": false,
      "has_issues": true,
      "has_projects": true,
      "has_wiki": false,
      "homepage": "https://eclipse.dev/jetty",
      "is_template": false,
      "merge_commit_message": "PR_TITLE",
      "merge_commit_title": "MERGE_MESSAGE",
      "name": "jetty.project",
      "private": false,
      "secret_scanning": "enabled",
      "secret_scanning_push_protection": "enabled",
      "squash_merge_commit_message": "COMMIT_MESSAGES",
      "squash_merge_commit_title": "COMMIT_OR_PR_TITLE",
      "template_repository": null,
      "topics": [
        "eclipse",
        "embedded",
        "fcgi",
        "http",
        "http-client",
        "http-server",
        "http2",
        "http2-push",
        "http3",
        "https",
        "jakartaee",
        "java",
        "jetty",
        "jsp",
        "osgi",
        "servlet",
        "ssl",
        "tls",
        "unix-socket",
        "websockets"
      ],
      "web_commit_signoff_required": false,
      "webhooks": [
        {
          "active": true,
          "content_type": "json",
          "events": [
            "pull_request",
            "push"
          ],
          "insecure_ssl": "0",
          "secret": null,
          "url": "https://jenkins.webtide.net/github-webhook/"
        }
      ],
      "default_branch_protection": "not_protected"
    },
    {
      "allow_auto_merge": false,
      "allow_forking": true,
      "allow_merge_commit": true,
      "allow_rebase_merge": true,
      "allow_squash_merge": true,
      "allow_update_branch": false,
      "archived": false,
      "auto_init": true,
      "branch_protection_rules": [],
      "default_branch": "master",
      "delete_branch_on_merge": false,
      "dependabot_alerts_enabled": true,
      "dependabot_security_updates_enabled": true,
      "description": "Eclipse Jetty\u00ae - Servlet Engine and Http Server project repository (jetty.toolchain)",
      "environments": [],
      "gh_pages_build_type": "disabled",
      "gh_pages_source_branch": null,
      "gh_pages_source_path": null,
      "has_discussions": false,
      "has_issues": true,
      "has_projects": true,
      "has_wiki": true,
      "homepage": "http://www.eclipse.org/jetty",
      "is_template": false,
      "merge_commit_message": "PR_TITLE",
      "merge_commit_title": "MERGE_MESSAGE",
      "name": "jetty.toolchain",
      "private": false,
      "secret_scanning": "enabled",
      "secret_scanning_push_protection": "enabled",
      "squash_merge_commit_message": "COMMIT_MESSAGES",
      "squash_merge_commit_title": "COMMIT_OR_PR_TITLE",
      "template_repository": null,
      "topics": [],
      "web_commit_signoff_required": false,
      "webhooks": [
        {
          "active": true,
          "content_type": "json",
          "events": [
            "pull_request",
            "push"
          ],
          "insecure_ssl": "0",
          "secret": null,
          "url": "https://jenkins.webtide.net/github-webhook/"
        }
      ],
      "default_branch_protection": "not_protected"
    },
    {
      "allow_auto_merge": false,
      "allow_forking": true,
      "allow_merge_commit": false,
      "allow_rebase_merge": true,
      "allow_squash_merge": true,
      "allow_update_branch": true,
      "archived": true,
      "auto_init": true,
      "branch_protection_rules": [],
      "default_branch": "master",
      "delete_branch_on_merge": true,
      "dependabot_alerts_enabled": true,
      "dependabot_security_updates_enabled": false,
      "description": null,
      "environments": [],
      "gh_pages_build_type": "disabled",
      "gh_pages_source_branch": null,
      "gh_pages_source_path": null,
      "has_discussions": false,
      "has_issues": true,
      "has_projects": true,
      "has_wiki": true,
      "homepage": null,
      "is_template": false,
      "merge_commit_message": "PR_TITLE",
      "merge_commit_title": "MERGE_MESSAGE",
      "name": "jetty.website",
      "private": false,
      "secret_scanning": "enabled",
      "secret_scanning_push_protection": "enabled",
      "squash_merge_commit_message": "COMMIT_MESSAGES",
      "squash_merge_commit_title": "COMMIT_OR_PR_TITLE",
      "template_repository": null,
      "topics": [],
      "web_commit_signoff_required": false,
      "webhooks": [],
      "default_branch_protection": "not_protected"
    }
  ],
  "secrets": [],
  "settings": {
    "billing_email": "wayne.beaton@eclipse-foundation.org",
    "blog": "https://eclipse.dev/jetty",
    "company": null,
    "default_branch_name": "main",
    "default_repository_permission": "none",
    "dependabot_alerts_enabled_for_new_repositories": false,
    "dependabot_security_updates_enabled_for_new_repositories": false,
    "dependency_graph_enabled_for_new_repositories": false,
    "description": "The Eclipse Jetty Project",
    "discussion_source_repository": null,
    "email": "jetty-dev@eclipse.org",
    "has_discussions": false,
    "has_organization_projects": true,
    "has_repository_projects": true,
    "location": null,
    "members_can_change_project_visibility": true,
    "members_can_change_repo_visibility": false,
    "members_can_create_private_repositories": false,
    "members_can_create_public_pages": true,
    "members_can_create_public_repositories": false,
    "members_can_create_teams": false,
    "members_can_delete_issues": false,
    "members_can_delete_repositories": false,
    "members_can_fork_private_repositories": false,
    "name": "Eclipse Jetty",
    "packages_containers_internal": false,
    "packages_containers_public": false,
    "plan": "free",
    "readers_can_create_discussions": true,
    "security_managers": [
      "eclipsefdn-security",
      "rt-jetty-committers"
    ],
    "twitter_username": null,
    "two_factor_requirement": false,
    "web_commit_signoff_required": false,
    "workflows": {
      "actions_can_approve_pull_request_reviews": false,
      "allow_action_patterns": [],
      "allow_github_owned_actions": true,
      "allow_verified_creator_actions": true,
      "allowed_actions": "all",
      "default_workflow_permissions": "read",
      "enabled_repositories": "all",
      "selected_repositories": []
    }
  },
  "webhooks": [],
  "@timestamp": "2023-10-17T06:55:05Z",
  "sha_commit": "1d0b788adbd20c37a4dd5db64760f2d46cb90824"
}