{
  "github_id": "eclipse-set",
  "repositories": [
    {
      "allow_auto_merge": false,
      "allow_forking": true,
      "allow_merge_commit": false,
      "allow_rebase_merge": true,
      "allow_squash_merge": true,
      "allow_update_branch": true,
      "archived": false,
      "auto_init": true,
      "branch_protection_rules": [
        {
          "allows_deletions": false,
          "allows_force_pushes": false,
          "blocks_creations": false,
          "bypass_force_push_allowances": [],
          "bypass_pull_request_allowances": [
            "@eclipse-set/eclipsefdn-releng",
            "@eclipse-set/eclipsefdn-security"
          ],
          "dismisses_stale_reviews": false,
          "is_admin_enforced": false,
          "lock_allows_fetch_and_merge": false,
          "lock_branch": false,
          "pattern": "main",
          "push_restrictions": [],
          "require_last_push_approval": false,
          "required_approving_review_count": 1,
          "required_deployment_environments": [],
          "required_status_checks": [],
          "requires_code_owner_reviews": true,
          "requires_commit_signatures": false,
          "requires_conversation_resolution": false,
          "requires_deployments": false,
          "requires_linear_history": false,
          "requires_pull_request": true,
          "requires_status_checks": false,
          "requires_strict_status_checks": false,
          "restricts_pushes": false,
          "restricts_review_dismissals": false,
          "review_dismissal_allowances": []
        }
      ],
      "default_branch": "main",
      "delete_branch_on_merge": true,
      "dependabot_alerts_enabled": true,
      "dependabot_security_updates_enabled": false,
      "description": "Repository to host configurations related to the Eclipse Foundation.",
      "environments": [
        {
          "branch_policies": [
            "main"
          ],
          "deployment_branch_policy": "selected",
          "name": "github-pages",
          "reviewers": [],
          "wait_timer": 0
        }
      ],
      "gh_pages_build_type": "workflow",
      "gh_pages_source_branch": null,
      "gh_pages_source_path": null,
      "has_discussions": false,
      "has_issues": true,
      "has_projects": false,
      "has_wiki": false,
      "homepage": "https://eclipse-set.github.io/.eclipsefdn/",
      "is_template": false,
      "merge_commit_message": "PR_TITLE",
      "merge_commit_title": "MERGE_MESSAGE",
      "name": ".eclipsefdn",
      "post_process_template_content": [
        ".github/CODEOWNERS",
        "README.md",
        "mkdocs.yml"
      ],
      "private": false,
      "secret_scanning": "enabled",
      "secret_scanning_push_protection": "enabled",
      "squash_merge_commit_message": "COMMIT_MESSAGES",
      "squash_merge_commit_title": "COMMIT_OR_PR_TITLE",
      "template_repository": "EclipseFdn/.eclipsefdn-template",
      "topics": [],
      "web_commit_signoff_required": true,
      "webhooks": [],
      "default_branch_protection": "protected"
    },
    {
      "allow_auto_merge": false,
      "allow_forking": true,
      "allow_merge_commit": false,
      "allow_rebase_merge": true,
      "allow_squash_merge": true,
      "allow_update_branch": false,
      "archived": false,
      "auto_init": true,
      "branch_protection_rules": [
        {
          "allows_deletions": false,
          "allows_force_pushes": false,
          "blocks_creations": false,
          "bypass_force_push_allowances": [],
          "bypass_pull_request_allowances": [],
          "dismisses_stale_reviews": false,
          "is_admin_enforced": false,
          "lock_allows_fetch_and_merge": false,
          "lock_branch": false,
          "pattern": "main",
          "push_restrictions": [],
          "require_last_push_approval": false,
          "required_approving_review_count": 0,
          "required_deployment_environments": [],
          "required_status_checks": [
            "eclipse-eca-validation:eclipsefdn/eca"
          ],
          "requires_code_owner_reviews": false,
          "requires_commit_signatures": false,
          "requires_conversation_resolution": false,
          "requires_deployments": false,
          "requires_linear_history": false,
          "requires_pull_request": true,
          "requires_status_checks": true,
          "requires_strict_status_checks": false,
          "restricts_pushes": false,
          "restricts_review_dismissals": false,
          "review_dismissal_allowances": []
        },
        {
          "allows_deletions": false,
          "allows_force_pushes": false,
          "blocks_creations": false,
          "bypass_force_push_allowances": [],
          "bypass_pull_request_allowances": [],
          "dismisses_stale_reviews": false,
          "is_admin_enforced": false,
          "lock_allows_fetch_and_merge": false,
          "lock_branch": false,
          "pattern": "release/*",
          "push_restrictions": [],
          "require_last_push_approval": false,
          "required_approving_review_count": 0,
          "required_deployment_environments": [],
          "required_status_checks": [
            "eclipse-eca-validation:eclipsefdn/eca"
          ],
          "requires_code_owner_reviews": false,
          "requires_commit_signatures": false,
          "requires_conversation_resolution": false,
          "requires_deployments": false,
          "requires_linear_history": false,
          "requires_pull_request": true,
          "requires_status_checks": true,
          "requires_strict_status_checks": false,
          "restricts_pushes": false,
          "restricts_review_dismissals": false,
          "review_dismissal_allowances": []
        }
      ],
      "default_branch": "main",
      "delete_branch_on_merge": true,
      "dependabot_alerts_enabled": true,
      "dependabot_security_updates_enabled": false,
      "description": null,
      "environments": [],
      "gh_pages_build_type": "disabled",
      "gh_pages_source_branch": null,
      "gh_pages_source_path": null,
      "has_discussions": false,
      "has_issues": false,
      "has_projects": true,
      "has_wiki": false,
      "homepage": null,
      "is_template": false,
      "merge_commit_message": "PR_TITLE",
      "merge_commit_title": "MERGE_MESSAGE",
      "name": "browser",
      "private": false,
      "secret_scanning": "enabled",
      "secret_scanning_push_protection": "enabled",
      "squash_merge_commit_message": "COMMIT_MESSAGES",
      "squash_merge_commit_title": "COMMIT_OR_PR_TITLE",
      "template_repository": null,
      "topics": [],
      "web_commit_signoff_required": false,
      "webhooks": [],
      "default_branch_protection": "protected"
    },
    {
      "allow_auto_merge": false,
      "allow_forking": true,
      "allow_merge_commit": false,
      "allow_rebase_merge": true,
      "allow_squash_merge": true,
      "allow_update_branch": false,
      "archived": false,
      "auto_init": true,
      "branch_protection_rules": [
        {
          "allows_deletions": false,
          "allows_force_pushes": false,
          "blocks_creations": false,
          "bypass_force_push_allowances": [],
          "bypass_pull_request_allowances": [],
          "dismisses_stale_reviews": false,
          "is_admin_enforced": false,
          "lock_allows_fetch_and_merge": false,
          "lock_branch": false,
          "pattern": "main",
          "push_restrictions": [],
          "require_last_push_approval": false,
          "required_approving_review_count": 0,
          "required_deployment_environments": [],
          "required_status_checks": [
            "eclipse-eca-validation:eclipsefdn/eca"
          ],
          "requires_code_owner_reviews": false,
          "requires_commit_signatures": false,
          "requires_conversation_resolution": false,
          "requires_deployments": false,
          "requires_linear_history": false,
          "requires_pull_request": true,
          "requires_status_checks": true,
          "requires_strict_status_checks": false,
          "restricts_pushes": false,
          "restricts_review_dismissals": false,
          "review_dismissal_allowances": []
        }
      ],
      "default_branch": "main",
      "delete_branch_on_merge": true,
      "dependabot_alerts_enabled": true,
      "dependabot_security_updates_enabled": false,
      "description": null,
      "environments": [],
      "gh_pages_build_type": "disabled",
      "gh_pages_source_branch": null,
      "gh_pages_source_path": null,
      "has_discussions": false,
      "has_issues": false,
      "has_projects": true,
      "has_wiki": false,
      "homepage": null,
      "is_template": false,
      "merge_commit_message": "PR_TITLE",
      "merge_commit_title": "MERGE_MESSAGE",
      "name": "build",
      "private": false,
      "secret_scanning": "enabled",
      "secret_scanning_push_protection": "enabled",
      "squash_merge_commit_message": "COMMIT_MESSAGES",
      "squash_merge_commit_title": "COMMIT_OR_PR_TITLE",
      "template_repository": null,
      "topics": [],
      "web_commit_signoff_required": false,
      "webhooks": [],
      "default_branch_protection": "protected"
    },
    {
      "allow_auto_merge": false,
      "allow_forking": true,
      "allow_merge_commit": false,
      "allow_rebase_merge": true,
      "allow_squash_merge": true,
      "allow_update_branch": false,
      "archived": false,
      "auto_init": true,
      "branch_protection_rules": [
        {
          "allows_deletions": false,
          "allows_force_pushes": false,
          "blocks_creations": false,
          "bypass_force_push_allowances": [],
          "bypass_pull_request_allowances": [],
          "dismisses_stale_reviews": false,
          "is_admin_enforced": false,
          "lock_allows_fetch_and_merge": false,
          "lock_branch": false,
          "pattern": "main",
          "push_restrictions": [],
          "require_last_push_approval": false,
          "required_approving_review_count": 0,
          "required_deployment_environments": [],
          "required_status_checks": [
            "eclipse-eca-validation:eclipsefdn/eca"
          ],
          "requires_code_owner_reviews": false,
          "requires_commit_signatures": false,
          "requires_conversation_resolution": false,
          "requires_deployments": false,
          "requires_linear_history": false,
          "requires_pull_request": true,
          "requires_status_checks": true,
          "requires_strict_status_checks": false,
          "restricts_pushes": false,
          "restricts_review_dismissals": false,
          "review_dismissal_allowances": []
        },
        {
          "allows_deletions": false,
          "allows_force_pushes": false,
          "blocks_creations": false,
          "bypass_force_push_allowances": [],
          "bypass_pull_request_allowances": [],
          "dismisses_stale_reviews": false,
          "is_admin_enforced": false,
          "lock_allows_fetch_and_merge": false,
          "lock_branch": false,
          "pattern": "release/*",
          "push_restrictions": [],
          "require_last_push_approval": false,
          "required_approving_review_count": 0,
          "required_deployment_environments": [],
          "required_status_checks": [
            "eclipse-eca-validation:eclipsefdn/eca"
          ],
          "requires_code_owner_reviews": false,
          "requires_commit_signatures": false,
          "requires_conversation_resolution": false,
          "requires_deployments": false,
          "requires_linear_history": false,
          "requires_pull_request": true,
          "requires_status_checks": true,
          "requires_strict_status_checks": false,
          "restricts_pushes": false,
          "restricts_review_dismissals": false,
          "review_dismissal_allowances": []
        }
      ],
      "default_branch": "main",
      "delete_branch_on_merge": true,
      "dependabot_alerts_enabled": true,
      "dependabot_security_updates_enabled": false,
      "description": null,
      "environments": [],
      "gh_pages_build_type": "disabled",
      "gh_pages_source_branch": null,
      "gh_pages_source_path": null,
      "has_discussions": false,
      "has_issues": false,
      "has_projects": true,
      "has_wiki": false,
      "homepage": null,
      "is_template": false,
      "merge_commit_message": "PR_TITLE",
      "merge_commit_title": "MERGE_MESSAGE",
      "name": "model",
      "private": false,
      "secret_scanning": "enabled",
      "secret_scanning_push_protection": "enabled",
      "squash_merge_commit_message": "COMMIT_MESSAGES",
      "squash_merge_commit_title": "COMMIT_OR_PR_TITLE",
      "template_repository": null,
      "topics": [],
      "web_commit_signoff_required": false,
      "webhooks": [],
      "default_branch_protection": "protected"
    },
    {
      "allow_auto_merge": false,
      "allow_forking": true,
      "allow_merge_commit": false,
      "allow_rebase_merge": true,
      "allow_squash_merge": true,
      "allow_update_branch": false,
      "archived": false,
      "auto_init": true,
      "branch_protection_rules": [
        {
          "allows_deletions": false,
          "allows_force_pushes": false,
          "blocks_creations": false,
          "bypass_force_push_allowances": [],
          "bypass_pull_request_allowances": [],
          "dismisses_stale_reviews": false,
          "is_admin_enforced": false,
          "lock_allows_fetch_and_merge": false,
          "lock_branch": false,
          "pattern": "main",
          "push_restrictions": [],
          "require_last_push_approval": false,
          "required_approving_review_count": 0,
          "required_deployment_environments": [],
          "required_status_checks": [
            "eclipse-eca-validation:eclipsefdn/eca"
          ],
          "requires_code_owner_reviews": false,
          "requires_commit_signatures": false,
          "requires_conversation_resolution": false,
          "requires_deployments": false,
          "requires_linear_history": false,
          "requires_pull_request": true,
          "requires_status_checks": true,
          "requires_strict_status_checks": false,
          "restricts_pushes": false,
          "restricts_review_dismissals": false,
          "review_dismissal_allowances": []
        },
        {
          "allows_deletions": false,
          "allows_force_pushes": false,
          "blocks_creations": false,
          "bypass_force_push_allowances": [],
          "bypass_pull_request_allowances": [],
          "dismisses_stale_reviews": false,
          "is_admin_enforced": false,
          "lock_allows_fetch_and_merge": false,
          "lock_branch": false,
          "pattern": "release/*",
          "push_restrictions": [],
          "require_last_push_approval": false,
          "required_approving_review_count": 0,
          "required_deployment_environments": [],
          "required_status_checks": [
            "eclipse-eca-validation:eclipsefdn/eca"
          ],
          "requires_code_owner_reviews": false,
          "requires_commit_signatures": false,
          "requires_conversation_resolution": false,
          "requires_deployments": false,
          "requires_linear_history": false,
          "requires_pull_request": true,
          "requires_status_checks": true,
          "requires_strict_status_checks": false,
          "restricts_pushes": false,
          "restricts_review_dismissals": false,
          "review_dismissal_allowances": []
        }
      ],
      "default_branch": "main",
      "delete_branch_on_merge": true,
      "dependabot_alerts_enabled": true,
      "dependabot_security_updates_enabled": false,
      "description": null,
      "environments": [],
      "gh_pages_build_type": "disabled",
      "gh_pages_source_branch": null,
      "gh_pages_source_path": null,
      "has_discussions": false,
      "has_issues": true,
      "has_projects": true,
      "has_wiki": false,
      "homepage": null,
      "is_template": false,
      "merge_commit_message": "PR_TITLE",
      "merge_commit_title": "MERGE_MESSAGE",
      "name": "set",
      "private": false,
      "secret_scanning": "enabled",
      "secret_scanning_push_protection": "enabled",
      "squash_merge_commit_message": "COMMIT_MESSAGES",
      "squash_merge_commit_title": "COMMIT_OR_PR_TITLE",
      "template_repository": null,
      "topics": [],
      "web_commit_signoff_required": false,
      "webhooks": [],
      "default_branch_protection": "protected"
    },
    {
      "allow_auto_merge": false,
      "allow_forking": true,
      "allow_merge_commit": false,
      "allow_rebase_merge": true,
      "allow_squash_merge": true,
      "allow_update_branch": false,
      "archived": false,
      "auto_init": true,
      "branch_protection_rules": [
        {
          "allows_deletions": false,
          "allows_force_pushes": false,
          "blocks_creations": false,
          "bypass_force_push_allowances": [],
          "bypass_pull_request_allowances": [],
          "dismisses_stale_reviews": false,
          "is_admin_enforced": false,
          "lock_allows_fetch_and_merge": false,
          "lock_branch": false,
          "pattern": "main",
          "push_restrictions": [],
          "require_last_push_approval": false,
          "required_approving_review_count": 0,
          "required_deployment_environments": [],
          "required_status_checks": [
            "eclipse-eca-validation:eclipsefdn/eca"
          ],
          "requires_code_owner_reviews": false,
          "requires_commit_signatures": false,
          "requires_conversation_resolution": false,
          "requires_deployments": false,
          "requires_linear_history": false,
          "requires_pull_request": true,
          "requires_status_checks": true,
          "requires_strict_status_checks": false,
          "restricts_pushes": false,
          "restricts_review_dismissals": false,
          "review_dismissal_allowances": []
        },
        {
          "allows_deletions": false,
          "allows_force_pushes": false,
          "blocks_creations": false,
          "bypass_force_push_allowances": [],
          "bypass_pull_request_allowances": [],
          "dismisses_stale_reviews": false,
          "is_admin_enforced": false,
          "lock_allows_fetch_and_merge": false,
          "lock_branch": false,
          "pattern": "release/*",
          "push_restrictions": [],
          "require_last_push_approval": false,
          "required_approving_review_count": 0,
          "required_deployment_environments": [],
          "required_status_checks": [
            "eclipse-eca-validation:eclipsefdn/eca"
          ],
          "requires_code_owner_reviews": false,
          "requires_commit_signatures": false,
          "requires_conversation_resolution": false,
          "requires_deployments": false,
          "requires_linear_history": false,
          "requires_pull_request": true,
          "requires_status_checks": true,
          "requires_strict_status_checks": false,
          "restricts_pushes": false,
          "restricts_review_dismissals": false,
          "review_dismissal_allowances": []
        }
      ],
      "default_branch": "main",
      "delete_branch_on_merge": true,
      "dependabot_alerts_enabled": true,
      "dependabot_security_updates_enabled": false,
      "description": null,
      "environments": [],
      "gh_pages_build_type": "disabled",
      "gh_pages_source_branch": null,
      "gh_pages_source_path": null,
      "has_discussions": false,
      "has_issues": false,
      "has_projects": true,
      "has_wiki": false,
      "homepage": null,
      "is_template": false,
      "merge_commit_message": "PR_TITLE",
      "merge_commit_title": "MERGE_MESSAGE",
      "name": "toolboxmodel",
      "private": false,
      "secret_scanning": "enabled",
      "secret_scanning_push_protection": "enabled",
      "squash_merge_commit_message": "COMMIT_MESSAGES",
      "squash_merge_commit_title": "COMMIT_OR_PR_TITLE",
      "template_repository": null,
      "topics": [],
      "web_commit_signoff_required": false,
      "webhooks": [],
      "default_branch_protection": "protected"
    }
  ],
  "secrets": [
    {
      "name": "GH_BOT_TOKEN",
      "selected_repositories": [],
      "value": "pass:bots/technology.set/github.com/api-token",
      "visibility": "public"
    },
    {
      "name": "GH_BOT_USERNAME",
      "selected_repositories": [],
      "value": "pass:bots/technology.set/github.com/username",
      "visibility": "public"
    },
    {
      "name": "GITLAB_API_TOKEN",
      "selected_repositories": [],
      "value": "pass:bots/technology.set/gitlab.eclipse.org/api-token",
      "visibility": "public"
    }
  ],
  "settings": {
    "billing_email": "webmaster@eclipse-foundation.org",
    "blog": null,
    "company": null,
    "default_branch_name": "main",
    "default_repository_permission": "none",
    "dependabot_alerts_enabled_for_new_repositories": true,
    "dependabot_security_updates_enabled_for_new_repositories": false,
    "dependency_graph_enabled_for_new_repositories": true,
    "description": "",
    "discussion_source_repository": null,
    "email": null,
    "has_discussions": false,
    "has_organization_projects": true,
    "has_repository_projects": true,
    "location": null,
    "members_can_change_project_visibility": true,
    "members_can_change_repo_visibility": false,
    "members_can_create_private_repositories": false,
    "members_can_create_public_pages": true,
    "members_can_create_public_repositories": false,
    "members_can_create_teams": false,
    "members_can_delete_issues": false,
    "members_can_delete_repositories": false,
    "members_can_fork_private_repositories": false,
    "name": "Eclipse SET",
    "packages_containers_internal": false,
    "packages_containers_public": true,
    "plan": "free",
    "readers_can_create_discussions": true,
    "security_managers": [
      "eclipsefdn-security"
    ],
    "twitter_username": null,
    "two_factor_requirement": true,
    "web_commit_signoff_required": false,
    "workflows": {
      "actions_can_approve_pull_request_reviews": false,
      "allow_action_patterns": [],
      "allow_github_owned_actions": true,
      "allow_verified_creator_actions": true,
      "allowed_actions": "all",
      "default_workflow_permissions": "read",
      "enabled_repositories": "all",
      "selected_repositories": []
    }
  },
  "webhooks": [],
  "@timestamp": "2023-09-23T11:26:50Z",
  "sha_commit": "5101898646d47e51e718f8d8c4c2966dbd93008d"
}