{
  "github_id": "eclipse-cbi",
  "repositories": [
    {
      "allow_auto_merge": false,
      "allow_forking": true,
      "allow_merge_commit": false,
      "allow_rebase_merge": true,
      "allow_squash_merge": true,
      "allow_update_branch": true,
      "archived": false,
      "auto_init": true,
      "branch_protection_rules": [
        {
          "allows_deletions": false,
          "allows_force_pushes": false,
          "blocks_creations": false,
          "bypass_force_push_allowances": [],
          "bypass_pull_request_allowances": [
            "@eclipse-cbi/eclipsefdn-releng",
            "@eclipse-cbi/eclipsefdn-security"
          ],
          "dismisses_stale_reviews": false,
          "is_admin_enforced": false,
          "lock_allows_fetch_and_merge": false,
          "lock_branch": false,
          "pattern": "main",
          "push_restrictions": [],
          "require_last_push_approval": false,
          "required_approving_review_count": 1,
          "required_deployment_environments": [],
          "required_status_checks": [],
          "requires_code_owner_reviews": true,
          "requires_commit_signatures": false,
          "requires_conversation_resolution": false,
          "requires_deployments": false,
          "requires_linear_history": false,
          "requires_pull_request": true,
          "requires_status_checks": false,
          "requires_strict_status_checks": false,
          "restricts_pushes": false,
          "restricts_review_dismissals": false,
          "review_dismissal_allowances": []
        }
      ],
      "default_branch": "main",
      "delete_branch_on_merge": true,
      "dependabot_alerts_enabled": true,
      "dependabot_security_updates_enabled": false,
      "description": "Repository to host configurations related to the Eclipse Foundation.",
      "environments": [
        {
          "branch_policies": [
            "main"
          ],
          "deployment_branch_policy": "selected",
          "name": "github-pages",
          "reviewers": [],
          "wait_timer": 0
        }
      ],
      "gh_pages_build_type": "workflow",
      "gh_pages_source_branch": null,
      "gh_pages_source_path": null,
      "has_discussions": false,
      "has_issues": true,
      "has_projects": false,
      "has_wiki": false,
      "homepage": "https://eclipse-cbi.github.io/.eclipsefdn/",
      "is_template": false,
      "merge_commit_message": "PR_TITLE",
      "merge_commit_title": "MERGE_MESSAGE",
      "name": ".eclipsefdn",
      "post_process_template_content": [
        ".github/CODEOWNERS",
        "README.md",
        "mkdocs.yml"
      ],
      "private": false,
      "secret_scanning": "enabled",
      "secret_scanning_push_protection": "enabled",
      "squash_merge_commit_message": "COMMIT_MESSAGES",
      "squash_merge_commit_title": "COMMIT_OR_PR_TITLE",
      "template_repository": "EclipseFdn/.eclipsefdn-template",
      "topics": [],
      "web_commit_signoff_required": true,
      "webhooks": [],
      "default_branch_protection": "protected"
    },
    {
      "allow_auto_merge": false,
      "allow_forking": true,
      "allow_merge_commit": true,
      "allow_rebase_merge": true,
      "allow_squash_merge": true,
      "allow_update_branch": false,
      "archived": false,
      "auto_init": true,
      "branch_protection_rules": [
        {
          "allows_deletions": false,
          "allows_force_pushes": false,
          "blocks_creations": false,
          "bypass_force_push_allowances": [],
          "bypass_pull_request_allowances": [],
          "dismisses_stale_reviews": false,
          "is_admin_enforced": false,
          "lock_allows_fetch_and_merge": false,
          "lock_branch": false,
          "pattern": "master",
          "push_restrictions": [],
          "require_last_push_approval": false,
          "required_approving_review_count": null,
          "required_deployment_environments": [],
          "required_status_checks": [
            "eclipse-eca-validation:eclipsefdn/eca"
          ],
          "requires_code_owner_reviews": false,
          "requires_commit_signatures": false,
          "requires_conversation_resolution": false,
          "requires_deployments": false,
          "requires_linear_history": false,
          "requires_pull_request": false,
          "requires_status_checks": false,
          "requires_strict_status_checks": false,
          "restricts_pushes": false,
          "restricts_review_dismissals": false,
          "review_dismissal_allowances": []
        }
      ],
      "default_branch": "master",
      "delete_branch_on_merge": false,
      "dependabot_alerts_enabled": true,
      "dependabot_security_updates_enabled": true,
      "description": "Global configurations for the eclipse-cbi GitHub organization",
      "environments": [],
      "gh_pages_build_type": "disabled",
      "gh_pages_source_branch": null,
      "gh_pages_source_path": null,
      "has_discussions": false,
      "has_issues": true,
      "has_projects": true,
      "has_wiki": true,
      "homepage": null,
      "is_template": false,
      "merge_commit_message": "PR_TITLE",
      "merge_commit_title": "MERGE_MESSAGE",
      "name": ".github",
      "private": false,
      "secret_scanning": "enabled",
      "secret_scanning_push_protection": "enabled",
      "squash_merge_commit_message": "COMMIT_MESSAGES",
      "squash_merge_commit_title": "COMMIT_OR_PR_TITLE",
      "template_repository": null,
      "topics": [],
      "web_commit_signoff_required": true,
      "webhooks": [],
      "default_branch_protection": "protected"
    },
    {
      "allow_auto_merge": false,
      "allow_forking": true,
      "allow_merge_commit": true,
      "allow_rebase_merge": true,
      "allow_squash_merge": true,
      "allow_update_branch": false,
      "archived": false,
      "auto_init": true,
      "branch_protection_rules": [
        {
          "allows_deletions": false,
          "allows_force_pushes": false,
          "blocks_creations": false,
          "bypass_force_push_allowances": [],
          "bypass_pull_request_allowances": [],
          "dismisses_stale_reviews": false,
          "is_admin_enforced": false,
          "lock_allows_fetch_and_merge": false,
          "lock_branch": false,
          "pattern": "main",
          "push_restrictions": [],
          "require_last_push_approval": false,
          "required_approving_review_count": null,
          "required_deployment_environments": [],
          "required_status_checks": [
            "eclipse-eca-validation:eclipsefdn/eca"
          ],
          "requires_code_owner_reviews": false,
          "requires_commit_signatures": false,
          "requires_conversation_resolution": false,
          "requires_deployments": false,
          "requires_linear_history": false,
          "requires_pull_request": false,
          "requires_status_checks": false,
          "requires_strict_status_checks": false,
          "restricts_pushes": false,
          "restricts_review_dismissals": false,
          "review_dismissal_allowances": []
        }
      ],
      "default_branch": "main",
      "delete_branch_on_merge": false,
      "dependabot_alerts_enabled": true,
      "dependabot_security_updates_enabled": true,
      "description": "Ansible playbooks for CBI",
      "environments": [],
      "gh_pages_build_type": "disabled",
      "gh_pages_source_branch": null,
      "gh_pages_source_path": null,
      "has_discussions": false,
      "has_issues": true,
      "has_projects": true,
      "has_wiki": true,
      "homepage": null,
      "is_template": false,
      "merge_commit_message": "PR_TITLE",
      "merge_commit_title": "MERGE_MESSAGE",
      "name": "ansible-playbooks",
      "private": false,
      "secret_scanning": "enabled",
      "secret_scanning_push_protection": "enabled",
      "squash_merge_commit_message": "COMMIT_MESSAGES",
      "squash_merge_commit_title": "COMMIT_OR_PR_TITLE",
      "template_repository": null,
      "topics": [],
      "web_commit_signoff_required": true,
      "webhooks": [],
      "default_branch_protection": "protected"
    },
    {
      "allow_auto_merge": false,
      "allow_forking": true,
      "allow_merge_commit": true,
      "allow_rebase_merge": true,
      "allow_squash_merge": true,
      "allow_update_branch": false,
      "archived": false,
      "auto_init": true,
      "branch_protection_rules": [
        {
          "allows_deletions": false,
          "allows_force_pushes": false,
          "blocks_creations": false,
          "bypass_force_push_allowances": [],
          "bypass_pull_request_allowances": [],
          "dismisses_stale_reviews": false,
          "is_admin_enforced": false,
          "lock_allows_fetch_and_merge": false,
          "lock_branch": false,
          "pattern": "main",
          "push_restrictions": [],
          "require_last_push_approval": false,
          "required_approving_review_count": null,
          "required_deployment_environments": [],
          "required_status_checks": [
            "eclipse-eca-validation:eclipsefdn/eca"
          ],
          "requires_code_owner_reviews": false,
          "requires_commit_signatures": false,
          "requires_conversation_resolution": false,
          "requires_deployments": false,
          "requires_linear_history": false,
          "requires_pull_request": false,
          "requires_status_checks": false,
          "requires_strict_status_checks": false,
          "restricts_pushes": false,
          "restricts_review_dismissals": false,
          "review_dismissal_allowances": []
        }
      ],
      "default_branch": "main",
      "delete_branch_on_merge": false,
      "dependabot_alerts_enabled": true,
      "dependabot_security_updates_enabled": true,
      "description": "Collection of best practices for Common Build Infrastructure",
      "environments": [],
      "gh_pages_build_type": "disabled",
      "gh_pages_source_branch": null,
      "gh_pages_source_path": null,
      "has_discussions": false,
      "has_issues": true,
      "has_projects": true,
      "has_wiki": true,
      "homepage": null,
      "is_template": false,
      "merge_commit_message": "PR_TITLE",
      "merge_commit_title": "MERGE_MESSAGE",
      "name": "best-practices",
      "private": false,
      "secret_scanning": "enabled",
      "secret_scanning_push_protection": "enabled",
      "squash_merge_commit_message": "COMMIT_MESSAGES",
      "squash_merge_commit_title": "COMMIT_OR_PR_TITLE",
      "template_repository": null,
      "topics": [],
      "web_commit_signoff_required": true,
      "webhooks": [],
      "default_branch_protection": "protected"
    },
    {
      "allow_auto_merge": false,
      "allow_forking": true,
      "allow_merge_commit": true,
      "allow_rebase_merge": true,
      "allow_squash_merge": true,
      "allow_update_branch": false,
      "archived": false,
      "auto_init": true,
      "branch_protection_rules": [
        {
          "allows_deletions": false,
          "allows_force_pushes": false,
          "blocks_creations": false,
          "bypass_force_push_allowances": [],
          "bypass_pull_request_allowances": [],
          "dismisses_stale_reviews": false,
          "is_admin_enforced": false,
          "lock_allows_fetch_and_merge": false,
          "lock_branch": false,
          "pattern": "main",
          "push_restrictions": [],
          "require_last_push_approval": false,
          "required_approving_review_count": null,
          "required_deployment_environments": [],
          "required_status_checks": [
            "eclipse-eca-validation:eclipsefdn/eca"
          ],
          "requires_code_owner_reviews": false,
          "requires_commit_signatures": false,
          "requires_conversation_resolution": false,
          "requires_deployments": false,
          "requires_linear_history": false,
          "requires_pull_request": false,
          "requires_status_checks": false,
          "requires_strict_status_checks": false,
          "restricts_pushes": false,
          "restricts_review_dismissals": false,
          "review_dismissal_allowances": []
        }
      ],
      "default_branch": "main",
      "delete_branch_on_merge": false,
      "dependabot_alerts_enabled": true,
      "dependabot_security_updates_enabled": true,
      "description": null,
      "environments": [],
      "gh_pages_build_type": "disabled",
      "gh_pages_source_branch": null,
      "gh_pages_source_path": null,
      "has_discussions": false,
      "has_issues": true,
      "has_projects": true,
      "has_wiki": true,
      "homepage": null,
      "is_template": false,
      "merge_commit_message": "PR_TITLE",
      "merge_commit_title": "MERGE_MESSAGE",
      "name": "buildkitd-okd",
      "private": false,
      "secret_scanning": "enabled",
      "secret_scanning_push_protection": "enabled",
      "squash_merge_commit_message": "COMMIT_MESSAGES",
      "squash_merge_commit_title": "COMMIT_OR_PR_TITLE",
      "template_repository": null,
      "topics": [],
      "web_commit_signoff_required": true,
      "webhooks": [],
      "default_branch_protection": "protected"
    },
    {
      "allow_auto_merge": false,
      "allow_forking": true,
      "allow_merge_commit": false,
      "allow_rebase_merge": true,
      "allow_squash_merge": false,
      "allow_update_branch": false,
      "archived": false,
      "auto_init": true,
      "branch_protection_rules": [
        {
          "allows_deletions": false,
          "allows_force_pushes": false,
          "blocks_creations": false,
          "bypass_force_push_allowances": [],
          "bypass_pull_request_allowances": [],
          "dismisses_stale_reviews": false,
          "is_admin_enforced": false,
          "lock_allows_fetch_and_merge": false,
          "lock_branch": false,
          "pattern": "master",
          "push_restrictions": [],
          "require_last_push_approval": false,
          "required_approving_review_count": null,
          "required_deployment_environments": [],
          "required_status_checks": [
            "eclipse-eca-validation:eclipsefdn/eca"
          ],
          "requires_code_owner_reviews": false,
          "requires_commit_signatures": false,
          "requires_conversation_resolution": false,
          "requires_deployments": false,
          "requires_linear_history": false,
          "requires_pull_request": false,
          "requires_status_checks": false,
          "requires_strict_status_checks": false,
          "restricts_pushes": false,
          "restricts_review_dismissals": false,
          "review_dismissal_allowances": []
        }
      ],
      "default_branch": "master",
      "delete_branch_on_merge": false,
      "dependabot_alerts_enabled": true,
      "dependabot_security_updates_enabled": true,
      "description": null,
      "environments": [],
      "gh_pages_build_type": "disabled",
      "gh_pages_source_branch": null,
      "gh_pages_source_path": null,
      "has_discussions": false,
      "has_issues": true,
      "has_projects": true,
      "has_wiki": true,
      "homepage": null,
      "is_template": false,
      "merge_commit_message": "PR_TITLE",
      "merge_commit_title": "MERGE_MESSAGE",
      "name": "ci-admin",
      "private": false,
      "secret_scanning": "enabled",
      "secret_scanning_push_protection": "enabled",
      "squash_merge_commit_message": "COMMIT_MESSAGES",
      "squash_merge_commit_title": "COMMIT_OR_PR_TITLE",
      "template_repository": null,
      "topics": [],
      "web_commit_signoff_required": true,
      "webhooks": [],
      "default_branch_protection": "protected"
    },
    {
      "allow_auto_merge": false,
      "allow_forking": true,
      "allow_merge_commit": true,
      "allow_rebase_merge": true,
      "allow_squash_merge": true,
      "allow_update_branch": false,
      "archived": false,
      "auto_init": true,
      "branch_protection_rules": [
        {
          "allows_deletions": false,
          "allows_force_pushes": false,
          "blocks_creations": false,
          "bypass_force_push_allowances": [],
          "bypass_pull_request_allowances": [],
          "dismisses_stale_reviews": false,
          "is_admin_enforced": false,
          "lock_allows_fetch_and_merge": false,
          "lock_branch": false,
          "pattern": "master",
          "push_restrictions": [],
          "require_last_push_approval": false,
          "required_approving_review_count": null,
          "required_deployment_environments": [],
          "required_status_checks": [
            "eclipse-eca-validation:eclipsefdn/eca"
          ],
          "requires_code_owner_reviews": false,
          "requires_commit_signatures": false,
          "requires_conversation_resolution": false,
          "requires_deployments": false,
          "requires_linear_history": false,
          "requires_pull_request": false,
          "requires_status_checks": false,
          "requires_strict_status_checks": false,
          "restricts_pushes": false,
          "restricts_review_dismissals": false,
          "review_dismissal_allowances": []
        }
      ],
      "default_branch": "master",
      "delete_branch_on_merge": false,
      "dependabot_alerts_enabled": true,
      "dependabot_security_updates_enabled": true,
      "description": "Various Dockerfiles for building stuff @ Eclipse",
      "environments": [],
      "gh_pages_build_type": "disabled",
      "gh_pages_source_branch": null,
      "gh_pages_source_path": null,
      "has_discussions": false,
      "has_issues": true,
      "has_projects": true,
      "has_wiki": true,
      "homepage": null,
      "is_template": false,
      "merge_commit_message": "PR_TITLE",
      "merge_commit_title": "MERGE_MESSAGE",
      "name": "dockerfiles",
      "private": false,
      "secret_scanning": "enabled",
      "secret_scanning_push_protection": "enabled",
      "squash_merge_commit_message": "COMMIT_MESSAGES",
      "squash_merge_commit_title": "COMMIT_OR_PR_TITLE",
      "template_repository": null,
      "topics": [],
      "web_commit_signoff_required": true,
      "webhooks": [
        {
          "active": true,
          "content_type": "json",
          "events": [
            "create",
            "delete",
            "push"
          ],
          "insecure_ssl": "0",
          "secret": "********",
          "url": "https://ci.eclipse.org/cbi/github-webhook/"
        }
      ],
      "default_branch_protection": "protected"
    },
    {
      "allow_auto_merge": false,
      "allow_forking": true,
      "allow_merge_commit": true,
      "allow_rebase_merge": true,
      "allow_squash_merge": true,
      "allow_update_branch": false,
      "archived": false,
      "auto_init": true,
      "branch_protection_rules": [
        {
          "allows_deletions": false,
          "allows_force_pushes": false,
          "blocks_creations": false,
          "bypass_force_push_allowances": [],
          "bypass_pull_request_allowances": [],
          "dismisses_stale_reviews": false,
          "is_admin_enforced": false,
          "lock_allows_fetch_and_merge": false,
          "lock_branch": false,
          "pattern": "master",
          "push_restrictions": [],
          "require_last_push_approval": false,
          "required_approving_review_count": null,
          "required_deployment_environments": [],
          "required_status_checks": [
            "eclipse-eca-validation:eclipsefdn/eca"
          ],
          "requires_code_owner_reviews": false,
          "requires_commit_signatures": false,
          "requires_conversation_resolution": false,
          "requires_deployments": false,
          "requires_linear_history": false,
          "requires_pull_request": false,
          "requires_status_checks": false,
          "requires_strict_status_checks": false,
          "restricts_pushes": false,
          "restricts_review_dismissals": false,
          "review_dismissal_allowances": []
        }
      ],
      "default_branch": "master",
      "delete_branch_on_merge": false,
      "dependabot_alerts_enabled": true,
      "dependabot_security_updates_enabled": true,
      "description": null,
      "environments": [],
      "gh_pages_build_type": "disabled",
      "gh_pages_source_branch": null,
      "gh_pages_source_path": null,
      "has_discussions": false,
      "has_issues": true,
      "has_projects": true,
      "has_wiki": true,
      "homepage": null,
      "is_template": false,
      "merge_commit_message": "PR_TITLE",
      "merge_commit_title": "MERGE_MESSAGE",
      "name": "dockertools",
      "private": false,
      "secret_scanning": "enabled",
      "secret_scanning_push_protection": "enabled",
      "squash_merge_commit_message": "COMMIT_MESSAGES",
      "squash_merge_commit_title": "COMMIT_OR_PR_TITLE",
      "template_repository": null,
      "topics": [],
      "web_commit_signoff_required": true,
      "webhooks": [],
      "default_branch_protection": "protected"
    },
    {
      "allow_auto_merge": false,
      "allow_forking": true,
      "allow_merge_commit": true,
      "allow_rebase_merge": true,
      "allow_squash_merge": true,
      "allow_update_branch": false,
      "archived": false,
      "auto_init": true,
      "branch_protection_rules": [
        {
          "allows_deletions": false,
          "allows_force_pushes": false,
          "blocks_creations": false,
          "bypass_force_push_allowances": [],
          "bypass_pull_request_allowances": [],
          "dismisses_stale_reviews": false,
          "is_admin_enforced": false,
          "lock_allows_fetch_and_merge": false,
          "lock_branch": false,
          "pattern": "main",
          "push_restrictions": [],
          "require_last_push_approval": false,
          "required_approving_review_count": null,
          "required_deployment_environments": [],
          "required_status_checks": [
            "eclipse-eca-validation:eclipsefdn/eca"
          ],
          "requires_code_owner_reviews": false,
          "requires_commit_signatures": false,
          "requires_conversation_resolution": false,
          "requires_deployments": false,
          "requires_linear_history": false,
          "requires_pull_request": false,
          "requires_status_checks": false,
          "requires_strict_status_checks": false,
          "restricts_pushes": false,
          "restricts_review_dismissals": false,
          "review_dismissal_allowances": []
        }
      ],
      "default_branch": "main",
      "delete_branch_on_merge": false,
      "dependabot_alerts_enabled": true,
      "dependabot_security_updates_enabled": true,
      "description": "Eclipse CBI Tycho example project",
      "environments": [],
      "gh_pages_build_type": "disabled",
      "gh_pages_source_branch": null,
      "gh_pages_source_path": null,
      "has_discussions": false,
      "has_issues": true,
      "has_projects": true,
      "has_wiki": true,
      "homepage": "",
      "is_template": false,
      "merge_commit_message": "PR_TITLE",
      "merge_commit_title": "MERGE_MESSAGE",
      "name": "eclipse-cbi-tycho-example",
      "private": false,
      "secret_scanning": "enabled",
      "secret_scanning_push_protection": "enabled",
      "squash_merge_commit_message": "COMMIT_MESSAGES",
      "squash_merge_commit_title": "COMMIT_OR_PR_TITLE",
      "template_repository": null,
      "topics": [
        "cbi",
        "eclipse",
        "example",
        "maven",
        "tycho"
      ],
      "web_commit_signoff_required": true,
      "webhooks": [],
      "default_branch_protection": "protected"
    },
    {
      "allow_auto_merge": false,
      "allow_forking": true,
      "allow_merge_commit": true,
      "allow_rebase_merge": true,
      "allow_squash_merge": true,
      "allow_update_branch": false,
      "archived": false,
      "auto_init": true,
      "branch_protection_rules": [
        {
          "allows_deletions": false,
          "allows_force_pushes": false,
          "blocks_creations": false,
          "bypass_force_push_allowances": [],
          "bypass_pull_request_allowances": [],
          "dismisses_stale_reviews": false,
          "is_admin_enforced": false,
          "lock_allows_fetch_and_merge": false,
          "lock_branch": false,
          "pattern": "main",
          "push_restrictions": [],
          "require_last_push_approval": false,
          "required_approving_review_count": null,
          "required_deployment_environments": [],
          "required_status_checks": [
            "eclipse-eca-validation:eclipsefdn/eca"
          ],
          "requires_code_owner_reviews": false,
          "requires_commit_signatures": false,
          "requires_conversation_resolution": false,
          "requires_deployments": false,
          "requires_linear_history": false,
          "requires_pull_request": false,
          "requires_status_checks": false,
          "requires_strict_status_checks": false,
          "restricts_pushes": false,
          "restricts_review_dismissals": false,
          "review_dismissal_allowances": []
        }
      ],
      "default_branch": "main",
      "delete_branch_on_merge": false,
      "dependabot_alerts_enabled": true,
      "dependabot_security_updates_enabled": true,
      "description": null,
      "environments": [],
      "gh_pages_build_type": "disabled",
      "gh_pages_source_branch": null,
      "gh_pages_source_path": null,
      "has_discussions": false,
      "has_issues": true,
      "has_projects": true,
      "has_wiki": true,
      "homepage": null,
      "is_template": false,
      "merge_commit_message": "PR_TITLE",
      "merge_commit_title": "MERGE_MESSAGE",
      "name": "epl-license-feature",
      "private": false,
      "secret_scanning": "enabled",
      "secret_scanning_push_protection": "enabled",
      "squash_merge_commit_message": "COMMIT_MESSAGES",
      "squash_merge_commit_title": "COMMIT_OR_PR_TITLE",
      "template_repository": null,
      "topics": [],
      "web_commit_signoff_required": true,
      "webhooks": [],
      "default_branch_protection": "protected"
    },
    {
      "allow_auto_merge": false,
      "allow_forking": true,
      "allow_merge_commit": false,
      "allow_rebase_merge": true,
      "allow_squash_merge": true,
      "allow_update_branch": true,
      "archived": true,
      "auto_init": true,
      "branch_protection_rules": [],
      "default_branch": "master",
      "delete_branch_on_merge": true,
      "dependabot_alerts_enabled": true,
      "dependabot_security_updates_enabled": false,
      "description": "A tool that converts Hudson config files to make them compatible with Jenkins",
      "environments": [],
      "gh_pages_build_type": "disabled",
      "gh_pages_source_branch": null,
      "gh_pages_source_path": null,
      "has_discussions": false,
      "has_issues": true,
      "has_projects": true,
      "has_wiki": true,
      "homepage": "",
      "is_template": false,
      "merge_commit_message": "PR_TITLE",
      "merge_commit_title": "MERGE_MESSAGE",
      "name": "hipp2jipp",
      "private": false,
      "secret_scanning": "enabled",
      "secret_scanning_push_protection": "enabled",
      "squash_merge_commit_message": "COMMIT_MESSAGES",
      "squash_merge_commit_title": "COMMIT_OR_PR_TITLE",
      "template_repository": null,
      "topics": [
        "cbi",
        "config",
        "conversion",
        "hudson",
        "jenkins",
        "migration"
      ],
      "web_commit_signoff_required": true,
      "webhooks": [
        {
          "active": true,
          "content_type": "form",
          "events": [
            "pull_request",
            "push"
          ],
          "insecure_ssl": "0",
          "secret": null,
          "url": "https://ci.eclipse.org/cbi/github-webhook/"
        }
      ],
      "default_branch_protection": "not_protected"
    },
    {
      "allow_auto_merge": false,
      "allow_forking": true,
      "allow_merge_commit": false,
      "allow_rebase_merge": true,
      "allow_squash_merge": false,
      "allow_update_branch": false,
      "archived": false,
      "auto_init": true,
      "branch_protection_rules": [
        {
          "allows_deletions": false,
          "allows_force_pushes": false,
          "blocks_creations": false,
          "bypass_force_push_allowances": [],
          "bypass_pull_request_allowances": [],
          "dismisses_stale_reviews": false,
          "is_admin_enforced": false,
          "lock_allows_fetch_and_merge": false,
          "lock_branch": false,
          "pattern": "master",
          "push_restrictions": [],
          "require_last_push_approval": false,
          "required_approving_review_count": null,
          "required_deployment_environments": [],
          "required_status_checks": [
            "eclipse-eca-validation:eclipsefdn/eca"
          ],
          "requires_code_owner_reviews": false,
          "requires_commit_signatures": false,
          "requires_conversation_resolution": false,
          "requires_deployments": false,
          "requires_linear_history": false,
          "requires_pull_request": false,
          "requires_status_checks": false,
          "requires_strict_status_checks": false,
          "restricts_pushes": false,
          "restricts_review_dismissals": false,
          "review_dismissal_allowances": []
        }
      ],
      "default_branch": "master",
      "delete_branch_on_merge": true,
      "dependabot_alerts_enabled": true,
      "dependabot_security_updates_enabled": true,
      "description": "Jenkins infrastructure for projects hosted by the Eclipse Foundation",
      "environments": [],
      "gh_pages_build_type": "disabled",
      "gh_pages_source_branch": null,
      "gh_pages_source_path": null,
      "has_discussions": false,
      "has_issues": true,
      "has_projects": true,
      "has_wiki": true,
      "homepage": null,
      "is_template": false,
      "merge_commit_message": "PR_TITLE",
      "merge_commit_title": "MERGE_MESSAGE",
      "name": "jiro",
      "private": false,
      "secret_scanning": "enabled",
      "secret_scanning_push_protection": "enabled",
      "squash_merge_commit_message": "COMMIT_MESSAGES",
      "squash_merge_commit_title": "COMMIT_OR_PR_TITLE",
      "template_repository": null,
      "topics": [],
      "web_commit_signoff_required": true,
      "webhooks": [],
      "default_branch_protection": "protected"
    },
    {
      "allow_auto_merge": false,
      "allow_forking": true,
      "allow_merge_commit": false,
      "allow_rebase_merge": true,
      "allow_squash_merge": false,
      "allow_update_branch": false,
      "archived": false,
      "auto_init": true,
      "branch_protection_rules": [
        {
          "allows_deletions": false,
          "allows_force_pushes": false,
          "blocks_creations": false,
          "bypass_force_push_allowances": [],
          "bypass_pull_request_allowances": [],
          "dismisses_stale_reviews": false,
          "is_admin_enforced": false,
          "lock_allows_fetch_and_merge": false,
          "lock_branch": false,
          "pattern": "master",
          "push_restrictions": [],
          "require_last_push_approval": false,
          "required_approving_review_count": null,
          "required_deployment_environments": [],
          "required_status_checks": [
            "eclipse-eca-validation:eclipsefdn/eca"
          ],
          "requires_code_owner_reviews": false,
          "requires_commit_signatures": false,
          "requires_conversation_resolution": false,
          "requires_deployments": false,
          "requires_linear_history": false,
          "requires_pull_request": false,
          "requires_status_checks": false,
          "requires_strict_status_checks": false,
          "restricts_pushes": false,
          "restricts_review_dismissals": false,
          "review_dismissal_allowances": []
        }
      ],
      "default_branch": "master",
      "delete_branch_on_merge": true,
      "dependabot_alerts_enabled": true,
      "dependabot_security_updates_enabled": true,
      "description": "Jenkins agents for projects hosted by the Eclipse Foundation",
      "environments": [],
      "gh_pages_build_type": "disabled",
      "gh_pages_source_branch": null,
      "gh_pages_source_path": null,
      "has_discussions": false,
      "has_issues": true,
      "has_projects": true,
      "has_wiki": true,
      "homepage": "",
      "is_template": false,
      "merge_commit_message": "PR_TITLE",
      "merge_commit_title": "MERGE_MESSAGE",
      "name": "jiro-agents",
      "private": false,
      "secret_scanning": "enabled",
      "secret_scanning_push_protection": "enabled",
      "squash_merge_commit_message": "COMMIT_MESSAGES",
      "squash_merge_commit_title": "COMMIT_OR_PR_TITLE",
      "template_repository": null,
      "topics": [],
      "web_commit_signoff_required": true,
      "webhooks": [],
      "default_branch_protection": "protected"
    },
    {
      "allow_auto_merge": false,
      "allow_forking": true,
      "allow_merge_commit": true,
      "allow_rebase_merge": true,
      "allow_squash_merge": true,
      "allow_update_branch": false,
      "archived": false,
      "auto_init": true,
      "branch_protection_rules": [
        {
          "allows_deletions": false,
          "allows_force_pushes": false,
          "blocks_creations": false,
          "bypass_force_push_allowances": [],
          "bypass_pull_request_allowances": [],
          "dismisses_stale_reviews": false,
          "is_admin_enforced": false,
          "lock_allows_fetch_and_merge": false,
          "lock_branch": false,
          "pattern": "master",
          "push_restrictions": [],
          "require_last_push_approval": false,
          "required_approving_review_count": null,
          "required_deployment_environments": [],
          "required_status_checks": [
            "eclipse-eca-validation:eclipsefdn/eca"
          ],
          "requires_code_owner_reviews": false,
          "requires_commit_signatures": false,
          "requires_conversation_resolution": false,
          "requires_deployments": false,
          "requires_linear_history": false,
          "requires_pull_request": false,
          "requires_status_checks": false,
          "requires_strict_status_checks": false,
          "restricts_pushes": false,
          "restricts_review_dismissals": false,
          "review_dismissal_allowances": []
        }
      ],
      "default_branch": "master",
      "delete_branch_on_merge": false,
      "dependabot_alerts_enabled": true,
      "dependabot_security_updates_enabled": true,
      "description": null,
      "environments": [],
      "gh_pages_build_type": "disabled",
      "gh_pages_source_branch": null,
      "gh_pages_source_path": null,
      "has_discussions": false,
      "has_issues": true,
      "has_projects": true,
      "has_wiki": true,
      "homepage": null,
      "is_template": false,
      "merge_commit_message": "PR_TITLE",
      "merge_commit_title": "MERGE_MESSAGE",
      "name": "jiro-dashboard",
      "private": false,
      "secret_scanning": "enabled",
      "secret_scanning_push_protection": "enabled",
      "squash_merge_commit_message": "COMMIT_MESSAGES",
      "squash_merge_commit_title": "COMMIT_OR_PR_TITLE",
      "template_repository": null,
      "topics": [],
      "web_commit_signoff_required": true,
      "webhooks": [],
      "default_branch_protection": "protected"
    },
    {
      "allow_auto_merge": false,
      "allow_forking": true,
      "allow_merge_commit": false,
      "allow_rebase_merge": true,
      "allow_squash_merge": false,
      "allow_update_branch": false,
      "archived": false,
      "auto_init": true,
      "branch_protection_rules": [
        {
          "allows_deletions": false,
          "allows_force_pushes": false,
          "blocks_creations": false,
          "bypass_force_push_allowances": [],
          "bypass_pull_request_allowances": [],
          "dismisses_stale_reviews": false,
          "is_admin_enforced": false,
          "lock_allows_fetch_and_merge": false,
          "lock_branch": false,
          "pattern": "master",
          "push_restrictions": [],
          "require_last_push_approval": false,
          "required_approving_review_count": null,
          "required_deployment_environments": [],
          "required_status_checks": [
            "eclipse-eca-validation:eclipsefdn/eca"
          ],
          "requires_code_owner_reviews": false,
          "requires_commit_signatures": false,
          "requires_conversation_resolution": false,
          "requires_deployments": false,
          "requires_linear_history": false,
          "requires_pull_request": false,
          "requires_status_checks": false,
          "requires_strict_status_checks": false,
          "restricts_pushes": false,
          "restricts_review_dismissals": false,
          "review_dismissal_allowances": []
        }
      ],
      "default_branch": "master",
      "delete_branch_on_merge": true,
      "dependabot_alerts_enabled": true,
      "dependabot_security_updates_enabled": true,
      "description": "Jenkins master (base) images for projects hosted by the Eclipse Foundation",
      "environments": [],
      "gh_pages_build_type": "disabled",
      "gh_pages_source_branch": null,
      "gh_pages_source_path": null,
      "has_discussions": false,
      "has_issues": true,
      "has_projects": true,
      "has_wiki": true,
      "homepage": "",
      "is_template": false,
      "merge_commit_message": "PR_TITLE",
      "merge_commit_title": "MERGE_MESSAGE",
      "name": "jiro-masters",
      "private": false,
      "secret_scanning": "enabled",
      "secret_scanning_push_protection": "enabled",
      "squash_merge_commit_message": "COMMIT_MESSAGES",
      "squash_merge_commit_title": "COMMIT_OR_PR_TITLE",
      "template_repository": null,
      "topics": [],
      "web_commit_signoff_required": true,
      "webhooks": [],
      "default_branch_protection": "protected"
    },
    {
      "allow_auto_merge": false,
      "allow_forking": true,
      "allow_merge_commit": true,
      "allow_rebase_merge": true,
      "allow_squash_merge": true,
      "allow_update_branch": false,
      "archived": false,
      "auto_init": true,
      "branch_protection_rules": [
        {
          "allows_deletions": false,
          "allows_force_pushes": false,
          "blocks_creations": false,
          "bypass_force_push_allowances": [],
          "bypass_pull_request_allowances": [],
          "dismisses_stale_reviews": false,
          "is_admin_enforced": false,
          "lock_allows_fetch_and_merge": false,
          "lock_branch": false,
          "pattern": "main",
          "push_restrictions": [],
          "require_last_push_approval": false,
          "required_approving_review_count": null,
          "required_deployment_environments": [],
          "required_status_checks": [
            "eclipse-eca-validation:eclipsefdn/eca"
          ],
          "requires_code_owner_reviews": false,
          "requires_commit_signatures": false,
          "requires_conversation_resolution": false,
          "requires_deployments": false,
          "requires_linear_history": false,
          "requires_pull_request": false,
          "requires_status_checks": false,
          "requires_strict_status_checks": false,
          "restricts_pushes": false,
          "restricts_review_dismissals": false,
          "review_dismissal_allowances": []
        }
      ],
      "default_branch": "main",
      "delete_branch_on_merge": false,
      "dependabot_alerts_enabled": true,
      "dependabot_security_updates_enabled": true,
      "description": null,
      "environments": [],
      "gh_pages_build_type": "disabled",
      "gh_pages_source_branch": null,
      "gh_pages_source_path": null,
      "has_discussions": false,
      "has_issues": true,
      "has_projects": true,
      "has_wiki": true,
      "homepage": null,
      "is_template": false,
      "merge_commit_message": "PR_TITLE",
      "merge_commit_title": "MERGE_MESSAGE",
      "name": "jiro-static-agents",
      "private": false,
      "secret_scanning": "enabled",
      "secret_scanning_push_protection": "enabled",
      "squash_merge_commit_message": "COMMIT_MESSAGES",
      "squash_merge_commit_title": "COMMIT_OR_PR_TITLE",
      "template_repository": null,
      "topics": [],
      "web_commit_signoff_required": true,
      "webhooks": [],
      "default_branch_protection": "protected"
    },
    {
      "allow_auto_merge": false,
      "allow_forking": true,
      "allow_merge_commit": false,
      "allow_rebase_merge": true,
      "allow_squash_merge": false,
      "allow_update_branch": false,
      "archived": false,
      "auto_init": true,
      "branch_protection_rules": [
        {
          "allows_deletions": false,
          "allows_force_pushes": false,
          "blocks_creations": false,
          "bypass_force_push_allowances": [],
          "bypass_pull_request_allowances": [],
          "dismisses_stale_reviews": false,
          "is_admin_enforced": false,
          "lock_allows_fetch_and_merge": false,
          "lock_branch": false,
          "pattern": "main",
          "push_restrictions": [],
          "require_last_push_approval": false,
          "required_approving_review_count": null,
          "required_deployment_environments": [],
          "required_status_checks": [
            "eclipse-eca-validation:eclipsefdn/eca"
          ],
          "requires_code_owner_reviews": false,
          "requires_commit_signatures": false,
          "requires_conversation_resolution": false,
          "requires_deployments": false,
          "requires_linear_history": false,
          "requires_pull_request": false,
          "requires_status_checks": false,
          "requires_strict_status_checks": false,
          "restricts_pushes": false,
          "restricts_review_dismissals": false,
          "review_dismissal_allowances": []
        }
      ],
      "default_branch": "main",
      "delete_branch_on_merge": true,
      "dependabot_alerts_enabled": true,
      "dependabot_security_updates_enabled": true,
      "description": "REST Service to notarize macOS application bundles and DMG",
      "environments": [],
      "gh_pages_build_type": "disabled",
      "gh_pages_source_branch": null,
      "gh_pages_source_path": null,
      "has_discussions": true,
      "has_issues": true,
      "has_projects": true,
      "has_wiki": true,
      "homepage": "",
      "is_template": false,
      "merge_commit_message": "PR_TITLE",
      "merge_commit_title": "MERGE_MESSAGE",
      "name": "macos-notarization-service",
      "private": false,
      "secret_scanning": "enabled",
      "secret_scanning_push_protection": "enabled",
      "squash_merge_commit_message": "COMMIT_MESSAGES",
      "squash_merge_commit_title": "COMMIT_OR_PR_TITLE",
      "template_repository": null,
      "topics": [],
      "web_commit_signoff_required": true,
      "webhooks": [
        {
          "active": true,
          "content_type": "json",
          "events": [
            "create",
            "delete",
            "pull_request",
            "pull_request_review_comment",
            "push"
          ],
          "insecure_ssl": "0",
          "secret": "********",
          "url": "https://ci.eclipse.org/cbi/github-webhook/"
        }
      ],
      "default_branch_protection": "protected"
    },
    {
      "allow_auto_merge": false,
      "allow_forking": true,
      "allow_merge_commit": false,
      "allow_rebase_merge": true,
      "allow_squash_merge": true,
      "allow_update_branch": true,
      "archived": false,
      "auto_init": true,
      "branch_protection_rules": [
        {
          "allows_deletions": false,
          "allows_force_pushes": false,
          "blocks_creations": false,
          "bypass_force_push_allowances": [],
          "bypass_pull_request_allowances": [],
          "dismisses_stale_reviews": false,
          "is_admin_enforced": false,
          "lock_allows_fetch_and_merge": false,
          "lock_branch": false,
          "pattern": "main",
          "push_restrictions": [],
          "require_last_push_approval": false,
          "required_approving_review_count": null,
          "required_deployment_environments": [],
          "required_status_checks": [
            "eclipse-eca-validation:eclipsefdn/eca"
          ],
          "requires_code_owner_reviews": false,
          "requires_commit_signatures": false,
          "requires_conversation_resolution": false,
          "requires_deployments": false,
          "requires_linear_history": false,
          "requires_pull_request": false,
          "requires_status_checks": false,
          "requires_strict_status_checks": false,
          "restricts_pushes": false,
          "restricts_review_dismissals": false,
          "review_dismissal_allowances": []
        }
      ],
      "default_branch": "main",
      "delete_branch_on_merge": true,
      "dependabot_alerts_enabled": true,
      "dependabot_security_updates_enabled": true,
      "description": "CBI Maven plugins and Webservices",
      "environments": [],
      "gh_pages_build_type": "disabled",
      "gh_pages_source_branch": null,
      "gh_pages_source_path": null,
      "has_discussions": false,
      "has_issues": true,
      "has_projects": true,
      "has_wiki": true,
      "homepage": null,
      "is_template": false,
      "merge_commit_message": "PR_TITLE",
      "merge_commit_title": "MERGE_MESSAGE",
      "name": "org.eclipse.cbi",
      "private": false,
      "secret_scanning": "enabled",
      "secret_scanning_push_protection": "enabled",
      "squash_merge_commit_message": "COMMIT_MESSAGES",
      "squash_merge_commit_title": "COMMIT_OR_PR_TITLE",
      "template_repository": null,
      "topics": [],
      "web_commit_signoff_required": true,
      "webhooks": [],
      "default_branch_protection": "protected"
    },
    {
      "allow_auto_merge": false,
      "allow_forking": true,
      "allow_merge_commit": true,
      "allow_rebase_merge": true,
      "allow_squash_merge": true,
      "allow_update_branch": false,
      "archived": false,
      "auto_init": true,
      "branch_protection_rules": [
        {
          "allows_deletions": false,
          "allows_force_pushes": false,
          "blocks_creations": false,
          "bypass_force_push_allowances": [],
          "bypass_pull_request_allowances": [],
          "dismisses_stale_reviews": false,
          "is_admin_enforced": false,
          "lock_allows_fetch_and_merge": false,
          "lock_branch": false,
          "pattern": "main",
          "push_restrictions": [],
          "require_last_push_approval": false,
          "required_approving_review_count": null,
          "required_deployment_environments": [],
          "required_status_checks": [
            "eclipse-eca-validation:eclipsefdn/eca"
          ],
          "requires_code_owner_reviews": false,
          "requires_commit_signatures": false,
          "requires_conversation_resolution": false,
          "requires_deployments": false,
          "requires_linear_history": false,
          "requires_pull_request": false,
          "requires_status_checks": false,
          "requires_strict_status_checks": false,
          "restricts_pushes": false,
          "restricts_review_dismissals": false,
          "review_dismissal_allowances": []
        }
      ],
      "default_branch": "main",
      "delete_branch_on_merge": false,
      "dependabot_alerts_enabled": true,
      "dependabot_security_updates_enabled": true,
      "description": null,
      "environments": [],
      "gh_pages_build_type": "disabled",
      "gh_pages_source_branch": null,
      "gh_pages_source_path": null,
      "has_discussions": false,
      "has_issues": true,
      "has_projects": true,
      "has_wiki": true,
      "homepage": null,
      "is_template": false,
      "merge_commit_message": "PR_TITLE",
      "merge_commit_title": "MERGE_MESSAGE",
      "name": "org.eclipse.cbi-testdata",
      "private": false,
      "secret_scanning": "enabled",
      "secret_scanning_push_protection": "enabled",
      "squash_merge_commit_message": "COMMIT_MESSAGES",
      "squash_merge_commit_title": "COMMIT_OR_PR_TITLE",
      "template_repository": null,
      "topics": [],
      "web_commit_signoff_required": true,
      "webhooks": [],
      "default_branch_protection": "protected"
    },
    {
      "allow_auto_merge": false,
      "allow_forking": true,
      "allow_merge_commit": true,
      "allow_rebase_merge": true,
      "allow_squash_merge": true,
      "allow_update_branch": false,
      "archived": false,
      "auto_init": true,
      "branch_protection_rules": [
        {
          "allows_deletions": false,
          "allows_force_pushes": false,
          "blocks_creations": false,
          "bypass_force_push_allowances": [],
          "bypass_pull_request_allowances": [],
          "dismisses_stale_reviews": false,
          "is_admin_enforced": false,
          "lock_allows_fetch_and_merge": false,
          "lock_branch": false,
          "pattern": "main",
          "push_restrictions": [],
          "require_last_push_approval": false,
          "required_approving_review_count": null,
          "required_deployment_environments": [],
          "required_status_checks": [
            "eclipse-eca-validation:eclipsefdn/eca"
          ],
          "requires_code_owner_reviews": false,
          "requires_commit_signatures": false,
          "requires_conversation_resolution": false,
          "requires_deployments": false,
          "requires_linear_history": false,
          "requires_pull_request": false,
          "requires_status_checks": false,
          "requires_strict_status_checks": false,
          "restricts_pushes": false,
          "restricts_review_dismissals": false,
          "review_dismissal_allowances": []
        }
      ],
      "default_branch": "main",
      "delete_branch_on_merge": false,
      "dependabot_alerts_enabled": true,
      "dependabot_security_updates_enabled": true,
      "description": null,
      "environments": [],
      "gh_pages_build_type": "disabled",
      "gh_pages_source_branch": null,
      "gh_pages_source_path": null,
      "has_discussions": false,
      "has_issues": true,
      "has_projects": true,
      "has_wiki": true,
      "homepage": null,
      "is_template": false,
      "merge_commit_message": "PR_TITLE",
      "merge_commit_title": "MERGE_MESSAGE",
      "name": "p2repo-aggregator",
      "private": false,
      "secret_scanning": "enabled",
      "secret_scanning_push_protection": "enabled",
      "squash_merge_commit_message": "COMMIT_MESSAGES",
      "squash_merge_commit_title": "COMMIT_OR_PR_TITLE",
      "template_repository": null,
      "topics": [],
      "web_commit_signoff_required": true,
      "webhooks": [],
      "default_branch_protection": "protected"
    },
    {
      "allow_auto_merge": false,
      "allow_forking": true,
      "allow_merge_commit": true,
      "allow_rebase_merge": true,
      "allow_squash_merge": true,
      "allow_update_branch": false,
      "archived": false,
      "auto_init": true,
      "branch_protection_rules": [
        {
          "allows_deletions": false,
          "allows_force_pushes": false,
          "blocks_creations": false,
          "bypass_force_push_allowances": [],
          "bypass_pull_request_allowances": [],
          "dismisses_stale_reviews": false,
          "is_admin_enforced": false,
          "lock_allows_fetch_and_merge": false,
          "lock_branch": false,
          "pattern": "main",
          "push_restrictions": [],
          "require_last_push_approval": false,
          "required_approving_review_count": null,
          "required_deployment_environments": [],
          "required_status_checks": [
            "eclipse-eca-validation:eclipsefdn/eca"
          ],
          "requires_code_owner_reviews": false,
          "requires_commit_signatures": false,
          "requires_conversation_resolution": false,
          "requires_deployments": false,
          "requires_linear_history": false,
          "requires_pull_request": false,
          "requires_status_checks": false,
          "requires_strict_status_checks": false,
          "restricts_pushes": false,
          "restricts_review_dismissals": false,
          "review_dismissal_allowances": []
        }
      ],
      "default_branch": "main",
      "delete_branch_on_merge": false,
      "dependabot_alerts_enabled": true,
      "dependabot_security_updates_enabled": true,
      "description": null,
      "environments": [],
      "gh_pages_build_type": "disabled",
      "gh_pages_source_branch": null,
      "gh_pages_source_path": null,
      "has_discussions": false,
      "has_issues": true,
      "has_projects": true,
      "has_wiki": true,
      "homepage": null,
      "is_template": false,
      "merge_commit_message": "PR_TITLE",
      "merge_commit_title": "MERGE_MESSAGE",
      "name": "p2repo-analyzers",
      "private": false,
      "secret_scanning": "enabled",
      "secret_scanning_push_protection": "enabled",
      "squash_merge_commit_message": "COMMIT_MESSAGES",
      "squash_merge_commit_title": "COMMIT_OR_PR_TITLE",
      "template_repository": null,
      "topics": [],
      "web_commit_signoff_required": true,
      "webhooks": [],
      "default_branch_protection": "protected"
    },
    {
      "allow_auto_merge": false,
      "allow_forking": true,
      "allow_merge_commit": true,
      "allow_rebase_merge": true,
      "allow_squash_merge": true,
      "allow_update_branch": false,
      "archived": false,
      "auto_init": true,
      "branch_protection_rules": [
        {
          "allows_deletions": false,
          "allows_force_pushes": false,
          "blocks_creations": false,
          "bypass_force_push_allowances": [],
          "bypass_pull_request_allowances": [],
          "dismisses_stale_reviews": false,
          "is_admin_enforced": false,
          "lock_allows_fetch_and_merge": false,
          "lock_branch": false,
          "pattern": "master",
          "push_restrictions": [],
          "require_last_push_approval": false,
          "required_approving_review_count": null,
          "required_deployment_environments": [],
          "required_status_checks": [
            "eclipse-eca-validation:eclipsefdn/eca"
          ],
          "requires_code_owner_reviews": false,
          "requires_commit_signatures": false,
          "requires_conversation_resolution": false,
          "requires_deployments": false,
          "requires_linear_history": false,
          "requires_pull_request": false,
          "requires_status_checks": false,
          "requires_strict_status_checks": false,
          "restricts_pushes": false,
          "restricts_review_dismissals": false,
          "review_dismissal_allowances": []
        }
      ],
      "default_branch": "master",
      "delete_branch_on_merge": false,
      "dependabot_alerts_enabled": true,
      "dependabot_security_updates_enabled": true,
      "description": "Docker images and Kubernetes deployment files for Sonatype Nexus repositories hosted by the Eclipse Foundation",
      "environments": [],
      "gh_pages_build_type": "disabled",
      "gh_pages_source_branch": null,
      "gh_pages_source_path": null,
      "has_discussions": false,
      "has_issues": true,
      "has_projects": true,
      "has_wiki": true,
      "homepage": null,
      "is_template": false,
      "merge_commit_message": "PR_TITLE",
      "merge_commit_title": "MERGE_MESSAGE",
      "name": "sonatype-nexus",
      "private": false,
      "secret_scanning": "enabled",
      "secret_scanning_push_protection": "enabled",
      "squash_merge_commit_message": "COMMIT_MESSAGES",
      "squash_merge_commit_title": "COMMIT_OR_PR_TITLE",
      "template_repository": null,
      "topics": [],
      "web_commit_signoff_required": true,
      "webhooks": [],
      "default_branch_protection": "protected"
    },
    {
      "allow_auto_merge": false,
      "allow_forking": true,
      "allow_merge_commit": false,
      "allow_rebase_merge": true,
      "allow_squash_merge": false,
      "allow_update_branch": false,
      "archived": false,
      "auto_init": true,
      "branch_protection_rules": [
        {
          "allows_deletions": false,
          "allows_force_pushes": false,
          "blocks_creations": false,
          "bypass_force_push_allowances": [],
          "bypass_pull_request_allowances": [],
          "dismisses_stale_reviews": false,
          "is_admin_enforced": false,
          "lock_allows_fetch_and_merge": false,
          "lock_branch": false,
          "pattern": "master",
          "push_restrictions": [],
          "require_last_push_approval": false,
          "required_approving_review_count": null,
          "required_deployment_environments": [],
          "required_status_checks": [
            "eclipse-eca-validation:eclipsefdn/eca"
          ],
          "requires_code_owner_reviews": false,
          "requires_commit_signatures": false,
          "requires_conversation_resolution": false,
          "requires_deployments": false,
          "requires_linear_history": false,
          "requires_pull_request": false,
          "requires_status_checks": false,
          "requires_strict_status_checks": false,
          "restricts_pushes": false,
          "restricts_review_dismissals": false,
          "review_dismissal_allowances": []
        }
      ],
      "default_branch": "master",
      "delete_branch_on_merge": true,
      "dependabot_alerts_enabled": true,
      "dependabot_security_updates_enabled": true,
      "description": "Target Platform Definition DSL and Generator",
      "environments": [
        {
          "branch_policies": [],
          "deployment_branch_policy": "all",
          "name": "github-pages",
          "reviewers": [],
          "wait_timer": 0
        }
      ],
      "gh_pages_build_type": "disabled",
      "gh_pages_source_branch": null,
      "gh_pages_source_path": null,
      "has_discussions": false,
      "has_issues": true,
      "has_projects": true,
      "has_wiki": true,
      "homepage": "",
      "is_template": false,
      "merge_commit_message": "PR_TITLE",
      "merge_commit_title": "MERGE_MESSAGE",
      "name": "targetplatform-dsl",
      "private": false,
      "secret_scanning": "enabled",
      "secret_scanning_push_protection": "enabled",
      "squash_merge_commit_message": "COMMIT_MESSAGES",
      "squash_merge_commit_title": "COMMIT_OR_PR_TITLE",
      "template_repository": null,
      "topics": [],
      "web_commit_signoff_required": true,
      "webhooks": [
        {
          "active": true,
          "content_type": "form",
          "events": [
            "create",
            "delete",
            "issue_comment",
            "member",
            "public",
            "pull_request",
            "push",
            "repository"
          ],
          "insecure_ssl": "0",
          "secret": null,
          "url": "https://notify.travis-ci.org"
        }
      ],
      "default_branch_protection": "protected"
    }
  ],
  "secrets": [],
  "settings": {
    "billing_email": "webmaster@eclipse.org",
    "blog": "https://projects.eclipse.org/projects/technology.cbi",
    "company": null,
    "default_branch_name": "main",
    "default_repository_permission": "none",
    "dependabot_alerts_enabled_for_new_repositories": true,
    "dependabot_security_updates_enabled_for_new_repositories": true,
    "dependency_graph_enabled_for_new_repositories": true,
    "description": "The Eclipse CBI project",
    "discussion_source_repository": null,
    "email": "cbi-dev@eclipse.org",
    "has_discussions": false,
    "has_organization_projects": true,
    "has_repository_projects": true,
    "location": "Belgium",
    "members_can_change_project_visibility": true,
    "members_can_change_repo_visibility": false,
    "members_can_create_private_repositories": false,
    "members_can_create_public_pages": true,
    "members_can_create_public_repositories": false,
    "members_can_create_teams": false,
    "members_can_delete_issues": false,
    "members_can_delete_repositories": false,
    "members_can_fork_private_repositories": false,
    "name": "Eclipse CBI",
    "packages_containers_internal": false,
    "packages_containers_public": true,
    "plan": "free",
    "readers_can_create_discussions": true,
    "security_managers": [
      "eclipsefdn-security",
      "technology-cbi-project-leads"
    ],
    "twitter_username": null,
    "two_factor_requirement": true,
    "web_commit_signoff_required": true,
    "workflows": {
      "actions_can_approve_pull_request_reviews": true,
      "allow_action_patterns": [
        "ludeeus/action-shellcheck@*",
        "marocchino/sticky-pull-request-comment@*",
        "release-drafter/release-drafter@*",
        "slsa-framework/slsa-github-generator/*",
        "softprops/action-gh-release@*"
      ],
      "allow_github_owned_actions": true,
      "allow_verified_creator_actions": true,
      "allowed_actions": "selected",
      "default_workflow_permissions": "write",
      "enabled_repositories": "all",
      "selected_repositories": []
    }
  },
  "webhooks": [
    {
      "active": true,
      "content_type": "form",
      "events": [
        "create",
        "delete",
        "organization",
        "pull_request",
        "pull_request_review_comment",
        "push",
        "repository"
      ],
      "insecure_ssl": "0",
      "secret": "pass:bots/technology.cbi/github.com/webhook-secret",
      "url": "https://ci.eclipse.org/cbi/github-webhook/"
    }
  ],
  "@timestamp": "2023-10-17T06:49:28Z",
  "sha_commit": "fe78128c421d47113acb97d33a6849e2c7d58447"
}