{
  "annotations": {
    "list": [
      {
        "builtIn": 1,
        "datasource": {
          "type": "grafana",
          "uid": "-- Grafana --"
        },
        "enable": true,
        "hide": true,
        "iconColor": "rgba(0, 211, 255, 1)",
        "name": "Annotations & Alerts",
        "type": "dashboard"
      }
    ]
  },
  "editable": true,
  "fiscalYearStartMonth": 0,
  "graphTooltip": 0,
  "id": 1,
  "links": [],
  "liveNow": false,
  "panels": [
    {
      "collapsed": false,
      "gridPos": {
        "h": 1,
        "w": 24,
        "x": 0,
        "y": 0
      },
      "id": 8,
      "panels": [],
      "type": "row"
    },
    {
      "datasource": {
        "type": "grafana-opensearch-datasource",
        "uid": "a9ea5c01-64ee-4be9-849d-1dbbbbc0e433"
      },
      "gridPos": {
        "h": 4,
        "w": 5,
        "x": 0,
        "y": 1
      },
      "id": 9,
      "options": {
        "code": {
          "language": "plaintext",
          "showLineNumbers": false,
          "showMiniMap": false
        },
        "content": "![Eclipse Foundation](https://www.eclipse.org/eclipse.org-common/themes/solstice/public/images/logo/eclipse-foundation-white-orange.svg)",
        "mode": "markdown"
      },
      "pluginVersion": "10.2.0",
      "targets": [
        {
          "alias": "",
          "bucketAggs": [
            {
              "field": "@timestamp",
              "id": "2",
              "settings": {
                "interval": "auto"
              },
              "type": "date_histogram"
            }
          ],
          "datasource": {
            "type": "grafana-opensearch-datasource",
            "uid": "a9ea5c01-64ee-4be9-849d-1dbbbbc0e433"
          },
          "format": "table",
          "metrics": [
            {
              "id": "1",
              "type": "count"
            }
          ],
          "query": "",
          "queryType": "lucene",
          "refId": "A",
          "timeField": "@timestamp"
        }
      ],
      "transparent": true,
      "type": "text"
    },
    {
      "datasource": {
        "type": "grafana-opensearch-datasource",
        "uid": "P85C652D44C90D60A"
      },
      "fieldConfig": {
        "defaults": {
          "color": {
            "mode": "thresholds"
          },
          "mappings": [],
          "thresholds": {
            "mode": "absolute",
            "steps": [
              {
                "color": "green",
                "value": null
              }
            ]
          }
        },
        "overrides": []
      },
      "gridPos": {
        "h": 8,
        "w": 4,
        "x": 5,
        "y": 1
      },
      "id": 4,
      "options": {
        "colorMode": "value",
        "graphMode": "none",
        "justifyMode": "auto",
        "orientation": "auto",
        "reduceOptions": {
          "calcs": [
            "sum"
          ],
          "fields": "",
          "values": false
        },
        "textMode": "auto"
      },
      "pluginVersion": "10.2.0",
      "targets": [
        {
          "alias": "",
          "bucketAggs": [
            {
              "field": "@timestamp",
              "id": "2",
              "settings": {
                "interval": "auto"
              },
              "type": "date_histogram"
            }
          ],
          "datasource": {
            "type": "grafana-opensearch-datasource",
            "uid": "P85C652D44C90D60A"
          },
          "format": "table",
          "metrics": [
            {
              "field": "org_github_hash.keyword",
              "id": "1",
              "type": "cardinality"
            }
          ],
          "query": "",
          "queryType": "lucene",
          "refId": "A",
          "timeField": "@timestamp"
        }
      ],
      "title": "GitHub Organizations",
      "transparent": true,
      "type": "stat"
    },
    {
      "datasource": {
        "type": "grafana-opensearch-datasource",
        "uid": "P85C652D44C90D60A"
      },
      "fieldConfig": {
        "defaults": {
          "color": {
            "mode": "thresholds"
          },
          "mappings": [],
          "thresholds": {
            "mode": "absolute",
            "steps": [
              {
                "color": "green",
                "value": null
              }
            ]
          }
        },
        "overrides": []
      },
      "gridPos": {
        "h": 8,
        "w": 4,
        "x": 9,
        "y": 1
      },
      "id": 3,
      "options": {
        "colorMode": "value",
        "graphMode": "none",
        "justifyMode": "auto",
        "orientation": "auto",
        "reduceOptions": {
          "calcs": [
            "sum"
          ],
          "fields": "",
          "limit": 2,
          "values": false
        },
        "textMode": "value"
      },
      "pluginVersion": "10.2.0",
      "targets": [
        {
          "alias": "",
          "bucketAggs": [
            {
              "field": "@timestamp",
              "id": "2",
              "settings": {
                "interval": "auto"
              },
              "type": "date_histogram"
            }
          ],
          "datasource": {
            "type": "grafana-opensearch-datasource",
            "uid": "P85C652D44C90D60A"
          },
          "format": "table",
          "metrics": [
            {
              "id": "1",
              "type": "count"
            }
          ],
          "query": "",
          "queryType": "lucene",
          "refId": "A",
          "timeField": "@timestamp"
        }
      ],
      "title": "GitHub Repositories",
      "transparent": true,
      "type": "stat"
    },
    {
      "datasource": {
        "type": "grafana-opensearch-datasource",
        "uid": "P85C652D44C90D60A"
      },
      "fieldConfig": {
        "defaults": {
          "color": {
            "mode": "palette-classic"
          },
          "custom": {
            "hideFrom": {
              "legend": false,
              "tooltip": false,
              "viz": false
            }
          },
          "mappings": []
        },
        "overrides": [
          {
            "matcher": {
              "id": "byName",
              "options": "not_protected"
            },
            "properties": [
              {
                "id": "color",
                "value": {
                  "fixedColor": "dark-red",
                  "mode": "fixed"
                }
              }
            ]
          }
        ]
      },
      "gridPos": {
        "h": 8,
        "w": 4,
        "x": 13,
        "y": 1
      },
      "id": 5,
      "options": {
        "legend": {
          "displayMode": "table",
          "placement": "bottom",
          "showLegend": true,
          "values": [
            "value",
            "percent"
          ]
        },
        "pieType": "pie",
        "reduceOptions": {
          "calcs": [
            "lastNotNull"
          ],
          "fields": "",
          "values": true
        },
        "tooltip": {
          "mode": "multi",
          "sort": "asc"
        }
      },
      "pluginVersion": "10.1.4",
      "targets": [
        {
          "alias": "",
          "bucketAggs": [
            {
              "field": "default_branch_protection.keyword",
              "id": "2",
              "settings": {
                "min_doc_count": "0",
                "order": "desc",
                "orderBy": "_term",
                "size": "10"
              },
              "type": "terms"
            }
          ],
          "datasource": {
            "type": "grafana-opensearch-datasource",
            "uid": "P85C652D44C90D60A"
          },
          "format": "table",
          "metrics": [
            {
              "id": "1",
              "type": "count"
            }
          ],
          "query": "",
          "queryType": "lucene",
          "refId": "A",
          "timeField": "@timestamp"
        }
      ],
      "title": "Default Branch Protection",
      "transparent": true,
      "type": "piechart"
    },
    {
      "datasource": {
        "type": "grafana-opensearch-datasource",
        "uid": "P85C652D44C90D60A"
      },
      "fieldConfig": {
        "defaults": {
          "color": {
            "mode": "palette-classic"
          },
          "custom": {
            "hideFrom": {
              "legend": false,
              "tooltip": false,
              "viz": false
            }
          },
          "mappings": []
        },
        "overrides": [
          {
            "matcher": {
              "id": "byName",
              "options": "not_protected"
            },
            "properties": [
              {
                "id": "color",
                "value": {
                  "fixedColor": "dark-red",
                  "mode": "fixed"
                }
              }
            ]
          },
          {
            "matcher": {
              "id": "byName",
              "options": "disabled"
            },
            "properties": [
              {
                "id": "color",
                "value": {
                  "fixedColor": "dark-red",
                  "mode": "fixed"
                }
              }
            ]
          }
        ]
      },
      "gridPos": {
        "h": 8,
        "w": 4,
        "x": 17,
        "y": 1
      },
      "id": 6,
      "options": {
        "legend": {
          "displayMode": "table",
          "placement": "bottom",
          "showLegend": true,
          "values": [
            "value",
            "percent"
          ]
        },
        "pieType": "pie",
        "reduceOptions": {
          "calcs": [
            "lastNotNull"
          ],
          "fields": "",
          "values": true
        },
        "tooltip": {
          "mode": "multi",
          "sort": "asc"
        }
      },
      "pluginVersion": "10.1.4",
      "targets": [
        {
          "alias": "",
          "bucketAggs": [
            {
              "field": "secret_scanning.keyword",
              "id": "2",
              "settings": {
                "min_doc_count": "0",
                "order": "desc",
                "orderBy": "_term",
                "size": "10"
              },
              "type": "terms"
            }
          ],
          "datasource": {
            "type": "grafana-opensearch-datasource",
            "uid": "P85C652D44C90D60A"
          },
          "format": "table",
          "metrics": [
            {
              "id": "1",
              "type": "count"
            }
          ],
          "query": "",
          "queryType": "lucene",
          "refId": "A",
          "timeField": "@timestamp"
        }
      ],
      "title": "Secret Scanning",
      "transparent": true,
      "type": "piechart"
    },
    {
      "datasource": {
        "type": "grafana-opensearch-datasource",
        "uid": "P8F3A9120A6D9CA56"
      },
      "fieldConfig": {
        "defaults": {
          "color": {
            "mode": "palette-classic"
          },
          "custom": {
            "axisBorderShow": false,
            "axisCenteredZero": false,
            "axisColorMode": "text",
            "axisLabel": "",
            "axisPlacement": "auto",
            "barAlignment": 0,
            "drawStyle": "bars",
            "fillOpacity": 44,
            "gradientMode": "hue",
            "hideFrom": {
              "legend": false,
              "tooltip": false,
              "viz": false
            },
            "insertNulls": false,
            "lineInterpolation": "linear",
            "lineWidth": 1,
            "pointSize": 5,
            "scaleDistribution": {
              "type": "linear"
            },
            "showPoints": "auto",
            "spanNulls": false,
            "stacking": {
              "group": "A",
              "mode": "none"
            },
            "thresholdsStyle": {
              "mode": "off"
            }
          },
          "mappings": [],
          "thresholds": {
            "mode": "absolute",
            "steps": [
              {
                "color": "green",
                "value": null
              },
              {
                "color": "red",
                "value": 80
              }
            ]
          }
        },
        "overrides": []
      },
      "gridPos": {
        "h": 4,
        "w": 5,
        "x": 0,
        "y": 5
      },
      "id": 15,
      "options": {
        "legend": {
          "calcs": [],
          "displayMode": "list",
          "placement": "bottom",
          "showLegend": true
        },
        "tooltip": {
          "mode": "single",
          "sort": "none"
        }
      },
      "targets": [
        {
          "alias": "Num of Otterdog Commits",
          "bucketAggs": [
            {
              "field": "@timestamp",
              "id": "2",
              "settings": {
                "interval": "1d"
              },
              "type": "date_histogram"
            }
          ],
          "datasource": {
            "type": "grafana-opensearch-datasource",
            "uid": "P8F3A9120A6D9CA56"
          },
          "format": "table",
          "metrics": [
            {
              "id": "1",
              "type": "count"
            }
          ],
          "query": "",
          "queryType": "lucene",
          "refId": "A",
          "timeField": "@timestamp"
        }
      ],
      "transparent": true,
      "type": "timeseries"
    },
    {
      "gridPos": {
        "h": 1,
        "w": 24,
        "x": 0,
        "y": 9
      },
      "id": 7,
      "title": "Timeline",
      "type": "row"
    },
    {
      "datasource": {
        "type": "grafana-opensearch-datasource",
        "uid": "PB493F1A17CC0537A"
      },
      "fieldConfig": {
        "defaults": {
          "color": {
            "mode": "palette-classic"
          },
          "custom": {
            "axisBorderShow": false,
            "axisCenteredZero": false,
            "axisColorMode": "text",
            "axisLabel": "# Githug Organisations",
            "axisPlacement": "auto",
            "fillOpacity": 80,
            "gradientMode": "hue",
            "hideFrom": {
              "legend": false,
              "tooltip": false,
              "viz": false
            },
            "lineWidth": 1,
            "scaleDistribution": {
              "type": "linear"
            },
            "thresholdsStyle": {
              "mode": "off"
            }
          },
          "decimals": 0,
          "mappings": [],
          "thresholds": {
            "mode": "absolute",
            "steps": [
              {
                "color": "dark-blue",
                "value": null
              }
            ]
          }
        },
        "overrides": [
          {
            "matcher": {
              "id": "byName",
              "options": "Github Orgs Managed"
            },
            "properties": [
              {
                "id": "color",
                "value": {
                  "fixedColor": "dark-orange",
                  "mode": "fixed"
                }
              }
            ]
          },
          {
            "matcher": {
              "id": "byName",
              "options": "Github Orgs"
            },
            "properties": [
              {
                "id": "color",
                "value": {
                  "fixedColor": "#FFB357",
                  "mode": "fixed"
                }
              }
            ]
          },
          {
            "matcher": {
              "id": "byName",
              "options": "Number of GitHub Organizations managed by OtterDog"
            },
            "properties": [
              {
                "id": "color",
                "value": {
                  "fixedColor": "#ffb357",
                  "mode": "fixed"
                }
              }
            ]
          }
        ]
      },
      "gridPos": {
        "h": 10,
        "w": 12,
        "x": 0,
        "y": 10
      },
      "id": 12,
      "options": {
        "barRadius": 0,
        "barWidth": 0.97,
        "fullHighlight": false,
        "groupWidth": 0.7,
        "legend": {
          "calcs": [],
          "displayMode": "list",
          "placement": "bottom",
          "showLegend": true
        },
        "orientation": "auto",
        "showValue": "auto",
        "stacking": "none",
        "text": {
          "valueSize": 15
        },
        "tooltip": {
          "mode": "multi",
          "sort": "none"
        },
        "xField": "Time",
        "xTickLabelRotation": -45,
        "xTickLabelSpacing": 0
      },
      "targets": [
        {
          "alias": "Number of GitHub Organizations managed by OtterDog",
          "bucketAggs": [
            {
              "field": "@timestamp",
              "id": "2",
              "settings": {
                "interval": "1d"
              },
              "type": "date_histogram"
            }
          ],
          "datasource": {
            "type": "grafana-opensearch-datasource",
            "uid": "PB493F1A17CC0537A"
          },
          "format": "table",
          "metrics": [
            {
              "field": "org_github_id.keyword",
              "hide": true,
              "id": "1",
              "type": "cardinality"
            },
            {
              "field": "total_github_id",
              "id": "3",
              "type": "avg"
            }
          ],
          "query": "",
          "queryType": "lucene",
          "refId": "A",
          "timeField": "@timestamp"
        }
      ],
      "title": "GitHub Organizations",
      "transparent": true,
      "type": "barchart"
    },
    {
      "datasource": {
        "type": "grafana-opensearch-datasource",
        "uid": "PB493F1A17CC0537A"
      },
      "fieldConfig": {
        "defaults": {
          "color": {
            "mode": "palette-classic"
          },
          "custom": {
            "axisBorderShow": false,
            "axisCenteredZero": false,
            "axisColorMode": "text",
            "axisLabel": "# Repositories",
            "axisPlacement": "auto",
            "fillOpacity": 80,
            "gradientMode": "hue",
            "hideFrom": {
              "legend": false,
              "tooltip": false,
              "viz": false
            },
            "lineWidth": 1,
            "scaleDistribution": {
              "type": "linear"
            },
            "thresholdsStyle": {
              "mode": "off"
            }
          },
          "decimals": 0,
          "mappings": [],
          "thresholds": {
            "mode": "absolute",
            "steps": [
              {
                "color": "green",
                "value": null
              }
            ]
          }
        },
        "overrides": [
          {
            "__systemRef": "hideSeriesFrom",
            "matcher": {
              "id": "byNames",
              "options": {
                "mode": "exclude",
                "names": [
                  "Count"
                ],
                "prefix": "All except:",
                "readOnly": true
              }
            },
            "properties": [
              {
                "id": "custom.hideFrom",
                "value": {
                  "legend": false,
                  "tooltip": false,
                  "viz": false
                }
              }
            ]
          },
          {
            "matcher": {
              "id": "byName",
              "options": "Github Repositories Managed 2"
            },
            "properties": [
              {
                "id": "color",
                "value": {
                  "fixedColor": "dark-orange",
                  "mode": "fixed"
                }
              },
              {
                "id": "displayName",
                "value": "Cumulative Sum"
              }
            ]
          },
          {
            "matcher": {
              "id": "byName",
              "options": "Repositories"
            },
            "properties": [
              {
                "id": "color",
                "value": {
                  "fixedColor": "#1F60C4",
                  "mode": "fixed"
                }
              }
            ]
          },
          {
            "matcher": {
              "id": "byName",
              "options": "Number of GitHub Repositories managed by OtterDog"
            },
            "properties": [
              {
                "id": "color",
                "value": {
                  "fixedColor": "#1f60c4",
                  "mode": "fixed"
                }
              }
            ]
          }
        ]
      },
      "gridPos": {
        "h": 10,
        "w": 12,
        "x": 12,
        "y": 10
      },
      "id": 11,
      "options": {
        "barRadius": 0,
        "barWidth": 0.97,
        "fullHighlight": false,
        "groupWidth": 0.7,
        "legend": {
          "calcs": [],
          "displayMode": "list",
          "placement": "bottom",
          "showLegend": true
        },
        "orientation": "auto",
        "showValue": "auto",
        "stacking": "none",
        "text": {
          "valueSize": 15
        },
        "tooltip": {
          "mode": "multi",
          "sort": "none"
        },
        "xField": "Time",
        "xTickLabelRotation": -45,
        "xTickLabelSpacing": 0
      },
      "targets": [
        {
          "alias": "Number of GitHub Repositories managed by OtterDog",
          "bucketAggs": [
            {
              "field": "@timestamp",
              "id": "2",
              "settings": {
                "interval": "1d"
              },
              "type": "date_histogram"
            }
          ],
          "datasource": {
            "type": "grafana-opensearch-datasource",
            "uid": "PB493F1A17CC0537A"
          },
          "format": "table",
          "metrics": [
            {
              "hide": true,
              "id": "1",
              "type": "count"
            },
            {
              "field": "total_repositories",
              "id": "3",
              "type": "avg"
            }
          ],
          "query": "",
          "queryType": "lucene",
          "refId": "A",
          "timeField": "@timestamp"
        }
      ],
      "title": "GitHub Repositories",
      "transparent": true,
      "type": "barchart"
    },
    {
      "datasource": {
        "type": "grafana-opensearch-datasource",
        "uid": "PB493F1A17CC0537A"
      },
      "description": "",
      "fieldConfig": {
        "defaults": {
          "color": {
            "mode": "palette-classic"
          },
          "custom": {
            "axisBorderShow": false,
            "axisCenteredZero": false,
            "axisColorMode": "text",
            "axisLabel": "% Repos (Default Branch Protected)",
            "axisPlacement": "auto",
            "fillOpacity": 80,
            "gradientMode": "hue",
            "hideFrom": {
              "legend": false,
              "tooltip": false,
              "viz": false
            },
            "lineWidth": 1,
            "scaleDistribution": {
              "type": "linear"
            },
            "thresholdsStyle": {
              "mode": "off"
            }
          },
          "mappings": [],
          "thresholds": {
            "mode": "absolute",
            "steps": [
              {
                "color": "dark-blue",
                "value": null
              }
            ]
          },
          "unit": "percentunit"
        },
        "overrides": [
          {
            "matcher": {
              "id": "byName",
              "options": "Github Orgs Managed"
            },
            "properties": [
              {
                "id": "color",
                "value": {
                  "fixedColor": "dark-orange",
                  "mode": "fixed"
                }
              }
            ]
          },
          {
            "matcher": {
              "id": "byName",
              "options": "Github Orgs"
            },
            "properties": [
              {
                "id": "color",
                "value": {
                  "fixedColor": "#acacb7",
                  "mode": "fixed"
                }
              }
            ]
          },
          {
            "matcher": {
              "id": "byName",
              "options": "Repos with Secret Scanning"
            },
            "properties": [
              {
                "id": "color",
                "value": {
                  "fixedColor": "#797673",
                  "mode": "fixed"
                }
              }
            ]
          }
        ]
      },
      "gridPos": {
        "h": 9,
        "w": 12,
        "x": 0,
        "y": 20
      },
      "id": 14,
      "options": {
        "barRadius": 0,
        "barWidth": 0.97,
        "fullHighlight": false,
        "groupWidth": 0.7,
        "legend": {
          "calcs": [],
          "displayMode": "list",
          "placement": "bottom",
          "showLegend": true
        },
        "orientation": "auto",
        "showValue": "auto",
        "stacking": "none",
        "text": {},
        "tooltip": {
          "mode": "multi",
          "sort": "none"
        },
        "xField": "Time",
        "xTickLabelRotation": -45,
        "xTickLabelSpacing": 0
      },
      "targets": [
        {
          "alias": "% of GitHub Repositories with their Default Branch protected by a Rule",
          "bucketAggs": [
            {
              "field": "@timestamp",
              "id": "2",
              "settings": {
                "interval": "1d"
              },
              "type": "date_histogram"
            }
          ],
          "datasource": {
            "type": "grafana-opensearch-datasource",
            "uid": "PB493F1A17CC0537A"
          },
          "format": "table",
          "metrics": [
            {
              "hide": true,
              "id": "1",
              "type": "count"
            },
            {
              "field": "default_branch_protection.perc_protected",
              "id": "3",
              "type": "avg"
            }
          ],
          "query": "",
          "queryType": "lucene",
          "refId": "A",
          "timeField": "@timestamp"
        }
      ],
      "title": "Default Branch Protection",
      "transparent": true,
      "type": "barchart"
    },
    {
      "datasource": {
        "type": "grafana-opensearch-datasource",
        "uid": "PB493F1A17CC0537A"
      },
      "description": "",
      "fieldConfig": {
        "defaults": {
          "color": {
            "mode": "palette-classic"
          },
          "custom": {
            "axisBorderShow": false,
            "axisCenteredZero": false,
            "axisColorMode": "text",
            "axisLabel": "% Repos (Secret Scanning Enabled)",
            "axisPlacement": "auto",
            "fillOpacity": 80,
            "gradientMode": "hue",
            "hideFrom": {
              "legend": false,
              "tooltip": false,
              "viz": false
            },
            "lineWidth": 1,
            "scaleDistribution": {
              "type": "linear"
            },
            "thresholdsStyle": {
              "mode": "off"
            }
          },
          "mappings": [],
          "thresholds": {
            "mode": "absolute",
            "steps": [
              {
                "color": "dark-blue",
                "value": null
              }
            ]
          },
          "unit": "percentunit"
        },
        "overrides": [
          {
            "matcher": {
              "id": "byName",
              "options": "Github Orgs Managed"
            },
            "properties": [
              {
                "id": "color",
                "value": {
                  "fixedColor": "dark-orange",
                  "mode": "fixed"
                }
              }
            ]
          },
          {
            "matcher": {
              "id": "byName",
              "options": "Github Orgs"
            },
            "properties": [
              {
                "id": "color",
                "value": {
                  "fixedColor": "#acacb7",
                  "mode": "fixed"
                }
              }
            ]
          },
          {
            "matcher": {
              "id": "byName",
              "options": "Repos with Secret Scanning"
            },
            "properties": [
              {
                "id": "color",
                "value": {
                  "fixedColor": "#797673",
                  "mode": "fixed"
                }
              }
            ]
          },
          {
            "matcher": {
              "id": "byName",
              "options": "% Repos with Secret Scanning"
            },
            "properties": [
              {
                "id": "color",
                "value": {
                  "fixedColor": "#4b4d48",
                  "mode": "fixed"
                }
              }
            ]
          },
          {
            "matcher": {
              "id": "byName",
              "options": "% of GitHub Repositories with Secret Scanning Enabled"
            },
            "properties": [
              {
                "id": "color",
                "value": {
                  "fixedColor": "#4b4d48",
                  "mode": "fixed"
                }
              }
            ]
          }
        ]
      },
      "gridPos": {
        "h": 9,
        "w": 12,
        "x": 12,
        "y": 20
      },
      "id": 13,
      "options": {
        "barRadius": 0,
        "barWidth": 0.97,
        "fullHighlight": false,
        "groupWidth": 0.7,
        "legend": {
          "calcs": [],
          "displayMode": "list",
          "placement": "bottom",
          "showLegend": true
        },
        "orientation": "auto",
        "showValue": "auto",
        "stacking": "none",
        "text": {},
        "tooltip": {
          "mode": "multi",
          "sort": "none"
        },
        "xField": "Time",
        "xTickLabelRotation": -45,
        "xTickLabelSpacing": 0
      },
      "targets": [
        {
          "alias": "% of GitHub Repositories with Secret Scanning Enabled",
          "bucketAggs": [
            {
              "field": "@timestamp",
              "id": "2",
              "settings": {
                "interval": "1d"
              },
              "type": "date_histogram"
            }
          ],
          "datasource": {
            "type": "grafana-opensearch-datasource",
            "uid": "PB493F1A17CC0537A"
          },
          "format": "table",
          "metrics": [
            {
              "hide": true,
              "id": "1",
              "type": "count"
            },
            {
              "field": "secret_scanning.perc_enabled",
              "id": "3",
              "type": "avg"
            }
          ],
          "query": "",
          "queryType": "lucene",
          "refId": "A",
          "timeField": "@timestamp"
        }
      ],
      "title": "Secret Scanning",
      "transparent": true,
      "type": "barchart"
    }
  ],
  "refresh": "5m",
  "schemaVersion": 38,
  "tags": [],
  "templating": {
    "list": []
  },
  "time": {
    "from": "now-3w",
    "to": "now"
  },
  "timepicker": {
    "hidden": false,
    "refresh_intervals": [
      "5m"
    ]
  },
  "timezone": "",
  "title": "otterdog",
  "uid": "ac7c41bc-29e8-440b-a669-5e2523069b8b",
  "version": 12,
  "weekStart": "monday"
}