eclipse-jgit,2
eclipse-wildwebdeveloper,2
eclipse-cdt-cloud,19
eclipse-platform,22
eclipse-keypop,16
eclipse-sirius,6
eclipse-orbit,6
eclipse-esmf,14
eclipse-edc,24
eclipse-lsp4j,2
eclipse-sumo,3
eclipse-tractusx,58
eclipse-oomph,4
eclipse-mylyn,17
eclipse-babel,5
eclipse-cbi,23
eclipse-leda,13
eclipse-chariott,4
eclipse-vertx,17
eclipse-kanto,15
eclipse-pass,36
eclipse-egit,2
eclipse-oniro4openharmony,3
eclipse-embed-cdt,8
eclipse-thingweb,8
eclipse-zenoh,26
eclipse-pdt,4
eclipse-packaging,2
eclipse-velocitas,24
eclipse-nattable,3
eclipse-volttron,47
eclipse-justj,5
eclipse-glsp,12
eclipse-jdt,8
eclipse-cdt,7
eclipse-emf,4
eclipse-simrel,5
eclipse-set,6
eclipse-virgo,4
eclipse-kuksa,7
adoptium,62
eclipse-datatools,3
eclipse-uprotocol,16
eclipse-gemini,16
jetty,9
eclipse-xpanse,9
eclipse-ibeji,4
