{
  "github_id": "eclipse-embed-cdt",
  "repositories": [
    {
      "allow_auto_merge": false,
      "allow_forking": true,
      "allow_merge_commit": false,
      "allow_rebase_merge": true,
      "allow_squash_merge": true,
      "allow_update_branch": true,
      "archived": false,
      "auto_init": true,
      "branch_protection_rules": [
        {
          "allows_deletions": false,
          "allows_force_pushes": false,
          "blocks_creations": false,
          "bypass_force_push_allowances": [],
          "bypass_pull_request_allowances": [
            "@eclipse-embed-cdt/eclipsefdn-releng",
            "@eclipse-embed-cdt/eclipsefdn-security"
          ],
          "dismisses_stale_reviews": false,
          "is_admin_enforced": false,
          "lock_allows_fetch_and_merge": false,
          "lock_branch": false,
          "pattern": "main",
          "push_restrictions": [],
          "require_last_push_approval": false,
          "required_approving_review_count": 1,
          "required_deployment_environments": [],
          "required_status_checks": [],
          "requires_code_owner_reviews": true,
          "requires_commit_signatures": false,
          "requires_conversation_resolution": false,
          "requires_deployments": false,
          "requires_linear_history": false,
          "requires_pull_request": true,
          "requires_status_checks": false,
          "requires_strict_status_checks": false,
          "restricts_pushes": false,
          "restricts_review_dismissals": false,
          "review_dismissal_allowances": []
        }
      ],
      "default_branch": "main",
      "delete_branch_on_merge": true,
      "dependabot_alerts_enabled": true,
      "dependabot_security_updates_enabled": false,
      "description": "Repository to host configurations related to the Eclipse Foundation.",
      "environments": [
        {
          "branch_policies": [
            "main"
          ],
          "deployment_branch_policy": "selected",
          "name": "github-pages",
          "reviewers": [],
          "wait_timer": 0
        }
      ],
      "gh_pages_build_type": "workflow",
      "gh_pages_source_branch": null,
      "gh_pages_source_path": null,
      "has_discussions": false,
      "has_issues": true,
      "has_projects": false,
      "has_wiki": false,
      "homepage": "https://eclipse-embed-cdt.github.io/.eclipsefdn/",
      "is_template": false,
      "merge_commit_message": "PR_TITLE",
      "merge_commit_title": "MERGE_MESSAGE",
      "name": ".eclipsefdn",
      "post_process_template_content": [
        ".github/CODEOWNERS",
        "README.md",
        "mkdocs.yml"
      ],
      "private": false,
      "secret_scanning": "enabled",
      "secret_scanning_push_protection": "enabled",
      "squash_merge_commit_message": "COMMIT_MESSAGES",
      "squash_merge_commit_title": "COMMIT_OR_PR_TITLE",
      "template_repository": "EclipseFdn/.eclipsefdn-template",
      "topics": [],
      "web_commit_signoff_required": true,
      "webhooks": [],
      "default_branch_protection": "protected"
    },
    {
      "allow_auto_merge": false,
      "allow_forking": true,
      "allow_merge_commit": true,
      "allow_rebase_merge": true,
      "allow_squash_merge": true,
      "allow_update_branch": false,
      "archived": false,
      "auto_init": true,
      "branch_protection_rules": [],
      "default_branch": "develop",
      "delete_branch_on_merge": false,
      "dependabot_alerts_enabled": false,
      "dependabot_security_updates_enabled": false,
      "description": "An ANTLR based 'Liquid Template' parser and rendering engine.",
      "environments": [],
      "gh_pages_build_type": "disabled",
      "gh_pages_source_branch": null,
      "gh_pages_source_path": null,
      "has_discussions": false,
      "has_issues": false,
      "has_projects": true,
      "has_wiki": true,
      "homepage": "",
      "is_template": false,
      "merge_commit_message": "PR_TITLE",
      "merge_commit_title": "MERGE_MESSAGE",
      "name": "Liqp",
      "private": false,
      "secret_scanning": "enabled",
      "secret_scanning_push_protection": "enabled",
      "squash_merge_commit_message": "COMMIT_MESSAGES",
      "squash_merge_commit_title": "COMMIT_OR_PR_TITLE",
      "template_repository": null,
      "topics": [],
      "web_commit_signoff_required": false,
      "webhooks": [],
      "default_branch_protection": "not_protected"
    },
    {
      "allow_auto_merge": false,
      "allow_forking": true,
      "allow_merge_commit": true,
      "allow_rebase_merge": true,
      "allow_squash_merge": true,
      "allow_update_branch": false,
      "archived": false,
      "auto_init": true,
      "branch_protection_rules": [],
      "default_branch": "master",
      "delete_branch_on_merge": false,
      "dependabot_alerts_enabled": false,
      "dependabot_security_updates_enabled": false,
      "description": "Various assets, like images, icons, etc.",
      "environments": [],
      "gh_pages_build_type": "disabled",
      "gh_pages_source_branch": null,
      "gh_pages_source_path": null,
      "has_discussions": false,
      "has_issues": true,
      "has_projects": true,
      "has_wiki": true,
      "homepage": null,
      "is_template": false,
      "merge_commit_message": "PR_TITLE",
      "merge_commit_title": "MERGE_MESSAGE",
      "name": "assets",
      "private": false,
      "secret_scanning": "enabled",
      "secret_scanning_push_protection": "enabled",
      "squash_merge_commit_message": "COMMIT_MESSAGES",
      "squash_merge_commit_title": "COMMIT_OR_PR_TITLE",
      "template_repository": null,
      "topics": [],
      "web_commit_signoff_required": false,
      "webhooks": [],
      "default_branch_protection": "not_protected"
    },
    {
      "allow_auto_merge": false,
      "allow_forking": true,
      "allow_merge_commit": true,
      "allow_rebase_merge": true,
      "allow_squash_merge": true,
      "allow_update_branch": false,
      "archived": false,
      "auto_init": true,
      "branch_protection_rules": [],
      "default_branch": "master",
      "delete_branch_on_merge": false,
      "dependabot_alerts_enabled": false,
      "dependabot_security_updates_enabled": false,
      "description": "The Eclipse Embedded CDT web static site.",
      "environments": [
        {
          "branch_policies": [],
          "deployment_branch_policy": "all",
          "name": "github-pages",
          "reviewers": [],
          "wait_timer": 0
        }
      ],
      "gh_pages_build_type": "legacy",
      "gh_pages_source_branch": "master",
      "gh_pages_source_path": "/docs",
      "has_discussions": false,
      "has_issues": false,
      "has_projects": false,
      "has_wiki": false,
      "homepage": "https://eclipse-embed-cdt.github.io/",
      "is_template": false,
      "merge_commit_message": "PR_TITLE",
      "merge_commit_title": "MERGE_MESSAGE",
      "name": "eclipse-embed-cdt.github.io",
      "private": false,
      "secret_scanning": "enabled",
      "secret_scanning_push_protection": "enabled",
      "squash_merge_commit_message": "COMMIT_MESSAGES",
      "squash_merge_commit_title": "COMMIT_OR_PR_TITLE",
      "template_repository": null,
      "topics": [
        "cdt",
        "eclipse",
        "embedded",
        "static-site",
        "web"
      ],
      "web_commit_signoff_required": false,
      "webhooks": [],
      "default_branch_protection": "not_protected"
    },
    {
      "allow_auto_merge": false,
      "allow_forking": true,
      "allow_merge_commit": true,
      "allow_rebase_merge": true,
      "allow_squash_merge": true,
      "allow_update_branch": false,
      "archived": false,
      "auto_init": true,
      "branch_protection_rules": [],
      "default_branch": "master",
      "delete_branch_on_merge": false,
      "dependabot_alerts_enabled": true,
      "dependabot_security_updates_enabled": true,
      "description": "The Eclipse Embedded CDT plug-ins for Arm & RISC-V C/C++ developers (formerly known as the GNU MCU Eclipse plug-ins). Includes the archive of previous plug-ins versions, as Releases.",
      "environments": [],
      "gh_pages_build_type": "disabled",
      "gh_pages_source_branch": null,
      "gh_pages_source_path": null,
      "has_discussions": true,
      "has_issues": true,
      "has_projects": false,
      "has_wiki": false,
      "homepage": "http://eclipse-embed-cdt.github.io/",
      "is_template": false,
      "merge_commit_message": "PR_TITLE",
      "merge_commit_title": "MERGE_MESSAGE",
      "name": "eclipse-plugins",
      "private": false,
      "secret_scanning": "enabled",
      "secret_scanning_push_protection": "enabled",
      "squash_merge_commit_message": "COMMIT_MESSAGES",
      "squash_merge_commit_title": "COMMIT_OR_PR_TITLE",
      "template_repository": null,
      "topics": [
        "arm",
        "cdt",
        "eclipse",
        "eclipse-marketplace",
        "embedded",
        "plug-ins",
        "plugins",
        "risc-v"
      ],
      "web_commit_signoff_required": false,
      "webhooks": [],
      "default_branch_protection": "not_protected"
    },
    {
      "allow_auto_merge": false,
      "allow_forking": true,
      "allow_merge_commit": true,
      "allow_rebase_merge": true,
      "allow_squash_merge": true,
      "allow_update_branch": false,
      "archived": false,
      "auto_init": true,
      "branch_protection_rules": [],
      "default_branch": "embed-cdt",
      "delete_branch_on_merge": false,
      "dependabot_alerts_enabled": true,
      "dependabot_security_updates_enabled": true,
      "description": "A fork of the Eclipse project used to generate distributable binaries, extended to include the Eclipse Embedded CDT plug-ins. The archive of previous packages is also here, as Releases.",
      "environments": [],
      "gh_pages_build_type": "disabled",
      "gh_pages_source_branch": null,
      "gh_pages_source_path": null,
      "has_discussions": false,
      "has_issues": false,
      "has_projects": false,
      "has_wiki": false,
      "homepage": "",
      "is_template": false,
      "merge_commit_message": "PR_TITLE",
      "merge_commit_title": "MERGE_MESSAGE",
      "name": "org.eclipse.epp.packages",
      "private": false,
      "secret_scanning": "enabled",
      "secret_scanning_push_protection": "enabled",
      "squash_merge_commit_message": "COMMIT_MESSAGES",
      "squash_merge_commit_title": "COMMIT_OR_PR_TITLE",
      "template_repository": null,
      "topics": [
        "eclipse",
        "epp",
        "profiles",
        "rcp",
        "signing-profiles-enabled"
      ],
      "web_commit_signoff_required": false,
      "webhooks": [],
      "default_branch_protection": "not_protected"
    },
    {
      "allow_auto_merge": false,
      "allow_forking": true,
      "allow_merge_commit": true,
      "allow_rebase_merge": true,
      "allow_squash_merge": true,
      "allow_update_branch": false,
      "archived": false,
      "auto_init": true,
      "branch_protection_rules": [],
      "default_branch": "master",
      "delete_branch_on_merge": false,
      "dependabot_alerts_enabled": false,
      "dependabot_security_updates_enabled": false,
      "description": "The Jekyll source code used to generate the project static web.",
      "environments": [
        {
          "branch_policies": [],
          "deployment_branch_policy": "all",
          "name": "BABURIBA",
          "reviewers": [],
          "wait_timer": 0
        }
      ],
      "gh_pages_build_type": "disabled",
      "gh_pages_source_branch": null,
      "gh_pages_source_path": null,
      "has_discussions": false,
      "has_issues": true,
      "has_projects": false,
      "has_wiki": false,
      "homepage": "https://eclipse-embed-cdt.github.io/",
      "is_template": false,
      "merge_commit_message": "PR_TITLE",
      "merge_commit_title": "MERGE_MESSAGE",
      "name": "web-jekyll",
      "private": false,
      "secret_scanning": "enabled",
      "secret_scanning_push_protection": "enabled",
      "secrets": [
        {
          "name": "ILG_TOKEN",
          "value": "********"
        }
      ],
      "squash_merge_commit_message": "COMMIT_MESSAGES",
      "squash_merge_commit_title": "COMMIT_OR_PR_TITLE",
      "template_repository": null,
      "topics": [
        "jekyll",
        "static"
      ],
      "web_commit_signoff_required": false,
      "webhooks": [
        {
          "active": true,
          "content_type": "form",
          "events": [
            "create",
            "delete",
            "issue_comment",
            "member",
            "public",
            "pull_request",
            "push",
            "repository"
          ],
          "insecure_ssl": "0",
          "secret": null,
          "url": "https://notify.travis-ci.org"
        }
      ],
      "default_branch_protection": "not_protected"
    },
    {
      "allow_auto_merge": false,
      "allow_forking": true,
      "allow_merge_commit": true,
      "allow_rebase_merge": true,
      "allow_squash_merge": true,
      "allow_update_branch": false,
      "archived": false,
      "auto_init": true,
      "branch_protection_rules": [],
      "default_branch": "master",
      "delete_branch_on_merge": false,
      "dependabot_alerts_enabled": false,
      "dependabot_security_updates_enabled": false,
      "description": "Preview of the web-jekyll content.",
      "environments": [
        {
          "branch_policies": [],
          "deployment_branch_policy": "all",
          "name": "github-pages",
          "reviewers": [],
          "wait_timer": 0
        }
      ],
      "gh_pages_build_type": "legacy",
      "gh_pages_source_branch": "master",
      "gh_pages_source_path": "/docs",
      "has_discussions": false,
      "has_issues": false,
      "has_projects": false,
      "has_wiki": false,
      "homepage": "https://eclipse-embed-cdt.github.io/web-preview/",
      "is_template": false,
      "merge_commit_message": "PR_TITLE",
      "merge_commit_title": "MERGE_MESSAGE",
      "name": "web-preview",
      "private": false,
      "secret_scanning": "enabled",
      "secret_scanning_push_protection": "enabled",
      "squash_merge_commit_message": "COMMIT_MESSAGES",
      "squash_merge_commit_title": "COMMIT_OR_PR_TITLE",
      "template_repository": null,
      "topics": [
        "jekyll"
      ],
      "web_commit_signoff_required": false,
      "webhooks": [],
      "default_branch_protection": "not_protected"
    }
  ],
  "secrets": [],
  "settings": {
    "billing_email": "webmaster@eclpse-foundation.org",
    "blog": null,
    "company": null,
    "default_branch_name": "main",
    "default_repository_permission": "none",
    "dependabot_alerts_enabled_for_new_repositories": false,
    "dependabot_security_updates_enabled_for_new_repositories": false,
    "dependency_graph_enabled_for_new_repositories": false,
    "description": "",
    "discussion_source_repository": null,
    "email": null,
    "has_discussions": false,
    "has_organization_projects": true,
    "has_repository_projects": true,
    "location": null,
    "members_can_change_project_visibility": false,
    "members_can_change_repo_visibility": false,
    "members_can_create_private_repositories": false,
    "members_can_create_public_pages": true,
    "members_can_create_public_repositories": false,
    "members_can_create_teams": false,
    "members_can_delete_issues": false,
    "members_can_delete_repositories": false,
    "members_can_fork_private_repositories": false,
    "name": "Eclipse Embedded CDT (C/C++ Development Tools)",
    "packages_containers_internal": false,
    "packages_containers_public": false,
    "plan": "free",
    "readers_can_create_discussions": true,
    "security_managers": [
      "eclipsefdn-security"
    ],
    "twitter_username": null,
    "two_factor_requirement": false,
    "web_commit_signoff_required": false,
    "workflows": {
      "actions_can_approve_pull_request_reviews": true,
      "allow_action_patterns": [],
      "allow_github_owned_actions": true,
      "allow_verified_creator_actions": true,
      "allowed_actions": "all",
      "default_workflow_permissions": "write",
      "enabled_repositories": "all",
      "selected_repositories": []
    }
  },
  "webhooks": [],
  "@timestamp": "2023-10-17T06:50:17Z",
  "sha_commit": "297beef6ecd5592fe561f25839476007292c83cb"
}