{
  "defaults": {
    "github": {
      "config_repo": ".eclipsefdn"
    },
    "bitwarden": {
      "api_token_key": "api_token_admin"
    },
    "jsonnet": {
      "base_template": "https://github.com/EclipseFdn/otterdog-defaults#otterdog-defaults.libsonnet@v0.4.0",
      "config_dir": "orgs"
    }
  },
  "organizations": [
    {
      "name": "adoptium",
      "github_id": "adoptium",
      "eclipse_project": "adoptium",
      "credentials": {
        "provider": "pass"
      }
    },
    {
      "name": "eclipse-ankaios",
      "github_id": "eclipse-ankaios",
      "eclipse_project": "automotive.ankaios",
      "credentials": {
        "provider": "pass"
      }
    },
    {
      "name": "eclipse-babel",
      "github_id": "eclipse-babel",
      "eclipse_project": "technology.babel",
      "credentials": {
        "provider": "pass"
      }
    },
    {
      "name": "eclipse-bluechi",
      "github_id": "eclipse-bluechi",
      "eclipse_project": "automotive.bluechi",
      "credentials": {
        "provider": "pass"
      }
    },
    {
      "name": "eclipse-cbi",
      "github_id": "eclipse-cbi",
      "eclipse_project": "technology.cbi",
      "credentials": {
        "provider": "pass"
      }
    },
    {
      "name": "eclipse-cdt",
      "github_id": "eclipse-cdt",
      "eclipse_project": "tools.cdt",
      "credentials": {
        "provider": "pass"
      }
    },
    {
      "name": "eclipse-cdt-cloud",
      "github_id": "eclipse-cdt-cloud",
      "eclipse_project": "ecd.cdt-cloud",
      "credentials": {
        "provider": "pass"
      }
    },
    {
      "name": "eclipse-chariott",
      "github_id": "eclipse-chariott",
      "eclipse_project": "automotive.chariott",
      "credentials": {
        "provider": "pass"
      }
    },
    {
      "name": "eclipse-datatools",
      "github_id": "eclipse-datatools",
      "eclipse_project": "tools.datatools",
      "credentials": {
        "provider": "pass"
      }
    },
    {
      "name": "eclipse-dash",
      "github_id": "eclipse-dash",
      "eclipse_project": "technology.dash",
      "credentials": {
        "provider": "pass"
      }
    },
    {
      "name": "eclipse-edc",
      "github_id": "eclipse-edc",
      "eclipse_project": "technology.edc",
      "credentials": {
        "provider": "pass"
      }
    },
    {
      "name": "eclipse-ee4j",
      "github_id": "eclipse-ee4j",
      "eclipse_project": "ee4j",
      "credentials": {
        "provider": "pass"
      }
    },
    {
      "name": "eclipse-egit",
      "github_id": "eclipse-egit",
      "eclipse_project": "technology.egit",
      "credentials": {
        "provider": "pass"
      }
    },
    {
      "name": "eclipse-embed-cdt",
      "github_id": "eclipse-embed-cdt",
      "eclipse_project": "iot.embed-cdt",
      "credentials": {
        "provider": "pass"
      }
    },
    {
      "name": "eclipse-emf",
      "github_id": "eclipse-emf",
      "eclipse_project": "modeling.emf",
      "credentials": {
        "provider": "pass"
      }
    },
    {
      "name": "eclipse-esmf",
      "github_id": "eclipse-esmf",
      "eclipse_project": "dt.esmf",
      "credentials": {
        "provider": "pass"
      }
    },
    {
      "name": "eclipse-gemini",
      "github_id": "eclipse-gemini",
      "eclipse_project": "rt.gemini",
      "credentials": {
        "provider": "pass"
      }
    },
    {
      "name": "eclipse-glsp",
      "github_id": "eclipse-glsp",
      "eclipse_project": "ecd.glsp",
      "credentials": {
        "provider": "pass"
      }
    },
    {
      "name": "eclipse-ibeji",
      "github_id": "eclipse-ibeji",
      "eclipse_project": "automotive.ibeji",
      "credentials": {
        "provider": "pass"
      }
    },
    {
      "name": "eclipse-jdt",
      "github_id": "eclipse-jdt",
      "eclipse_project": "eclipse.jdt",
      "credentials": {
        "provider": "pass"
      }
    },
    {
      "name": "eclipse-jdtls",
      "github_id": "eclipse-jdtls",
      "eclipse_project": "eclipse.jdt.ls",
      "credentials": {
        "provider": "pass"
      }
    },
    {
      "name": "eclipse-jgit",
      "github_id": "eclipse-jgit",
      "eclipse_project": "technology.jgit",
      "credentials": {
        "provider": "pass"
      }
    },
    {
      "name": "eclipse-justj",
      "github_id": "eclipse-justj",
      "eclipse_project": "technology.justj",
      "credentials": {
        "provider": "pass"
      }
    },
    {
      "name": "eclipse-kanto",
      "github_id": "eclipse-kanto",
      "eclipse_project": "iot.kanto",
      "credentials": {
        "provider": "pass"
      }
    },
    {
      "name": "eclipse-keypop",
      "github_id": "eclipse-keypop",
      "eclipse_project": "iot.keypop",
      "credentials": {
        "provider": "pass"
      }
    },
    {
      "name": "eclipse-kuksa",
      "github_id": "eclipse-kuksa",
      "eclipse_project": "automotive.kuksa",
      "credentials": {
        "provider": "pass"
      }
    },
    {
      "name": "eclipse-langium",
      "github_id": "eclipse-langium",
      "eclipse_project": "ecd.langium",
      "credentials": {
        "provider": "pass"
      }
    },
    {
      "name": "eclipse-leda",
      "github_id": "eclipse-leda",
      "eclipse_project": "automotive.leda",
      "credentials": {
        "provider": "pass"
      }
    },
    {
      "name": "eclipse-lsp4j",
      "github_id": "eclipse-lsp4j",
      "eclipse_project": "technology.lsp4j",
      "credentials": {
        "provider": "pass"
      }
    },
    {
      "name": "eclipse-mylyn",
      "github_id": "eclipse-mylyn",
      "eclipse_project": "tools.mylyn",
      "credentials": {
        "provider": "pass"
      }
    },
    {
      "name": "eclipse-nattable",
      "github_id": "eclipse-nattable",
      "eclipse_project": "technology.nebula.nattable",
      "credentials": {
        "provider": "pass"
      }
    },
    {
      "name": "eclipse-oniro4openharmony",
      "github_id": "eclipse-oniro4openharmony",
      "eclipse_project": "oniro.oniro4openharmony",
      "credentials": {
        "provider": "pass"
      }
    },
    {
      "name": "eclipse-oomph",
      "github_id": "eclipse-oomph",
      "eclipse_project": "tools.oomph",
      "credentials": {
        "provider": "pass"
      }
    },
    {
      "name": "eclipse-orbit",
      "github_id": "eclipse-orbit",
      "eclipse_project": "tools.orbit",
      "credentials": {
        "provider": "pass"
      }
    },
    {
      "name": "eclipse-packaging",
      "github_id": "eclipse-packaging",
      "eclipse_project": "technology.packaging",
      "credentials": {
        "provider": "pass"
      }
    },
    {
      "name": "eclipse-pass",
      "github_id": "eclipse-pass",
      "eclipse_project": "technology.pass",
      "credentials": {
        "provider": "pass"
      }
    },
    {
      "name": "eclipse-pdt",
      "github_id": "eclipse-pdt",
      "eclipse_project": "tools.pdt",
      "credentials": {
        "provider": "pass"
      }
    },
    {
      "name": "eclipse-platform",
      "github_id": "eclipse-platform",
      "eclipse_project": "eclipse.platform",
      "credentials": {
        "provider": "pass"
      }
    },
    {
      "name": "eclipse-set",
      "github_id": "eclipse-set",
      "eclipse_project": "technology.set",
      "credentials": {
        "provider": "pass"
      }
    },
    {
      "name": "eclipse-simrel",
      "github_id": "eclipse-simrel",
      "eclipse_project": "foundation-internal.simrel",
      "credentials": {
        "provider": "pass"
      }
    },
    {
      "name": "eclipse-sirius",
      "github_id": "eclipse-sirius",
      "eclipse_project": "modeling.sirius",
      "credentials": {
        "provider": "pass"
      }
    },
    {
      "name": "eclipse-sumo",
      "github_id": "eclipse-sumo",
      "eclipse_project": "automotive.sumo",
      "credentials": {
        "provider": "pass"
      }
    },
    {
      "name": "eclipse-thingweb",
      "github_id": "eclipse-thingweb",
      "eclipse_project": "iot.thingweb",
      "credentials": {
        "provider": "pass"
      }
    },
    {
      "name": "eclipse-tractusx",
      "github_id": "eclipse-tractusx",
      "eclipse_project": "automotive.tractusx",
      "credentials": {
        "provider": "pass"
      }
    },
    {
      "name": "eclipse-uprotocol",
      "github_id": "eclipse-uprotocol",
      "eclipse_project": "automotive.uprotocol",
      "credentials": {
        "provider": "pass"
      }
    },
    {
      "name": "eclipse-velocitas",
      "github_id": "eclipse-velocitas",
      "eclipse_project": "automotive.velocitas",
      "credentials": {
        "provider": "pass"
      }
    },
    {
      "name": "eclipse-vertx",
      "github_id": "eclipse-vertx",
      "eclipse_project": "rt.vertx",
      "credentials": {
        "provider": "pass"
      }
    },
    {
      "name": "eclipse-virgo",
      "github_id": "eclipse-virgo",
      "eclipse_project": "rt.virgo",
      "credentials": {
        "provider": "pass"
      }
    },
    {
      "name": "eclipse-volttron",
      "github_id": "eclipse-volttron",
      "eclipse_project": "iot.volttron",
      "credentials": {
        "provider": "pass"
      }
    },
    {
      "name": "eclipse-wildwebdeveloper",
      "github_id": "eclipse-wildwebdeveloper",
      "eclipse_project": "tools.wildwebdeveloper",
      "credentials": {
        "provider": "pass"
      }
    },
    {
      "name": "eclipse-xpanse",
      "github_id": "eclipse-xpanse",
      "eclipse_project": "technology.xpanse",
      "credentials": {
        "provider": "pass"
      }
    },
    {
      "name": "eclipse-zenoh",
      "github_id": "eclipse-zenoh",
      "eclipse_project": "iot.zenoh",
      "credentials": {
        "provider": "pass"
      }
    },
    {
      "name": "jakartaee",
      "github_id": "jakartaee",
      "eclipse_project": "ee4j.jakartaee-platform",
      "credentials": {
        "provider": "pass"
      }
    },
    {
      "name": "jetty",
      "github_id": "jetty",
      "eclipse_project": "rt.jetty",
      "credentials": {
        "provider": "pass"
      }
    }
  ]
}
