{
  "version": 1,
  "dependencies": [
    {
      "source": {
        "git": {
          "remote": "https://github.com/grafana/jsonnet-libs.git",
          "subdir": "ksonnet-util"
        }
      },
      "version": "master"
    },
    {
      "source": {
        "git": {
          "remote": "https://github.com/jsonnet-libs/docsonnet.git",
          "subdir": "doc-util"
        }
      },
      "version": "master"
    },
    {
      "source": {
        "git": {
          "remote": "https://github.com/jsonnet-libs/k8s-libsonnet.git",
          "subdir": "1.26"
        }
      },
      "version": "main"
    },
    {
      "source": {
        "git": {
          "remote": "https://github.com/jsonnet-libs/xtd.git",
          "subdir": ""
        }
      },
      "version": "master"
    }
  ],
  "legacyImports": true
}
