<?xml version="1.0" encoding="UTF-8" standalone="no"?>
<!-- Created with Inkscape (http://www.inkscape.org/) -->

<svg
   version="1.1"
   id="svg1"
   width="1798.952"
   height="376.16931"
   viewBox="0 0 1798.9521 376.16931"
   xmlns:xlink="http://www.w3.org/1999/xlink"
   xmlns="http://www.w3.org/2000/svg"
   xmlns:svg="http://www.w3.org/2000/svg">
  <defs
     id="defs1">
    <clipPath
       clipPathUnits="userSpaceOnUse"
       id="clipPath2">
      <path
         d="M 0,597.661 H 1650.893 V 0 H 0 Z"
         transform="translate(-193.7892,-401.98101)"
         id="path2" />
    </clipPath>
    <clipPath
       clipPathUnits="userSpaceOnUse"
       id="clipPath4">
      <path
         d="M 0,597.661 H 1650.893 V 0 H 0 Z"
         transform="translate(-193.7892,-230.981)"
         id="path4" />
    </clipPath>
    <clipPath
       clipPathUnits="userSpaceOnUse"
       id="clipPath6">
      <path
         d="M 0,597.661 H 1650.893 V 0 H 0 Z"
         transform="translate(-193.7892,-273.9203)"
         id="path6" />
    </clipPath>
    <clipPath
       clipPathUnits="userSpaceOnUse"
       id="clipPath8">
      <path
         d="M 0,597.661 H 1650.893 V 0 H 0 Z"
         transform="translate(-330.84971,-303.98101)"
         id="path8" />
    </clipPath>
    <clipPath
       clipPathUnits="userSpaceOnUse"
       id="clipPath10">
      <path
         d="M 0,597.661 H 1650.893 V 0 H 0 Z"
         transform="translate(-373.79111,-303.98101)"
         id="path10" />
    </clipPath>
    <clipPath
       clipPathUnits="userSpaceOnUse"
       id="clipPath12">
      <path
         d="M 0,597.661 H 1650.893 V 0 H 0 Z"
         transform="translate(-193.7892,-358.92031)"
         id="path12" />
    </clipPath>
    <clipPath
       clipPathUnits="userSpaceOnUse"
       id="clipPath14">
      <path
         d="M 0,597.661 H 1650.893 V 0 H 0 Z"
         transform="translate(-345.82821,-406.09411)"
         id="path14" />
    </clipPath>
    <clipPath
       clipPathUnits="userSpaceOnUse"
       id="clipPath16">
      <path
         d="M 0,597.661 H 1650.893 V 0 H 0 Z"
         transform="translate(-339.13491,-410.05121)"
         id="path16" />
    </clipPath>
    <clipPath
       clipPathUnits="userSpaceOnUse"
       id="clipPath18">
      <path
         d="M 0,597.661 H 1650.893 V 0 H 0 Z"
         transform="translate(-333.68171,-413.11181)"
         id="path18" />
    </clipPath>
    <clipPath
       clipPathUnits="userSpaceOnUse"
       id="clipPath20">
      <path
         d="M 0,597.661 H 1650.893 V 0 H 0 Z"
         transform="translate(-332.39661,-413.82671)"
         id="path20" />
    </clipPath>
    <clipPath
       clipPathUnits="userSpaceOnUse"
       id="clipPath22">
      <path
         d="M 0,597.661 H 1650.893 V 0 H 0 Z"
         transform="translate(-306.41421,-378.23681)"
         id="path22" />
    </clipPath>
    <clipPath
       clipPathUnits="userSpaceOnUse"
       id="clipPath24">
      <path
         d="M 0,597.661 H 1650.893 V 0 H 0 Z"
         transform="translate(-336.29111,-411.66261)"
         id="path24" />
    </clipPath>
    <clipPath
       clipPathUnits="userSpaceOnUse"
       id="clipPath26">
      <path
         d="M 0,597.661 H 1650.893 V 0 H 0 Z"
         transform="translate(-342.11241,-408.31091)"
         id="path26" />
    </clipPath>
    <clipPath
       clipPathUnits="userSpaceOnUse"
       id="clipPath28">
      <path
         d="M 0,597.661 H 1650.893 V 0 H 0 Z"
         transform="translate(-327.99621,-242.19581)"
         id="path28" />
    </clipPath>
    <clipPath
       clipPathUnits="userSpaceOnUse"
       id="clipPath30">
      <path
         d="M 0,597.661 H 1650.893 V 0 H 0 Z"
         transform="translate(-332.39661,-413.82671)"
         id="path30" />
    </clipPath>
    <clipPath
       clipPathUnits="userSpaceOnUse"
       id="clipPath32">
      <path
         d="M 0,597.661 H 1650.893 V 0 H 0 Z"
         transform="translate(-256.42201,-303.98101)"
         id="path32" />
    </clipPath>
    <clipPath
       clipPathUnits="userSpaceOnUse"
       id="clipPath34">
      <path
         d="M 0,597.661 H 1650.893 V 0 H 0 Z"
         transform="translate(-306.49621,-378.38921)"
         id="path34" />
    </clipPath>
    <clipPath
       clipPathUnits="userSpaceOnUse"
       id="clipPath36">
      <path
         d="M 0,597.661 H 1650.893 V 0 H 0 Z"
         transform="translate(-630.93761,-337.46131)"
         id="path36" />
    </clipPath>
    <clipPath
       clipPathUnits="userSpaceOnUse"
       id="clipPath38">
      <path
         d="M 0,597.661 H 1650.893 V 0 H 0 Z"
         transform="translate(-707.12022,-317.66541)"
         id="path38" />
    </clipPath>
    <clipPath
       clipPathUnits="userSpaceOnUse"
       id="clipPath40">
      <path
         d="M 0,597.661 H 1650.893 V 0 H 0 Z"
         transform="translate(-804.13885,-341.96911)"
         id="path40" />
    </clipPath>
    <clipPath
       clipPathUnits="userSpaceOnUse"
       id="clipPath42">
      <path
         d="M 0,597.661 H 1650.893 V 0 H 0 Z"
         transform="translate(-929.22572,-316.09711)"
         id="path42" />
    </clipPath>
    <clipPath
       clipPathUnits="userSpaceOnUse"
       id="clipPath44">
      <path
         d="M 0,597.661 H 1650.893 V 0 H 0 Z"
         transform="translate(-999.589,-329.42521)"
         id="path44" />
    </clipPath>
    <clipPath
       clipPathUnits="userSpaceOnUse"
       id="clipPath46">
      <path
         d="M 0,597.661 H 1650.893 V 0 H 0 Z"
         transform="translate(-1089.6906,-317.66541)"
         id="path46" />
    </clipPath>
    <clipPath
       clipPathUnits="userSpaceOnUse"
       id="clipPath48">
      <path
         d="M 0,597.661 H 1650.893 V 0 H 0 Z"
         id="path48" />
    </clipPath>
    <clipPath
       clipPathUnits="userSpaceOnUse"
       id="clipPath50">
      <path
         d="M 0,597.661 H 1650.893 V 0 H 0 Z"
         transform="translate(-1271.3995,-281.9936)"
         id="path50" />
    </clipPath>
    <clipPath
       clipPathUnits="userSpaceOnUse"
       id="clipPath52">
      <path
         d="M 0,597.661 H 1650.893 V 0 H 0 Z"
         transform="translate(-1350.3673,-341.96911)"
         id="path52" />
    </clipPath>
    <clipPath
       clipPathUnits="userSpaceOnUse"
       id="clipPath54">
      <path
         d="M 0,597.661 H 1650.893 V 0 H 0 Z"
         transform="translate(-1475.4543,-316.09711)"
         id="path54" />
    </clipPath>
  </defs>
  <g
     id="layer-MC0"
     transform="translate(-207.2576,-203.50801)">
    <path
       id="path1"
       d="M 0,0 C -7.07,0 -13.775,1.58 -19.797,4.389 -22.73,-3.418 -25.334,-11.383 -27.602,-19.488 -19.096,-23.033 -9.773,-25 0,-25 36.648,-25 66.967,2.529 71.418,37.99 63.348,40.017 55.145,41.709 46.822,43.049 44.809,18.977 24.584,0 0,0"
       style="fill:#ffffff;fill-opacity:1;fill-rule:nonzero;stroke:none"
       transform="matrix(1.3333333,0,0,-1.3333333,258.3856,260.90667)"
       clip-path="url(#clipPath2)" />
    <path
       id="path3"
       d="m 0,0 c -9.777,0 -19.102,-1.967 -27.609,-5.514 2.265,-8.105 4.869,-16.072 7.802,-23.879 C -13.783,-26.58 -7.074,-25 0,-25 c 24.594,0 44.824,-18.992 46.825,-43.078 8.321,1.34 16.525,3.029 24.595,5.058 C 66.984,-27.545 36.658,0 0,0"
       style="fill:#ffffff;fill-opacity:1;fill-rule:nonzero;stroke:none"
       transform="matrix(1.3333333,0,0,-1.3333333,258.3856,488.90667)"
       clip-path="url(#clipPath4)" />
    <path
       id="path5"
       d="m 0,0 c -12.621,0 -24.772,-2.051 -36.143,-5.826 1.038,-8.424 2.436,-16.735 4.176,-24.92 9.94,3.787 20.715,5.867 31.967,5.867 44.902,0 82.232,-33.033 88.973,-76.074 8.06,2.576 15.968,5.492 23.707,8.732 C 102.104,-39.688 55.602,0 0,0"
       style="fill:#ffffff;fill-opacity:1;fill-rule:nonzero;stroke:none"
       transform="matrix(1.3333333,0,0,-1.3333333,258.3856,431.65427)"
       clip-path="url(#clipPath6)" />
    <path
       id="path7"
       d="m 0,0 c 0,-34.164 14.987,-64.887 38.727,-85.959 6.721,5.082 13.215,10.449 19.466,16.082 C 37.88,-53.352 24.879,-28.168 24.879,0 c 0,28.158 12.992,53.334 33.295,69.861 C 51.922,75.494 45.428,80.859 38.707,85.939 14.979,64.869 0,34.152 0,0"
       style="fill:#ffffff;fill-opacity:1;fill-rule:nonzero;stroke:none"
       transform="matrix(1.3333333,0,0,-1.3333333,441.13293,391.57333)"
       clip-path="url(#clipPath8)" />
    <path
       id="path9"
       d="m 0,0 c -0.002,-23.328 11.159,-44.09 28.412,-57.256 5.86,5.981 11.469,12.205 16.801,18.668 C 33.008,-30.09 24.998,-15.967 25,0 25,15.959 33,30.076 45.195,38.576 39.863,45.039 34.252,51.264 28.393,57.242 11.152,44.074 0,23.318 0,0"
       style="fill:#ffffff;fill-opacity:1;fill-rule:nonzero;stroke:none"
       transform="matrix(1.3333333,0,0,-1.3333333,498.38813,391.57333)"
       clip-path="url(#clipPath10)" />
    <path
       id="path11"
       d="m 0,0 c -11.25,0 -22.022,2.08 -31.959,5.865 -1.742,-8.183 -3.141,-16.494 -4.18,-24.918 11.369,-3.775 23.52,-5.826 36.139,-5.826 55.592,0 102.088,39.672 112.674,92.19 -7.736,3.242 -15.645,6.158 -23.705,8.734 C 82.217,33.018 44.893,0 0,0"
       style="fill:#ffffff;fill-opacity:1;fill-rule:nonzero;stroke:none"
       transform="matrix(1.3333333,0,0,-1.3333333,258.3856,318.32093)"
       clip-path="url(#clipPath12)" />
    <path
       id="path13"
       d="M 0,0 C -0.432,0.264 -0.871,0.516 -1.305,0.777 -0.869,0.514 -0.439,0.244 -0.006,-0.02 -0.004,-0.014 -0.002,-0.008 0,0"
       style="fill:#ffffff;fill-opacity:1;fill-rule:nonzero;stroke:none"
       transform="matrix(1.3333333,0,0,-1.3333333,461.10427,255.42253)"
       clip-path="url(#clipPath14)" />
    <path
       id="path15"
       d="M 0,0 C 0.996,-0.574 1.988,-1.156 2.977,-1.74 1.988,-1.156 0.996,-0.572 0,0"
       style="fill:#ffffff;fill-opacity:1;fill-rule:nonzero;stroke:none"
       transform="matrix(1.3333333,0,0,-1.3333333,452.17987,250.1464)"
       clip-path="url(#clipPath16)" />
    <path
       id="path17"
       d="M 0,0 C 0.873,-0.477 1.742,-0.961 2.609,-1.449 1.741,-0.963 0.873,-0.477 0,0"
       style="fill:#ffffff;fill-opacity:1;fill-rule:nonzero;stroke:none"
       transform="matrix(1.3333333,0,0,-1.3333333,444.90893,246.0656)"
       clip-path="url(#clipPath18)" />
    <path
       id="path19"
       d="M 0,0 C -0.006,-0.006 -0.01,-0.01 -0.01,-0.01 0.418,-0.248 0.854,-0.479 1.285,-0.715 0.855,-0.479 0.432,-0.234 0,0"
       style="fill:#ffffff;fill-opacity:1;fill-rule:nonzero;stroke:none"
       transform="matrix(1.3333333,0,0,-1.3333333,443.19547,245.1124)"
       clip-path="url(#clipPath20)" />
    <path
       id="path21"
       d="M 0,0 C 1.836,2.914 3.566,5.902 5.178,8.961 3.357,6.037 1.631,3.049 0,0"
       style="fill:#ffffff;fill-opacity:1;fill-rule:nonzero;stroke:none"
       transform="matrix(1.3333333,0,0,-1.3333333,408.55227,292.5656)"
       clip-path="url(#clipPath22)" />
    <path
       id="path23"
       d="M 0,0 C 0.949,-0.531 1.898,-1.068 2.844,-1.611 1.899,-1.066 0.949,-0.533 0,0"
       style="fill:#ffffff;fill-opacity:1;fill-rule:nonzero;stroke:none"
       transform="matrix(1.3333333,0,0,-1.3333333,448.38813,247.99787)"
       clip-path="url(#clipPath24)" />
    <path
       id="path25"
       d="M 0,0 C 0.806,-0.477 1.61,-0.955 2.411,-1.439 1.61,-0.955 0.806,-0.478 0,0"
       style="fill:#ffffff;fill-opacity:1;fill-rule:nonzero;stroke:none"
       transform="matrix(1.3333333,0,0,-1.3333333,456.14987,252.4668)"
       clip-path="url(#clipPath26)" />
    <path
       id="path27"
       d="M 0,0 C 1.613,-3.063 3.339,-6.055 5.178,-8.971 3.545,-5.92 1.821,-2.928 0,0"
       style="fill:#ffffff;fill-opacity:1;fill-rule:nonzero;stroke:none"
       transform="matrix(1.3333333,0,0,-1.3333333,437.32827,473.9536)"
       clip-path="url(#clipPath28)" />
    <path
       id="path29"
       d="m 0,0 c -27.566,-28.449 -44.564,-67.197 -44.564,-109.846 0,-6.441 0.394,-12.791 1.147,-19.033 15.519,-11.756 28.807,-26.307 39.107,-42.9 -9.782,18.509 -15.338,39.582 -15.338,61.933 0,38.02 16.035,72.363 41.693,96.631 C 14.908,-8.5 7.555,-4.086 0,0"
       style="fill:#ffffff;fill-opacity:1;fill-rule:nonzero;stroke:none"
       transform="matrix(1.3333333,0,0,-1.3333333,443.19547,245.1124)"
       clip-path="url(#clipPath30)" />
    <path
       id="path31"
       d="m 0,0 c -15.725,-6.818 -32.767,-11.148 -50.63,-12.498 57.528,-5.168 104.619,-47.111 117.526,-102.08 7.706,3.822 15.218,7.973 22.518,12.437 C 76.453,-56.223 43.201,-18.733 0,0"
       style="fill:#ffffff;fill-opacity:1;fill-rule:nonzero;stroke:none"
       transform="matrix(1.3333333,0,0,-1.3333333,341.896,391.57333)"
       clip-path="url(#clipPath32)" />
    <path
       id="path33"
       d="m 0,0 c -23.557,-37.479 -65.264,-62.449 -112.707,-62.449 -13.135,0 -25.826,1.922 -37.82,5.484 -0.342,-5.777 -0.526,-11.596 -0.526,-17.459 0,-2.762 0.047,-5.512 0.123,-8.256 12.244,-3.054 25.047,-4.685 38.223,-4.685 35.719,0 68.701,11.922 95.19,31.99 C -15.125,-35.563 -9.051,-16.871 0,0"
       style="fill:#ffffff;fill-opacity:1;fill-rule:nonzero;stroke:none"
       transform="matrix(1.3333333,0,0,-1.3333333,408.6616,292.3624)"
       clip-path="url(#clipPath34)" />
    <path
       id="path35"
       d="m 0,0 c -8.232,6.859 -18.032,11.563 -28.812,11.563 -22.736,0 -39.2,-19.403 -39.2,-43.511 0,-25.284 13.916,-43.512 39.004,-43.512 10.388,0 20.972,4.508 28.812,11.956 L 17.836,-86.24 c -14.112,-10.976 -30.576,-16.659 -48.216,-16.659 -41.356,0 -71.344,29.595 -71.344,70.951 0,39.984 32.536,70.952 72.716,70.952 16.659,0 29.791,-5.292 44.295,-14.504 z"
       style="fill:#ffffff;fill-opacity:1;fill-rule:nonzero;stroke:none"
       transform="matrix(1.3333333,0,0,-1.3333333,841.25013,346.93293)"
       clip-path="url(#clipPath36)" />
    <path
       id="path37"
       d="m 0,0 c -14.112,0 -23.324,-12.152 -23.324,-28.225 0,-16.071 9.212,-28.223 23.324,-28.223 14.112,0 23.324,12.152 23.324,28.223 C 23.324,-12.152 14.112,0 0,0 m 55.468,-28.225 c 0,-30.967 -22.932,-54.879 -55.468,-54.879 -32.536,0 -55.468,23.912 -55.468,54.879 0,30.969 22.932,54.88 55.468,54.88 32.536,0 55.468,-23.911 55.468,-54.88"
       style="fill:#ffffff;fill-opacity:1;fill-rule:nonzero;stroke:none"
       transform="matrix(1.3333333,0,0,-1.3333333,942.82693,373.32747)"
       clip-path="url(#clipPath38)" />
    <path
       id="path39"
       d="m 0,0 2.744,-13.524 c 8.819,11.76 21.363,15.876 32.144,15.876 10.192,0 20.188,-5.488 27.048,-13.916 8.624,-10.976 9.408,-24.304 9.408,-39.004 v -54.488 H 39.592 v 53.312 c 0,6.86 0,14.896 -2.352,20.188 -2.352,5.292 -7.252,7.252 -12.544,7.252 -6.86,0 -15.288,-3.724 -19.6,-10.976 v -69.776 H -26.656 V 0 Z"
       style="fill:#ffffff;fill-opacity:1;fill-rule:nonzero;stroke:none"
       transform="matrix(1.3333333,0,0,-1.3333333,1072.1851,340.92253)"
       clip-path="url(#clipPath40)" />
    <path
       id="path41"
       d="m 0,0 v -38.416 c 0,-3.332 0,-6.272 0.588,-9.407 0.783,-4.313 2.743,-7.057 7.252,-7.057 4.508,0 7.643,0.981 11.367,2.941 l 9.996,-23.128 c -7.447,-4.313 -18.227,-6.468 -27.048,-6.468 -17.051,0 -29.008,9.603 -32.535,24.499 -1.177,5.097 -1.372,10.78 -1.372,16.268 V 0 h -11.956 v 25.872 h 11.956 l 5.88,22.54 H 0 V 25.872 H 25.871 V 0 Z"
       style="fill:#ffffff;fill-opacity:1;fill-rule:nonzero;stroke:none"
       transform="matrix(1.3333333,0,0,-1.3333333,1238.9676,375.41853)"
       clip-path="url(#clipPath42)" />
    <path
       id="path43"
       d="m 0,0 c 5.881,9.016 13.721,14.896 23.717,14.896 5.292,0 10.387,-1.176 14.111,-2.745 l -7.84,-26.263 c -2.94,1.568 -6.467,2.352 -9.996,2.352 -7.055,0 -14.307,-3.92 -17.836,-9.604 V -92.512 H -29.596 V 12.544 h 26.853 z"
       style="fill:#ffffff;fill-opacity:1;fill-rule:nonzero;stroke:none"
       transform="matrix(1.3333333,0,0,-1.3333333,1332.7853,357.64773)"
       clip-path="url(#clipPath44)" />
    <path
       id="path45"
       d="m 0,0 c -14.112,0 -23.324,-12.152 -23.324,-28.225 0,-16.071 9.212,-28.223 23.324,-28.223 14.112,0 23.324,12.152 23.324,28.223 C 23.324,-12.152 14.112,0 0,0 m 55.468,-28.225 c 0,-30.967 -22.932,-54.879 -55.468,-54.879 -32.536,0 -55.468,23.912 -55.468,54.879 0,30.969 22.932,54.88 55.468,54.88 32.536,0 55.468,-23.911 55.468,-54.88"
       style="fill:#ffffff;fill-opacity:1;fill-rule:nonzero;stroke:none"
       transform="matrix(1.3333333,0,0,-1.3333333,1452.9208,373.32747)"
       clip-path="url(#clipPath46)" />
    <path
       id="path47"
       d="m 1192.079,236.913 h -31.752 v 146.999 h 31.752 z"
       style="fill:#ffffff;fill-opacity:1;fill-rule:nonzero;stroke:none"
       transform="matrix(1.3333333,0,0,-1.3333333,0,796.88133)"
       clip-path="url(#clipPath48)" />
    <path
       id="path49"
       d="m 0,0 c -4.509,0.979 -8.429,1.764 -12.544,1.764 -9.604,0 -19.992,-4.117 -19.992,-15.288 0,-7.84 6.86,-12.741 14.307,-12.741 7.449,0 12.937,2.744 18.229,7.645 z m 5.096,-45.08 -2.941,8.232 c -6.271,-8.036 -17.248,-10.584 -27.635,-10.584 -19.6,0 -38.024,12.544 -38.024,33.908 0,25.48 24.108,33.515 45.472,33.515 5.88,0 12.152,-0.783 18.032,-2.155 v 0.784 c 0,12.151 -4.704,19.796 -19.208,19.796 -11.76,0 -21.756,-4.312 -31.164,-9.017 l -8.232,21.756 c 14.308,7.057 30.379,11.172 46.452,11.172 28.811,0 43.904,-17.052 43.904,-44.491 V -45.08 Z"
       style="fill:#ffffff;fill-opacity:1;fill-rule:nonzero;stroke:none"
       transform="matrix(1.3333333,0,0,-1.3333333,1695.1993,420.88987)"
       clip-path="url(#clipPath50)" />
    <path
       id="path51"
       d="m 0,0 2.744,-13.524 c 8.819,11.76 21.363,15.876 32.144,15.876 10.192,0 20.188,-5.488 27.048,-13.916 8.624,-10.976 9.408,-24.304 9.408,-39.004 v -54.488 H 39.592 v 53.312 c 0,6.86 0,14.896 -2.352,20.188 -2.352,5.292 -7.252,7.252 -12.544,7.252 -6.86,0 -15.288,-3.724 -19.6,-10.976 v -69.776 H -26.656 V 0 Z"
       style="fill:#ffffff;fill-opacity:1;fill-rule:nonzero;stroke:none"
       transform="matrix(1.3333333,0,0,-1.3333333,1800.4897,340.92253)"
       clip-path="url(#clipPath52)" />
    <path
       id="path53"
       d="m 0,0 v -38.416 c 0,-3.332 0,-6.272 0.588,-9.407 0.783,-4.313 2.743,-7.057 7.252,-7.057 4.508,0 7.643,0.981 11.367,2.941 l 9.996,-23.128 c -7.447,-4.313 -18.227,-6.468 -27.048,-6.468 -17.051,0 -29.008,9.603 -32.535,24.499 -1.177,5.097 -1.372,10.78 -1.372,16.268 V 0 h -11.956 v 25.872 h 11.956 l 5.88,22.54 H 0 V 25.872 H 25.871 V 0 Z"
       style="fill:#ffffff;fill-opacity:1;fill-rule:nonzero;stroke:none"
       transform="matrix(1.3333333,0,0,-1.3333333,1967.2723,375.41853)"
       clip-path="url(#clipPath54)" />
  </g>
</svg>
