{
	"adopters": [
		{
			"name": "Renesas",
			"homepage_url": "https://renesas.com/",
			"logo": "logo-renesas.svg",
			"logo_white": "logo-renesas-white.svg",
			"projects": [
				"ecd.theia",
				"ecd.emfcloud",
				"ecd.glsp"
			]
		},		
		{
			"name": "96Boards",
			"homepage_url": "https://www.96boards.org/",
			"logo": "logo-96boards.png",
			"logo_white": "logo-96boards-white.png",
			"projects": [
				"iot.cyclonedds"
			]
		},
		{
			"name": "Above Robotics",
			"homepage_url": "https://www.aboverobotics.com/",
			"logo": "logo-above-robotices.png",
			"logo_white": "logo-above-robotices-white.png",
			"projects": [
				"iot.cyclonedds"
			]
		},
		{
			"name": "Acquia",
			"homepage_url": "https://www.acquia.com/",
			"logo": "logo-acquia.png",
			"logo_white": "logo-acquia-white.png",
			"projects": [
				"ecd.theia"
			]
		},
		{
			"name": "ADLINK Technology",
			"homepage_url": "https://www.adlinktech.com",
			"logo": "logo-adlink.svg",
			"logo_white": "logo-adlink-white.png",
			"projects": [
				"iot.cyclonedds",
				"technology.iceoryx",
				"iot.zenoh"
			]
		},
		{
			"name": "AiP Safe",
			"homepage_url": "https://www.aipsafe.cz/",
			"logo": "logo-aipsafe.png",
			"logo_white": "logo-aipsafe-white.png",
			"projects": [
				"adoptium.temurin"
			]
		},
		{
			"name": "Alias Robotics",
			"homepage_url": "https://aliasrobotics.com/",
			"logo": "logo-alias.png",
			"logo_white": "logo-alias-white.png",
			"projects": [
				"iot.cyclonedds"
			]
		},
		{
			"name": "Aloxy",
			"homepage_url": "http://www.aloxy.io/",
			"logo": "logo-aloxy.svg",
			"logo_white": "logo-aloxy-white.svg",
			"projects": [
				"iot.ditto",
				"iot.vorto",
				"iot.hono"
			]
		},
		{
			"name": "Ampere Computing LLC.",
			"homepage_url": "https://amperecomputing.com/",
			"logo": "logo-amperecomputing.png",
			"logo_white": "logo-amperecomputing-white.png",
			"projects": [
				"iot.cyclonedds",
				"technology.iceoryx",
				"iot.zenoh"
			]
		},
		{
			"name": "AnyWare",
			"homepage_url": "https://any-ware.nl/",
			"logo": "logo-anyware.svg",
			"logo_white": "logo-anyware-white.svg",
			"projects": [
				"iot.leshan"
			]
		},
		{
			"name": "Apache SkyWalking",
			"homepage_url": "https://skywalking.apache.org/",
			"logo": "logo-apache-skywalking.svg",
			"logo_white": "",
			"projects": [
				"adoptium.temurin"
			]
		},
		{
			"name": "Apex.AI",
			"homepage_url": "https://www.apex.ai/",
			"logo": "logo-apexai.png",
			"logo_white": "logo-apexai-white.png",
			"projects": [
				"iot.cyclonedds",
				"technology.iceoryx"
			]
		},
        {
            "name": "Arburg",
            "homepage_url": "https://www.arburg.com/en/",
            "logo": "logo-arburg.png",
            "logo_white": "logo-arburg-white.png",
            "projects": [
                "iot.streamsheets"
            ]
        },
        {
            "name": "Archeion",
            "homepage_url": "https://archeion.tech/",
            "logo": "logo-archeion.svg",
            "logo_white": "logo-archeion-white.svg",
            "projects": [
                "iot.thingweb"
            ]
        },
		{
			"name": "Arduino",
			"homepage_url": "https://www.arduino.cc/en/software#future-version-of-the-arduino-ide",
			"logo": "logo-arduino.svg",
			"logo_white": "logo-arduino-white.svg",
			"projects": [
				"ecd.theia"
			]
		},
		{
			"name": "Atlassian",
			"homepage_url": "https://www.atlassian.com/",
			"logo": "logo-atlassian.svg",
			"logo_white": "logo-atlassian-white.svg",
			"projects": [
				"adoptium.temurin"
			]
		},
		{
			"name": "AutoCore.ai",
			"homepage_url": "http://www.autocore.ai/",
			"logo": "autocore-ai.png",
			"logo_white": "autocore-ai-white.png",
			"projects": [
				"iot.cyclonedds"
			]
		},
		{
			"name": "Autoware Foundation",
			"homepage_url": "https://www.autoware.org/",
			"logo": "logo-autoware.png",
			"logo_white": "logo-autoware-white.png",
			"projects": [
				"iot.cyclonedds"
			]
		},
		{
			"name": "Arm",
			"homepage_url": "https://www.arm.com/",
			"logo": "logo-arm.svg",
			"logo_white": "logo-arm-white.svg",
			"projects": [
				"adoptium.temurin",
				"iot.cyclonedds",
				"ecd.theia"
			]
		},
		{
			"name": "Axon Ivy",
			"homepage_url": "https://www.axonivy.com/",
			"logo": "axonivy-logo.svg",
			"logo_white": "axonivy-logo-white.svg",
			"projects": [
				"ecd.glsp"
			]
		},
		{
			"name": "Avantronics",
			"homepage_url": "https://avantronics.com.mx/",
			"logo": "logo-avantronics.png",
			"logo_white": "logo-avantronics-white.png",
			"projects": [
				"iot.keyple"
			]
		},
		{
			"name": "beyonnex.io",
			"homepage_url": "https://beyonnex.io",
			"logo": "logo-beyonnex.svg",
			"logo_white": "logo-beyonnex-white.svg",
			"projects": [
				"iot.ditto"
			]
		},
		{
			"name": "Billettique Services",
			"homepage_url": "https://billettiqueservices.com/",
			"logo": "logo-billettique-services.png",
			"logo_white": "logo-billetique-services-white.png",
			"projects": [
				"iot.keyple"
			]
		},
		{
			"name": "Binero Group",
			"homepage_url": "https://binero.com/en",
			"logo": "logo-binero.png",
			"logo_white": "logo-binero-white.png",
			"projects": [
				"adoptium.temurin"
			]
		},		
		{
			"name": "Blockbax",
			"homepage_url": "https://blockbax.com/",
			"logo": "logo-blockbax.svg",
			"logo_white": "logo-blockbax-white.svg",
			"projects": [
				"adoptium.temurin"
			]
		},
		{
			"name": "Bluebird",
			"homepage_url": "https://bluebirdcorp.com/?lang=US",
			"logo": "logo-bluebird.png",
			"logo_white": "logo-bluebird-white.png",
			"projects": [
				"iot.keyple"
			]
		},
		{
			"name": "Bosch",
			"homepage_url": "https://www.bosch.com",
			"logo": "logo-bosch.svg",
			"logo_white": "logo-bosch-white.svg",
			"projects": [
				"iot.cyclonedds",
				"technology.iceoryx"
			]
		},
		{
			"name": "Bosch.IO",
			"homepage_url": "https://bosch-iot-suite.com",
			"logo": "logo-bosch.svg",
			"logo_white": "logo-bosch-white.svg",
			"projects": [
				"iot.ditto",
				"iot.vorto",
				"iot.hono",
				"iot.hawkbit",
				"iot.leshan",
				"iot.californium",
				"iot.zenoh"
			]
		},
		{
			"name": "Bosch Rexroth AG",
			"homepage_url": "https://www.boschrexroth.com/",
			"logo": "logo-bosch-rexroth-ag.png",
			"logo_white": "logo-bosch-rexroth-ag-white.png",
			"projects": [
				"iot.mosquitto"
			]
		},
		{
			"name": "Box Robotics, Inc.",
			"homepage_url": "http://boxrobotics.ai",
			"logo": "logo-box-robotics.png",
			"logo_white": "logo-box-robotics-white.png",
			"projects": [
				"iot.cyclonedds"
			]
		},
		{
			"name": "Brisa Robotica",
			"homepage_url": "https://brisa.tech",
			"logo": "logo-brisa.svg",
			"logo_white": "logo-brisa-white.svg",
			"projects": [
				"iot.cyclonedds"
			]
		},
		{
			"name": "Broadcom Inc.",
			"homepage_url": "https://www.broadcom.com/solutions/mainframe",
			"logo": "logo-broadcom.png",
			"logo_white": "logo-broadcom-white.png",
			"projects": [
				"ecd.che",
				"ecd.theia",
				"ecd.openvsx"
			]
		},
		{
			"name": "Calypso Networks Association",
			"homepage_url": "https://calypsonet.org/keyple-resources/",
			"logo": "logo-calypsonet.png",
			"logo_white": "",
			"projects": [
				"iot.keyple"
			]
		},
		{
			"name": "CarGurus",
			"homepage_url": "https://www.cargurus.com/",
			"logo": "logo-cargurus.png",
			"logo_white": "",
			"projects": [
				"adoptium.temurin"
			]
		},
		{
			"name": "Cassens",
			"homepage_url": "https://www.cassens.com/",
			"logo": "logo-cassens.png",
			"logo_white": "logo-cassens-white.png",
			"projects": [
				"iot.mosquitto"
			]
		},
		{
			"name": "Cedalo AG",
			"homepage_url": "http://www.cedalo.com/",
			"logo": "logo-cedaloag.png",
			"logo_white": "logo-cedaloag-white.png",
			"projects": [
				"iot.mosquitto",
				"iot.streamsheets"
			]
		},
		{
			"name": "CentraleSupelec, CNRS, Signals and Systems Laboratory",
			"homepage_url": "https://www.l2s.centralesupelec.fr/en/",
			"logo": "logo-centralesupelec.png",
			"logo_white": "logo-centralesupelec-white.png",
			"projects": [
				"iot.zenoh"
			]
		},
		{
			"name": "codbex",
			"homepage_url": "https://www.codbex.com",
			"logo": "logo-codbex.png",
			"logo_white": "logo-codbex-white.png",
			"projects": [
				"ecd.dirigible"
			]
		},
		{
			"name": "Coder",
			"homepage_url": "https://coder.com/",
			"logo": "logo-coder.png",
			"logo_white": "logo-coder-white.png",
			"projects": [
				"ecd.openvsx"
			]
		},
		{
			"name": "CONTACT Software",
			"homepage_url": "https://www.contact-software.com/en/products/iot-platform-for-digital-business-models/",
			"logo": "logo-contactsoftware.png",
			"logo_white": "logo-contactsoftware-white.png",
			"projects": [
				"iot.kura",
				"iot.kapua"
			]
		},
		{
			"name": "Controlant hf.",
			"homepage_url": "https://www.controlant.com/",
			"logo": "logo-controlant.svg",
			"logo_white": "logo-controlant-white.svg",
			"projects": [
				"iot.hono"
			]
		},
		{
			"name": "Coppernic",
			"homepage_url": "https://www.coppernic.fr/coppernicactus/coppernic-au-meetup-sdk-eclipse-keyple/",
			"logo": "logo-coppernic.png",
			"logo_white": "logo-coppernic-white.png",
			"projects": [
				"iot.keyple"
			]
		},
		{
			"name": "cosmoONE",
			"homepage_url": "https://www.cosmo-one.gr/",
			"logo": "logo-cosmoone.png",
			"logo_white": "logo-cosmoone-white.png",
			"projects": [
				"adoptium.temurin"
			]
		},
		{
			"name": "CS GROUP - France",
			"homepage_url": "https://www.csgroup.eu",
			"logo": "logo-cs_group.svg",
			"logo_white": "logo-cs_group-white.svg",
			"projects": [
				"ecd.theia",
				"ecd.emfcloud"
			]
		},
		{
			"name": "CTS",
			"homepage_url": "https://cts-strasbourg.eu/en/",
			"logo": "logo-cts.png",
			"logo_white": "",
			"projects": [
				"iot.keyple"
			]
		},
        {
            "name": "Cumulocity IoT by Software AG",
            "homepage_url": "https://www.softwareag.cloud/site/product/cumulocity-iot.html",
            "logo": "logo-cumulocity-by-softwareag.svg",
            "logo_white": "logo-cumulocity-by-softwareag-white.svg",
            "projects": [
                "iot.leshan"
            ]
        },
		{
			"name": "Delphix",
			"homepage_url": "https://www.delphix.com",
			"logo": "logo-delphix.svg",
			"logo_white": "",
			"projects": [
				"adoptium.temurin"
			]
		},
		{
			"name": "Digital Lights",
			"homepage_url": "https://lights.digital",
			"logo": "logo-digital-lights.png",
			"logo_white": "logo-digital-lights-white.png",
			"projects": [
				"ecd.dirigible"
			]
		},
		{
			"name": "Dynatrace",
			"homepage_url": "https://www.dynatrace.com/",
			"logo": "logo-dynatrace.png",
			"logo_white": "logo-dynatrace-white.png",
			"projects": [
				"adoptium.temurin"
			]
		},
		{
			"name": "Doping Technology",
			"homepage_url": "https://dopingtech.net",
			"logo": "logo-doping-tech.svg",
			"logo_white": "",
			"projects": [
				"adoptium.temurin"
			]
		},
		{
			"name": "EclipseSource",
			"homepage_url": "https://eclipsesource.com/",
			"logo": "logo-es.svg",
			"logo_white": "logo-es-white.svg",
			"projects": [
				"iot.cyclonedds",
				"ecd.che",
				"ecd.theia",
				"ecd.emfcloud",
				"ecd.glsp",
				"ecd.sprotty"
			]
		},
		{
			"name": "Eclipse Hono project",
			"homepage_url": "https://www.eclipse.org/hono/",
			"logo": "logo-hono.svg",
			"logo_white": "logo-hono-white.svg",
			"projects": [
				"iot.californium"
			]
		},
        {
            "name": "Eckl Electric",
            "homepage_url": "https://www.getstokt.com/",
            "logo": "logo-eckl-electric.png",
            "logo_white": "logo-eckl-electric-white.png",
            "projects": [
                "iot.mosquitto"
            ]
        },
        {
            "name": "EcoMobility",
            "homepage_url": "https://www.ecomobility-project.eu/",
            "logo": "logo-eco-mobility.png",
            "logo_white": "",
            "projects": [
                "iot.zenoh"
            ]
        },
		{
			"name": "EdgeIQ",
			"homepage_url": "https://www.edgeiq.ai/",
			"logo": "logo-edge-iq.svg",
			"logo_white": "logo-edge-iq-white.svg",
			"projects": [
				"iot.leshan"
			]
		},
		{
			"name": "Ekumen",
			"homepage_url": "https://www.ekumenlabs.com/",
			"logo": "logo-ekumen.png",
			"logo_white": "logo-ekumen-white.png",
			"projects": [
				"iot.cyclonedds"
			]
		},
        {
            "name": "EMPYREAN",
            "homepage_url": "https://empyrean-horizon.eu/",
            "logo": "logo-empyrean.png",
            "logo_white": "",
            "projects": [
                "iot.zenoh"
            ]
        },
		{
			"name": "Entiros",
			"homepage_url": "https://entiros.se/",
			"logo": "logo-entiros.png",
			"logo_white": "logo-entiros-white.png",
			"projects": [
				"iot.mosquitto"
			]
		},
		{
			"name": "Ericsson",
			"homepage_url": "https://www.ericsson.com/en/networks/offerings/cellular-iot",
			"logo": "logo-ericsson.svg",
			"logo_white": "logo-ericsson-white.svg",
			"projects": [
				"ecd.openvsx",
				"ecd.sprotty",
				"ecd.theia",
				"iot.leshan"
			]
		},
		{
			"name": "eTactica",
			"homepage_url": "https://etactica.com/",
			"logo": "logo-etactica.svg",
			"logo_white": "logo-etactica-white.svg",
			"projects": [
				"iot.mosquitto"
			]
		},
		{
			"name": "Eurotech",
			"homepage_url": "https://www.eurotech.com",
			"logo": "logo-eurotech.png",
			"logo_white": "",
			"projects": [
				"iot.kura",
				"iot.kapua",
				"iot.paho"
			]
		},
		{
			"name": "F1Tenth Autonomous Racing Community",
			"homepage_url": "https://f1tenth.org/",
			"logo": "logo-f1tenth.png",
			"logo_white": "logo-f1tenth-white.png",
			"projects": [
				"iot.cyclonedds",
				"technology.iceoryx",
				"iot.zenoh"
			]
		},
		{
			"name": "FIT IoT-Lab",
			"homepage_url": "https://www.iot-lab.info/",
			"logo": "logo-iotlab.svg",
			"logo_white": "logo-iotlab-white.svg",
			"projects": [
				"iot.leshan"
			]
		},
		{
			"name": "Faktor Zehn GmbH",
			"homepage_url": "https://www.faktorzehn.com/",
			"logo": "logo-faktorzehn.svg",
			"logo_white": "logo-faktorzehn-white.svg",
			"projects": [
				"adoptium.temurin"
			]
		},
		{
			"name": "Famoco",
			"homepage_url": "https://www.famoco.com/",
			"logo": "logo-famoco.png",
			"logo_white": "logo-famoco-white.png",
			"projects": [
				"iot.keyple"
			]
		},
        {
            "name": "FARobot",
            "homepage_url": "https://www.farobottech.com/",
            "logo": "logo-farobot.png",
            "logo_white": "logo-farobot-white.png",
            "projects": [
                "iot.cyclonedds",
                "technology.iceoryx",
                "iot.zenoh"
            ]
        },
        {
            "name": "FAU Chair of Technical Information Systems",
            "homepage_url": "https://www.ti.rw.fau.de/",
            "logo": "logo-fau.png",
            "logo_white": "logo-fau-white.png",
            "projects": [
                "iot.thingweb"
            ]
        },
		{
			"name": "Fivecomm",
			"homepage_url": "https://fivecomm.eu/",
			"logo": "logo-fivecomm.png",
			"logo_white": "logo-fivecomm-white.png",
			"projects": [
				"iot.mosquitto"
			]
		},
		{
			"name": "Flowbird",
			"homepage_url": "https://www.flowbird.group/",
			"logo": "logo-flowbird.png",
			"logo_white": "logo-flowbird-white.png",
			"projects": [
				"iot.keyple"
			]
		},
		{
			"name": "flx:business",
			"homepage_url": "https://flx-business.de/",
			"logo": "logo-flxbusiness.png",
			"logo_white": "logo-flxbusiness-white.png",
			"projects": [
				"iot.streamsheets"
			]
		},
		{
			"name": "Freedom Robotics",
			"homepage_url": "https://www.freedomrobotics.ai/",
			"logo": "logo-freedom-robotics.png",
			"logo_white": "logo-freedom-robotics-white.png",
			"projects": [
				"iot.cyclonedds"
			]
		},
        {
            "name": "Futurewei",
            "homepage_url": "https://www.futurewei.com/",
            "logo": "logo-futurewei.png",
            "logo_white": "logo-futurewei-white.png",
            "projects": [
                "iot.zenoh"
            ]
        },
		{
			"name": "Foxconn",
			"homepage_url": "https://www.foxconn.com/en-us/",
			"logo": "logo-foxconn.png",
			"logo_white": "logo-foxconn-white.png",
			"projects": [
				"iot.cyclonedds",
				"technology.iceoryx",
				"iot.zenoh"
			]
		},
		{
			"name": "Gaia Platform",
			"homepage_url": "https://www.gaiaplatform.io/",
			"logo": "logo-gaia.png",
			"logo_white": "logo-gaia-white.png",
			"projects": [
				"iot.cyclonedds"
			]
		},
		{
			"name": "Gambit Communications",
			"homepage_url": "https://www.gambitcomm.com/",
			"logo": "logo-gambit-communications.png",
			"logo_white": "logo-gambit-communications-white.png",
			"projects": [
				"iot.hono",
				"iot.tahu",
				"iot.vorto"
			]
		},
		{
			"name": "gematik GmbH",
			"homepage_url": "https://www.gematik.de/",
			"logo": "logo-gematik.png",
			"logo_white": "logo-gematik-white.png",
			"projects": [
				"adoptium.temurin"
			]
		},
		{
			"name": "Ghost Robotics",
			"homepage_url": "https://www.ghostrobotics.io/",
			"logo": "logo-ghostrobotics.png",
			"logo_white": "logo-ghostrobotics-white.png",
			"projects": [
				"iot.cyclonedds"
			]
		},
		{
			"name": "Gitpod",
			"homepage_url": "https://www.gitpod.io/",
			"logo": "logo-gitpod.svg",
			"logo_white": "logo-gitpod-white.svg",
			"projects": [
				"ecd.openvsx",
				"ecd.theia"
			]
		},
		{
			"name": "GoCD",
			"homepage_url": "https://www.gocd.org/",
			"logo": "logo-gocd.svg",
			"logo_white": "logo-gocd-white.svg",
			"projects": [
				"adoptium.temurin"
			]
		},
		{
			"name": "grandcentrix",
			"homepage_url": "https://grandcentrix.net",
			"logo": "logo-grandcentrix.svg",
			"logo_white": "logo-grandcentrix-white.svg",
			"projects": [
				"iot.californium",
				"iot.hawkbit",
				"iot.leshan",
				"iot.mosquitto",
				"iot.paho"
			]
		},
		{
			"name": "Hadabot",
			"homepage_url": "https://www.hadabot.com/",
			"logo": "logo-hadabot.png",
			"logo_white": "logo-hadabot-white.png",
			"projects": [
				"iot.cyclonedds"
			]
		},
		{
			"name": "Hawai'i - AVTech",
			"homepage_url": "https://www.HawaiiAVTech.com",
			"logo": "logo-hawaiiavtech.png",
			"logo_white": "logo-hawaiiavtech-white.png",
			"projects": [
				"iot.cyclonedds"
			]
		},
		{
			"name": "Husarion",
			"homepage_url": "https://husarion.com/",
			"logo": "logo-husarion.png",
			"logo_white": "logo-husarion-white.png",
			"projects": [
				"iot.cyclonedds"
			]
		},
		{
			"name": "Husarnet",
			"homepage_url": "https://husarnet.com/",
			"logo": "logo-husarnet.png",
			"logo_white": "logo-husarnet-white.png",
			"projects": [
				"iot.cyclonedds"
			]
		},
		{
			"name": "IBM",
			"homepage_url": "https://www.ibm.com/products/wazi-developer",
			"logo": "logo-ibm.png",
			"logo_white": "logo-ibm-white.png",
			"projects": [
				"ecd.che",
				"ecd.theia",
				"ecd.openvsx"
			]
		},
        {
            "name": "ICOS",
            "homepage_url": "https://www.icos-project.eu/",
            "logo": "logo-icos.png",
            "logo_white": "",
            "projects": [
                "iot.zenoh"
            ]
        },
		{
			"name": "Ile-de-France Mobilités",
			"homepage_url": "https://www.iledefrance-mobilites.fr/",
			"logo": "logo-ile-de-france-mobilites.png",
			"logo_white": "logo-ile-de-france-mobilites-white.png",
			"projects": [
				"iot.keyple"
			]
		},
		{
			"name": "InnerSpace",
			"homepage_url": "https://innerspace.io/",
			"logo": "logo-innerspace.png",
			"logo_white": "logo-innerspace-white.png",
			"projects": [
				"iot.mosquitto"
			]
		},
		{
			"name": "Intel robotics project",
			"homepage_url": "https://www.intel.com/content/www/us/en/internet-of-things/overview.html",
			"logo": "logo-intel.png",
			"logo_white": "logo-intel-white.png",
			"projects": [
				"iot.cyclonedds"
			]
		},
		{
			"name": "IoT.nxt",
			"homepage_url": "https://www.iotnxt.com/",
			"logo": "logo-iot-nxt.png",
			"logo_white": "logo-iot-nxt-white.png",
			"projects": [
				"iot.mosquitto"
			]
		},
		{
			"name": "itemis AG",
			"homepage_url": "https://www.itemis.com",
			"logo": "logo-itemis.png",
			"logo_white": "logo-itemis-white.png",
			"projects": [
				"iot.cyclonedds"
			]
		},
		{
			"name": "Jenkins",
			"homepage_url": "https://jenkins.io/",
			"logo": "logo-jenkins.svg",
			"logo_white": "",
			"projects": [
				"adoptium.temurin"
			]
		},
		{
			"name": "Kestra",
			"homepage_url": "https://kestra.io/",
			"logo": "logo-kestra.svg",
			"logo_white": "logo-kestra-white.svg",
			"projects": [
				"adoptium.temurin"
			]
		},
		{
			"name": "Killercoda",
			"homepage_url": "https://killercoda.com",
			"logo": "logo-killercoda.svg",
			"logo_white": "logo-killercoda.svg",
			"projects": [
				"ecd.theia"
			]
		},
		{
			"name": "Kiwigrid GmbH",
			"homepage_url": "https://www.kiwigrid.com",
			"logo": "logo-kiwigrid.svg",
			"logo_white": "logo-kiwigrid-white.svg",
			"projects": [
				"iot.ditto",
				"iot.hono",
				"iot.hawkbit"
			]
		},
		{
			"name": "Kopernikus Automotive GmbH",
			"homepage_url": "http://www.kopernikusauto.com",
			"logo": "logo-kopernikus-auto.png",
			"logo_white": "logo-opernikus-auto-white.png",
			"projects": [
				"iot.cyclonedds"
			]
		},
		{
			"name": "Kynetics",
			"homepage_url": "http://kynetics.com",
			"logo": "logo-kynetics.png",
			"logo_white": "logo-kynetics-white.png",
			"projects": [
				"iot.hawkbit"
			]
		},
		{
			"name": "K2View",
			"homepage_url": "https://www.k2view.com",
			"logo": "logo-k2view.svg",
			"logo_white": "logo-k2view-white.svg",
			"projects": [
				"ecd.theia"
			]
		},
		{
			"name": "Leshan",
			"homepage_url": "https://www.eclipse.org/leshan/",
			"logo": "logo-leshan.svg",
			"logo_white": "logo-leshan-white.svg",
			"projects": [
				"iot.californium"
			]
		},
		{
			"name": "LG Electronics, America R&D Lab",
			"homepage_url": "https://www.lgsvlsimulator.com/",
			"logo": "logo-lg.png",
			"logo_white": "logo-lg-white.svg",
			"projects": [
				"iot.cyclonedds"
			]
		},
		{
			"name": "Lightfleet Corporation",
			"homepage_url": "http://www.lightfleet.com",
			"logo": "logo-lightfleet.png",
			"logo_white": "logo-lightfleet-white.png",
			"projects": [
				"iot.cyclonedds"
			]
		},
		{
			"name": "Lizza",
			"homepage_url": "https://lizza.de/",
			"logo": "logo-lizza.png",
			"logo_white": "logo-lizza-white.png",
			"projects": [
				"iot.streamsheets"
			]
		},
		{
			"name": "Logi.cals",
			"homepage_url": "https://logicals.com/en/",
			"logo": "logo-logicals.svg",
			"logo_white": "logo-logicals-white.svg",
			"projects": [
				"ecd.che",
				"ecd.glsp",
				"ecd.theia"
			]
		},
        {
            "name": "Mapless AI, Inc.",
            "homepage_url": "https://mapless.ai",
            "logo": "logo-maplessai.svg",
            "logo_white": "logo-maplessai-white.svg",
            "projects": [
                "iot.cyclonedds"
            ]
        },
        {
            "name": "MAVERIC Project",
            "homepage_url": "https://www.maveric-project.org/",
            "logo": "logo-maveric.svg",
            "logo_white": "logo-maveric-white.svg",
            "projects": [
                "iot.thingweb"
            ]
        },
		{
			"name": "MediaMarktSaturn Technology",
			"homepage_url": "https://mms.tech/",
			"logo": "logo-mediamarktsaturn.png",
			"logo_white": "logo-mediamarktsaturn-white.png",
			"projects": [
				"adoptium.temurin"
			]
		},
		{
			"name": "Mercedes-Benz Tech Innovation GmbH",
			"homepage_url": "https://opensource.mercedes-benz.com/",
			"logo": "logo-mercedes-benz.png",
			"logo_white": "logo-mercedes-benz-white.png",
			"projects": [
				"adoptium.temurin"
			]
		},
		{
			"name": "Michelin",
			"homepage_url": "https://opensource.michelin.io/",
			"logo": "logo-michelin.svg",
			"logo_white": "logo-michelin-white.svg",
			"projects": [
				"adoptium.temurin"
			]
		},
		{
			"name": "Microsoft",
			"homepage_url": "https://microsoft.com/",
			"logo": "logo-microsoft.svg",
			"logo_white": "logo-microsoft-white.svg",
			"projects": [
				"iot.paho",
				"adoptium.temurin",
				"iot.thingweb"
			]
		},
		{
			"name": "Mindus SARL",
			"homepage_url": "https://www.mindus.co/",
			"logo": "logo-mindus.svg",
			"logo_white": "logo-mindus-white.svg",
			"projects": [
				"adoptium.temurin"
			]
		},
		{
			"name": "Mission Robotics Inc.",
			"homepage_url": "https://missionrobotics.us/",
			"logo": "logo-mission-robotics.svg",
			"logo_white": "logo-mission-robotics-white.svg",
			"projects": [
				"iot.cyclonedds"
			]
		},
		{
			"name": "MongoDB",
			"homepage_url": "https://mongodb.com/",
			"logo": "logo-mongodb.svg",
			"logo_white": "logo-mongodb-white.svg",
			"projects": [
				"adoptium.temurin"
			]
		},
        {
            "name": "NEPHELE Project",
            "homepage_url": "https://nephele-project.eu/",
            "logo": "logo-nephele.svg",
            "logo_white": "",
            "projects": [
                "iot.thingweb"
            ]
        },
		{
			"name": "New Eagle",
			"homepage_url": "https://neweagle.net",
			"logo": "logo-neweagle.png",
			"logo_white": "logo-neweagle-white.png",
			"projects": [
				"iot.cyclonedds"
			]
		},
		{
			"name": "ODALID",
			"homepage_url": "https://odalid.com/",
			"logo": "logo-odalid.png",
			"logo_white": "logo-odalid-white.png",
			"projects": [
				"iot.keyple"
			]
		},
		{
			"name": "OneWave",
			"homepage_url": "https://onewave.io/transport",
			"logo": "logo-onewave.png",
			"logo_white": "logo-onewave-white.png",
			"projects": [
				"iot.keyple"
			]
		},
		{
			"name": "Onivim 2",
			"homepage_url": "https://v2.onivim.io",
			"logo": "logo-onivim.svg",
			"logo_white": "logo-onivim-white.svg",
			"projects": [
				"ecd.openvsx"
			]
		},
		{
			"name": "OpenADx",
			"homepage_url": "https://openadx.eclipse.org/",
			"logo": "logo-openadx.png",
			"logo_white": "logo-openadx-white.svg",
			"projects": [
				"iot.cyclonedds",
				"technology.iceoryx",
				"iot.zenoh"
			]
		},
		{
			"name": "OpenBPMN",
			"homepage_url": "https://github.com/imixs/open-bpmn/",
			"logo": "logo-openbpmn.png",
			"logo_white": "logo-openbpmn-white.png",
			"projects": [
				"ecd.glsp"
			]
		},
		{
			"name": "OpenCV",
			"homepage_url": "https://opencv.org/",
			"logo": "logo-opencv.png",
			"logo_white": "logo-opencv-white.png",
			"projects": [
				"iot.cyclonedds"
			]
		},
		{
			"name": "OpenCV AI Kit",
			"homepage_url": "https://www.kickstarter.com/projects/opencv/opencv-ai-kit",
			"logo": "logo-oak.svg",
			"logo_white": "logo-oak-white.svg",
			"projects": [
				"iot.cyclonedds"
			]
		},
		{
			"name": "OpenElements",
			"homepage_url": "https://www.open-elements.com/",
			"logo": "logo-open-elements.svg",
			"logo_white": "logo-open-elements-white.svg",
			"projects": ["adoptium", "adoptium.temurin"]
		},
		{
			"name": "Open Robotics",
			"homepage_url": "https://www.openrobotics.org/",
			"logo": "logo-open-robotics.svg",
			"logo_white": "logo-open-robotics-white.svg",
			"projects": [
				"iot.cyclonedds"
			]
		},
		{
			"name": "Orange",
			"homepage_url": "https://www.orange.com/",
			"logo": "logo-orange.png",
			"logo_white": "logo-orange-white.png",
			"projects": [
				"iot.leshan"
			]
		},
		{
			"name": "ORMAES",
			"homepage_url": "https://www.ormaes.fr/",
			"logo": "logo-ormaes.svg",
			"logo_white": "logo-ormaes-white.svg",
			"projects": [
				"iot.keyple"
			]
		},
		{
			"name": "OSB connagtive GmbH",
			"homepage_url": "https://iot-suite.io",
			"logo": "logo-osb-connagtive.png",
			"logo_white": "logo-osb-connagtive-white.png",
			"projects": [
				"iot.hawkbit"
			]
		},
		{
			"name": "othermo",
			"homepage_url": "https://othermo.de",
			"logo": "logo-othermo.svg",
			"logo_white": "logo-othermo-white.svg",
			"projects": [
				"iot.ditto",
				"iot.vorto"
			]
		},
		{
			"name": "Otokar Automotive and Defence Industry",
			"homepage_url": "https://www.otokar.com.tr/en",
			"logo": "logo-otokar.png",
			"logo_white": "logo-otokar-white.png",
			"projects": [
				"iot.cyclonedds"
			]
		},
		{
			"name": "Ouster",
			"homepage_url": "https://ouster.com/",
			"logo": "logo-ouster.png",
			"logo_white": "logo-ouster-white.png",
			"projects": [
				"iot.cyclonedds"
			]
		},
		{
			"name": "PickNik",
			"homepage_url": "https://picknik.ai/",
			"logo": "logo-picknik.png",
			"logo_white": "logo-picknik-white.png",
			"projects": [
				"iot.cyclonedds"
			]
		},
		{
			"name": "pragmatic industries GmbH",
			"homepage_url": "https://pragmaticindustries.com/",
			"logo": "logo-pragmatic-industries.svg",
			"logo_white": "logo-pragmatic-industries-white.svg",
			"projects": [
				"iot.ditto",
				"iot.hawkbit"
			]
		},
		{
			"name": "pragmatic minds GmbH",
			"homepage_url": "https://pragmaticminds.de/",
			"logo": "logo-pragmatic-minds.svg",
			"logo_white": "logo-pragmatic-minds-white.svg",
			"projects": [
				"iot.ditto",
				"iot.hawkbit"
			]
		},
		{
			"name": "Radiant Logic",
			"homepage_url": "https://www.radiantlogic.com/",
			"logo": "logo-radiant-logic.png",
			"logo_white": "logo-radiant-logic-white.png",
			"projects": [
				"adoptium.temurin"
			]
		},
		{
			"name": "RATP Smart Systems",
			"homepage_url": "https://www.ratpsmartsystems.com",
			"logo": "logo-ratp-smart-systems.png",
			"logo_white": "logo-ratp-smart-systems-white.png",
			"projects": [
				"iot.keyple"
			]
		},
		{
			"name": "Record Evolution",
			"homepage_url": "https://www.record-evolution.de/en/home-en/",
			"logo": "logo-record-evolution.png",
			"logo_white": "logo-record-evolution-white.png",
			"projects": [
				"ecd.theia"
			]
		},
		{
			"name": "Red Hat",
			"homepage_url": "https://developers.redhat.com",
			"logo": "Logo-RedHat-A-Color-RGB.svg",
			"logo_white": "Logo-RedHat-A-White-RGB.svg",
			"projects": [
				"iot.hono",
				"iot.paho",
				"ecd.che",
				"ecd.theia",
				"ecd.jkube",
				"adoptium.temurin"
			]
		},
		{
			"name": "Rightbot",
			"homepage_url": "https://www.rightbot.in",
			"logo": "logo-rightbot.png",
			"logo_white": "logo-rightbot-white.png",
			"projects": [
				"iot.cyclonedds"
			]
		},
		{
			"name": "RISE",
			"homepage_url": "https://www.ri.se",
			"logo": "logo-rise.svg",
			"logo_white": "logo-rise-white.svg",
			"projects": [
				"iot.leshan"
			]
		},
		{
			"name": "RITMS UP2DATE",
			"homepage_url": "https://up2date.ritms.online/",
			"logo": "logo-ritms-up2date.svg",
			"logo_white": "logo-ritms-up2date-white.svg",
			"projects": [
				"iot.hawkbit"
			]
		},
		{
			"name": "Robotec.ai",
			"homepage_url": "http://www.robotec.ai/",
			"logo": "logo-robotec.png",
			"logo_white": "logo-robotec-white.png",
			"projects": [
				"iot.cyclonedds"
			]
		},
		{
			"name": "ROBOTIS",
			"homepage_url": "https://www.robotis.com/",
			"logo": "logo-robotis.png",
			"logo_white": "logo-robotis-white.png",
			"projects": [
				"iot.cyclonedds"
			]
		},
		{
			"name": "Rover Robotics",
			"homepage_url": "http://www.roverrobotics.com",
			"logo": "logo-rover-robotics.png",
			"logo_white": "logo-rover-robotics-white.png",
			"projects": [
				"iot.cyclonedds"
			]
		},
		{
			"name": "RYRacing, LLC",
			"homepage_url": "http://www.ryracing.com",
			"logo": "logo-ryracing.svg",
			"logo_white": "logo-ryracing-white.svg",
			"projects": [
				"iot.cyclonedds"
			]
		},
		{
			"name": "R3m Score",
			"homepage_url": "https://r3mscore.com/",
			"logo": "logo-r3m-score.png",
			"logo_white": "",
			"projects": [
				"adoptium.temurin"
			]
		},
		{
			"name": "Samsung",
			"homepage_url": "https://semiconductor.samsung.com/us/",
			"logo": "logo-samsung.png",
			"logo_white": "",
			"projects": [
				"ecd.theia"
			]
		},
		{
			"name": "SAP",
			"homepage_url": "https://www.sap.com",
			"logo": "logo-sap.png",
			"logo_white": "logo-sap-white.png",
			"projects": [
				"ecd.dirigible",
				"ecd.che",
				"ecd.theia",
				"ecd.openvsx",
				"ecd.orion",
				"technology.jgit",
				"technology.egit",
				"technology.steady",
				"tools.mat"
			]
		},
		{
			"name": "Saxion University of Applied Sciences / Mechatronics Research Group",
			"homepage_url": "https://saxion.nl/mechatronics",
			"logo": "logo-saxion.png",
			"logo_white": "logo-saxion-white.png",
			"projects": [
				"iot.cyclonedds"
			]
		},
		{
			"name": "Secretaría de Movilidad",
			"homepage_url": "https://www.semovi.cdmx.gob.mx",
			"logo": "logo-cdmx-semovi.svg",
			"logo_white": "logo-cdmx-semovi-white.svg",
			"projects": [
				"iot.keyple"
			]
		},
		{
			"name": "Scentbird",
			"homepage_url": "https://www.scentbird.com",
			"logo": "logo-scentbird.png",
			"logo_white": "logo-scentbird-white.png",
			"projects": [
				"adoptium.temurin"
			]
		},
		{
			"name": "Seafloor Systems, Inc.",
			"homepage_url": "https://www.seafloorsystems.com/",
			"logo": "logo-seafloor.png",
			"logo_white": "logo-seafloor-white.png",
			"projects": [
				"iot.cyclonedds"
			]
		},
		{
			"name": "Siemens",
			"homepage_url": "https://www.siemens.com",
			"logo": "logo-siemens.png",
			"logo_white": "logo-siemens-white.png",
			"projects": [
				"iot.thingweb"
			]
		},
		{
			"name": "Sierra Wireless",
			"homepage_url": "https://www.sierrawireless.com/",
			"logo": "logo-swir.svg",
			"logo_white": "logo-swir-white.svg",
			"projects": [
				"iot.leshan",
				"iot.californium",
				"iot.mosquitto"
			]
		},
		{
			"name": "Smartface",
			"homepage_url": "https://smartface.io/",
			"logo": "logo-smartface.svg",
			"logo_white": "logo-smartface-white.svg",
			"projects": [
				"ecd.theia"
			]
		},
		{
			"name": "SNCF",
			"homepage_url": "https://www.sncf.com/fr",
			"logo": "logo-sncf.png",
			"logo_white": "logo-sncf-white.png",
			"projects": [
				"iot.keyple"
			]
		},
		{
			"name": "Societe Generale",
			"homepage_url": "https://www.societegenerale.com/",
			"logo": "logo-societe-generale.svg",
			"logo_white": "logo-societe-generale-white.svg",
			"projects": [
				"adoptium.temurin"
			]
		},
		{
			"name": "SopraSteria",
			"homepage_url": "https://www.soprasteria.com/",
			"logo": "logo-soprasteria.svg",
			"logo_white": "logo-soprasteria-white.png",
			"projects": [
				"iot.keyple"
			]
		},
		{
			"name": "Soracom",
			"homepage_url": "https://www.soracom.io/",
			"logo": "logo-soracom.svg",
			"logo_white": "logo-soracom-white.svg",
			"projects": [
				"iot.leshan"
			]
		},
		{
			"name": "SOTEC",
			"homepage_url": "https://www.sotec.eu/en/",
			"logo": "logo-sotec.png",
			"logo_white": "logo-sotec-white.png",
			"projects": [
				"iot.hono"
			]
		},
		{
			"name": "Spirtech",
			"homepage_url": "https://spirtech.com/",
			"logo": "logo-spirtech.png",
			"logo_white": "logo-spirtech-white.png",
			"projects": [
				"iot.keyple"
			]
		},
		{
			"name": "Starburst",
			"homepage_url": "https://starburst.io/",
			"logo": "logo-starburst.svg",
			"logo_white": "logo-starburst-white.svg",
			"projects": [
				"adoptium.temurin"
			]
		},	
		{
			"name": "Steinbeis-Transferzentrum Industrielle Digitalisierung",
			"homepage_url": "https://idhorb.de/",
			"logo": "logo-steinbeis-transferzentrum-industrielle-digitalisierung.png",
			"logo_white": "logo-steinbeis-transferzentrum-industrielle-digitalisierung-white.png",
			"projects": [
				"iot.streamsheets"
			]
		},
		{
			"name": "STMicroelectronics",
			"homepage_url": "https://www.st.com",
			"logo": "logo-stmicroelectronics.svg",
			"logo_white": "logo-stmicroelectronics-white.svg",
			"projects": [
				"ecd.theia",
				"ecd.glsp",
				"ecd.emfcloud"
			]
		},
		{
			"name": "Stokt",
			"homepage_url": "https://www.getstokt.com/",
			"logo": "logo-stokt.svg",
			"logo_white": "logo-stokt-white.svg",
			"projects": [
				"iot.mosquitto"
			]
		},
		{
			"name": "Streamsheets",
			"homepage_url": "https://cedalo.com/products/streamsheets/",
			"logo": "logo-streamsheets.png",
			"logo_white": "logo-streamsheets-white.png",
			"projects": [
				"iot.mosquitto"
			]
		},
        {
            "name": "SyMetric",
            "homepage_url": "https://www.symetricsystems.com/",
            "logo": "logo-symetric.svg",
            "logo_white": "logo-symetric-white.svg",
            "projects": [
                "ecd.dirigible"
            ]
        },
        {
            "name": "Synamedia",
            "homepage_url": "https://www.synamedia.com",
            "logo": "logo-synamedia.png",
            "logo_white": "logo-synamedia-white.png",
            "projects": [
                "iot.ditto"
            ]
        },
        {
            "name": "Technical University of Munich (TUM)",
            "homepage_url": "https://www.tum.de/",
            "logo": "logo-tum.png",
            "logo_white": "logo-tum-white.png",
            "projects": [
                "iot.thingweb"
            ]
        },
        {
            "name": "Terapines",
            "homepage_url": "https://www.terapines.com/",
            "logo": "logo-terapines.svg",
            "logo_white": "logo-terapines-white.svg",
            "projects": [
                "ecd.theia"
            ]
        },
        {
            "name": "Texas Instruments",
            "homepage_url": "https://www.ti.com/",
            "logo": "logo-texas-instruments.png",
            "logo_white": "logo-texas-instruments.png",
            "projects": [
                "ecd.theia"
            ]
        },
		{
			"name": "The Construct",
			"homepage_url": "http://www.theconstruct.ai",
			"logo": "logo-construct.png",
			"logo_white": "logo-construct-white.png",
			"projects": [
				"iot.cyclonedds"
			]
		},
		{
			"name": "ThingsBoard",
			"homepage_url": "https://thingsboard.io/",
			"logo": "logo-thingsboard.svg",
			"logo_white": "logo-thingsboard-white.svg",
			"projects": [
				"iot.leshan",
				"iot.californium"
			]
		},
		{
			"name": "Tier IV",
			"homepage_url": "https://tier4.jp/en/",
			"logo": "logo-tier-iv.png",
			"logo_white": "logo-tier-iv-white.png",
			"projects": [
				"iot.cyclonedds"
			]
		},
		{
			"name": "Timefold",
			"homepage_url": "https://timefold.ai/",
			"logo": "logo-timefold.png",
			"logo_white": "logo-timefold-white.png",
			"projects": [
				"adoptium.temurin"
			]
		},		
		{
			"name": "Tirasa",
			"homepage_url": "https://www.tirasa.net/",
			"logo": "logo-tirasa.svg",
			"logo_white": "logo-tirasa-white.svg",
			"projects": [
				"adoptium.temurin"
			]
		},
		{
			"name": "Total Validator",
			"homepage_url": "https://www.totalvalidator.com/",
			"logo": "logo-total-validator.svg",
			"logo_white": "logo-total-validator-white.svg",
			"projects": [
				"adoptium.temurin"
			]
		},		
		{
			"name": "Tractonomy Robotics",
			"homepage_url": "https://www.tractonomy.com",
			"logo": "logo-tractonomy-robotics.png",
			"logo_white": "logo-tractonomy-robotics-white.png",
			"projects": [
				"iot.cyclonedds",
				"technology.iceoryx",
				"iot.zenoh"
			]
		},
		{
			"name": "Trajekt Sports Inc.",
			"homepage_url": "http://www.trajektsports.com",
			"logo": "logo-trajekt-sports.svg",
			"logo_white": "logo-trajekt-sports-white.svg",
			"projects": [
				"iot.cyclonedds"
			]
		},
		{
			"name": "Trend Micro",
			"homepage_url": "https://www.trendmicro.com/",
			"logo": "logo-trend-micro.png",
			"logo_white": "",
			"projects": [
				"adoptium.temurin"
			]
		},
		{
			"name": "TypeFox",
			"homepage_url": "https://www.typefox.io/",
			"logo": "logo-typefox.svg",
			"logo_white": "logo-typefox-white.svg",
			"projects": [
				"ecd.openvsx",
				"ecd.sprotty",
				"ecd.theia"
			]
		},
		{
			"name": "T-Systems",
			"homepage_url": "https://www.t-systems.com/",
			"logo": "logo-t-systems.svg",
			"logo_white": "logo-t-systems-white.svg",
			"projects": [
				"adoptium.temurin"
			]
		},
		{
			"name": "University of Hawai`i",
			"homepage_url": "https://www.hawaii.edu/",
			"logo": "logo-university-hawaii.png",
			"logo_white": "logo-university-hawaii-white.png",
			"projects": [
				"iot.cyclonedds"
			]
		},
		{
			"name": "USGS Volcano Hazards Program",
			"homepage_url": "https://www.usgs.gov/natural-hazards/volcano-hazards/",
			"logo": "logo-usgs.svg",
			"logo_white": "logo-usgs-white.svg",
			"projects": [
				"iot.mosquitto"
			]
		},
		{
			"name": "Vector",
			"homepage_url": "https://www.vector.com/int/en/",
			"logo": "logo-vector.png",
			"logo_white": "logo-vector-white.png",
			"projects": [
				"iot.cyclonedds"
			]
		},
		{
			"name": "VectorAero AVT",
			"homepage_url": "https://www.Vectoraero.com",
			"logo": "logo-vectoraero.png",
			"logo_white": "logo-vectoraero-white.png",
			"projects": [
				"iot.cyclonedds"
			]
		},
		{
			"name": "Verizon",
			"homepage_url": "https://thingspace.verizon.com/",
			"logo": "logo-verizon.svg",
			"logo_white": "logo-verizon-white.svg",
			"projects": [
				"iot.leshan"
			]
		},
		{
			"name": "VSCodium",
			"homepage_url": "https://vscodium.com",
			"logo": "logo-vscodium.svg",
			"logo_white": "logo-vscodium-white.svg",
			"projects": [
				"ecd.openvsx"
			]
		},
		{
			"name": "VUEngine",
			"homepage_url": "https://www.vuengine.dev",
			"logo": "logo-vuengine.png",
			"logo_white": "logo-vuengine-white.png",
			"projects": [
				"ecd.theia"
			]
		},
		{
			"name": "WUT Driverless",
			"homepage_url": "https://www.indyautonomouschallenge.com/warsaw-university-of-technology",
			"logo": "logo-wut-driverless.png",
			"logo_white": "logo-wut-driverless-white.png",
			"projects": [
				"iot.cyclonedds"
			]
		}
	]
}
