<?xml version="1.0" encoding="UTF-8"?>
<svg id="Livello_1" data-name="Livello 1" xmlns="http://www.w3.org/2000/svg" viewBox="0 0 841.89 252.09">
  <defs>
    <style>
      .cls-1 {
        fill: #201a3f;
      }
    </style>
  </defs>
  <g>
    <g>
      <path class="cls-1" d="m239.85,155.53c0-7.16,2.32-12.69,6.97-16.59,4.65-3.9,11.14-5.85,19.49-5.85h21.9v-5.58c0-10.38-5.49-15.57-16.46-15.57-5.3,0-9.41,1.18-12.31,3.54-2.9,2.36-4.47,5.67-4.69,9.93h-11.83c.31-7.21,3.11-12.86,8.36-16.97,5.26-4.1,12.31-6.15,21.15-6.15,4.58,0,8.71.67,12.38,2.01,3.67,1.34,6.51,3.05,8.5,5.13,2.04,2.18,3.54,4.44,4.49,6.8,1.59,3.67,2.38,7.53,2.38,11.56v39.72h10.75v8.91h-12.45c-3.22,0-5.54-.67-6.97-2.01-1.43-1.34-2.25-3.41-2.48-6.22l-.14-3.74h-.82c-1.59,4.08-4.64,7.32-9.15,9.73-4.51,2.4-9.74,3.6-15.68,3.6-7.26,0-12.97-2.01-17.14-6.02-4.17-4.01-6.26-9.42-6.26-16.22Zm12.38-3.06v4.42c0,3.54,1.24,6.28,3.71,8.23,2.47,1.95,5.84,2.92,10.1,2.92,6.75,0,12.14-2.04,16.15-6.12,4.01-4.08,6.02-9.48,6.02-16.19v-3.88h-20.74c-4.71,0-8.43.98-11.15,2.92-2.72,1.95-4.08,4.51-4.08,7.69Z"/>
      <path class="cls-1" d="m335.64,103.7h25.23v10h-24.15v62.71h-12.11v-61.96c0-7.16,3.67-10.75,11.02-10.75Z"/>
      <path class="cls-1" d="m418.92,151.58h11.97c-1.18,8.12-4.65,14.51-10.4,19.18-5.76,4.67-13.06,7.01-21.9,7.01-10.84,0-19.3-3.38-25.37-10.13-6.12-6.8-9.18-15.94-9.18-27.41s3.19-21.22,9.59-27.88c6.44-6.71,14.9-10.07,25.37-10.07,8.39,0,15.44,2.28,21.15,6.83s9.16,10.64,10.34,18.26h-11.97c-1.18-4.85-3.54-8.55-7.07-11.09-3.54-2.54-7.87-3.81-12.99-3.81-6.49,0-11.78,2.11-15.88,6.32-4.11,4.22-6.16,9.68-6.16,16.39v11.02c0,6.48,2.02,11.7,6.05,15.64s9.36,5.92,15.98,5.92c5.35,0,9.87-1.46,13.57-4.39s6-6.86,6.9-11.8Z"/>
      <path class="cls-1" d="m459.29,176.41h-12.11v-102.08h12.11v42.64h.89c2.27-4.53,5.58-8.12,9.93-10.75,4.35-2.63,9.2-3.94,14.55-3.94,7.84,0,14.01,2.63,18.5,7.89,4.49,5.26,6.73,12.4,6.73,21.42v44.82h-11.97v-43.59c0-13.56-5.76-20.33-17.27-20.33-6.39,0-11.55,2.32-15.47,6.97-3.92,4.65-5.88,10.83-5.88,18.53v38.43Z"/>
      <path class="cls-1" d="m559.84,102.28c9.98,0,17.85,2.94,23.63,8.81,5.78,5.87,8.67,13.86,8.67,23.97,0,2.72-.14,5.21-.41,7.48h-53.66v4.22c0,6.39,2.02,11.54,6.05,15.44,4.03,3.9,9.4,5.85,16.12,5.85,5.08,0,9.44-1.22,13.09-3.67s6.06-5.74,7.24-9.86h11.97c-1.59,7.16-5.3,12.83-11.15,17-6.03,4.17-13.17,6.26-21.43,6.26-10.56,0-18.92-3.41-25.06-10.24-6.14-6.82-9.21-16.08-9.21-27.78s3.05-20.81,9.15-27.48,14.43-10,24.99-10Zm-21.76,29.45v1.9h42.1v-2.79c0-5.62-1.87-10.16-5.61-13.6-3.74-3.45-8.65-5.17-14.73-5.17-6.39,0-11.62,1.81-15.68,5.44-4.06,3.63-6.09,8.37-6.09,14.21Z"/>
      <path class="cls-1" d="m621.36,90.17h-11.97v-15.85h11.97v15.85Zm0,86.24h-11.97v-72.7h11.97v72.7Z"/>
      <path class="cls-1" d="m638.19,140.02c0-11.7,3.19-20.88,9.59-27.54,6.39-6.8,14.85-10.2,25.37-10.2s18.93,3.36,25.23,10.07c6.39,6.66,9.59,15.89,9.59,27.68s-3.09,20.8-9.25,27.58c-6.17,6.78-14.69,10.17-25.57,10.17s-19.43-3.38-25.64-10.13c-6.21-6.76-9.32-15.96-9.32-27.61Zm12.38-5.24v11.29c0,6.71,2.12,12,6.36,15.88,4.24,3.88,9.65,5.81,16.22,5.81s12.04-1.96,16.25-5.88c4.22-3.92,6.33-9.19,6.33-15.81v-11.29c0-6.66-2.1-12.05-6.29-16.15-4.19-4.1-9.62-6.15-16.29-6.15s-11.95,2.09-16.26,6.26c-4.22,4.08-6.32,9.43-6.32,16.05Z"/>
      <path class="cls-1" d="m737.04,176.41h-12.11v-72.7h10.61l1.5,13.53h1.02c2.27-4.67,5.54-8.33,9.82-10.98,4.29-2.65,9.17-3.98,14.66-3.98,7.8,0,13.95,2.65,18.46,7.96,4.51,5.3,6.77,12.47,6.77,21.49v44.68h-12.11v-43.46c0-13.28-5.71-19.93-17.14-19.93-6.39,0-11.57,2.34-15.54,7.01-3.97,4.67-5.95,10.79-5.95,18.36v38.02Z"/>
    </g>
    <path class="cls-1" d="m807.71,159.48c2.39,0,4.38.77,5.96,2.32,1.6,1.54,2.4,3.53,2.4,5.96s-.8,4.42-2.4,5.96c-1.62,1.56-3.61,2.34-5.96,2.34s-4.34-.78-5.93-2.34c-1.58-1.55-2.37-3.54-2.37-5.96s.79-4.41,2.37-5.96,3.56-2.32,5.93-2.32Zm7.34,8.28c0-2.18-.7-3.95-2.11-5.33-1.41-1.41-3.15-2.11-5.23-2.11s-3.8.7-5.2,2.11c-1.39,1.42-2.08,3.2-2.08,5.36s.69,3.91,2.08,5.27c1.43,1.37,3.17,2.05,5.23,2.05s3.81-.68,5.2-2.05c1.41-1.38,2.11-3.14,2.11-5.3Zm-9.05,4.03h-1.35v-8.19h3.97c.77,0,1.36.21,1.78.62s.62.99.62,1.73c0,1.05-.41,1.71-1.23,1.99v.11h.38c.59,0,.88.3.88.91v2.83h-1.32v-3.05h-3.73v3.05Zm0-7.05v2.89h2.31c.39,0,.7-.11.94-.32s.35-.5.35-.85v-.63c0-.33-.11-.59-.33-.79s-.51-.3-.87-.3h-2.4Z"/>
  </g>
  <g>
    <path class="cls-1" d="m169.78,121.53c-4.59,7.99-16.72,29.1-19.54,33.99-.36.63-1.04,1.02-1.77,1.02h-41.54c-1.57,0-2.55,1.7-1.77,3.06l19.79,34.41c.36.63,1.04,1.02,1.77,1.02h43.91c.73,0,1.41-.39,1.77-1.03l20.66-36.02c.36-.63.36-1.4,0-2.03l-19.73-34.42c-.78-1.37-2.76-1.37-3.54,0Z"/>
    <path class="cls-1" d="m106.97,133.32l-7.34-12.77c-.79-1.37-2.76-1.37-3.54,0l-19.99,34.85c-.36.64-1.04,1.03-1.77,1.03h-40.42c-1.57,0-2.55,1.7-1.77,3.06l19.77,34.51c.36.64,1.04,1.03,1.77,1.03h42.01c.73,0,1.41-.39,1.77-1.03l9.4-16.39c.36-.63.36-1.41,0-2.04l-11-19.13c-.36-.63-.36-1.42,0-2.05l11.11-19.04c.37-.63.37-1.41,0-2.05Z"/>
    <path class="cls-1" d="m101.3,111.06l12.29,21.42c.36.64,1.04,1.03,1.77,1.03h16.67c.73,0,1.41-.39,1.77-1.03l22.31-38.91c.36-.63.36-1.4,0-2.03l-19.2-33.46c-.79-1.37-2.76-1.37-3.54,0l-19.92,34.73c-.36.64-1.04,1.03-1.77,1.03h-41.6c-1.57,0-2.55,1.7-1.77,3.06l6.94,12.1c.36.63,1.04,1.03,1.77,1.03h22.51c.73,0,1.41.39,1.77,1.03Z"/>
    <polygon class="cls-1" points="107.28 133.51 107.27 133.51 107.27 133.52 107.28 133.51"/>
  </g>
</svg>