<?xml version="1.0" encoding="UTF-8" standalone="no"?>
<!-- Created with Inkscape (http://www.inkscape.org/) -->

<svg
   width="161.20424mm"
   height="108.66962mm"
   viewBox="0 0 161.20424 108.66962"
   version="1.1"
   id="svg5"
   xml:space="preserve"
   inkscape:version="1.2.2 (b0a8486541, 2022-12-01)"
   sodipodi:docname="anyware.svg"
   xmlns:inkscape="http://www.inkscape.org/namespaces/inkscape"
   xmlns:sodipodi="http://sodipodi.sourceforge.net/DTD/sodipodi-0.dtd"
   xmlns="http://www.w3.org/2000/svg"
   xmlns:svg="http://www.w3.org/2000/svg"><sodipodi:namedview
     id="namedview7"
     pagecolor="#ffffff"
     bordercolor="#000000"
     borderopacity="0.25"
     inkscape:showpageshadow="2"
     inkscape:pageopacity="0.0"
     inkscape:pagecheckerboard="0"
     inkscape:deskcolor="#d1d1d1"
     inkscape:document-units="mm"
     showgrid="false"
     inkscape:zoom="1.4414001"
     inkscape:cx="161.64838"
     inkscape:cy="482.86384"
     inkscape:window-width="2560"
     inkscape:window-height="1371"
     inkscape:window-x="0"
     inkscape:window-y="0"
     inkscape:window-maximized="1"
     inkscape:current-layer="layer1" /><defs
     id="defs2" /><g
     inkscape:label="Layer 1"
     inkscape:groupmode="layer"
     id="layer1"
     transform="translate(-23.920508,-94.214162)"><g
       id="g446"><g
         id="g109"
         transform="matrix(0.30369439,0,0,0.30369439,75.210617,94.21416)"><path
           d="m 108.56,11.45 a 98.1,98.1 0 1 0 98.1,98.09 98.09,98.09 0 0 0 -98.1,-98.09 z m 0.08,176.78 a 78.66,78.66 0 1 1 78.66,-78.66 78.66,78.66 0 0 1 -78.66,78.66 z"
           transform="translate(-10.47,-11.45)"
           style="fill:#1b1c39"
           id="path97" /><circle
           cx="123.97"
           cy="63.439999"
           r="17.790001"
           style="fill:#b51548"
           id="circle99" /></g><g
         id="g431"><g
           id="g95"
           transform="matrix(0.30420513,0,0,0.30420513,91.788532,161.77696)"><path
             d="m 45.36,77.28 26.16,-69 25.08,69 26.59,-64.43 h 15.83 L 96,115.39 71.18,47.07 45.38,115.39 4.46,12.88 20.22,12.83 Z"
             transform="translate(-4.46,-8.27)"
             style="fill:#1b1c39"
             id="path77" /><path
             d="M 196.82,109.25 H 182.71 V 103 h -0.15 c -6.27,5.25 -9.19,7.38 -18.12,8 a 26.66,26.66 0 0 1 -16.66,-4.87 C 139,100 136.73,90.54 136,87.49 a 35.67,35.67 0 0 1 -0.88,-8.73 34.23,34.23 0 0 1 3.06,-15.2 30,30 0 0 1 11.82,-13.17 28.75,28.75 0 0 1 6.85,-2.77 26.21,26.21 0 0 1 7.48,-0.84 21.26,21.26 0 0 1 10.86,2.94 30.7,30.7 0 0 1 7.37,5.64 h 0.15 v -6.88 h 14.13 z m -13.26,-30 c 0,-1.45 0.05,-11.91 -7.77,-17.1 A 17.31,17.31 0 0 0 166.48,59.4 16.36,16.36 0 0 0 151.92,68.13 20.23,20.23 0 0 0 149.33,79 c 0,1 0.5,13 9.34,17.68 a 17.2,17.2 0 0 0 8.14,1.83 17.49,17.49 0 0 0 7.89,-2 c 8.46,-4.77 8.84,-16.46 8.86,-17.22 z"
             transform="translate(-4.46,-8.27)"
             style="fill:#1b1c39"
             id="path79" /><path
             d="m 225.64,53.69 h 0.15 c 4.83,-5.33 8.65,-7.09 15.63,-6.8 2.54,0.1 6.87,1.93 9.81,3.58 l -6.48,12.75 a 30.24,30.24 0 0 0 -3.13,-1.85 3.41,3.41 0 0 0 -0.56,-0.22 10.28,10.28 0 0 0 -2.89,-0.74 13.53,13.53 0 0 0 -5,0.47 v 0 a 11.2,11.2 0 0 0 -1.4,0.62 9.57,9.57 0 0 0 -1.52,1 c -1.12,1.17 -1.58,1.64 -1.72,1.85 -1.31,2 -3.38,5.5 -3.08,16.73 l 0.13,28.17 H 211.4 V 48.48 h 14.24 z"
             transform="translate(-4.46,-8.27)"
             style="fill:#1b1c39"
             id="path81" /><path
             d="m 267.33,82.11 a 16.12,16.12 0 0 0 1.36,6.72 19.27,19.27 0 0 0 3.06,5 13.88,13.88 0 0 0 1,1.08 16.94,16.94 0 0 0 9.92,3.61 15.28,15.28 0 0 0 7.94,-1.83 11.91,11.91 0 0 0 4,-3.2 40.3,40.3 0 0 0 5,-6.75 l 11.67,6.67 c -5.81,10.69 -16,17.72 -28,17.72 -18.88,0 -30.61,-13.12 -30.61,-31.33 0,-19 9.37,-33 29.3,-33 19.67,0 28.86,13.54 28.86,31.89 l -0.05,3.5 z m 29.11,-11.22 c -0.75,-4 -4,-12 -14.47,-11.61 -10.16,0.35 -12.87,7.73 -13.8,11.55 z"
             transform="translate(-4.46,-8.27)"
             style="fill:#1b1c39"
             id="path83" /></g><g
           id="g126"
           transform="matrix(0.30337137,0,0,0.30337137,23.926576,161.78)"><path
             d="M 33.39,85.9 22.77,109.25 H 7 L 54.72,6.86 100.77,109.25 h -16 l -10,-23.35 z m 21.1,-46.45 -15,32.71 h 29.33 z"
             transform="translate(-7.02,-6.86)"
             style="fill:#1b1c39"
             id="path111" /><path
             d="m 121.28,54 h 0.16 c 4.74,-4.39 8.48,-6.89 16.29,-7.09 16.12,-0.44 21.77,9.79 21.77,26.69 v 35.68 H 145.34 V 75 a 42.8,42.8 0 0 0 -0.19,-4.53 23.4,23.4 0 0 0 -0.41,-3 10.33,10.33 0 0 0 -3.21,-6 9,9 0 0 0 -3.28,-1.63 12.73,12.73 0 0 0 -4.13,-0.45 c -2.33,0.09 -5.83,0.23 -8.47,2.71 a 11.49,11.49 0 0 0 -2.53,3.8 14.84,14.84 0 0 0 -1.1,3.58 68.65,68.65 0 0 0 -0.75,12.47 v 27.33 H 107 v -60.8 h 14.27 z"
             transform="translate(-7.02,-6.86)"
             style="fill:#1b1c39"
             id="path113" /><path
             d="m 164.1,48.48 h 16.21 l 18.61,35 17.27,-35 h 15.92 l -48.4,93.87 h -16 L 191.36,98 Z"
             transform="translate(-7.02,-6.86)"
             style="fill:#1b1c39"
             id="path115" /></g></g></g></g></svg>
