{
    "id": "npm/npmjs/@types/imagemin-optipng/5.2.3",
    "license": "MIT",
    "authority": "https://gitlab.eclipse.org/eclipsefdn/emo-team/iplab-test/-/issues/406",
    "source": "https://registry.yarnpkg.com/@types/imagemin-optipng/-/imagemin-optipng-5.2.3.tgz",
    "status": "approved",
    "scans": [
        {
            "date": "December 8, 2023 at 6:38:02 p.m. GMT",
            "authority": "https://gitlab.eclipse.org/eclipsefdn/emo-team/iplab-test/-/issues/406",
            "scancode-version": "31.2.1",
            "licenses-discovered": [
                "MIT"
            ],
            "copyrights": [
                "Copyright (c) Microsoft Corporation"
            ],
            "file-count": 4,
            "sha256": "4bb9f1d296ed158571207bb104d5d1b64f24ea4ee4436a25bf81c70799db32e3",
            "source": "https://registry.yarnpkg.com/@types/imagemin-optipng/-/imagemin-optipng-5.2.3.tgz",
            "status": "approved"
        }
    ]
}