{
    "id": "git/github/eclipse/dash-licenses/2b47ebec148749e30cf1a226d143086e471c7dff",
    "license": "EPL-2.0 AND MIT AND (Apache-2.0 AND GPL-3.0-only AND ISC AND MIT) AND CC0-1.0 AND (BSD-2-Clause AND GPL-2.0-only AND MIT)",
    "authority": "https://gitlab.eclipse.org/eclipsefdn/emo-team/iplab-test/-/issues/433",
    "source": "https://github.com/eclipse/dash-licenses/archive/2b47ebec148749e30cf1a226d143086e471c7dff.zip",
    "status": "restricted",
    "scans": [
        {
            "date": "February 3, 2024 at 3:42:43 a.m. GMT",
            "authority": "https://gitlab.eclipse.org/eclipsefdn/emo-team/iplab-test/-/issues/433",
            "scancode-version": "31.2.1",
            "licenses-discovered": [
                "EPL-2.0",
                "MIT",
                "Apache-2.0 AND GPL-3.0-only AND ISC AND MIT",
                "CC0-1.0",
                "BSD-2-Clause AND GPL-2.0-only AND MIT"
            ],
            "copyrights": [
                "(c) Sindre Sorhus (https://sindresorhus.com)",
                "Copyright (c) 2011 Andrei Mackenzie",
                "Copyright (c) 2011 Einar Otto Stangvik <einaros@gmail.com>",
                "Copyright (c) 2012-2014 Raynos",
                "Copyright (c) 2013-present, Facebook",
                "Copyright (c) 2014-2017, Jon",
                "Copyright (c) 2014-2017, Jon Schlinkert",
                "Copyright (c) 2015 hashes",
                "Copyright (c) 2015 unknown",
                "Copyright (c) 2016 hashes",
                "Copyright (c) 2016 unknown",
                "Copyright (c) 2017 Made With MOXY Lda",
                "Copyright (c) 2017, Jon Schlinkert (https://github.com/jonschlinkert)",
                "Copyright (c) 2019 Eclipse Foundation and others",
                "Copyright (c) 2019 The Eclipse Foundation and others",
                "Copyright (c) 2019, 2020 The Eclipse Foundation and others",
                "Copyright (c) 2019, The Eclipse Foundation and others",
                "Copyright (c) 2019,2021 The Eclipse Foundation and others",
                "Copyright (c) 2019,2022 The Eclipse Foundation and others",
                "Copyright (c) 2019,2023 The Eclipse Foundation and others",
                "Copyright (c) 2020 Eclipse Foundation and others",
                "Copyright (c) 2020 The Eclipse Foundation and others",
                "Copyright (c) 2020, 2022 The Eclipse Foundation and others",
                "Copyright (c) 2020, Red Hat Inc.",
                "Copyright (c) 2020, The Eclipse Foundation and others",
                "Copyright (c) 2020,2021 Contributors",
                "Copyright (c) 2020,2021 The Eclipse Foundation and others",
                "Copyright (c) 2020,2022 Eclipse Foundation and others",
                "Copyright (c) 2020,2022 The Eclipse Foundation and others",
                "Copyright (c) 2020,2023 Red Hat Inc. and others",
                "Copyright (c) 2021 Oleksandr Andriienko",
                "Copyright (c) 2021 The Eclipse Foundation and others",
                "Copyright (c) 2021, 2022 The Eclipse Foundation and others",
                "Copyright (c) 2021, The Eclipse Foundation",
                "Copyright (c) 2021,2022 The Eclipse Foundation and others",
                "Copyright (c) 2022 Eclipse Foundation and others",
                "Copyright (c) 2022 Hannes Wellmann and others",
                "Copyright (c) 2022 Mat Booth and others",
                "Copyright (c) 2022 STMicroelectronics and others",
                "Copyright (c) 2022 The Eclipse Foundation and others",
                "Copyright (c) 2022, 2023 Hannes Wellmann and others",
                "Copyright (c) 2023 Eclipse Foundation and others",
                "Copyright (c) 2023 The Eclipse Foundation",
                "Copyright (c) 2023 The Eclipse Foundation and others",
                "Copyright (c) Isaac Z. Schlueter and Contributors",
                "Copyright (c) Sindre Sorhus <sindresorhus@gmail.com> (sindresorhus.com)",
                "Copyright 2010 James Halliday",
                "Copyright 2010 James Halliday (mail@substack.net)",
                "Copyright 2014', Copyright (c) 2011 Andrei",
                "Copyright 2014', Copyright 2010 James Halliday (mail@substack.net)",
                "Copyright 2018 Contributors",
                "Copyright 2018 Stefan Penner",
                "Copyright 2019 Eclipse Foundation",
                "Copyright 2020 Eclipse Foundation",
                "Copyright 2021 Eclipse Foundation, Inc.",
                "Copyright 2022 Eclipse Foundation",
                "Copyright 2023 Eclipse Foundation",
                "Copyright Joyent, Inc. and other Node contributors",
                "Copyright Louis-Dominique Dubeau and contributors",
                "copyright (c) 2018 Denis",
                "copyright Louis-Dominique Dubeau"
            ],
            "file-count": 123,
            "sha256": "5dcb9f4ea83ac69694c54873e1e6286e698279b7eb102903a4a97be58ffa7d11",
            "source": "https://github.com/eclipse/dash-licenses/archive/2b47ebec148749e30cf1a226d143086e471c7dff.zip",
            "status": "restricted"
        }
    ]
}