{
    "id": "project/ecd.opensmartclide/eclipse-opensmartclide/smartclide-td-reusability-theia/998b01ae7800ead108a2aae2ac8c0b74514fe9ea",
    "license": "EPL-2.0",
    "authority": "https://gitlab.eclipse.org/eclipsefdn/emo-team/iplab-test/-/issues/120",
    "source": "https://github.com/eclipse-opensmartclide/smartclide-td-reusability-theia/archive/998b01ae7800ead108a2aae2ac8c0b74514fe9ea.zip",
    "status": "restricted",
    "scans": [
        {
            "date": "January 13, 2023 at 7:03:25 p.m. GMT",
            "authority": "https://gitlab.eclipse.org/eclipsefdn/emo-team/iplab-test/-/issues/120",
            "scancode-version": "31.2.1",
            "licenses-discovered": [
                "EPL-2.0"
            ],
            "copyrights": [
                "Copyright (c) 2021-2022 UoM - University of Macedonia"
            ],
            "file-count": 22,
            "sha256": "abf03a8d6115a0452278b2485490ce86fd950bbf913edbe5448740ffe266e264",
            "source": "https://github.com/eclipse-opensmartclide/smartclide-td-reusability-theia/archive/998b01ae7800ead108a2aae2ac8c0b74514fe9ea.zip",
            "status": "restricted"
        }
    ]
}