{
    "id": "git/github/RicoSuter/Namotion.Reflection/be75f31cee421b81bb4fc2f2b867382c796504ad",
    "license": "MIT",
    "authority": "https://gitlab.eclipse.org/eclipsefdn/emo-team/iplab-test/-/issues/442",
    "source": "https://github.com/RicoSuter/Namotion.Reflection/archive/be75f31cee421b81bb4fc2f2b867382c796504ad.zip",
    "status": "approved",
    "scans": [
        {
            "date": "July 9, 2024 at 9:44:11 p.m. GMT",
            "authority": "https://gitlab.eclipse.org/eclipsefdn/emo-team/iplab-test/-/issues/442",
            "scancode-version": "31.2.6",
            "licenses-discovered": [
                "MIT"
            ],
            "copyrights": [
                "Copyright (c) 2019 Rico Suter",
                "Copyright (c) Rico Suter"
            ],
            "file-count": 59,
            "sha256": "e9940d88b1068cb88c0b22526a309c5073e44291dbf82612205fbe7e2fd4906a",
            "source": "https://github.com/RicoSuter/Namotion.Reflection/archive/be75f31cee421b81bb4fc2f2b867382c796504ad.zip",
            "status": "approved"
        }
    ]
}