{
    "id": "project/ecd.opensmartclide/eclipse-opensmartclide/kie-wb-common/719ff8b40fd271914a0d3229a2425b136db6e25e",
    "license": "Apache-2.0 AND BSD-3-Clause AND EPL-1.0 AND LGPL-2.1-or-later",
    "authority": "https://gitlab.eclipse.org/eclipsefdn/emo-team/iplab-test/-/issues/123",
    "source": "https://github.com/eclipse-opensmartclide/kie-wb-common/archive/719ff8b40fd271914a0d3229a2425b136db6e25e.zip",
    "status": "approved",
    "scans": [
        {
            "date": "January 13, 2023 at 7:01:30 p.m. GMT",
            "authority": "https://gitlab.eclipse.org/eclipsefdn/emo-team/iplab-test/-/issues/123",
            "scancode-version": "31.2.1",
            "licenses-discovered": [
                "Apache-2.0",
                "BSD-3-Clause AND EPL-1.0",
                "Apache-2.0 AND LicenseRef-scancode-commons-clause",
                "LGPL-2.1-only",
                "Apache-2.0 AND BSD-3-Clause",
                "Apache-2.0 AND LicenseRef-scancode-unknown"
            ],
            "copyrights": [
                "Configure Copyright Template",
                "Copyright (c) 2007-2008 Terence Parr",
                "Copyright (c) 2008 - 2013 Oracle Corporation",
                "Copyright (c) 2014 Red Hat, Inc. and/or its affiliates",
                "Copyright (c) 2017 Red Hat, Inc. and/or its affiliates",
                "Copyright (c) 2018 Red Hat, Inc. and/or its affiliates",
                "Copyright . 4. Click",
                "Copyright 2005 Red Hat, Inc. and/or its affiliates",
                "Copyright 2010 Red Hat, Inc. and/or its affiliates",
                "Copyright 2011 Red Hat, Inc. and/or its affiliates",
                "Copyright 2012 JBoss Inc",
                "Copyright 2012 Red Hat, Inc. and/or its affiliates",
                "Copyright 2013 Red Hat, Inc. and/or its affiliates",
                "Copyright 2014 JBoss",
                "Copyright 2014 Red Hat, Inc. and/or its affiliates",
                "Copyright 2015 JBoss",
                "Copyright 2015 JBoss Inc",
                "Copyright 2015 Red Hat, Inc. and/or its affiliates",
                "Copyright 2016 JBoss",
                "Copyright 2016 JBoss Inc",
                "Copyright 2016 Red Hat, Inc. and/or its affiliates",
                "Copyright 2017 JBoss",
                "Copyright 2017 Red Hat Inc. and/or its affiliates and other contributors ~ as indicated by the author tags",
                "Copyright 2017 Red Hat, Inc. and/or its affiliates",
                "Copyright 2018 JBoss",
                "Copyright 2018 R8d Hat, Inc. and/or its affiliates",
                "Copyright 2018 Red Hat, Inc. and/or its affiliates",
                "Copyright 2019 Red Hat Inc. and/or its affiliates",
                "Copyright 2019 Red Hat, Inc. and/or its affiliates",
                "Copyright 2020 Red Hat, Inc. and/or its affiliates",
                "Copyright 2021 Red Hat, Inc. and/or its affiliates",
                "Copyright d d d d Red Hat, Inc",
                "Copyright year Red Hat, Inc. and/or its affiliates",
                "copyright . 3. Select"
            ],
            "file-count": 15819,
            "sha256": "d0469424f5ea8ecf1447bdc7916550ff13fa2cfa9d95006b7b6cec5862f44d41",
            "source": "https://github.com/eclipse-opensmartclide/kie-wb-common/archive/719ff8b40fd271914a0d3229a2425b136db6e25e.zip",
            "status": "restricted"
        }
    ]
}
