{
    "id": "project/automotive.dco/eclipse-dco/developer-console/073ae22d60f9069488d638206613f4155eed2109",
    "license": "Apache-2.0 AND (CC-BY-4.0 AND MIT AND OFL-1.1)",
    "authority": "https://gitlab.eclipse.org/eclipsefdn/emo-team/iplab-test/-/issues/185",
    "source": "https://gitlab.eclipse.org/api/v4/projects/eclipse%2Fdco%2Fdeveloper-console/repository/archive.zip?sha=073ae22d60f9069488d638206613f4155eed2109",
    "status": "restricted",
    "scans": [
        {
            "date": "July 18, 2023 at 4:25:28 p.m. GMT",
            "authority": "https://gitlab.eclipse.org/eclipsefdn/emo-team/iplab-test/-/issues/185",
            "scancode-version": "31.2.1",
            "licenses-discovered": [
                "Apache-2.0",
                "CC-BY-4.0 AND MIT AND OFL-1.1"
            ],
            "copyrights": [
                "Copyright (c) 2022 - 2023 T-Systems International GmbH",
                "Copyright 2021 Fonticons, Inc.",
                "Copyright 2023 T-Systems"
            ],
            "file-count": 803,
            "sha256": "1b94b315cfb228d86c708ac6efe3237689990b92bb1d35648809bef5d9fc0311",
            "source": "https://gitlab.eclipse.org/api/v4/projects/eclipse%2Fdco%2Fdeveloper-console/repository/archive.zip?sha=073ae22d60f9069488d638206613f4155eed2109",
            "status": "restricted"
        }
    ]
}