{
    "id": "project/ecd.opensmartclide/eclipse-opensmartclide/smartclide-frontend-comm/1e976ae5ace369cf1ddb03867735580b844ba2b1",
    "license": "EPL-2.0",
    "authority": "https://gitlab.eclipse.org/eclipsefdn/emo-team/iplab-test/-/issues/56",
    "source": "https://github.com/eclipse-opensmartclide/smartclide-frontend-comm/archive/1e976ae5ace369cf1ddb03867735580b844ba2b1.zip",
    "status": "restricted",
    "scans": [
        {
            "date": "December 7, 2022 at 9:03:01 p.m. GMT",
            "authority": "https://gitlab.eclipse.org/eclipsefdn/emo-team/iplab-test/-/issues/56",
            "scancode-version": "31.2.1",
            "licenses-discovered": [
                "EPL-2.0"
            ],
            "copyrights": [
                "Copyright (c) 2022 Unparallel Innovation"
            ],
            "file-count": 7,
            "sha256": "ae603eb38ce19c70c66f897dac947c26db09da50d6ec186de65c12ecc2b23ef4",
            "source": "https://github.com/eclipse-opensmartclide/smartclide-frontend-comm/archive/1e976ae5ace369cf1ddb03867735580b844ba2b1.zip",
            "status": "restricted"
        }
    ]
}