{
    "id": "nuget/nuget/-/EFCore.NamingConventions/7.0.2",
    "license": "Apache-2.0",
    "authority": "https://gitlab.eclipse.org/eclipsefdn/emo-team/iplab-test/-/issues/344",
    "source": "https://github.com/efcore/EFCore.NamingConventions/archive/refs/tags/v7.0.2.zip",
    "status": "approved",
    "scans": [
        {
            "date": "August 16, 2023 at 8:16:26 p.m. GMT",
            "authority": "https://gitlab.eclipse.org/eclipsefdn/emo-team/iplab-test/-/issues/344",
            "scancode-version": "31.2.1",
            "licenses-discovered": [
                "Apache-2.0"
            ],
            "copyrights": [
                "(c) Shay Rojansky Entity Framework Core",
                "Copyright (c) .NET Foundation",
                "Shay Rojansky Copyright 2022"
            ],
            "file-count": 30,
            "sha256": "9bf72b5735f7102fc116b53ab5635460c655727bf4676f90aad153e9171e413c",
            "source": "https://github.com/efcore/EFCore.NamingConventions/archive/refs/tags/v7.0.2.zip",
            "status": "approved"
        }
    ]
}