{
    "id": "maven/mavencentral/org.apache.commons/commons-fileupload2-portlet/2.0.0-M1",
    "license": "Apache-2.0",
    "authority": "https://gitlab.eclipse.org/eclipsefdn/emo-team/iplab-test/-/issues/432",
    "source": "https://repo1.maven.org/maven2/org/apache/commons/commons-fileupload2-portlet/2.0.0-M1/commons-fileupload2-portlet-2.0.0-M1-sources.jar",
    "status": "approved",
    "scans": [
        {
            "date": "February 2, 2024 at 10:13:17 p.m. GMT",
            "authority": "https://gitlab.eclipse.org/eclipsefdn/emo-team/iplab-test/-/issues/432",
            "scancode-version": "31.2.1",
            "licenses-discovered": [
                "Apache-2.0"
            ],
            "copyrights": [
            ],
            "file-count": 7,
            "sha256": "bdd2f21249802e0c17bd5b24f99ae2bad4b42a08dc7928ef3343d8a94d5cdc37",
            "source": "https://repo1.maven.org/maven2/org/apache/commons/commons-fileupload2-portlet/2.0.0-M1/commons-fileupload2-portlet-2.0.0-M1-sources.jar",
            "status": "approved"
        }
    ]
}