{
    "id": "project/iot.om2m/stuff/stuff/0.0",
    "license": "EPL-1.0 AND EPL-2.0",
    "authority": "https://gitlab.eclipse.org/eclipsefdn/emo-team/iplab-test/-/issues/133",
    "source": "https://gitlab.eclipse.org/eclipse/om2m/om2m/-/merge_requests/2.diff",
    "status": "restricted",
    "scans": [
        {
            "date": "January 29, 2023 at 4:26:12 a.m. GMT",
            "authority": "https://gitlab.eclipse.org/eclipsefdn/emo-team/iplab-test/-/issues/133",
            "scancode-version": "31.2.1",
            "licenses-discovered": [
                "EPL-1.0 AND EPL-2.0"
            ],
            "copyrights": [
                "Copyright (c) 2013-2020 LAAS-CNRS (www.laas.fr)",
                "Copyright (c) 2014 - 2018 Orange",
                "Copyright (c) 2014, 2016 Orange",
                "Copyright (c) 2022-2023 Sejong University"
            ],
            "file-count": 1,
            "sha256": "f19f771e3de0d92f3398b27732e27bed9b8bc126e01982a181165921c37005ab",
            "source": "https://gitlab.eclipse.org/eclipse/om2m/om2m/-/merge_requests/2.diff",
            "status": "restricted"
        }
    ]
}