{
    "id": "go/golang/github.com%2Fshirou%2Fgopsutil/v3/v3.22.7",
    "license": "BSD-3-Clause AND BSD-2-Clause-Views AND MIT",
    "authority": "https://gitlab.eclipse.org/eclipsefdn/emo-team/iplab-test/-/issues/414",
    "source": "https://proxy.golang.org/github.com%2Fshirou%2Fgopsutil/v3/@v/v3.22.7.zip",
    "status": "approved",
    "scans": [
        {
            "date": "January 9, 2024 at 5:41:45 p.m. GMT",
            "authority": "https://gitlab.eclipse.org/eclipsefdn/emo-team/iplab-test/-/issues/414",
            "scancode-version": "31.2.1",
            "licenses-discovered": [
                "BSD-3-Clause",
                "BSD-2-Clause-Views",
                "MIT"
            ],
            "copyrights": [
                "Copyright (c) 1979, 1980, 1983, 1986, 1988, 1989, 1991, 1992, 1993, 1994 The Regents of the University of California",
                "Copyright (c) 1992-2011 The FreeBSD Project",
                "Copyright (c) 1992-2016 The FreeBSD Project",
                "Copyright (c) 2009 The Go Authors",
                "Copyright (c) 2010 Ed Schouten <ed@FreeBSD.org>",
                "Copyright (c) 2014, WAKAYAMA Shirou",
                "Copyright 2009 The Go Authors"
            ],
            "file-count": 264,
            "sha256": "804ef8c0ff2fe51315f6cba65dc4d29993568931e91632ed4d8c2c4dc4f57734",
            "source": "https://proxy.golang.org/github.com%2Fshirou%2Fgopsutil/v3/@v/v3.22.7.zip",
            "status": "approved"
        }
    ]
}