{
    "id": "p2/orbit/p2.eclipse.plugin/org.apache.batik.codec/1.18.0.v20241009-1200",
    "license": "Apache-2.0",
    "authority": "https://gitlab.eclipse.org/eclipsefdn/emo-team/iplab-test/-/issues/451",
    "source": "https://repo1.maven.org/maven2/org/apache/xmlgraphics/batik-codec/1.18/batik-codec-1.18-sources.jar",
    "status": "approved",
    "scans": [
        {
            "date": "October 15, 2024, 2:51:56 a.m. GMT",
            "authority": "https://gitlab.eclipse.org/eclipsefdn/emo-team/iplab-test/-/issues/451",
            "scancode-version": "31.2.6",
            "licenses-discovered": [
                "Apache-2.0"
            ],
            "copyrights": [
            ],
            "file-count": 41,
            "sha256": "9924c7d71a029d0b3462b16db4a7279ef3c5d92c8268f2ede960e06a3238581f",
            "source": "https://repo1.maven.org/maven2/org/apache/xmlgraphics/batik-codec/1.18/batik-codec-1.18-sources.jar",
            "status": "approved"
        }
    ]
}