{
    "license": "Apache-2.0",
    "file-count": 111,
    "authority": "https://gitlab.eclipse.org/eclipsefdn/emo-team/iplab/-/issues/1567",
    "scancode-version": "30.1.0",
    "licenses-discovered": [
    ],
    "id": "maven/mavencentral/org.camunda.bpm.model/camunda-xml-model/7.15.0",
    "source": "https://search.maven.org/remotecontent?filepath=org/camunda/bpm/model/camunda-xml-model/7.15.0/camunda-xml-model-7.15.0-sources.jar",
    "status": "approved"
}
