{
    "id": "maven/mavencentral/org.geotools.xsd/gt-xsd-gml2/30.4",
    "license": "LGPL-2.1-only",
    "authority": "https://gitlab.eclipse.org/eclipsefdn/emo-team/iplab/-/issues/15579",
    "source": "https://repo.osgeo.org/repository/geotools-releases/org/geotools/xsd/gt-xsd-gml2/30.4/gt-xsd-gml2-30.4-sources.jar",
    "status": "approved",
    "scans": [
        {
            "date": "July 3, 2024 at 2:57:24 p.m. GMT",
            "authority": "https://gitlab.eclipse.org/eclipsefdn/emo-team/iplab/-/issues/15579",
            "scancode-version": "31.2.1",
            "licenses-discovered": [
                "LGPL-2.1-only"
            ],
            "copyrights": [
                "(c) 2002-2008, Open Source Geospatial Foundation",
                "(c) 2002-2010, Open Source Geospatial Foundation",
                "(c) 2002-2012, Open Source Geospatial Foundation",
                "(c) 2002-2015, Open Source Geospatial Foundation",
                "(c) 2002-2016, Open Source Geospatial Foundation",
                "(c) 2015 - 2016, Open Source Geospatial Foundation",
                "(c) 2015, Open Source Geospatial Foundation",
                "(c) 2015-2016, Open Source Geospatial Foundation",
                "(c) 2016, Open Source Geospatial Foundation",
                "Copyright (c) 2001,2002 OGC",
                "Copyright (c) 2002 OGC"
            ],
            "file-count": 67,
            "sha256": "b021696111645b61e35a5cb29ed00f6aa24497c3f8a0e99bc2fbaf6d17431a2d",
            "source": "https://repo.osgeo.org/repository/geotools-releases/org/geotools/xsd/gt-xsd-gml2/30.4/gt-xsd-gml2-30.4-sources.jar",
            "status": "approved"
        }
    ]
}