{
    "id": "maven/mavencentral/io.fabric8/kubernetes-model-coordination/6.6.0",
    "license": "Apache-2.0",
    "authority": "https://gitlab.eclipse.org/eclipsefdn/emo-team/iplab/-/issues/8331",
    "source": "https://search.maven.org/remotecontent?filepath=io/fabric8/kubernetes-model-coordination/6.6.0/kubernetes-model-coordination-6.6.0-sources.jar",
    "status": "approved",
    "scans": [
        {
            "date": "May 5, 2023 at 6:01:39 a.m. GMT",
            "authority": "https://gitlab.eclipse.org/eclipsefdn/emo-team/iplab/-/issues/8331",
            "scancode-version": "31.2.1",
            "licenses-discovered": [
                "Apache-2.0"
            ],
            "copyrights": [
                "Copyright (c) 2015 Red Hat, Inc."
            ],
            "file-count": 21,
            "sha256": "10eb2f341742e3d1772bd99121f99ec35107cee613648b5c9a280ab63f661c9f",
            "source": "https://search.maven.org/remotecontent?filepath=io/fabric8/kubernetes-model-coordination/6.6.0/kubernetes-model-coordination-6.6.0-sources.jar",
            "status": "approved"
        }
    ]
}