{
    "id": "npm/npmjs/@webassemblyjs/wast-printer/1.11.5",
    "license": "MIT",
    "authority": "https://gitlab.eclipse.org/eclipsefdn/emo-team/iplab/-/issues/7957",
    "source": "https://registry.npmjs.org/@webassemblyjs/wast-printer/-/wast-printer-1.11.5.tgz",
    "status": "approved",
    "scans": [
        {
            "date": "April 26, 2023 at 1:04:02 p.m. GMT",
            "authority": "https://gitlab.eclipse.org/eclipsefdn/emo-team/iplab/-/issues/7957",
            "scancode-version": "31.2.1",
            "licenses-discovered": [
                "MIT"
            ],
            "copyrights": [
            ],
            "file-count": 3,
            "sha256": "5ef0609c521991e70d8cb496be0a34f873792df55076ba312942f99bac451a18",
            "source": "https://registry.npmjs.org/@webassemblyjs/wast-printer/-/wast-printer-1.11.5.tgz",
            "status": "approved"
        }
    ]
}