{
    "id": "maven/mavencentral/org.apache.arrow/arrow-format/11.0.0",
    "license": "Apache-2.0",
    "authority": "https://gitlab.eclipse.org/eclipsefdn/emo-team/iplab/-/issues/7009",
    "source": "https://search.maven.org/remotecontent?filepath=org/apache/arrow/arrow-format/11.0.0/arrow-format-11.0.0-sources.jar",
    "status": "approved",
    "scans": [
        {
            "date": "February 3, 2023 at 5:36:38 p.m. GMT",
            "authority": "https://gitlab.eclipse.org/eclipsefdn/emo-team/iplab/-/issues/7009",
            "scancode-version": "31.2.1",
            "licenses-discovered": [
                "Apache-2.0"
            ],
            "copyrights": [
            ],
            "file-count": 58,
            "sha256": "1ec5abdd86589fb0619c437037160473bb220fd13e0f6783c100dce5e95daf9a",
            "source": "https://search.maven.org/remotecontent?filepath=org/apache/arrow/arrow-format/11.0.0/arrow-format-11.0.0-sources.jar",
            "status": "approved"
        }
    ]
}