{
    "id": "maven/mavencentral/org.springframework.cloud/spring-cloud-stream-binder-rabbit-core/4.1.0",
    "license": "Apache-2.0",
    "authority": "https://gitlab.eclipse.org/eclipsefdn/emo-team/iplab/-/issues/13741",
    "source": "https://repo1.maven.org/maven2/org/springframework/cloud/spring-cloud-stream-binder-rabbit-core/4.1.0/spring-cloud-stream-binder-rabbit-core-4.1.0-sources.jar",
    "status": "approved",
    "scans": [
        {
            "date": "March 15, 2024 at 2:07:11 p.m. GMT",
            "authority": "https://gitlab.eclipse.org/eclipsefdn/emo-team/iplab/-/issues/13741",
            "scancode-version": "31.2.1",
            "licenses-discovered": [
                "Apache-2.0"
            ],
            "copyrights": [
                "Copyright 2015-2019 the original author or authors",
                "Copyright 2015-2022 the original author or authors",
                "Copyright 2016-2018 the original author or authors",
                "Copyright 2016-2023 the original author or authors",
                "Copyright 2017-2018 the original author or authors"
            ],
            "file-count": 12,
            "sha256": "b68351f415bb62a4a26392f017ead03fc68f03e7faf9319b849532a3386d8985",
            "source": "https://repo1.maven.org/maven2/org/springframework/cloud/spring-cloud-stream-binder-rabbit-core/4.1.0/spring-cloud-stream-binder-rabbit-core-4.1.0-sources.jar",
            "status": "approved"
        }
    ]
}