{
    "id": "project/dt.mnestix/eclipse-mnestix/mnestix-browser/9afd544ac4760de68c5132990c9e32a6abfe8e34",
    "license": "MIT",
    "authority": "https://gitlab.eclipse.org/eclipsefdn/emo-team/iplab/-/issues/18876",
    "source": "https://github.com/eclipse-mnestix/mnestix-browser/archive/9afd544ac4760de68c5132990c9e32a6abfe8e34.zip",
    "status": "approved",
    "scans": [
        {
            "date": "January 16, 2025 at 9:22:44 p.m. GMT",
            "authority": "https://gitlab.eclipse.org/eclipsefdn/emo-team/iplab/-/issues/18876",
            "scancode-version": "31.2.1",
            "licenses-discovered": [
                "MIT"
            ],
            "copyrights": [
                "Copyright (c) 2024 XITASO GmbH"
            ],
            "file-count": 471,
            "sha256": "e2ef3d6eee91d3c8d14b7ea8c52ee66c9664bac3062da974ae4b4147b8e95eba",
            "source": "https://github.com/eclipse-mnestix/mnestix-browser/archive/9afd544ac4760de68c5132990c9e32a6abfe8e34.zip",
            "status": "restricted"
        }
    ]
}