{
    "id": "npm/npmjs/-/strip-ansi-cjs/6.0.1",
    "license": "MIT",
    "authority": "https://gitlab.eclipse.org/eclipsefdn/emo-team/iplab/-/issues/11643",
    "source": "https://registry.npmjs.org/strip-ansi/-/strip-ansi-6.0.1.tgz",
    "status": "approved",
    "scans": [
        {
            "date": "November 21, 2023 at 7:36:44 p.m. GMT",
            "authority": "https://gitlab.eclipse.org/eclipsefdn/emo-team/iplab/-/issues/11643",
            "scancode-version": "31.2.1",
            "licenses-discovered": [
                "MIT"
            ],
            "copyrights": [
                "Copyright (c) Sindre Sorhus <sindresorhus@gmail.com> (sindresorhus.com)"
            ],
            "file-count": 5,
            "sha256": "9bdb75d0bff49f156dd8c3bcb0e06b3fa96c3d88ddd4c342a4345866a40c08ca",
            "source": "https://registry.npmjs.org/strip-ansi/-/strip-ansi-6.0.1.tgz",
            "status": "approved"
        }
    ]
}