{
    "id": "maven/mavencentral/org.scala-lang.modules/scala-xml_2.13/2.2.0",
    "license": "Apache-2.0",
    "authority": "https://gitlab.eclipse.org/eclipsefdn/emo-team/iplab/-/issues/12632",
    "source": "https://repo1.maven.org/maven2/org/scala-lang/modules/scala-xml_2.13/2.2.0/scala-xml_2.13-2.2.0-sources.jar",
    "status": "approved",
    "scans": [
        {
            "date": "January 7, 2024 at 11:51:30 p.m. GMT",
            "authority": "https://gitlab.eclipse.org/eclipsefdn/emo-team/iplab/-/issues/12632",
            "scancode-version": "31.2.1",
            "licenses-discovered": [
                "Apache-2.0"
            ],
            "copyrights": [
                "(c) David Pollak 2007 WorldWide Conferencing, LLC",
                "(c) David Pollak 2007 WorldWide Conferencing, LLC.",
                "(c) David Pollak, 2007 WorldWide Conferencing, LLC."
            ],
            "file-count": 77,
            "sha256": "75edeab4d6688246d26a8de2deb430bc65a46dd25eb0350b3872c8631a9de602",
            "source": "https://repo1.maven.org/maven2/org/scala-lang/modules/scala-xml_2.13/2.2.0/scala-xml_2.13-2.2.0-sources.jar",
            "status": "approved"
        }
    ]
}