{
    "id": "maven/mavencentral/io.quarkus/quarkus-jdbc-h2/3.8.6",
    "license": "Apache-2.0",
    "authority": "https://gitlab.eclipse.org/eclipsefdn/emo-team/iplab/-/issues/17382",
    "source": "https://repo1.maven.org/maven2/io/quarkus/quarkus-jdbc-h2/3.8.6/quarkus-jdbc-h2-3.8.6-sources.jar",
    "status": "approved",
    "scans": [
        {
            "date": "November 20, 2024, 5:37:33 p.m. GMT",
            "authority": "https://gitlab.eclipse.org/eclipsefdn/emo-team/iplab/-/issues/17382",
            "scancode-version": "31.2.1",
            "licenses-discovered": [
            ],
            "copyrights": [
            ],
            "file-count": 11,
            "sha256": "2f1cd22e9c377ae9a21d163615614603c002cc9c6d95d51ece54f2582541d2fa",
            "source": "https://repo1.maven.org/maven2/io/quarkus/quarkus-jdbc-h2/3.8.6/quarkus-jdbc-h2-3.8.6-sources.jar",
            "status": "restricted"
        }
    ]
}