{
    "id": "git/github/eclipsesource/theia-cloud/80ffd29ac02b62da7c948c5841c655e0b877f405",
    "license": "(EPL-2.0 OR GPL-2.0-only WITH Classpath-exception-2.0) AND Apache-2.0 AND MIT",
    "authority": "https://gitlab.eclipse.org/eclipsefdn/emo-team/iplab/-/issues/15953",
    "source": "https://github.com/eclipsesource/theia-cloud/archive/80ffd29ac02b62da7c948c5841c655e0b877f405.zip",
    "status": "approved",
    "scans": [
        {
            "date": "August 19, 2024 at 4:26:52 a.m. GMT",
            "authority": "https://gitlab.eclipse.org/eclipsefdn/emo-team/iplab/-/issues/15953",
            "scancode-version": "31.2.1",
            "licenses-discovered": [
                "EPL-2.0",
                "MIT",
                "EPL-2.0 AND (GPL-2.0-only WITH Classpath-exception-2.0)",
                "Apache-2.0",
                "EPL-2.0 OR GPL-2.0-only WITH Classpath-exception-2.0"
            ],
            "copyrights": [
                "Copyright (c) 2009-2013 TJ Holowaychuk",
                "Copyright (c) 2010 Sencha Inc.",
                "Copyright (c) 2011 TJ Holowaychuk",
                "Copyright (c) 2012 Federico Romero",
                "Copyright (c) 2012 TJ Holowaychuk",
                "Copyright (c) 2012-2013 TJ Holowaychuk",
                "Copyright (c) 2012-2014 Isaac Z. Schlueter",
                "Copyright (c) 2012-2014 Roman Shtylman",
                "Copyright (c) 2012-2014 TJ Holowaychuk",
                "Copyright (c) 2013 Jonathan Ong",
                "Copyright (c) 2013 Roman Shtylman",
                "Copyright (c) 2013-2014 Jonathan Ong",
                "Copyright (c) 2013-2014 TJ Holowaychuk",
                "Copyright (c) 2014 Douglas Christopher Wilson",
                "Copyright (c) 2014 Jonathan Ong",
                "Copyright (c) 2014-2015 Douglas Christopher Wilson",
                "Copyright (c) 2014-2016 Douglas Christopher Wilson",
                "Copyright (c) 2014-2017 Douglas Christopher Wilson",
                "Copyright (c) 2014-2018 Douglas Christopher Wilson",
                "Copyright (c) 2014-2022 Douglas Christopher Wilson",
                "Copyright (c) 2015 Andreas Lubbe",
                "Copyright (c) 2015 Douglas Christopher Wilson",
                "Copyright (c) 2015 Jed Watson",
                "Copyright (c) 2015 Tiancheng Timothy Gu",
                "Copyright (c) 2015-2016 Douglas Christopher Wilson",
                "Copyright (c) 2015-2022 Douglas Christopher Wilson",
                "Copyright (c) 2016 Douglas Christopher Wilson",
                "Copyright (c) 2016-2017 Douglas Christopher Wilson",
                "Copyright (c) 2020-2021 EclipseSource and others",
                "Copyright (c) 2022 EclipseSource and others",
                "Copyright (c) 2022 EclipseSource, Lockular, Ericsson, STMicroelectronics and others",
                "Copyright (c) 2022 EclipseSource, logi.cals and others",
                "Copyright (c) 2022-2023 EclipseSource and others",
                "Copyright (c) 2022-2023 EclipseSource, Lockular, Ericsson, STMicroelectronics and others",
                "Copyright (c) 2022-2023 EclipseSource, STMicroelectronics and others",
                "Copyright (c) 2022-2024 EclipseSource and others",
                "Copyright (c) 2023 EclipseSource and others",
                "Copyright (c) 2023 EclipseSource, STMicroelectronics and others",
                "Copyright (c) 2024 EclipseSource and others"
            ],
            "file-count": 494,
            "sha256": "0511552d0be4c1140ce22a849eba82d1ce9c0687d30993bd7fcf287900bfcccb",
            "source": "https://github.com/eclipsesource/theia-cloud/archive/80ffd29ac02b62da7c948c5841c655e0b877f405.zip",
            "status": "restricted"
        }
    ]
}