{
    "id": "maven/mavencentral/io.netty/netty-buffer/4.2.0.Alpha4",
    "license": "Apache-2.0",
    "authority": "https://gitlab.eclipse.org/eclipsefdn/emo-team/iplab/-/issues/16116",
    "source": "https://repo1.maven.org/maven2/io/netty/netty-buffer/4.2.0.Alpha4/netty-buffer-4.2.0.Alpha4-sources.jar",
    "status": "approved",
    "scans": [
        {
            "date": "September 11, 2024, 11:54:10 p.m. GMT",
            "authority": "https://gitlab.eclipse.org/eclipsefdn/emo-team/iplab/-/issues/16116",
            "scancode-version": "31.2.1",
            "licenses-discovered": [
                "Apache-2.0"
            ],
            "copyrights": [
                "Copyright 2012 The Netty Project",
                "Copyright 2013 The Netty Project",
                "Copyright 2014 The Netty Project",
                "Copyright 2015 The Netty Project",
                "Copyright 2016 The Netty Project",
                "Copyright 2017 The Netty Project",
                "Copyright 2019 The Netty Project",
                "Copyright 2020 The Netty Project",
                "Copyright 2022 The Netty Project",
                "Copyright 2024 The Netty Project"
            ],
            "file-count": 88,
            "sha256": "51e8f4fe4d54aae18e07d5388a161d9ce95c88518301247df891dea9d6388be1",
            "source": "https://repo1.maven.org/maven2/io/netty/netty-buffer/4.2.0.Alpha4/netty-buffer-4.2.0.Alpha4-sources.jar",
            "status": "approved"
        }
    ]
}