{
    "id": "crate/cratesio/-/backtrace/0.3.74",
    "license": "Apache-2.0 AND MIT AND Apache-2.0 AND MIT",
    "authority": "https://gitlab.eclipse.org/eclipsefdn/emo-team/iplab/-/issues/16096",
    "source": "https://crates.io/api/v1/crates/backtrace/0.3.74/download",
    "status": "approved",
    "scans": [
        {
            "date": "September 10, 2024, 2:55:13 p.m. GMT",
            "authority": "https://gitlab.eclipse.org/eclipsefdn/emo-team/iplab/-/issues/16096",
            "scancode-version": "31.2.1",
            "licenses-discovered": [
                "Apache-2.0 AND MIT",
                "Apache-2.0",
                "MIT"
            ],
            "copyrights": [
                "Copyright (c) 2014 Alex Crichton"
            ],
            "file-count": 58,
            "sha256": "8d82cb332cdfaed17ae235a638438ac4d4839913cc2af585c3c6746e8f8bee1a",
            "source": "https://crates.io/api/v1/crates/backtrace/0.3.74/download",
            "status": "approved"
        }
    ]
}