{
    "id": "maven/mavencentral/com.jcabi/jcabi-log/0.20.0",
    "license": "BSD-3-Clause",
    "authority": "https://gitlab.eclipse.org/eclipsefdn/emo-team/iplab/-/issues/9114",
    "source": "https://repo.maven.apache.org/maven2/com/jcabi/jcabi-log/0.20.0/jcabi-log-0.20.0-sources.jar",
    "status": "approved",
    "scans": [
        {
            "date": "June 20, 2023 at 5:32:52 p.m. GMT",
            "authority": "https://gitlab.eclipse.org/eclipsefdn/emo-team/iplab/-/issues/9114",
            "scancode-version": "31.2.1",
            "licenses-discovered": [
                "BSD-3-Clause"
            ],
            "copyrights": [
                "Copyright (c) 2012-2021, jcabi.com"
            ],
            "file-count": 33,
            "sha256": "1496c4acbca9fffa5ae5e53c0ea7b56f53abf06b6e69e550cddd614fe5e6723c",
            "source": "https://repo.maven.apache.org/maven2/com/jcabi/jcabi-log/0.20.0/jcabi-log-0.20.0-sources.jar",
            "status": "approved"
        }
    ]
}