{
    "id": "npm/npmjs/@nrwl/nx-linux-x64-musl/15.7.0",
    "license": "MIT",
    "authority": "https://gitlab.eclipse.org/eclipsefdn/emo-team/iplab/-/issues/7123",
    "source": "https://registry.npmjs.org/@nrwl/nx-linux-x64-musl/-/nx-linux-x64-musl-15.7.0.tgz",
    "status": "approved",
    "scans": [
        {
            "date": "February 14, 2023 at 3:20:16 p.m. GMT",
            "authority": "https://gitlab.eclipse.org/eclipsefdn/emo-team/iplab/-/issues/7123",
            "scancode-version": "31.2.1",
            "licenses-discovered": [
                "MIT"
            ],
            "copyrights": [
                "Copyright (c) 2017-2023 Narwhal Technologies Inc."
            ],
            "file-count": 3,
            "sha256": "5832ac73abac9c848fbee89bd75ec15c20b5aacc761e88c3234ed3a0fbd4fd77",
            "source": "https://registry.npmjs.org/@nrwl/nx-linux-x64-musl/-/nx-linux-x64-musl-15.7.0.tgz",
            "status": "approved"
        }
    ]
}