{
    "id": "npm/npmjs/@babel/compat-data/7.26.2",
    "license": "MIT AND (BSD-2-Clause AND ISC AND MIT) AND BSD-2-Clause AND BSD-3-Clause",
    "authority": "https://gitlab.eclipse.org/eclipsefdn/emo-team/iplab/-/issues/17031",
    "source": "https://github.com/babel/babel/archive/refs/tags/v7.26.2.zip",
    "status": "approved",
    "scans": [
        {
            "date": "November 5, 2024, 10:35:40 a.m. GMT",
            "authority": "https://gitlab.eclipse.org/eclipsefdn/emo-team/iplab/-/issues/17031",
            "scancode-version": "31.2.1",
            "licenses-discovered": [
                "MIT",
                "BSD-2-Clause AND ISC AND MIT",
                "BSD-2-Clause",
                "BSD-3-Clause"
            ],
            "copyrights": [
                "(c) 2014-2024 Denis Pushkarev",
                "Copyright (c) 2011-2017 KARASZI Istvan <github@spam.raszi.hu>",
                "Copyright (c) 2012 Yusuke Suzuki <utatane.tea@gmail.com>",
                "Copyright (c) 2012-2013 Ecma International",
                "Copyright (c) 2012-2014 by various contributors",
                "Copyright (c) 2014-2015 Jason Quense <jason@quense.me>",
                "Copyright (c) 2014-present Sebastian McKenzie and other contributors",
                "Copyright (c) 2014-present, Facebook, Inc.",
                "Copyright (c) 2015 Jed Watson",
                "Copyright (c) 2016 the V8 project authors",
                "Copyright (c) 2020 Rick Waldron",
                "Copyright (c) jQuery Foundation, Inc. and Contributors",
                "Copyright 2013-2015, Facebook, Inc.",
                "Copyright 2020 Bloomberg Finance L.P.",
                "Copyright JS Foundation and other contributors",
                "Copyright OpenJS Foundation and other contributors"
            ],
            "file-count": 31700,
            "sha256": "b63c9c050e8819bed7df2f8abdd53038938df72ac475c201708f10770f420343",
            "source": "https://github.com/babel/babel/archive/refs/tags/v7.26.2.zip",
            "status": "approved"
        }
    ]
}