{
    "id": "maven/mavencentral/org.typelevel/cats-parse_2.12/0.3.6",
    "license": "MIT",
    "authority": "https://gitlab.eclipse.org/eclipsefdn/emo-team/iplab/-/issues/8861",
    "source": "https://repo.maven.apache.org/maven2/org/typelevel/cats-parse_2.12/0.3.6/cats-parse_2.12-0.3.6-sources.jar",
    "status": "approved",
    "scans": [
        {
            "date": "June 14, 2023 at 7:19:13 p.m. GMT",
            "authority": "https://gitlab.eclipse.org/eclipsefdn/emo-team/iplab/-/issues/8861",
            "scancode-version": "31.2.1",
            "licenses-discovered": [
                "MIT"
            ],
            "copyrights": [
                "Copyright (c) 2021 Typelevel"
            ],
            "file-count": 10,
            "sha256": "102f70003e09fa74e75ce027bc2c308c1934e319bea94428d97e0b9001de9dde",
            "source": "https://repo.maven.apache.org/maven2/org/typelevel/cats-parse_2.12/0.3.6/cats-parse_2.12-0.3.6-sources.jar",
            "status": "approved"
        }
    ]
}