{
    "id": "maven/mavencentral/software.amazon.awssdk/aws-xml-protocol/2.17.230",
    "license": "Apache-2.0",
    "licenses-discovered": [
        "Apache-2.0"
    ],
    "copyrights": [
        "Copyright Amazon.com, Inc. or its affiliates"
    ],
    "file-count": 31,
    "scancode-version": "31.2.1",
    "authority": "https://gitlab.eclipse.org/eclipsefdn/emo-team/iplab/-/issues/4411",
    "source": "https://search.maven.org/remotecontent?filepath=software/amazon/awssdk/aws-xml-protocol/2.17.230/aws-xml-protocol-2.17.230-sources.jar",
    "status": "approved"
}