{
    "id": "maven/mavencentral/it.unibz.inf.ontop/ontop-obda-core/5.0.2",
    "license": "Apache-2.0",
    "authority": "https://gitlab.eclipse.org/eclipsefdn/emo-team/iplab/-/issues/9812",
    "source": "https://repo.maven.apache.org/maven2/it/unibz/inf/ontop/ontop-obda-core/5.0.2/ontop-obda-core-5.0.2-sources.jar",
    "status": "approved",
    "scans": [
        {
            "date": "July 27, 2023 at 1:34:06 p.m. GMT",
            "authority": "https://gitlab.eclipse.org/eclipsefdn/emo-team/iplab/-/issues/9812",
            "scancode-version": "31.2.1",
            "licenses-discovered": [
                "Apache-2.0"
            ],
            "copyrights": [
                "Copyright (c) 2009 - 2014 Free University of Bozen-Bolzano"
            ],
            "file-count": 60,
            "sha256": "f10d90b942732ce6c4ca97535bf197ffa24211e8bb4e9ad9eb255e4df7e31c47",
            "source": "https://repo.maven.apache.org/maven2/it/unibz/inf/ontop/ontop-obda-core/5.0.2/ontop-obda-core-5.0.2-sources.jar",
            "status": "approved"
        }
    ]
}