{
    "id": "go/golang/github.com%2Fnakabonne/nestif/v0.3.1",
    "license": "BSD-2-Clause AND BSD-3-Clause",
    "authority": "https://gitlab.eclipse.org/eclipsefdn/emo-team/iplab/-/issues/12430",
    "source": "https://proxy.golang.org/github.com%2Fnakabonne/nestif/@v/v0.3.1.zip",
    "status": "approved",
    "scans": [
        {
            "date": "December 21, 2023 at 10:11:12 a.m. GMT",
            "authority": "https://gitlab.eclipse.org/eclipsefdn/emo-team/iplab/-/issues/12430",
            "scancode-version": "31.2.1",
            "licenses-discovered": [
                "BSD-2-Clause",
                "BSD-3-Clause"
            ],
            "copyrights": [
                "Copyright (c) 2013 The Go Authors",
                "Copyright (c) 2020, Ryo Nakao",
                "Copyright 2020 Ryo Nakao <ryo@nakao.dev>"
            ],
            "file-count": 19,
            "sha256": "7c0a39bd8577b7b158e9213f70f8d92a704d19d74900eee4f5da0e9f233fa7c7",
            "source": "https://proxy.golang.org/github.com%2Fnakabonne/nestif/@v/v0.3.1.zip",
            "status": "approved"
        }
    ]
}