{
    "id": "maven/mavencentral/org.jopendocument/jdom/1.1.1",
    "license": "LicenseRef-scancode-jdom",
    "authority": "https://gitlab.eclipse.org/eclipsefdn/emo-team/iplab/-/issues/13559",
    "source": "https://repo1.maven.org/maven2/org/jopendocument/jdom/1.1.1/jdom-1.1.1-sources.jar",
    "status": "restricted",
    "scans": [
        {
            "date": "March 6, 2024 at 5:35:00 p.m. GMT",
            "authority": "https://gitlab.eclipse.org/eclipsefdn/emo-team/iplab/-/issues/13559",
            "scancode-version": "31.2.1",
            "licenses-discovered": [
                "LicenseRef-scancode-jdom"
            ],
            "copyrights": [
                "Copyright (c) 2000-2007 Jason Hunter & Brett McLaughlin",
                "Copyright (c) 2001-2007 Jason Hunter & Brett McLaughlin",
                "Copyright (c) 2003-2007 Jason Hunter & Brett McLaughlin",
                "Copyright (c) 2007 Jason Hunter & Brett McLaughlin"
            ],
            "file-count": 70,
            "sha256": "cef177713e2b93c0fb2b3163cb5d161d6bc09332b3045e0c9ae7c9dad6507f82",
            "source": "https://repo1.maven.org/maven2/org/jopendocument/jdom/1.1.1/jdom-1.1.1-sources.jar",
            "status": "restricted"
        }
    ]
}