{
    "id": "git/github/chromium/chromium/120.0.6099.199",
    "license": "None",
    "authority": "https://gitlab.eclipse.org/eclipsefdn/emo-team/iplab/-/issues/12677",
    "source": "https://github.com/chromium/chromium/archive/refs/tags/120.0.6099.199.zip",
    "status": "approved",
    "scans": [
        {
            "date": "January 10, 2024 at 2:29:38 p.m. GMT",
            "authority": "https://gitlab.eclipse.org/eclipsefdn/emo-team/iplab/-/issues/12677",
            "scancode-version": "31.2.1",
            "licenses-discovered": [
            ],
            "copyrights": [
            ],
            "file-count": 1,
            "sha256": "2582728e9ca329bb35b72fdda11c884b9eabd14ae3148c962662b3cf88118179",
            "source": "https://github.com/chromium/chromium/archive/refs/tags/120.0.6099.199.zip",
            "status": "restricted"
        }
    ]
}
