{
    "id": "npm/npmjs/-/nan/2.18.0",
    "license": "BSD-3-Clause AND MIT",
    "authority": "https://gitlab.eclipse.org/eclipsefdn/emo-team/iplab/-/issues/10899",
    "source": "https://github.com/nodejs/nan/archive/refs/tags/v2.18.0.zip",
    "status": "approved",
    "scans": [
        {
            "date": "October 4, 2023 at 9:59:19 p.m. GMT",
            "authority": "https://gitlab.eclipse.org/eclipsefdn/emo-team/iplab/-/issues/10899",
            "scancode-version": "31.2.1",
            "licenses-discovered": [
                "BSD-3-Clause",
                "MIT"
            ],
            "copyrights": [
                "Copyright (c) 2009 Google Inc.",
                "Copyright (c) 2018 NAN WG Members",
                "Copyright (c) 2018 NAN contributors",
                "Copyright (c) 2018 NAN contributors - Rod Vagg <https://github.com/rvagg>",
                "Copyright (c) 2019 NAN contributors",
                "Copyright (c) 2021 NAN contributors",
                "Copyright Joyent, Inc. and other Node contributors"
            ],
            "file-count": 164,
            "sha256": "0cca9b9a9929b23d5abb280ed27fe3eefe882adc38d7b3dabb616334ed963d15",
            "source": "https://github.com/nodejs/nan/archive/refs/tags/v2.18.0.zip",
            "status": "approved"
        }
    ]
}