{
    "id": "npm/npmjs/-/core-js/2.6.0",
    "license": "MIT AND (BSD-3-Clause AND MIT)",
    "licenses-discovered": [
        "MIT",
        "BSD-3-Clause AND MIT"
    ],
    "copyrights": [
        "(c) Denis Pushkarev",
        "Copyright (c) Christian Johansen",
        "Copyright (c) Denis Pushkarev",
        "Copyright (c) Maximilian Antoni",
        "Copyright (c) Paul Johnston - Other contributors Greg Holt, Andrew Kepert, Ydnar, Lostinet",
        "Copyright Angel Marin, Paul Johnston - Other contributors Greg Holt, Andrew Kepert, Ydnar, Lostinet",
        "Copyright Joyent, Inc. and other Node contributors"
    ],
    "file-count": 1968,
    "scancode-version": "30.1.0",
    "authority": "https://gitlab.eclipse.org/eclipsefdn/emo-team/iplab/-/issues/2912",
    "source": "https://github.com/zloirock/core-js/archive/v2.6.0.zip",
    "status": "approved"
}