{
    "id": "maven/mavencentral/org.kohsuke/github-api/1.318",
    "license": "Apache-2.0 AND MIT",
    "authority": "https://gitlab.eclipse.org/eclipsefdn/emo-team/iplab/-/issues/13709",
    "source": "https://repo1.maven.org/maven2/org/kohsuke/github-api/1.318/github-api-1.318-sources.jar",
    "status": "approved",
    "scans": [
        {
            "date": "March 14, 2024 at 4:53:52 p.m. GMT",
            "authority": "https://gitlab.eclipse.org/eclipsefdn/emo-team/iplab/-/issues/13709",
            "scancode-version": "31.2.1",
            "licenses-discovered": [
                "MIT",
                "LicenseRef-scancode-proprietary-license AND MIT",
                "Apache-2.0"
            ],
            "copyrights": [
                "(c) Copyright 2015 - SourceClear Inc",
                "Copyright (c) 2010, Kohsuke Kawaguchi",
                "Copyright (c) 2011, Eric Maupin",
                "Copyright (c) 2011, Eric Maupin, Kohsuke Kawaguchi",
                "Copyright (c) 2013, Luca Milanesio",
                "Copyright (c) 2014 Square, Inc.",
                "Copyright (c) 2015, Julien Henry",
                "Copyright (c) 2016, Duncan Dickinson",
                "Copyright (c) 2017, CloudBees, Inc.",
                "Copyright 2016 CloudBees, Inc.",
                "Copyright 2018 Martin van Zijl",
                "Copyright 2020 CloudBees, Inc."
            ],
            "file-count": 237,
            "sha256": "0417d195d48b3738066a5cf5f325bb8b987bfeaf91f7d010c6399d7e7ddd6dc3",
            "source": "https://repo1.maven.org/maven2/org/kohsuke/github-api/1.318/github-api-1.318-sources.jar",
            "status": "restricted"
        }
    ]
}
