{
    "id": "maven/mavencentral/io.fabric8/openshift-model-tuned/6.7.0",
    "license": "Apache-2.0",
    "authority": "https://gitlab.eclipse.org/eclipsefdn/emo-team/iplab/-/issues/8644",
    "source": "https://repo.maven.apache.org/maven2/io/fabric8/openshift-model-tuned/6.7.0/openshift-model-tuned-6.7.0-sources.jar",
    "status": "approved",
    "scans": [
        {
            "date": "June 5, 2023 at 5:28:42 p.m. GMT",
            "authority": "https://gitlab.eclipse.org/eclipsefdn/emo-team/iplab/-/issues/8644",
            "scancode-version": "31.2.1",
            "licenses-discovered": [
                "Apache-2.0"
            ],
            "copyrights": [
                "Copyright (c) 2015 Red Hat, Inc."
            ],
            "file-count": 64,
            "sha256": "1784c906ac01f53df9eda25a82af6244bf2e540f166dd34cbb22b0240094cd02",
            "source": "https://repo.maven.apache.org/maven2/io/fabric8/openshift-model-tuned/6.7.0/openshift-model-tuned-6.7.0-sources.jar",
            "status": "approved"
        }
    ]
}