{
    "id": "project/iot.threadx/eclipse-threadx/getting-started/37ff82f757070f3fa5364acb1ac06fcc7a5b9d38",
    "license": "MIT AND Apache-2.0 AND LicenseRef-scancode-proprietary-license AND LicenseRef-scancode-microchip-products-2018 AND BSD-3-Clause AND (Apache-2.0 AND BSD-3-Clause) AND (BSD-3-Clause AND IJG AND LicenseRef-scancode-st-mcd-2.0 AND MIT) AND (Apache-2.0 AND BSD-2-Clause AND BSD-3-Clause AND LicenseRef-scancode-free-unknown AND MIT) AND (Apache-2.0 AND BSD-3-Clause AND GPL-2.0-only AND LGPL-2.1-or-later AND LicenseRef-scancode-proprietary-license AND LicenseRef-scancode-unknown AND freertos-exception-2.0) AND LicenseRef-scancode-unknown-spdx AND Zlib AND (BSD-3-Clause AND MIT) AND LicenseRef-scancode-st-bsd-restricted AND (Apache-2.0 AND LicenseRef-scancode-st-mcd-2.0) AND LicenseRef-scancode-st-mcd-2.0 AND (BSD-3-Clause AND LicenseRef-scancode-st-mcd-2.0 AND MIT) AND (Apache-2.0 AND BSD-3-Clause AND GPL-1.0-or-later AND LicenseRef-scancode-st-mcd-2.0 AND MIT) AND BSD-2-Clause",
    "authority": "https://gitlab.eclipse.org/eclipsefdn/emo-team/iplab/-/issues/13643",
    "source": "https://github.com/eclipse-threadx/getting-started/archive/37ff82f757070f3fa5364acb1ac06fcc7a5b9d38.zip",
    "status": "restricted",
    "scans": [
        {
            "date": "January 24, 2024 at 6:38:35 a.m. GMT",
            "authority": "https://gitlab.eclipse.org/eclipsefdn/emo-team/iplab/-/issues/12862",
            "scancode-version": "31.2.1",
            "licenses-discovered": [
                "MIT",
                "Apache-2.0",
                "LicenseRef-scancode-proprietary-license",
                "LicenseRef-scancode-microchip-products-2018",
                "BSD-3-Clause",
                "Apache-2.0 AND BSD-3-Clause",
                "BSD-3-Clause AND IJG AND LicenseRef-scancode-st-mcd-2.0 AND MIT",
                "Apache-2.0 AND BSD-2-Clause AND BSD-3-Clause AND LicenseRef-scancode-free-unknown AND MIT",
                "Apache-2.0 AND BSD-3-Clause AND GPL-2.0-only AND LGPL-2.1-or-later AND LicenseRef-scancode-proprietary-license AND LicenseRef-scancode-unknown AND freertos-exception-2.0",
                "LicenseRef-scancode-unknown-spdx",
                "Zlib",
                "BSD-3-Clause AND MIT",
                "LicenseRef-scancode-st-bsd-restricted",
                "Apache-2.0 AND LicenseRef-scancode-st-mcd-2.0",
                "LicenseRef-scancode-st-mcd-2.0",
                "BSD-3-Clause AND LicenseRef-scancode-st-mcd-2.0 AND MIT",
                "Apache-2.0 AND BSD-3-Clause AND GPL-1.0-or-later AND LicenseRef-scancode-st-mcd-2.0 AND MIT",
                "BSD-2-Clause"
            ],
            "copyrights": [
                "(c) . Linker",
                "(c) COPYRIGHT (c) 2017 STMicroelectronics",
                "(c) COPYRIGHT (c) 2019 STMicroelectronics",
                "(c) COPYRIGHT 2016 STMicroelectronics",
                "(c) COPYRIGHT 2020 STMicroelectronics",
                "(c) COPYRIGHT STMicroelectronics",
                "(c) Copyright (c) 2014 STMicroelectronics",
                "(c) Copyright (c) 2015 STMicroelectronics",
                "(c) Copyright (c) 2016 STMicroelectronics",
                "(c) Copyright (c) 2017 STMicroelectronics",
                "(c) Copyright (c) 2017 STMicroelectronics International N.V.",
                "(c) Copyright (c) 2018 STMicroelectronics",
                "(c) Copyright (c) 2019 STMicroelectronics",
                "(c) Copyright (c) 2020 STMicroelectronics",
                "(c) Copyright (c) 2021 STMicroelectronics",
                "(c) Copyright Ac6",
                "COPYRIGHT (c) 2016 STMicroelectronics",
                "COPYRIGHT (c) 2018 STMicroelectronics",
                "Copyright (c) 2003-2017, Jouni Malinen <j@w1.fi> and contributors",
                "Copyright (c) 2005-2006 Keil Software",
                "Copyright (c) 2006-2017, ARM Limited",
                "Copyright (c) 2009-2016 ARM Limited",
                "Copyright (c) 2009-2017 ARM Limited",
                "Copyright (c) 2009-2018 ARM Limited",
                "Copyright (c) 2009-2018 Arm Limited",
                "Copyright (c) 2009-2019 ARM Limited",
                "Copyright (c) 2009-2019 Arm Limited",
                "Copyright (c) 2010 Serge A. Zaitsev",
                "Copyright (c) 2010-2015 Arm Limited",
                "Copyright (c) 2010-2017 ARM Limited or its affiliates",
                "Copyright (c) 2010-2018 Arm Limited or its affiliates",
                "Copyright (c) 2010-2019 Arm Limited or its affiliates",
                "Copyright (c) 2011 Renesas Electronics Corporation",
                "Copyright (c) 2012 Atmel Corporation",
                "Copyright (c) 2013 - 2014, Freescale Semiconductor, Inc.",
                "Copyright (c) 2013 - 2015, Freescale Semiconductor, Inc.",
                "Copyright (c) 2013 Renesas Electronics Corporation",
                "Copyright (c) 2013(2020) Renesas Electronics Corporation",
                "Copyright (c) 2013-2016 ARM Limited",
                "Copyright (c) 2013-2017 ARM Limited",
                "Copyright (c) 2013-2018 ARM Limited",
                "Copyright (c) 2013-2018 Arm Limited",
                "Copyright (c) 2013-2020 Renesas Electronics Corporation",
                "Copyright (c) 2014 Renesas Electronics Corporation",
                "Copyright (c) 2014 STMicroelectronics",
                "Copyright (c) 2014-2018 Microchip Technology Inc. and its subsidiaries",
                "Copyright (c) 2014-2019 Microchip Technology Inc. and its subsidiaries",
                "Copyright (c) 2015 - 2016, Freescale Semiconductor, Inc.",
                "Copyright (c) 2015 Atmel Corporation",
                "Copyright (c) 2015 STMicroelectronics",
                "Copyright (c) 2015, Freescale Semiconductor, Inc.",
                "Copyright (c) 2015-2016, Freescale Semiconductor, Inc.",
                "Copyright (c) 2015-2017 ARM Limited",
                "Copyright (c) 2015-2018 Arm Limited",
                "Copyright (c) 2015-2018 Microchip Technology Inc. and its subsidiaries",
                "Copyright (c) 2015-2019 Microchip Technology Inc. and its subsidiaries",
                "Copyright (c) 2016 - 2017 Bosch Sensortec GmbH",
                "Copyright (c) 2016 Atmel Corporation, a wholly owned subsidiary of Microchip Technology Inc.",
                "Copyright (c) 2016 Renesas Electronics Corporation",
                "Copyright (c) 2016 STMicroelectronics",
                "Copyright (c) 2016(2019) Renesas Electronics Corporation",
                "Copyright (c) 2016, Freescale Semiconductor, Inc.",
                "Copyright (c) 2016, Freescale Semiconductor, Inc. Not",
                "Copyright (c) 2016-2018 Arm Limited",
                "Copyright (c) 2016-2018 Microchip Technology Inc. and its subsidiaries",
                "Copyright (c) 2016-2019 Microchip Technology Inc. and its subsidiaries",
                "Copyright (c) 2016-2019 Renesas Electronics Corporation",
                "Copyright (c) 2016-2020 Renesas Electronics Corporation",
                "Copyright (c) 2017 Amazon.com, Inc.",
                "Copyright (c) 2017 Microchip Technology Inc.",
                "Copyright (c) 2017 Renesas Electronics Corporation",
                "Copyright (c) 2017 STMicroelectronics",
                "Copyright (c) 2017-2018 Arm Limited",
                "Copyright (c) 2017-2018 IAR Systems",
                "Copyright (c) 2017-2019 Arm Limited",
                "Copyright (c) 2017-2019 IAR Systems",
                "Copyright (c) 2017-2019 Microchip Technology Inc. and its subsidiaries",
                "Copyright (c) 2018 Aleksander Alekseev",
                "Copyright (c) 2018 Arm Limited",
                "Copyright (c) 2018 Microchip Technology Inc. and its subsidiaries",
                "Copyright (c) 2018 Renesas Electronics Corporation",
                "Copyright (c) 2018, Silicon Laboratories, Inc.",
                "Copyright (c) 2018-2019 Arm Limited",
                "Copyright (c) 2018-2021 STMicroelectronics",
                "Copyright (c) 2019 Arm Limited",
                "Copyright (c) 2019 Atmel Corporation, a wholly owned subsidiary of Microchip Technology Inc.",
                "Copyright (c) 2019 Microchip Technology Inc.",
                "Copyright (c) 2019 Renesas Electronics Corporation",
                "Copyright (c) 2019 STMicroelectronics",
                "Copyright (c) 2020 Bosch Sensortec GmbH.",
                "Copyright (c) 2020 Renesas Electronics Corporation",
                "Copyright (c) 2020 STMicroelectronics",
                "Copyright (c) 2020 STMicroelectronics Microcontrollers Division",
                "Copyright (c) 2021 Renesas Electronics Corporation",
                "Copyright (c) 2021 STMicroelectronics",
                "Copyright (c) Microsoft Corporation",
                "Copyright 1997-2016 Freescale Semiconductor, Inc.",
                "Copyright 1998-2003 IAR Systems",
                "Copyright 1999-2000 MOTOROLA, INC.",
                "Copyright 2014-2016 Freescale Semiconductor, Inc.",
                "Copyright 2015 Silicon Laboratories, Inc. http://www.silabs.com",
                "Copyright 2016 - 2020, NXP",
                "Copyright 2016 Freescale Semiconductor, Inc.",
                "Copyright 2016-2017 NXP",
                "Copyright 2016-2017 NXP. Not",
                "Copyright 2016-2017, 2020 NXP",
                "Copyright 2016-2017, 2020-2021 NXP",
                "Copyright 2016-2017,2020 NXP. Not",
                "Copyright 2016-2017,2020,2021 NXP. Not",
                "Copyright 2016-2018 NXP",
                "Copyright 2016-2018, 2020 NXP",
                "Copyright 2016-2018, 2020-2021 NXP",
                "Copyright 2016-2019 NXP",
                "Copyright 2016-2020 NXP",
                "Copyright 2016-2020 NXP. Not",
                "Copyright 2016-2020,2021 NXP",
                "Copyright 2016-2021 NXP",
                "Copyright 2016-2021 NXP. Not",
                "Copyright 2017 - 2019 NXP",
                "Copyright 2017 - 2020 NXP",
                "Copyright 2017 - 2020, NXP",
                "Copyright 2017 NXP",
                "Copyright 2017 STMicroelectronics",
                "Copyright 2017, 2019 NXP",
                "Copyright 2017, 2020 NXP",
                "Copyright 2017, 2020-2021 NXP",
                "Copyright 2017- 2019 NXP",
                "Copyright 2017- 2021 NXP",
                "Copyright 2017-2018 NXP",
                "Copyright 2017-2018, 2020 NXP",
                "Copyright 2017-2018, 2020-2021 NXP",
                "Copyright 2017-2018, 2021 NXP",
                "Copyright 2017-2019 NXP",
                "Copyright 2017-2019, NXP",
                "Copyright 2017-2020 NXP",
                "Copyright 2017-2020, NXP",
                "Copyright 2017-2021 NXP",
                "Copyright 2017-2021, NXP",
                "Copyright 2018 - 2019 NXP",
                "Copyright 2018 - 2020 NXP",
                "Copyright 2018 - 2021 NXP",
                "Copyright 2018 NXP",
                "Copyright 2018 NXP.",
                "Copyright 2018 Silicon Laboratories Inc. www.silabs.com",
                "Copyright 2018, 2020 NXP",
                "Copyright 2018, Silicon Laboratories Inc.",
                "Copyright 2018-2019 NXP",
                "Copyright 2018-2020 ,2021 NXP",
                "Copyright 2018-2020 NXP",
                "Copyright 2018-2021 NXP",
                "Copyright 2019 - 2020, NXP",
                "Copyright 2019 NXP",
                "Copyright 2019 NXP.",
                "Copyright 2019 STMicroelectronics",
                "Copyright 2019 Silicon Laboratories Inc. www.silabs.com",
                "Copyright 2019 Silicon Laboratories, Inc.",
                "Copyright 2019-2020 NXP",
                "Copyright 2019-2021 NXP",
                "Copyright 2020 NXP",
                "Copyright 2020 Silicon Laboratories Inc. www.silabs.com",
                "Copyright 2020-2021 NXP",
                "Copyright 2020-2021 Renesas Electronics Corporation and/or its affiliates",
                "Copyright 2021 NXP",
                "Copyright 2021 STMicroelectronics",
                "Copyright CMSIS Apache",
                "Portions Copyright (c) 2021 STMicroelectronics"
            ],
            "file-count": 3951,
            "sha256": "da43627cc45155b5162e2fb65567d39088990ba57c6930349566f6b1e7a3a943",
            "source": "https://github.com/eclipse-threadx/getting-started/archive/37ff82f757070f3fa5364acb1ac06fcc7a5b9d38.zip",
            "status": "restricted"
        },
        {
            "date": "March 12, 2024 at 5:27:52 a.m. GMT",
            "authority": "https://gitlab.eclipse.org/eclipsefdn/emo-team/iplab/-/issues/13643",
            "scancode-version": "31.2.1",
            "licenses-discovered": [
                "MIT",
                "Apache-2.0",
                "LicenseRef-scancode-proprietary-license",
                "LicenseRef-scancode-microchip-products-2018",
                "BSD-3-Clause",
                "Apache-2.0 AND BSD-3-Clause",
                "BSD-3-Clause AND IJG AND LicenseRef-scancode-st-mcd-2.0 AND MIT",
                "Apache-2.0 AND BSD-2-Clause AND BSD-3-Clause AND LicenseRef-scancode-free-unknown AND MIT",
                "Apache-2.0 AND BSD-3-Clause AND GPL-2.0-only AND LGPL-2.1-or-later AND LicenseRef-scancode-proprietary-license AND LicenseRef-scancode-unknown AND freertos-exception-2.0",
                "LicenseRef-scancode-unknown-spdx",
                "Zlib",
                "BSD-3-Clause AND MIT",
                "LicenseRef-scancode-st-bsd-restricted",
                "Apache-2.0 AND LicenseRef-scancode-st-mcd-2.0",
                "LicenseRef-scancode-st-mcd-2.0",
                "BSD-3-Clause AND LicenseRef-scancode-st-mcd-2.0 AND MIT",
                "Apache-2.0 AND BSD-3-Clause AND GPL-1.0-or-later AND LicenseRef-scancode-st-mcd-2.0 AND MIT",
                "BSD-2-Clause"
            ],
            "copyrights": [
                "(c) . Linker",
                "(c) COPYRIGHT (c) 2017 STMicroelectronics",
                "(c) COPYRIGHT (c) 2019 STMicroelectronics",
                "(c) COPYRIGHT 2016 STMicroelectronics",
                "(c) COPYRIGHT 2020 STMicroelectronics",
                "(c) COPYRIGHT STMicroelectronics",
                "(c) Copyright (c) 2014 STMicroelectronics",
                "(c) Copyright (c) 2015 STMicroelectronics",
                "(c) Copyright (c) 2016 STMicroelectronics",
                "(c) Copyright (c) 2017 STMicroelectronics",
                "(c) Copyright (c) 2017 STMicroelectronics International N.V.",
                "(c) Copyright (c) 2018 STMicroelectronics",
                "(c) Copyright (c) 2019 STMicroelectronics",
                "(c) Copyright (c) 2020 STMicroelectronics",
                "(c) Copyright (c) 2021 STMicroelectronics",
                "(c) Copyright Ac6",
                "COPYRIGHT (c) 2016 STMicroelectronics",
                "COPYRIGHT (c) 2018 STMicroelectronics",
                "Copyright (c) 2003-2017, Jouni Malinen <j@w1.fi> and contributors",
                "Copyright (c) 2005-2006 Keil Software",
                "Copyright (c) 2006-2017, ARM Limited",
                "Copyright (c) 2009-2016 ARM Limited",
                "Copyright (c) 2009-2017 ARM Limited",
                "Copyright (c) 2009-2018 ARM Limited",
                "Copyright (c) 2009-2018 Arm Limited",
                "Copyright (c) 2009-2019 ARM Limited",
                "Copyright (c) 2009-2019 Arm Limited",
                "Copyright (c) 2010 Serge A. Zaitsev",
                "Copyright (c) 2010-2015 Arm Limited",
                "Copyright (c) 2010-2017 ARM Limited or its affiliates",
                "Copyright (c) 2010-2018 Arm Limited or its affiliates",
                "Copyright (c) 2010-2019 Arm Limited or its affiliates",
                "Copyright (c) 2011 Renesas Electronics Corporation",
                "Copyright (c) 2012 Atmel Corporation",
                "Copyright (c) 2013 - 2014, Freescale Semiconductor, Inc.",
                "Copyright (c) 2013 - 2015, Freescale Semiconductor, Inc.",
                "Copyright (c) 2013 Renesas Electronics Corporation",
                "Copyright (c) 2013(2020) Renesas Electronics Corporation",
                "Copyright (c) 2013-2016 ARM Limited",
                "Copyright (c) 2013-2017 ARM Limited",
                "Copyright (c) 2013-2018 ARM Limited",
                "Copyright (c) 2013-2018 Arm Limited",
                "Copyright (c) 2013-2020 Renesas Electronics Corporation",
                "Copyright (c) 2014 Renesas Electronics Corporation",
                "Copyright (c) 2014 STMicroelectronics",
                "Copyright (c) 2014-2018 Microchip Technology Inc. and its subsidiaries",
                "Copyright (c) 2014-2019 Microchip Technology Inc. and its subsidiaries",
                "Copyright (c) 2015 - 2016, Freescale Semiconductor, Inc.",
                "Copyright (c) 2015 Atmel Corporation",
                "Copyright (c) 2015 STMicroelectronics",
                "Copyright (c) 2015, Freescale Semiconductor, Inc.",
                "Copyright (c) 2015-2016, Freescale Semiconductor, Inc.",
                "Copyright (c) 2015-2017 ARM Limited",
                "Copyright (c) 2015-2018 Arm Limited",
                "Copyright (c) 2015-2018 Microchip Technology Inc. and its subsidiaries",
                "Copyright (c) 2015-2019 Microchip Technology Inc. and its subsidiaries",
                "Copyright (c) 2016 - 2017 Bosch Sensortec GmbH",
                "Copyright (c) 2016 Atmel Corporation, a wholly owned subsidiary of Microchip Technology Inc.",
                "Copyright (c) 2016 Renesas Electronics Corporation",
                "Copyright (c) 2016 STMicroelectronics",
                "Copyright (c) 2016(2019) Renesas Electronics Corporation",
                "Copyright (c) 2016, Freescale Semiconductor, Inc.",
                "Copyright (c) 2016, Freescale Semiconductor, Inc. Not",
                "Copyright (c) 2016-2018 Arm Limited",
                "Copyright (c) 2016-2018 Microchip Technology Inc. and its subsidiaries",
                "Copyright (c) 2016-2019 Microchip Technology Inc. and its subsidiaries",
                "Copyright (c) 2016-2019 Renesas Electronics Corporation",
                "Copyright (c) 2016-2020 Renesas Electronics Corporation",
                "Copyright (c) 2017 Amazon.com, Inc.",
                "Copyright (c) 2017 Microchip Technology Inc.",
                "Copyright (c) 2017 Renesas Electronics Corporation",
                "Copyright (c) 2017 STMicroelectronics",
                "Copyright (c) 2017-2018 Arm Limited",
                "Copyright (c) 2017-2018 IAR Systems",
                "Copyright (c) 2017-2019 Arm Limited",
                "Copyright (c) 2017-2019 IAR Systems",
                "Copyright (c) 2017-2019 Microchip Technology Inc. and its subsidiaries",
                "Copyright (c) 2018 Aleksander Alekseev",
                "Copyright (c) 2018 Arm Limited",
                "Copyright (c) 2018 Microchip Technology Inc. and its subsidiaries",
                "Copyright (c) 2018 Renesas Electronics Corporation",
                "Copyright (c) 2018, Silicon Laboratories, Inc.",
                "Copyright (c) 2018-2019 Arm Limited",
                "Copyright (c) 2018-2021 STMicroelectronics",
                "Copyright (c) 2019 Arm Limited",
                "Copyright (c) 2019 Atmel Corporation, a wholly owned subsidiary of Microchip Technology Inc.",
                "Copyright (c) 2019 Microchip Technology Inc.",
                "Copyright (c) 2019 Renesas Electronics Corporation",
                "Copyright (c) 2019 STMicroelectronics",
                "Copyright (c) 2020 Bosch Sensortec GmbH.",
                "Copyright (c) 2020 Renesas Electronics Corporation",
                "Copyright (c) 2020 STMicroelectronics",
                "Copyright (c) 2020 STMicroelectronics Microcontrollers Division",
                "Copyright (c) 2021 Renesas Electronics Corporation",
                "Copyright (c) 2021 STMicroelectronics",
                "Copyright (c) Microsoft Corporation",
                "Copyright 1997-2016 Freescale Semiconductor, Inc.",
                "Copyright 1998-2003 IAR Systems",
                "Copyright 1999-2000 MOTOROLA, INC.",
                "Copyright 2014-2016 Freescale Semiconductor, Inc.",
                "Copyright 2015 Silicon Laboratories, Inc. http://www.silabs.com",
                "Copyright 2016 - 2020, NXP",
                "Copyright 2016 Freescale Semiconductor, Inc.",
                "Copyright 2016-2017 NXP",
                "Copyright 2016-2017 NXP. Not",
                "Copyright 2016-2017, 2020 NXP",
                "Copyright 2016-2017, 2020-2021 NXP",
                "Copyright 2016-2017,2020 NXP. Not",
                "Copyright 2016-2017,2020,2021 NXP. Not",
                "Copyright 2016-2018 NXP",
                "Copyright 2016-2018, 2020 NXP",
                "Copyright 2016-2018, 2020-2021 NXP",
                "Copyright 2016-2019 NXP",
                "Copyright 2016-2020 NXP",
                "Copyright 2016-2020 NXP. Not",
                "Copyright 2016-2020,2021 NXP",
                "Copyright 2016-2021 NXP",
                "Copyright 2016-2021 NXP. Not",
                "Copyright 2017 - 2019 NXP",
                "Copyright 2017 - 2020 NXP",
                "Copyright 2017 - 2020, NXP",
                "Copyright 2017 NXP",
                "Copyright 2017 STMicroelectronics",
                "Copyright 2017, 2019 NXP",
                "Copyright 2017, 2020 NXP",
                "Copyright 2017, 2020-2021 NXP",
                "Copyright 2017- 2019 NXP",
                "Copyright 2017- 2021 NXP",
                "Copyright 2017-2018 NXP",
                "Copyright 2017-2018, 2020 NXP",
                "Copyright 2017-2018, 2020-2021 NXP",
                "Copyright 2017-2018, 2021 NXP",
                "Copyright 2017-2019 NXP",
                "Copyright 2017-2019, NXP",
                "Copyright 2017-2020 NXP",
                "Copyright 2017-2020, NXP",
                "Copyright 2017-2021 NXP",
                "Copyright 2017-2021, NXP",
                "Copyright 2018 - 2019 NXP",
                "Copyright 2018 - 2020 NXP",
                "Copyright 2018 - 2021 NXP",
                "Copyright 2018 NXP",
                "Copyright 2018 NXP.",
                "Copyright 2018 Silicon Laboratories Inc. www.silabs.com",
                "Copyright 2018, 2020 NXP",
                "Copyright 2018, Silicon Laboratories Inc.",
                "Copyright 2018-2019 NXP",
                "Copyright 2018-2020 ,2021 NXP",
                "Copyright 2018-2020 NXP",
                "Copyright 2018-2021 NXP",
                "Copyright 2019 - 2020, NXP",
                "Copyright 2019 NXP",
                "Copyright 2019 NXP.",
                "Copyright 2019 STMicroelectronics",
                "Copyright 2019 Silicon Laboratories Inc. www.silabs.com",
                "Copyright 2019 Silicon Laboratories, Inc.",
                "Copyright 2019-2020 NXP",
                "Copyright 2019-2021 NXP",
                "Copyright 2020 NXP",
                "Copyright 2020 Silicon Laboratories Inc. www.silabs.com",
                "Copyright 2020-2021 NXP",
                "Copyright 2020-2021 Renesas Electronics Corporation and/or its affiliates",
                "Copyright 2021 NXP",
                "Copyright 2021 STMicroelectronics",
                "Copyright CMSIS Apache",
                "Portions Copyright (c) 2021 STMicroelectronics"
            ],
            "file-count": 3951,
            "sha256": "da43627cc45155b5162e2fb65567d39088990ba57c6930349566f6b1e7a3a943",
            "source": "https://github.com/eclipse-threadx/getting-started/archive/37ff82f757070f3fa5364acb1ac06fcc7a5b9d38.zip",
            "status": "restricted"
        }
    ]
}