{
    "id": "maven/mavencentral/io.openmanufacturing/sds-aspect-model-java-core/2.1.3",
    "license": "MPL-2.0",
    "authority": "https://gitlab.eclipse.org/eclipsefdn/emo-team/iplab/-/issues/9794",
    "source": "https://repo.maven.apache.org/maven2/io/openmanufacturing/sds-aspect-model-java-core/2.1.3/sds-aspect-model-java-core-2.1.3-sources.jar",
    "status": "approved",
    "scans": [
        {
            "date": "July 26, 2023 at 11:25:46 a.m. GMT",
            "authority": "https://gitlab.eclipse.org/eclipsefdn/emo-team/iplab/-/issues/9794",
            "scancode-version": "31.2.1",
            "licenses-discovered": [
                "MPL-2.0"
            ],
            "copyrights": [
                "Copyright (c) 2021 Robert Bosch Manufacturing Solutions GmbH"
            ],
            "file-count": 4,
            "sha256": "15053d8542cacae349b616bb48c93a0268baebb9f478ae38c4089d4083c3de5f",
            "source": "https://repo.maven.apache.org/maven2/io/openmanufacturing/sds-aspect-model-java-core/2.1.3/sds-aspect-model-java-core-2.1.3-sources.jar",
            "status": "approved"
        }
    ]
}