{
    "id": "go/golang/github.com%2Fcensus-instrumentation/opencensus-proto/v0.2.1",
    "license": "Apache-2.0",
    "authority": "https://gitlab.eclipse.org/eclipsefdn/emo-team/iplab/-/issues/5610",
    "source": "https://proxy.golang.org/github.com%2Fcensus-instrumentation/opencensus-proto/@v/v0.2.1.zip",
    "status": "approved",
    "scans": [
        {
            "date": "December 9, 2022 at 10:18:58 p.m. GMT",
            "authority": "https://gitlab.eclipse.org/eclipsefdn/emo-team/iplab/-/issues/5610",
            "scancode-version": "31.2.1",
            "licenses-discovered": [
                "Apache-2.0"
            ],
            "copyrights": [
                "Copyright 2016-17, OpenCensus",
                "Copyright 2016-18, OpenCensus",
                "Copyright 2017, OpenCensus",
                "Copyright 2018, OpenCensus",
                "Copyright 2019, OpenCensus"
            ],
            "file-count": 134,
            "sha256": "b3c09f3e635d47b4138695a547d1f2c7138f382cbe5a8b5865b66a8e08233461",
            "source": "https://proxy.golang.org/github.com%2Fcensus-instrumentation/opencensus-proto/@v/v0.2.1.zip",
            "status": "approved"
        }
    ]
}