{
    "id": "maven/mavencentral/org.webjars/swagger-ui/5.13.0",
    "license": "Apache-2.0",
    "authority": "https://gitlab.eclipse.org/eclipsefdn/emo-team/iplab/-/issues/14547",
    "source": "https://github.com/webjars/swagger-ui/archive/refs/tags/swagger-ui-5.13.0.zip",
    "status": "approved",
    "scans": [
        {
            "date": "April 24, 2024 at 4:48:58 a.m. GMT",
            "authority": "https://gitlab.eclipse.org/eclipsefdn/emo-team/iplab/-/issues/14547",
            "scancode-version": "31.2.1",
            "licenses-discovered": [
                "Apache-2.0"
            ],
            "copyrights": [
            ],
            "file-count": 2,
            "sha256": "1697ee5ec7924075fafde817ed0f952a138c43bb884d6b28111e4c6e13d5d596",
            "source": "https://github.com/webjars/swagger-ui/archive/refs/tags/swagger-ui-5.13.0.zip",
            "status": "approved"
        }
    ]
}