{
    "id": "maven/mavencentral/org.checkerframework/compiler/2.4.0",
    "license": "GPL-2.0-or-later WITH Classpath-exception-2.0",
    "licenses-discovered": [
    ],
    "file-count": 2,
    "scancode-version": "30.1.0",
    "authority": "https://gitlab.eclipse.org/eclipsefdn/emo-team/iplab/-/issues/2263",
    "source": "https://search.maven.org/remotecontent?filepath=org/checkerframework/compiler/2.4.0/compiler-2.4.0-sources.jar",
    "status": "restricted",
    "workswith": [
        "ee4j.jaxb-impl"
    ]
}
