{
    "id": "maven/mavencentral/com.vladsch.flexmark/flexmark-all/0.64.8",
    "license": "BSD-2-Clause",
    "authority": "https://gitlab.eclipse.org/eclipsefdn/emo-team/iplab/-/issues/11307",
    "source": "https://repo.maven.apache.org/maven2/com/vladsch/flexmark/flexmark-all/0.64.8/flexmark-all-0.64.8.pom",
    "status": "approved",
    "scans": [
        {
            "date": "October 26, 2023 at 7:43:50 p.m. GMT",
            "authority": "https://gitlab.eclipse.org/eclipsefdn/emo-team/iplab/-/issues/11307",
            "scancode-version": "31.2.1",
            "licenses-discovered": [
            ],
            "copyrights": [
            ],
            "file-count": 1,
            "sha256": "030e992d3fd96c7e99d208988328e1157b8c6054863f03067e29445cf0b732dc",
            "source": "https://repo.maven.apache.org/maven2/com/vladsch/flexmark/flexmark-all/0.64.8/flexmark-all-0.64.8.pom",
            "status": "restricted"
        }
    ]
}
