{
    "id": "npm/npmjs/-/terser/5.38.0",
    "license": "BSD-2-Clause AND (BSD-2-Clause AND BSD-3-Clause) AND ISC",
    "authority": "https://gitlab.eclipse.org/eclipsefdn/emo-team/iplab/-/issues/19323",
    "source": "https://github.com/terser/terser/archive/refs/tags/v5.38.0.zip",
    "status": "approved",
    "scans": [
        {
            "date": "February 5, 2025 at 10:33:51 p.m. GMT",
            "authority": "https://gitlab.eclipse.org/eclipsefdn/emo-team/iplab/-/issues/19323",
            "scancode-version": "31.2.1",
            "licenses-discovered": [
                "BSD-2-Clause",
                "BSD-2-Clause AND BSD-3-Clause",
                "ISC"
            ],
            "copyrights": [
                "Copyright 2012 (c) Mihai Bazon <mihai.bazon@gmail.com>",
                "Copyright 2012-2018 (c) Mihai Bazon <mihai.bazon@gmail.com>"
            ],
            "file-count": 308,
            "sha256": "281a833f399bf8d45850c3393347496f950779a0000eabfee9bb731d30a847a5",
            "source": "https://github.com/terser/terser/archive/refs/tags/v5.38.0.zip",
            "status": "approved"
        }
    ]
}