{
    "id": "npm/npmjs/@types/diff/3.5.6",
    "license": "MIT",
    "authority": "https://gitlab.eclipse.org/eclipsefdn/emo-team/iplab/-/issues/10997",
    "source": "https://registry.yarnpkg.com/@types/diff/-/diff-3.5.6.tgz",
    "status": "approved",
    "scans": [
        {
            "date": "October 11, 2023 at 7:20:53 a.m. GMT",
            "authority": "https://gitlab.eclipse.org/eclipsefdn/emo-team/iplab/-/issues/10997",
            "scancode-version": "31.2.1",
            "licenses-discovered": [
                "MIT"
            ],
            "copyrights": [
                "Copyright (c) Microsoft Corporation"
            ],
            "file-count": 4,
            "sha256": "4e73faf7270929585a43954ab2db43a80d1f13aa4e55ae86034fa22ff3e98278",
            "source": "https://registry.yarnpkg.com/@types/diff/-/diff-3.5.6.tgz",
            "status": "approved"
        }
    ]
}