{
    "id": "maven/mavencentral/com.hazelcast/hazelcast/5.1.7",
    "license": "Apache-2.0 AND MIT AND JSON AND LicenseRef-Public-domain",
    "authority": "https://gitlab.eclipse.org/eclipsefdn/emo-team/iplab/-/issues/11236",
    "source": "https://repo.maven.apache.org/maven2/com/hazelcast/hazelcast/5.1.7/hazelcast-5.1.7-sources.jar",
    "status": "approved",
    "scans": [
        {
            "date": "October 25, 2023 at 8:31:19 p.m. GMT",
            "authority": "https://gitlab.eclipse.org/eclipsefdn/emo-team/iplab/-/issues/11236",
            "scancode-version": "31.2.1",
            "licenses-discovered": [
                "Apache-2.0",
                "MIT",
                "Apache-2.0 AND GPL-1.0-or-later",
                "Apache-2.0 AND LicenseRef-scancode-proprietary-license",
                "Apache-2.0 AND CC-PDDC",
                "JSON",
                "Apache-2.0 AND LicenseRef-scancode-free-unknown AND MIT"
            ],
            "copyrights": [
                "(c) Override public ObjectCodec",
                "Copyright (c) 2002 JSON.org",
                "Copyright (c) 2005-2021, by Ewgenij Proschak and Contributors",
                "Copyright (c) 2006 JSON.org",
                "Copyright (c) 2007- Tatu Saloranta, tatu.saloranta@iki.fi",
                "Copyright (c) 2008 Google Inc.",
                "Copyright (c) 2008-2019, Hazelcast, Inc.",
                "Copyright (c) 2008-2022, Hazelcast, Inc.",
                "Copyright (c) 2009-2017 Lightbend Inc. <http://www.lightbend.com>",
                "Copyright (c) 2011 Everit Kft. (http://www.everit.org)",
                "Copyright (c) 2013, 2014 EclipseSource",
                "Copyright (c) 2013, 2015 EclipseSource",
                "Copyright (c) 2013, 2016 EclipseSource",
                "Copyright (c) 2013, 2017 EclipseSource",
                "Copyright (c) 2014, Appear Networks",
                "Copyright (c) 2015 EclipseSource",
                "Copyright (c) 2015, 2016 EclipseSource",
                "Copyright (c) 2015-2021, Hazelcast, Inc.",
                "Copyright (c) 2016 EclipseSource",
                "Copyright (c) 2016 Johno Crawford",
                "Copyright (c) 2017 Harith Elrufaie",
                "Copyright (c) 2017 R. Kempees",
                "Copyright (c) 2017 Sergey Bespalov",
                "Copyright (c) 2017-2021, Hazelcast, Inc.",
                "Copyright (c) 2018, http://www.snakeyaml.org",
                "Copyright (c) 2019 Luke Hutchison",
                "Copyright (c) 2019 jacobg, Luke Hutchison",
                "Copyright (c) 2019 mcollovati",
                "Copyright (c) 2019-2021, Hazelcast, Inc.",
                "Copyright (c) 2020 Luke Hutchison",
                "Copyright (c) 2021 Luke Hutchison",
                "Copyright (c) 2021, Hazelcast, Inc.",
                "Copyright (c) 2023 Werner Randelshofer, Switzerland",
                "Copyright 2006-2021 the original author or authors",
                "Copyright 2007-, Tatu Saloranta (tatu.saloranta@iki.fi)",
                "Copyright 2015 Real Logic Ltd.",
                "Copyright 2018-2020 Raffaello Giulietti",
                "Copyright 2019 The Moby Project",
                "Portions Copyright 2014 Real Logic Ltd.",
                "Portions Copyright 2014 the original author or authors",
                "Portions Copyright 2016 Real Logic Ltd."
            ],
            "file-count": 6593,
            "sha256": "f8cc283db5761e9e16a2327956c5b23e858fd4b564e973f77ee760c40663d350",
            "source": "https://repo.maven.apache.org/maven2/com/hazelcast/hazelcast/5.1.7/hazelcast-5.1.7-sources.jar",
            "status": "restricted"
        }
    ]
}
