{
    "id": "maven/mavencentral/com.fasterxml.jackson.module/jackson-module-parameter-names/2.18.1",
    "license": "Apache-2.0",
    "authority": "https://gitlab.eclipse.org/eclipsefdn/emo-team/iplab/-/issues/17542",
    "source": "https://repo1.maven.org/maven2/com/fasterxml/jackson/module/jackson-module-parameter-names/2.18.1/jackson-module-parameter-names-2.18.1-sources.jar",
    "status": "approved",
    "scans": [
        {
            "date": "November 29, 2024 at 4:16:10 a.m. GMT",
            "authority": "https://gitlab.eclipse.org/eclipsefdn/emo-team/iplab/-/issues/17542",
            "scancode-version": "31.2.1",
            "licenses-discovered": [
                "Apache-2.0"
            ],
            "copyrights": [
            ],
            "file-count": 10,
            "sha256": "a865e95cc33cac2356df532f34ff31bb16b9120b4bb324c5a89248c0b0b14fb7",
            "source": "https://repo1.maven.org/maven2/com/fasterxml/jackson/module/jackson-module-parameter-names/2.18.1/jackson-module-parameter-names-2.18.1-sources.jar",
            "status": "approved"
        }
    ]
}