{
    "id": "maven/mavencentral/org.apache.lucene/lucene-queryparser/9.2.0",
    "license": "Apache-2.0",
    "licenses-discovered": [
        "Apache-2.0"
    ],
    "copyrights": [
        "Copyright (c) Anders Moeller",
        "Copyright (c) Center for Intelligent Information Retrieval, University of Massachusetts, Amherst",
        "Copyright (c) Dawid Weiss",
        "Copyright (c) Dawid Weiss, Marcin Milkowski",
        "Copyright (c) Dr Martin Porter",
        "Copyright (c) International Business Machines Corporation and others",
        "Copyright (c) Jean-Philippe Barrette-LaPierre, <jpb@rrette.com>",
        "Copyright (c) Richard Boulton",
        "Copyright (c) Yann Collet",
        "Copyright (c) Zygmunt Saloni, Wlodzimierz Gruszczynski, Marcin Wolinski, Robert Wolosz",
        "Copyright The Apache Software Foundation",
        "Copyright Unicode, Inc.",
        "copyright by www.imdict.net"
    ],
    "file-count": 251,
    "scancode-version": "30.1.0",
    "authority": "https://gitlab.eclipse.org/eclipsefdn/emo-team/iplab/-/issues/3069",
    "source": "https://search.maven.org/remotecontent?filepath=org/apache/lucene/lucene-queryparser/9.2.0/lucene-queryparser-9.2.0-sources.jar",
    "status": "approved"
}