{
    "id": "maven/mavencentral/org.geotools.xsd/gt-xsd-core/28.2",
    "license": "LGPL-2.1-only",
    "authority": "https://gitlab.eclipse.org/eclipsefdn/emo-team/iplab/-/issues/7192",
    "source": "https://repo.osgeo.org/repository/geotools-releases/org/geotools/xsd/gt-xsd-core/28.2/gt-xsd-core-28.2-sources.jar",
    "status": "approved",
    "scans": [
        {
            "date": "February 23, 2023 at 5:40:45 p.m. GMT",
            "authority": "https://gitlab.eclipse.org/eclipsefdn/emo-team/iplab/-/issues/7192",
            "scancode-version": "31.2.1",
            "licenses-discovered": [
                "LGPL-2.1-only"
            ],
            "copyrights": [
                "(c) 2002-2008, Open Source Geospatial Foundation",
                "(c) 2002-2009, Open Source Geospatial Foundation",
                "(c) 2002-2010, Open Source Geospatial Foundation",
                "(c) 2002-2011, Open Source Geospatial Foundation",
                "(c) 2002-2012, Open Source Geospatial Foundation",
                "(c) 2002-2014, Open Source Geospatial Foundation",
                "(c) 2002-2015, Open Source Geospatial Foundation",
                "(c) 2002-2016, Open Source Geospatial Foundation",
                "(c) 2007-2008, Open Source Geospatial Foundation",
                "(c) 2008, Open Source Geospatial Foundation",
                "(c) 2009-2015, Open Source Geospatial Foundation",
                "(c) 2012-2015, Open Source Geospatial Foundation",
                "(c) 2019, Open Source Geospatial Foundation"
            ],
            "file-count": 197,
            "sha256": "b074b51938d27e5106d5e12f4d713f05385f0fc25e623ce123b250940094de32",
            "source": "https://repo.osgeo.org/repository/geotools-releases/org/geotools/xsd/gt-xsd-core/28.2/gt-xsd-core-28.2-sources.jar",
            "status": "approved"
        }
    ]
}