{
    "id": "maven/mavencentral/org.apache.camel/camel-direct/3.22.2",
    "license": "Apache-2.0",
    "authority": "https://gitlab.eclipse.org/eclipsefdn/emo-team/iplab/-/issues/14982",
    "source": "https://repo1.maven.org/maven2/org/apache/camel/camel-direct/3.22.2/camel-direct-3.22.2-sources.jar",
    "status": "approved",
    "scans": [
        {
            "date": "May 29, 2024 at 12:00:46 p.m. GMT",
            "authority": "https://gitlab.eclipse.org/eclipsefdn/emo-team/iplab/-/issues/14982",
            "scancode-version": "31.2.1",
            "licenses-discovered": [
                "Apache-2.0"
            ],
            "copyrights": [
            ],
            "file-count": 18,
            "sha256": "0e0edaf9cc6f5680579496f546e1553f4009bcde55c8b8a5d50de984d52daab5",
            "source": "https://repo1.maven.org/maven2/org/apache/camel/camel-direct/3.22.2/camel-direct-3.22.2-sources.jar",
            "status": "approved"
        }
    ]
}