{
    "id": "go/golang/github.com%2Ffrankban/quicktest/v1.14.3",
    "license": "LGPL-3.0-only AND MIT",
    "authority": "https://gitlab.eclipse.org/eclipsefdn/emo-team/iplab/-/issues/10723",
    "source": "https://proxy.golang.org/github.com%2Ffrankban/quicktest/@v/v1.14.3.zip",
    "status": "approved",
    "scans": [
        {
            "date": "September 28, 2023 at 2:25:47 p.m. GMT",
            "authority": "https://gitlab.eclipse.org/eclipsefdn/emo-team/iplab/-/issues/10723",
            "scancode-version": "31.2.1",
            "licenses-discovered": [
                "LGPL-3.0-only",
                "MIT"
            ],
            "copyrights": [
                "Copyright (c) 2017 Canonical Ltd.",
                "Copyright 2011 Canonical Ltd."
            ],
            "file-count": 37,
            "sha256": "35014be7acc79de33c58785d9372f48702556bf35fd89067c3ecbedf49c2e987",
            "source": "https://proxy.golang.org/github.com%2Ffrankban/quicktest/@v/v1.14.3.zip",
            "status": "approved"
        }
    ]
}