{
    "id": "maven/mavencentral/io.fabric8/kubernetes-model-core/6.4.0",
    "license": "Apache-2.0",
    "authority": "https://gitlab.eclipse.org/eclipsefdn/emo-team/iplab/-/issues/6604",
    "source": "https://search.maven.org/remotecontent?filepath=io/fabric8/kubernetes-model-core/6.4.0/kubernetes-model-core-6.4.0-sources.jar",
    "status": "approved",
    "scans": [
        {
            "date": "January 24, 2023 at 8:45:13 a.m. GMT",
            "authority": "https://gitlab.eclipse.org/eclipsefdn/emo-team/iplab/-/issues/6604",
            "scancode-version": "31.2.1",
            "licenses-discovered": [
                "Apache-2.0"
            ],
            "copyrights": [
                "Copyright (c) 2015 Red Hat, Inc."
            ],
            "file-count": 1034,
            "sha256": "fcf83db24ecaccf3baa3a07772faff5ce68710651eccb147588d963c0d432aa3",
            "source": "https://search.maven.org/remotecontent?filepath=io/fabric8/kubernetes-model-core/6.4.0/kubernetes-model-core-6.4.0-sources.jar",
            "status": "approved"
        }
    ]
}