{
    "id": "maven/mavencentral/org.springframework.cloud/spring-cloud-starter-openfeign/4.0.0-RC3",
    "license": "Apache-2.0",
    "authority": "https://gitlab.eclipse.org/eclipsefdn/emo-team/iplab/-/issues/7302",
    "source": "https://search.maven.org/remotecontent?filepath=org/springframework/cloud/spring-cloud-starter-openfeign/4.0.1/spring-cloud-starter-openfeign-4.0.1.jar",
    "status": "approved",
    "scans": [
        {
            "date": "March 9, 2023 at 8:50:25 p.m. GMT",
            "authority": "https://gitlab.eclipse.org/eclipsefdn/emo-team/iplab/-/issues/7302",
            "scancode-version": "31.2.1",
            "licenses-discovered": [
                "Apache-2.0"
            ],
            "copyrights": [
                "Copyright 2014-2021 the original author or authors"
            ],
            "file-count": 3,
            "sha256": "2889221bbf91131cf862e44259b460b5874248d389b04db74c101a513153221a",
            "source": "https://search.maven.org/remotecontent?filepath=org/springframework/cloud/spring-cloud-starter-openfeign/4.0.1/spring-cloud-starter-openfeign-4.0.1.jar",
            "status": "approved"
        }
    ]
}