{
    "id": "p2/orbit/p2.eclipse.plugin/wrapped.org.apache.ant.ant-apache-resolver/1.10.14",
    "license": "Apache-2.0 AND LicenseRef-Public-domain AND W3C",
    "authority": "https://gitlab.eclipse.org/eclipsefdn/emo-team/iplab/-/issues/10645",
    "source": "https://repo.maven.apache.org/maven2/org/apache/ant/ant-apache-resolver/1.10.14/ant-apache-resolver-1.10.14-sources.jar",
    "status": "approved",
    "scans": [
        {
            "date": "September 25, 2023 at 9:25:04 p.m. GMT",
            "authority": "https://gitlab.eclipse.org/eclipsefdn/emo-team/iplab/-/issues/10645",
            "scancode-version": "31.2.1",
            "licenses-discovered": [
                "Apache-2.0 AND SAX-PD AND W3C",
                "Apache-2.0"
            ],
            "copyrights": [
            ],
            "file-count": 5,
            "sha256": "76ccbab5fed5edb67854f00d9220c7ceb8e66c40ef5de92185dffbc40438037e",
            "source": "https://repo.maven.apache.org/maven2/org/apache/ant/ant-apache-resolver/1.10.14/ant-apache-resolver-1.10.14-sources.jar",
            "status": "restricted"
        }
    ]
}
