{
    "id": "go/golang/github.com%2Fprometheus/common/v0.26.0",
    "license": "Apache-2.0 AND BSD-3-Clause",
    "authority": "https://gitlab.eclipse.org/eclipsefdn/emo-team/iplab/-/issues/5788",
    "source": "https://proxy.golang.org/github.com%2Fprometheus/common/@v/v0.26.0.zip",
    "status": "approved",
    "scans": [
        {
            "date": "December 14, 2022 at 4:45:45 a.m. GMT",
            "authority": "https://gitlab.eclipse.org/eclipsefdn/emo-team/iplab/-/issues/5788",
            "scancode-version": "31.2.1",
            "licenses-discovered": [
                "Apache-2.0",
                "BSD-3-Clause"
            ],
            "copyrights": [
                "(c) http://example.com",
                "Copyright (c) 2011, Open Knowledge Foundation Ltd.",
                "Copyright 2013 The Prometheus Authors",
                "Copyright 2014 The Prometheus Authors",
                "Copyright 2015 The Prometheus Authors",
                "Copyright 2016 The Prometheus Authors",
                "Copyright 2017 The Prometheus Authors",
                "Copyright 2018 The Prometheus Authors",
                "Copyright 2019 The Prometheus Authors",
                "Copyright 2020 The Prometheus Authors",
                "Copyright 2021 The Prometheus Authors"
            ],
            "file-count": 130,
            "sha256": "147cd46d031694892a4357c614387e1220176cbacb17fa8ea4c9fdc00d537227",
            "source": "https://proxy.golang.org/github.com%2Fprometheus/common/@v/v0.26.0.zip",
            "status": "approved"
        }
    ]
}