{
    "id": "maven/mavencentral/org.apache.hadoop/hadoop-common/3.3.6",
    "license": "Apache-2.0 AND BSD-2-Clause AND BSD-3-Clause AND BSL-1.0 AND MIT AND LicenseRef-Public-Domain",
    "authority": "https://gitlab.eclipse.org/eclipsefdn/emo-team/iplab/-/issues/13052",
    "source": "https://repo1.maven.org/maven2/org/apache/hadoop/hadoop-common/3.3.6/hadoop-common-3.3.6-sources.jar",
    "status": "approved",
    "scans": [
        {
            "date": "February 1, 2024 at 2:50:38 p.m. GMT",
            "authority": "https://gitlab.eclipse.org/eclipsefdn/emo-team/iplab/-/issues/13052",
            "scancode-version": "31.2.1",
            "licenses-discovered": [
                "Apache-2.0",
                "Apache-2.0 AND BSD-2-Clause AND BSD-3-Clause AND BSL-1.0 AND MIT",
                "Apache-2.0 AND BSD-3-Clause",
                "Apache-2.0 AND LicenseRef-scancode-public-domain-disclaimer"
            ],
            "copyrights": [
                "Copyright (c) 2004-2006 Intel Corportation",
                "Copyright (c) 2005, European Commission project OneLab",
                "Copyright 2015 Apache Software Foundation"
            ],
            "file-count": 1180,
            "sha256": "623f48c2aa243e43b4c5046ad1c0da0f5b6e61f862e462334e785703569b1f7d",
            "source": "https://repo1.maven.org/maven2/org/apache/hadoop/hadoop-common/3.3.6/hadoop-common-3.3.6-sources.jar",
            "status": "restricted"
        }
    ]
}
