{
    "id": "maven/mavencentral/org.kie/kie-memory-compiler/7.63.0",
    "license": "Apache-2.0",
    "licenses-discovered": [
        "Apache-2.0"
    ],
    "copyrights": [
        "Copyright (c) Red Hat, Inc. and/or its affiliates"
    ],
    "file-count": 22,
    "scancode-version": "30.1.0",
    "authority": "https://gitlab.eclipse.org/eclipsefdn/emo-team/iplab/-/issues/2874",
    "source": "https://search.maven.org/remotecontent?filepath=org/kie/kie-memory-compiler/7.63.0.Final/kie-memory-compiler-7.63.0.Final-sources.jar",
    "status": "approved"
}