{
    "id": "nuget/nuget/-/Flurl.Http.Signed/3.2.4",
    "license": "MIT",
    "licenses-discovered": [
        "MIT"
    ],
    "copyrights": [
        "Copyright (c) Todd Menier"
    ],
    "file-count": 106,
    "scancode-version": "30.1.0",
    "authority": "https://gitlab.eclipse.org/eclipsefdn/emo-team/iplab/-/issues/3503",
    "source": "https://github.com/tmenier/Flurl/archive/refs/tags/Flurl.Http.3.2.4.zip",
    "status": "approved"
}