{
    "id": "npm/npmjs/-/oauth4webapi/3.1.3",
    "license": "MIT",
    "authority": "https://gitlab.eclipse.org/eclipsefdn/emo-team/iplab/-/issues/17948",
    "source": "https://github.com/panva/oauth4webapi/archive/refs/tags/v3.1.3.zip",
    "status": "approved",
    "scans": [
        {
            "date": "December 18, 2024 at 2:24:03 p.m. GMT",
            "authority": "https://gitlab.eclipse.org/eclipsefdn/emo-team/iplab/-/issues/17948",
            "scancode-version": "31.2.1",
            "licenses-discovered": [
                "MIT"
            ],
            "copyrights": [
                "Copyright (c) 2022 Filip Skokan"
            ],
            "file-count": 315,
            "sha256": "fa80583e3f93140a75f16be20b0d3f517204cb2dbb123933c128d8ee75a32e65",
            "source": "https://github.com/panva/oauth4webapi/archive/refs/tags/v3.1.3.zip",
            "status": "approved"
        }
    ]
}