{
    "id": "p2/orbit/p2.eclipse.plugin/org.apache.lucene.analysis-smartcn/9.8.0.v20230929-1030",
    "license": "Apache-2.0",
    "authority": "https://gitlab.eclipse.org/eclipsefdn/emo-team/iplab/-/issues/10736",
    "source": "https://repo.maven.apache.org/maven2/org/apache/lucene/lucene-analysis-smartcn/9.8.0/lucene-analysis-smartcn-9.8.0-sources.jar",
    "status": "approved",
    "scans": [
        {
            "date": "September 29, 2023 at 6:33:41 p.m. GMT",
            "authority": "https://gitlab.eclipse.org/eclipsefdn/emo-team/iplab/-/issues/10736",
            "scancode-version": "31.2.1",
            "licenses-discovered": [
                "Apache-2.0"
            ],
            "copyrights": [
            ],
            "file-count": 22,
            "sha256": "a5f8f9c15a6058eedbeae1126f7bfec70be52f302a5e1580d2d099ac5efdb0b2",
            "source": "https://repo.maven.apache.org/maven2/org/apache/lucene/lucene-analysis-smartcn/9.8.0/lucene-analysis-smartcn-9.8.0-sources.jar",
            "status": "approved"
        }
    ]
}