{
    "id": "project/iot.threadx/eclipse-threadx/rtos-docs/4d8fe09d5f91b00c18d5af9cd7c22a96052aee57",
    "license": "MIT",
    "authority": "https://gitlab.eclipse.org/eclipsefdn/emo-team/iplab/-/issues/12866",
    "source": "https://github.com/eclipse-threadx/rtos-docs/archive/4d8fe09d5f91b00c18d5af9cd7c22a96052aee57.zip",
    "status": "approved",
    "scans": [
        {
            "date": "January 23, 2024 at 6:56:46 p.m. GMT",
            "authority": "https://gitlab.eclipse.org/eclipsefdn/emo-team/iplab/-/issues/12866",
            "scancode-version": "31.2.1",
            "licenses-discovered": [
                "MIT",
                "LicenseRef-scancode-free-unknown",
                "LicenseRef-scancode-proprietary-license"
            ],
            "copyrights": [
                "Copyright (c) 2024 Azure RTOS",
                "Copyright (c) Eclipse Foundation Corporation",
                "Copyright (c) Microsoft Corporation",
                "Copyright 2005-2008 Weston Schmidt, Harald Welte and OpenMoko Inc.",
                "Copyright 2010-2012 Tormod Volden and Stefan Schmidt"
            ],
            "file-count": 1245,
            "sha256": "2ef6ab6c62895ee4f286efafe31b7f00782141a10ce1b1934a0d3c51daa6c910",
            "source": "https://github.com/eclipse-threadx/rtos-docs/archive/4d8fe09d5f91b00c18d5af9cd7c22a96052aee57.zip",
            "status": "restricted"
        }
    ]
}
