{
    "id": "maven/mavencentral/org.geotools/gt-process/22.1",
    "license": "LGPL-2.0-or-later AND LGPL-2.1-only",
    "authority": "https://gitlab.eclipse.org/eclipsefdn/emo-team/iplab/-/issues/4915",
    "source": "https://repo.osgeo.org/repository/geotools-releases/org/geotools/gt-process/22.1/gt-process-22.1-sources.jar",
    "status": "approved",
    "scans": [
        {
            "date": "November 15, 2022 at 11:41:55 p.m. GMT",
            "authority": "https://gitlab.eclipse.org/eclipsefdn/emo-team/iplab/-/issues/4915",
            "scancode-version": "31.2.1",
            "licenses-discovered": [
                "LGPL-2.0-or-later",
                "LGPL-2.1-only"
            ],
            "copyrights": [
                "(c) 2007 TOPP - www.openplans.org",
                "(c) 2008, Open Source Geospatial Foundation",
                "(c) 2008-2016, Open Source Geospatial Foundation",
                "(c) 2009, Open Source Geospatial Foundation",
                "(c) 2009-2011, Open Source Geospatial Foundation",
                "(c) 2011-2012, Open Source Geospatial Foundation",
                "(c) 2016, Open Source Geospatial Foundation",
                "(c) 2019, Open Source Geospatial Foundation"
            ],
            "file-count": 38,
            "sha256": "f6ff127d69b7f04de0882e1b9b9d997fdaa858560e28658e5e8864cd5b8b6010",
            "source": "https://repo.osgeo.org/repository/geotools-releases/org/geotools/gt-process/22.1/gt-process-22.1-sources.jar",
            "status": "restricted"
        },
        {
            "date": "November 16, 2022 at 1:16:38 a.m. GMT",
            "authority": "https://gitlab.eclipse.org/eclipsefdn/emo-team/iplab/-/issues/4915",
            "scancode-version": "31.2.1",
            "licenses-discovered": [
                "LGPL-2.0-or-later",
                "LGPL-2.1-only"
            ],
            "copyrights": [
                "(c) 2007 TOPP - www.openplans.org",
                "(c) 2008, Open Source Geospatial Foundation",
                "(c) 2008-2016, Open Source Geospatial Foundation",
                "(c) 2009, Open Source Geospatial Foundation",
                "(c) 2009-2011, Open Source Geospatial Foundation",
                "(c) 2011-2012, Open Source Geospatial Foundation",
                "(c) 2016, Open Source Geospatial Foundation",
                "(c) 2019, Open Source Geospatial Foundation"
            ],
            "file-count": 38,
            "sha256": "f6ff127d69b7f04de0882e1b9b9d997fdaa858560e28658e5e8864cd5b8b6010",
            "source": "https://repo.osgeo.org/repository/geotools-releases/org/geotools/gt-process/22.1/gt-process-22.1-sources.jar",
            "status": "approved"
        }
    ]
}