{
    "id": "pypi/pypi/-/charset-normalizer/3.1.0",
    "license": "MIT AND (LGPL-2.1-only AND MIT) AND LGPL-2.1-only AND CC-BY-SA-3.0",
    "authority": "https://gitlab.eclipse.org/eclipsefdn/emo-team/iplab/-/issues/7989",
    "source": "https://files.pythonhosted.org/packages/ff/d7/8d757f8bd45be079d76309248845a04f09619a7b17d6dfc8c9ff6433cac2/charset-normalizer-3.1.0.tar.gz",
    "status": "approved",
    "scans": [
        {
            "date": "April 27, 2023 at 2:12:19 p.m. GMT",
            "authority": "https://gitlab.eclipse.org/eclipsefdn/emo-team/iplab/-/issues/7989",
            "scancode-version": "31.2.1",
            "licenses-discovered": [
                "MIT",
                "LGPL-2.1-only AND MIT",
                "LGPL-2.1-only",
                "CC-BY-SA-3.0"
            ],
            "copyrights": [
                "(c) 2012 Denny Vrandecic (http://simia.net/letters/)",
                "(c) https://stackoverflow.com/questions/3041986/apt-command-line-interface-like-yes-no-input",
                "COPYRIGHT (c) FOOBAR",
                "Copyright (c) 2019 Ahmed TAHRI Ousret",
                "Copyright (c) 2019 TAHRI Ahmed R.",
                "Copyright (c) Ahmed TAHRI Ousret (https://github.com/Ousret)",
                "copyright (c) 2021 by Ahmed TAHRI",
                "copyright 2019, Ahmed TAHRI"
            ],
            "file-count": 72,
            "sha256": "34e0a2f9c370eb95597aae63bf85eb5e96826d81e3dcf88b8886012906f509b5",
            "source": "https://files.pythonhosted.org/packages/ff/d7/8d757f8bd45be079d76309248845a04f09619a7b17d6dfc8c9ff6433cac2/charset-normalizer-3.1.0.tar.gz",
            "status": "approved"
        }
    ]
}