{
    "id": "maven/mavencentral/org.springframework/spring-core/6.2.0",
    "license": "Apache-2.0 AND BSD-3-Clause",
    "authority": "https://gitlab.eclipse.org/eclipsefdn/emo-team/iplab/-/issues/17535",
    "source": "https://repo1.maven.org/maven2/org/springframework/spring-core/6.2.0/spring-core-6.2.0-sources.jar",
    "status": "approved",
    "scans": [
        {
            "date": "November 29, 2024 at 4:08:39 a.m. GMT",
            "authority": "https://gitlab.eclipse.org/eclipsefdn/emo-team/iplab/-/issues/17535",
            "scancode-version": "31.2.1",
            "licenses-discovered": [
                "Apache-2.0",
                "BSD-3-Clause"
            ],
            "copyrights": [
                "Copyright (c) 2000-2005 INRIA, France Telecom",
                "Copyright (c) 2000-2011 INRIA, France Telecom",
                "Copyright (c) 2014 Google, Inc.",
                "Copyright (c) 2015 Square, Inc.",
                "Copyright (c) 2016 Square, Inc.",
                "Copyright 2002,2003 The Apache Software Foundation",
                "Copyright 2002,2003,2004 The Apache Software Foundation",
                "Copyright 2002-2007 the original author or authors",
                "Copyright 2002-2009 the original author or authors",
                "Copyright 2002-2010 the original author or authors",
                "Copyright 2002-2011 the original author or authors",
                "Copyright 2002-2012 the original author or authors",
                "Copyright 2002-2014 the original author or authors",
                "Copyright 2002-2015 the original author or authors",
                "Copyright 2002-2016 the original author or authors",
                "Copyright 2002-2017 the original author or authors",
                "Copyright 2002-2018 the original author or authors",
                "Copyright 2002-2019 the original author or authors",
                "Copyright 2002-2020 the original author or authors",
                "Copyright 2002-2021 the original author or authors",
                "Copyright 2002-2022 the original author or authors",
                "Copyright 2002-2023 the original author or authors",
                "Copyright 2002-2024 the original author or authors",
                "Copyright 2003 The Apache Software Foundation",
                "Copyright 2003,2004 The Apache Software Foundation",
                "Copyright 2004 The Apache Software Foundation",
                "Copyright 2006-2021 the original author or authors",
                "Copyright 2006-2024 the original author or authors",
                "Copyright 2011 The Apache Software Foundation",
                "Copyright 2012-2024 the original author or authors"
            ],
            "file-count": 795,
            "sha256": "b05c3fbca93419f1c175cf0f9b3a5a6e3514e460895b2e519a5dbcb787c7414e",
            "source": "https://repo1.maven.org/maven2/org/springframework/spring-core/6.2.0/spring-core-6.2.0-sources.jar",
            "status": "approved"
        }
    ]
}