{
    "id": "maven/mavencentral/org.springframework.boot/spring-boot-starter-cache/3.1.1",
    "license": "Apache-2.0",
    "authority": "https://gitlab.eclipse.org/eclipsefdn/emo-team/iplab/-/issues/9653",
    "source": "https://repo.maven.apache.org/maven2/org/springframework/boot/spring-boot-starter-cache/3.1.1/spring-boot-starter-cache-3.1.1-sources.jar",
    "status": "approved",
    "scans": [
        {
            "date": "July 19, 2023 at 10:47:09 a.m. GMT",
            "authority": "https://gitlab.eclipse.org/eclipsefdn/emo-team/iplab/-/issues/9653",
            "scancode-version": "31.2.1",
            "licenses-discovered": [
                "Apache-2.0"
            ],
            "copyrights": [
            ],
            "file-count": 2,
            "sha256": "10ff5ff98f886a8bcb0fc17de7c1071588421b8137523c064b96e9c45af622ea",
            "source": "https://repo.maven.apache.org/maven2/org/springframework/boot/spring-boot-starter-cache/3.1.1/spring-boot-starter-cache-3.1.1-sources.jar",
            "status": "approved"
        }
    ]
}