{
    "id": "maven/mavencentral/org.geotools/gt-epsg-wkt/30.1",
    "license": "LGPL-2.1-only",
    "authority": "https://gitlab.eclipse.org/eclipsefdn/emo-team/iplab/-/issues/12740",
    "source": "https://repo.osgeo.org/repository/geotools-releases/org/geotools/gt-epsg-wkt/30.1/gt-epsg-wkt-30.1-sources.jar",
    "status": "approved",
    "scans": [
        {
            "date": "January 10, 2024 at 11:31:37 p.m. GMT",
            "authority": "https://gitlab.eclipse.org/eclipsefdn/emo-team/iplab/-/issues/12740",
            "scancode-version": "31.2.1",
            "licenses-discovered": [
                "LGPL-2.1-only"
            ],
            "copyrights": [
                "(c) 2004-2008, Open Source Geospatial Foundation"
            ],
            "file-count": 6,
            "sha256": "c6ee4e8472231c3540287d5da13d849bca75b14970e313f4068d0c10a53f8ac9",
            "source": "https://repo.osgeo.org/repository/geotools-releases/org/geotools/gt-epsg-wkt/30.1/gt-epsg-wkt-30.1-sources.jar",
            "status": "approved"
        }
    ]
}