{
    "id": "maven/mavencentral/org.geotools.ogc/net.opengis.ows/30.2",
    "license": "LGPL-3.0-only",
    "authority": "https://gitlab.eclipse.org/eclipsefdn/emo-team/iplab/-/issues/13111",
    "source": "https://repo.osgeo.org/repository/geotools-releases/org/geotools/ogc/net.opengis.ows/30.2/net.opengis.ows-30.2-sources.jar",
    "status": "approved",
    "scans": [
        {
            "date": "February 2, 2024 at 8:33:55 p.m. GMT",
            "authority": "https://gitlab.eclipse.org/eclipsefdn/emo-team/iplab/-/issues/13111",
            "scancode-version": "31.2.1",
            "licenses-discovered": [
            ],
            "copyrights": [
                "Copyright (c) 2006 Open Geospatial Consortium, Inc.",
                "Copyright (c) 2009 Open Geospatial Consortium. To"
            ],
            "file-count": 414,
            "sha256": "063eedc88bfe374af4707375a2e62d703358d86d5d9b1b6e45458cf9cb074283",
            "source": "https://repo.osgeo.org/repository/geotools-releases/org/geotools/ogc/net.opengis.ows/30.2/net.opengis.ows-30.2-sources.jar",
            "status": "restricted"
        }
    ]
}
