{
    "id": "npm/npmjs/@babel/types/7.20.2",
    "license": "MIT",
    "licenses-discovered": [
        "MIT"
    ],
    "copyrights": [
        "Copyright (c) 2014-present Sebastian McKenzie and other contributors"
    ],
    "file-count": 166,
    "scancode-version": "31.2.1",
    "authority": "https://gitlab.eclipse.org/eclipsefdn/emo-team/iplab/-/issues/4626",
    "source": "https://registry.npmjs.org/@babel/types/-/types-7.20.2.tgz",
    "status": "approved"
}