{
    "id": "maven/mavencentral/com.vladsch.flexmark/flexmark-ext-jekyll-front-matter/0.64.8",
    "license": "BSD-2-Clause AND CC-BY-SA-4.0",
    "authority": "https://gitlab.eclipse.org/eclipsefdn/emo-team/iplab/-/issues/11270",
    "source": "https://repo.maven.apache.org/maven2/com/vladsch/flexmark/flexmark-ext-jekyll-front-matter/0.64.8/flexmark-ext-jekyll-front-matter-0.64.8-sources.jar",
    "status": "approved",
    "scans": [
        {
            "date": "October 27, 2023 at 4:27:03 a.m. GMT",
            "authority": "https://gitlab.eclipse.org/eclipsefdn/emo-team/iplab/-/issues/11270",
            "scancode-version": "31.2.1",
            "licenses-discovered": [
            ],
            "copyrights": [
            ],
            "file-count": 12,
            "sha256": "6e822e4a31736483d0f1a59108c69d0ca259911c4ce954e30324c89cd7646d05",
            "source": "https://repo.maven.apache.org/maven2/com/vladsch/flexmark/flexmark-ext-jekyll-front-matter/0.64.8/flexmark-ext-jekyll-front-matter-0.64.8-sources.jar",
            "status": "restricted"
        }
    ]
}
