{
    "id": "maven/mavencentral/org.jboss.forge.roaster/roaster-api/2.24.0.Final",
    "license": "EPL-1.0",
    "authority": "https://gitlab.eclipse.org/eclipsefdn/emo-team/iplab/-/issues/7286",
    "source": "https://search.maven.org/remotecontent?filepath=org/jboss/forge/roaster/roaster-api/2.24.0.Final/roaster-api-2.24.0.Final-sources.jar",
    "status": "approved",
    "scans": [
        {
            "date": "March 1, 2023 at 2:14:21 p.m. GMT",
            "authority": "https://gitlab.eclipse.org/eclipsefdn/emo-team/iplab/-/issues/7286",
            "scancode-version": "31.2.1",
            "licenses-discovered": [
                "EPL-1.0"
            ],
            "copyrights": [
                "Copyright 2012 Red Hat, Inc. and/or its affiliates",
                "Copyright 2012-2013 Red Hat, Inc. and/or its affiliates",
                "Copyright 2012-2014 Red Hat, Inc. and/or its affiliates",
                "Copyright 2013 Red Hat, Inc. and/or its affiliates",
                "Copyright 2014 Red Hat, Inc. and/or its affiliates",
                "Copyright 2015 Red Hat, Inc. and/or its affiliates",
                "Copyright 2016 Red Hat, Inc. and/or its affiliates",
                "Copyright 2017 Red Hat, Inc. and/or its affiliates"
            ],
            "file-count": 94,
            "sha256": "20dccc25db51a3852384f04e437e0245e6d67c81c808746243c44cba0e53bf6a",
            "source": "https://search.maven.org/remotecontent?filepath=org/jboss/forge/roaster/roaster-api/2.24.0.Final/roaster-api-2.24.0.Final-sources.jar",
            "status": "approved"
        }
    ]
}