{
    "id": "crate/cratesio/-/prost/0.12.1",
    "license": "Apache-2.0",
    "authority": "https://gitlab.eclipse.org/eclipsefdn/emo-team/iplab/-/issues/10594",
    "source": "https://crates.io/api/v1/crates/prost/0.12.1/download",
    "status": "approved",
    "scans": [
        {
            "date": "September 20, 2023 at 6:45:15 a.m. GMT",
            "authority": "https://gitlab.eclipse.org/eclipsefdn/emo-team/iplab/-/issues/10594",
            "scancode-version": "31.2.1",
            "licenses-discovered": [
                "Apache-2.0"
            ],
            "copyrights": [
                "Copyright 2022 Dan Burkert & Tokio Contributors"
            ],
            "file-count": 22,
            "sha256": "f4fdd22f3b9c31b53c060df4a0613a1c7f062d4115a2b984dd15b1858f7e340d",
            "source": "https://crates.io/api/v1/crates/prost/0.12.1/download",
            "status": "approved"
        }
    ]
}