{
    "id": "go/golang/gopkg.in/yaml.v2/v2.3.0",
    "license": "Apache-2.0 AND MIT",
    "authority": "https://gitlab.eclipse.org/eclipsefdn/emo-team/iplab/-/issues/6075",
    "source": "https://proxy.golang.org/gopkg.in/yaml.v2/@v/v2.3.0.zip",
    "status": "approved",
    "scans": [
        {
            "date": "January 6, 2023 at 2:15:51 p.m. GMT",
            "authority": "https://gitlab.eclipse.org/eclipsefdn/emo-team/iplab/-/issues/6075",
            "scancode-version": "31.2.1",
            "licenses-discovered": [
                "Apache-2.0",
                "MIT",
                "Apache-2.0 AND MIT"
            ],
            "copyrights": [
                "Copyright (c) 2006 Kirill Simonov"
            ],
            "file-count": 23,
            "sha256": "98e04f293019ca9bb6aff031f37eca555a48b0fc0b8b7cc083219bc13e8655bb",
            "source": "https://proxy.golang.org/gopkg.in/yaml.v2/@v/v2.3.0.zip",
            "status": "approved"
        }
    ]
}