{
    "id": "maven/mavencentral/org.apache.activemq/artemis-dto/2.38.0",
    "license": "Apache-2.0",
    "authority": "https://gitlab.eclipse.org/eclipsefdn/emo-team/iplab/-/issues/17321",
    "source": "https://repo1.maven.org/maven2/org/apache/activemq/artemis-dto/2.38.0/artemis-dto-2.38.0-sources.jar",
    "status": "approved",
    "scans": [
        {
            "date": "November 19, 2024, 5:59:10 p.m. GMT",
            "authority": "https://gitlab.eclipse.org/eclipsefdn/emo-team/iplab/-/issues/17321",
            "scancode-version": "31.2.1",
            "licenses-discovered": [
                "Apache-2.0"
            ],
            "copyrights": [
            ],
            "file-count": 29,
            "sha256": "4a7ee46a34060029e96c6654bc7c151d93c9409a7d4c658429265d8f14d506f3",
            "source": "https://repo1.maven.org/maven2/org/apache/activemq/artemis-dto/2.38.0/artemis-dto-2.38.0-sources.jar",
            "status": "approved"
        }
    ]
}