{
    "id": "p2/orbit/p2.eclipse.plugin/org.eclipse.jetty.http/10.0.6",
    "license": "EPL-2.0 OR Apache-2.0",
    "licenses-discovered": [
        "EPL-2.0 OR Apache-2.0"
    ],
    "copyrights": [
        "Copyright (c) 1995-2021 Mort Bay Consulting Pty Ltd and others"
    ],
    "file-count": 56,
    "scancode-version": "31.2.1",
    "authority": "https://gitlab.eclipse.org/eclipsefdn/emo-team/iplab/-/issues/4016",
    "source": "https://search.maven.org/remotecontent?filepath=org/eclipse/jetty/jetty-http/10.0.6/jetty-http-10.0.6-sources.jar",
    "status": "approved"
}