{
    "id": "maven/mavencentral/org.apache.xmlgraphics/batik-transcoder/1.18",
    "license": "Apache-2.0",
    "authority": "https://gitlab.eclipse.org/eclipsefdn/emo-team/iplab/-/issues/16588",
    "source": "https://repo1.maven.org/maven2/org/apache/xmlgraphics/batik-transcoder/1.18/batik-transcoder-1.18-sources.jar",
    "status": "approved",
    "scans": [
        {
            "date": "October 9, 2024, 2:54:52 p.m. GMT",
            "authority": "https://gitlab.eclipse.org/eclipsefdn/emo-team/iplab/-/issues/16588",
            "scancode-version": "31.2.1",
            "licenses-discovered": [
                "Apache-2.0"
            ],
            "copyrights": [
            ],
            "file-count": 49,
            "sha256": "6b8d58b7fc0d70eea4bca0964ed707e5f91c0ed7ada5b7922b957b9c14ee719e",
            "source": "https://repo1.maven.org/maven2/org/apache/xmlgraphics/batik-transcoder/1.18/batik-transcoder-1.18-sources.jar",
            "status": "approved"
        }
    ]
}