{
    "id": "npm/npmjs/-/dompurify/2.5.2",
    "license": "Apache-2.0 OR MPL-2.0",
    "authority": "https://gitlab.eclipse.org/eclipsefdn/emo-team/iplab/-/issues/14657",
    "source": "https://github.com/cure53/DOMPurify/archive/refs/tags/2.5.2.zip",
    "status": "approved",
    "scans": [
        {
            "date": "May 8, 2024 at 8:55:31 a.m. GMT",
            "authority": "https://gitlab.eclipse.org/eclipsefdn/emo-team/iplab/-/issues/14657",
            "scancode-version": "31.2.1",
            "licenses-discovered": [
                "Apache-2.0 AND MPL-2.0",
                "Apache-2.0 AND GPL-2.0-only AND MPL-2.0"
            ],
            "copyrights": [
                "(c) Cure53 and other contributors",
                "Copyright 2024 Dr.-Ing. Mario Heiderich, Cure53",
                "copyright content src https://leaking.via/meta-name-copyright-reading-view",
                "copyright https://leaking.via/link-copyright"
            ],
            "file-count": 61,
            "sha256": "6585697787cb59047d57d433e74b492e52d77f9e76c46a7f5850c068c2ae48f8",
            "source": "https://github.com/cure53/DOMPurify/archive/refs/tags/2.5.2.zip",
            "status": "restricted"
        }
    ]
}