{
    "id": "maven/mavencentral/net.sf.saxon/Saxon-HE/11.5",
    "license": "MPL-2.0-no-copyleft-exception AND X11 AND MIT AND MPL-1.0 AND Apache-2.0",
    "authority": "https://gitlab.eclipse.org/eclipsefdn/emo-team/iplab/-/issues/19926",
    "source": "https://repo1.maven.org/maven2/net/sf/saxon/Saxon-HE/11.5/Saxon-HE-11.5-sources.jar",
    "status": "approved",
    "scans": [
        {
            "date": "March 6, 2025 at 11:06:00 a.m. GMT",
            "authority": "https://gitlab.eclipse.org/eclipsefdn/emo-team/iplab/-/issues/19926",
            "scancode-version": "31.2.1",
            "licenses-discovered": [
                "MPL-2.0-no-copyleft-exception",
                "LicenseRef-scancode-proprietary-license AND MPL-2.0-no-copyleft-exception",
                "MPL-2.0-no-copyleft-exception AND X11",
                "MIT AND MPL-2.0-no-copyleft-exception",
                "MPL-1.0 AND MPL-2.0-no-copyleft-exception",
                "Apache-2.0 AND MPL-2.0-no-copyleft-exception",
                "MPL-1.0"
            ],
            "copyrights": [
                "Copyright (c) (your legal entity)",
                "Copyright (c) 1998, 1999 James Clark",
                "Copyright (c) 2004-2022 Saxonica Limited",
                "Copyright (c) 2005-2022 Saxonica Limited",
                "Copyright (c) 2008-2022 Saxonica Limited",
                "Copyright (c) 2009-2020 Saxonica Limited",
                "Copyright (c) 2009-2022 Saxonica Limited",
                "Copyright (c) 2010-2022 Saxonica Limited",
                "Copyright (c) 2011-2022 Saxonica Limited",
                "Copyright (c) 2012 Michael Froh",
                "Copyright (c) 2012-2021 Saxonica Limited",
                "Copyright (c) 2012-2022 Saxonica Limited",
                "Copyright (c) 2013-2022 Saxonica Limited",
                "Copyright (c) 2014-2022 Saxonica Limited",
                "Copyright (c) 2015-2022 Saxonica Limited",
                "Copyright (c) 2017-2022 Saxonica Limited",
                "Copyright (c) 2018-2020 Saxonica Limited",
                "Copyright (c) 2018-2021 Saxonica Limited",
                "Copyright (c) 2018-2022 Saxonica Limited",
                "Copyright (c) 2020 Saxonica Limited"
            ],
            "file-count": 1707,
            "sha256": "19811d7cd7fa4e1693f2c119c1a840552df480e185d495d17191206026fab6ac",
            "source": "https://repo1.maven.org/maven2/net/sf/saxon/Saxon-HE/11.5/Saxon-HE-11.5-sources.jar",
            "status": "restricted"
        }
    ]
}