{
    "id": "maven/mavencentral/com.google.cloud/google-cloud-iamcredentials/2.36.0",
    "license": "Apache-2.0",
    "authority": "https://gitlab.eclipse.org/eclipsefdn/emo-team/iplab/-/issues/13441",
    "source": "https://repo1.maven.org/maven2/com/google/cloud/google-cloud-iamcredentials/2.36.0/google-cloud-iamcredentials-2.36.0-sources.jar",
    "status": "approved",
    "scans": [
        {
            "date": "February 26, 2024 at 7:12:03 a.m. GMT",
            "authority": "https://gitlab.eclipse.org/eclipsefdn/emo-team/iplab/-/issues/13441",
            "scancode-version": "31.2.1",
            "licenses-discovered": [
                "Apache-2.0"
            ],
            "copyrights": [
                "Copyright 2024 Google LLC"
            ],
            "file-count": 14,
            "sha256": "cac6811746758dd1aa9803cfa1f3352d4b3846f9057781e113ccf9d611d8630c",
            "source": "https://repo1.maven.org/maven2/com/google/cloud/google-cloud-iamcredentials/2.36.0/google-cloud-iamcredentials-2.36.0-sources.jar",
            "status": "approved"
        }
    ]
}