{
    "id": "maven/mavencentral/io.fabric8/kubernetes-model-rbac/6.11.0",
    "license": "Apache-2.0",
    "authority": "https://gitlab.eclipse.org/eclipsefdn/emo-team/iplab/-/issues/14167",
    "source": "https://repo1.maven.org/maven2/io/fabric8/kubernetes-model-rbac/6.11.0/kubernetes-model-rbac-6.11.0-sources.jar",
    "status": "approved",
    "scans": [
        {
            "date": "March 26, 2024 at 5:57:04 p.m. GMT",
            "authority": "https://gitlab.eclipse.org/eclipsefdn/emo-team/iplab/-/issues/14167",
            "scancode-version": "31.2.1",
            "licenses-discovered": [
                "Apache-2.0"
            ],
            "copyrights": [
                "Copyright (c) 2015 Red Hat, Inc."
            ],
            "file-count": 45,
            "sha256": "5eb2d4d5bf8daa984d576796caf0006781edc2d9acc2ea197cf2f745a16a71b2",
            "source": "https://repo1.maven.org/maven2/io/fabric8/kubernetes-model-rbac/6.11.0/kubernetes-model-rbac-6.11.0-sources.jar",
            "status": "approved"
        }
    ]
}