{
    "id": "maven/mavencentral/org.jboss/jboss-vfs/3.2.15.Final",
    "license": "Apache-2.0",
    "licenses-discovered": [
        "Apache-2.0"
    ],
    "file-count": 62,
    "scancode-version": "30.1.0",
    "authority": "https://gitlab.eclipse.org/eclipsefdn/emo-team/iplab/-/issues/2061",
    "source": "https://search.maven.org/remotecontent?filepath=org/jboss/jboss-vfs/3.2.15.Final/jboss-vfs-3.2.15.Final-sources.jar",
    "status": "approved"
}