{
    "id": "maven/mavencentral/org.apache.xmlgraphics/batik-ext/1.18",
    "license": "Apache-2.0 AND W3C",
    "authority": "https://gitlab.eclipse.org/eclipsefdn/emo-team/iplab/-/issues/16594",
    "source": "https://repo1.maven.org/maven2/org/apache/xmlgraphics/batik-ext/1.18/batik-ext-1.18-sources.jar",
    "status": "approved",
    "scans": [
        {
            "date": "October 9, 2024, 2:57:01 p.m. GMT",
            "authority": "https://gitlab.eclipse.org/eclipsefdn/emo-team/iplab/-/issues/16594",
            "scancode-version": "31.2.1",
            "licenses-discovered": [
                "Apache-2.0",
                "W3C"
            ],
            "copyrights": [
                "Copyright (c) 2006 World Wide Web Consortium"
            ],
            "file-count": 10,
            "sha256": "e5917cb2238a2f5dbacecfcaeab193a26195a72ca725c4165bf7f8f60babdfbd",
            "source": "https://repo1.maven.org/maven2/org/apache/xmlgraphics/batik-ext/1.18/batik-ext-1.18-sources.jar",
            "status": "approved"
        }
    ]
}