{
    "id": "npm/npmjs/-/cmd-shim/6.0.3",
    "license": "ISC",
    "authority": "https://gitlab.eclipse.org/eclipsefdn/emo-team/iplab/-/issues/14654",
    "source": "https://github.com/npm/cmd-shim/archive/refs/tags/v6.0.3.zip",
    "status": "approved",
    "scans": [
        {
            "date": "May 8, 2024 at 8:51:47 a.m. GMT",
            "authority": "https://gitlab.eclipse.org/eclipsefdn/emo-team/iplab/-/issues/14654",
            "scancode-version": "31.2.1",
            "licenses-discovered": [
                "ISC"
            ],
            "copyrights": [
                "Copyright (c) npm, Inc. and Contributors"
            ],
            "file-count": 35,
            "sha256": "f193247f9729778afd140e2f75d69d042efbb2ff71ccaa9a0d2b2ee46319ef2c",
            "source": "https://github.com/npm/cmd-shim/archive/refs/tags/v6.0.3.zip",
            "status": "approved"
        }
    ]
}