{
    "id": "maven/mavencentral/biz.aQute.bnd/biz.aQute.tester.junit-platform/7.1.0",
    "license": "EPL-2.0",
    "authority": "https://gitlab.eclipse.org/eclipsefdn/emo-team/iplab/-/issues/19480",
    "source": "https://repo1.maven.org/maven2/biz/aQute/bnd/biz.aQute.tester.junit-platform/7.1.0/biz.aQute.tester.junit-platform-7.1.0-sources.jar",
    "status": "approved",
    "scans": [
        {
            "date": "February 19, 2025 at 8:50:20 a.m. GMT",
            "authority": "https://gitlab.eclipse.org/eclipsefdn/emo-team/iplab/-/issues/19480",
            "scancode-version": "31.2.1",
            "licenses-discovered": [
                "EPL-2.0"
            ],
            "copyrights": [
                "Copyright 2015-2019 the original author or authors"
            ],
            "file-count": 23,
            "sha256": "50c78b4d4565ec48af89cd3c7919ff15d4383c7ad59e682c43175096d29ff1f3",
            "source": "https://repo1.maven.org/maven2/biz/aQute/bnd/biz.aQute.tester.junit-platform/7.1.0/biz.aQute.tester.junit-platform-7.1.0-sources.jar",
            "status": "approved"
        }
    ]
}