{
    "id": "maven/mavencentral/software.amazon.awssdk/crt-core/2.30.33",
    "license": "Apache-2.0",
    "authority": "https://gitlab.eclipse.org/eclipsefdn/emo-team/iplab/-/issues/19908",
    "source": "https://repo1.maven.org/maven2/software/amazon/awssdk/crt-core/2.30.33/crt-core-2.30.33-sources.jar",
    "status": "approved",
    "scans": [
        {
            "date": "March 6, 2025 at 8:11:55 a.m. GMT",
            "authority": "https://gitlab.eclipse.org/eclipsefdn/emo-team/iplab/-/issues/19908",
            "scancode-version": "31.2.1",
            "licenses-discovered": [
                "Apache-2.0"
            ],
            "copyrights": [
                "Copyright Amazon.com, Inc. or its affiliates"
            ],
            "file-count": 7,
            "sha256": "754cc99608fb546eb349df4385cb7356f6155546403e8360ac5eecf691ecc05f",
            "source": "https://repo1.maven.org/maven2/software/amazon/awssdk/crt-core/2.30.33/crt-core-2.30.33-sources.jar",
            "status": "approved"
        }
    ]
}