{
    "id": "npm/npmjs/@eslint/js/8.40.0",
    "license": "MIT AND (LGPL-2.0-or-later AND MIT) AND ISC AND CC-BY-NC-SA-4.0 AND CC-BY-SA-4.0 AND OFL-1.1 AND CC-BY-SA-2.0 AND (JSON AND LicenseRef-scancode-proprietary-license AND MIT)",
    "authority": "https://gitlab.eclipse.org/eclipsefdn/emo-team/iplab/-/issues/12938",
    "source": "https://github.com/eslint/eslint/archive/refs/tags/v8.40.0.zip",
    "status": "restricted",
    "scans": [
        {
            "date": "May 8, 2023 at 12:52:34 p.m. GMT",
            "authority": "https://gitlab.eclipse.org/eclipsefdn/emo-team/iplab/-/issues/8375",
            "scancode-version": "31.2.1",
            "licenses-discovered": [
                "MIT",
                "LGPL-2.0-or-later AND MIT",
                "ISC",
                "CC-BY-NC-SA-4.0",
                "CC-BY-SA-4.0",
                "OFL-1.1",
                "CC-BY-SA-2.0",
                "JSON AND LicenseRef-scancode-proprietary-license AND MIT"
            ],
            "copyrights": [
                "(c) 2009-2013 Jeremy Ashkenas, DocumentCloud Inc. Underscore",
                "(c) 2018-2019 John Hildenbiddle <http://hildenbiddle.com>",
                "(c) ExpressionStatement CallExpression Identifier",
                "(c) OpenJS Foundation and ESLint",
                "Copyright (c) 2002 Douglas Crockford (www.JSLint.com)",
                "Copyright (c) 2009 Thomas Robinson <280north.com>",
                "Copyright (c) 2016-2019 The Inter Project",
                "Copyright (c) 2019-present, Yuxi",
                "Copyright 2013-2016 Dulin Marat and other contributors",
                "Copyright 2016 Google Inc.",
                "Copyright 2020 The Inter Project",
                "Copyright 2020 The Space Grotesk Project",
                "Copyright JS Foundation and other contributors, https://js.foundation",
                "Copyright Joyent, Inc. and other Node contributors",
                "Copyright OpenJS Foundation and other contributors, <www.openjsf.org>",
                "Copyright https://openjsf.org' OpenJS Foundation and ESLint contributors. The https://openjsf.org' OpenJS Foundation"
            ],
            "file-count": 2151,
            "sha256": "a92547f0a1a41b52e1058b40810bef1f4116dd148c6ab094191e042e18cb1cb9",
            "source": "https://github.com/eslint/eslint/archive/v8.40.0.zip",
            "status": "restricted"
        },
        {
            "date": "January 29, 2024 at 4:23:19 p.m. GMT",
            "authority": "https://gitlab.eclipse.org/eclipsefdn/emo-team/iplab/-/issues/12938",
            "scancode-version": "31.2.1",
            "licenses-discovered": [
                "MIT",
                "LGPL-2.0-or-later AND MIT",
                "ISC",
                "CC-BY-NC-SA-4.0",
                "CC-BY-SA-4.0",
                "OFL-1.1",
                "CC-BY-SA-2.0",
                "JSON AND LicenseRef-scancode-proprietary-license AND MIT"
            ],
            "copyrights": [
                "(c) 2009-2013 Jeremy Ashkenas, DocumentCloud Inc. Underscore",
                "(c) 2018-2019 John Hildenbiddle <http://hildenbiddle.com>",
                "(c) ExpressionStatement CallExpression Identifier",
                "(c) OpenJS Foundation and ESLint",
                "Copyright (c) 2002 Douglas Crockford (www.JSLint.com)",
                "Copyright (c) 2009 Thomas Robinson <280north.com>",
                "Copyright (c) 2016-2019 The Inter Project",
                "Copyright (c) 2019-present, Yuxi",
                "Copyright 2013-2016 Dulin Marat and other contributors",
                "Copyright 2016 Google Inc.",
                "Copyright 2020 The Inter Project",
                "Copyright 2020 The Space Grotesk Project",
                "Copyright JS Foundation and other contributors, https://js.foundation",
                "Copyright Joyent, Inc. and other Node contributors",
                "Copyright OpenJS Foundation and other contributors, <www.openjsf.org>",
                "Copyright https://openjsf.org' OpenJS Foundation and ESLint contributors. The https://openjsf.org' OpenJS Foundation"
            ],
            "file-count": 2151,
            "sha256": "a92547f0a1a41b52e1058b40810bef1f4116dd148c6ab094191e042e18cb1cb9",
            "source": "https://github.com/eslint/eslint/archive/refs/tags/v8.40.0.zip",
            "status": "restricted"
        }
    ]
}