{
    "id": "maven/mavencentral/org.wildfly.security/wildfly-elytron-x500-cert-util/2.6.0.Final",
    "license": "Apache-2.0",
    "authority": "https://gitlab.eclipse.org/eclipsefdn/emo-team/iplab/-/issues/16663",
    "source": "https://repo1.maven.org/maven2/org/wildfly/security/wildfly-elytron-x500-cert-util/2.6.0.Final/wildfly-elytron-x500-cert-util-2.6.0.Final-sources.jar",
    "status": "approved",
    "scans": [
        {
            "date": "October 15, 2024, 3:02:35 a.m. GMT",
            "authority": "https://gitlab.eclipse.org/eclipsefdn/emo-team/iplab/-/issues/16663",
            "scancode-version": "31.2.1",
            "licenses-discovered": [
                "Apache-2.0"
            ],
            "copyrights": [
                "Copyright 2014 Red Hat, Inc., and individual contributors",
                "Copyright 2018 Red Hat, Inc., and individual contributors"
            ],
            "file-count": 8,
            "sha256": "473be8d052633b9a120a3fec9ee18f57867166db699836ec6ce92cfc19b47c9e",
            "source": "https://repo1.maven.org/maven2/org/wildfly/security/wildfly-elytron-x500-cert-util/2.6.0.Final/wildfly-elytron-x500-cert-util-2.6.0.Final-sources.jar",
            "status": "approved"
        }
    ]
}