{
    "id": "npm/npmjs/@types/ssh2-sftp-client/9.0.1",
    "license": "MIT",
    "authority": "https://gitlab.eclipse.org/eclipsefdn/emo-team/iplab/-/issues/10848",
    "source": "https://registry.yarnpkg.com/@types/ssh2-sftp-client/-/ssh2-sftp-client-9.0.1.tgz",
    "status": "approved",
    "scans": [
        {
            "date": "October 3, 2023 at 1:56:36 p.m. GMT",
            "authority": "https://gitlab.eclipse.org/eclipsefdn/emo-team/iplab/-/issues/10848",
            "scancode-version": "31.2.1",
            "licenses-discovered": [
                "MIT"
            ],
            "copyrights": [
                "Copyright (c) Microsoft Corporation"
            ],
            "file-count": 4,
            "sha256": "7c2520093bb8f4d9b38490b0538d629509dbd01e48de4523a1e03a8dfc203d48",
            "source": "https://registry.yarnpkg.com/@types/ssh2-sftp-client/-/ssh2-sftp-client-9.0.1.tgz",
            "status": "approved"
        }
    ]
}