{
    "id": "npm/npmjs/-/commander/10.0.1",
    "license": "MIT",
    "authority": "https://gitlab.eclipse.org/eclipsefdn/emo-team/iplab/-/issues/8062",
    "source": "https://github.com/tj/commander.js/archive/v10.0.1.zip",
    "status": "approved",
    "scans": [
        {
            "date": "April 28, 2023 at 2:39:54 p.m. GMT",
            "authority": "https://gitlab.eclipse.org/eclipsefdn/emo-team/iplab/-/issues/8062",
            "scancode-version": "31.2.1",
            "licenses-discovered": [
                "MIT"
            ],
            "copyrights": [
                "Copyright (c) 2011 TJ Holowaychuk <tj@vision-media.ca>"
            ],
            "file-count": 189,
            "sha256": "6e3015afde80219a7d0e3d6f45f363100fbe3390a0f36a6d496132698a71538c",
            "source": "https://github.com/tj/commander.js/archive/v10.0.1.zip",
            "status": "approved"
        }
    ]
}