{
    "id": "npm/npmjs/-/jscodeshift/0.13.1",
    "license": "MIT",
    "authority": "https://gitlab.eclipse.org/eclipsefdn/emo-team/iplab/-/issues/9853",
    "source": "https://registry.yarnpkg.com/jscodeshift/-/jscodeshift-0.13.1.tgz",
    "status": "approved",
    "scans": [
        {
            "date": "August 8, 2023 at 9:53:07 a.m. GMT",
            "authority": "https://gitlab.eclipse.org/eclipsefdn/emo-team/iplab/-/issues/9853",
            "scancode-version": "31.2.1",
            "licenses-discovered": [
                "MIT"
            ],
            "copyrights": [
                "Copyright (c) Facebook, Inc. and its affiliates"
            ],
            "file-count": 54,
            "sha256": "6b67244470fa47110da83deaedfc7586d650ac75c1b22575a49eae32a88e3184",
            "source": "https://registry.yarnpkg.com/jscodeshift/-/jscodeshift-0.13.1.tgz",
            "status": "approved"
        }
    ]
}