{
    "id": "npm/npmjs/-/ts-jest/29.2.5",
    "license": "MIT",
    "authority": "https://gitlab.eclipse.org/eclipsefdn/emo-team/iplab/-/issues/19364",
    "source": "https://github.com/kulshekhar/ts-jest/archive/refs/tags/v29.2.5.zip",
    "status": "approved",
    "scans": [
        {
            "date": "February 7, 2025 at 6:47:06 p.m. GMT",
            "authority": "https://gitlab.eclipse.org/eclipsefdn/emo-team/iplab/-/issues/19364",
            "scancode-version": "31.2.1",
            "licenses-discovered": [
                "MIT"
            ],
            "copyrights": [
                "Copyright (c) 2016-2018 Permission",
                "Copyright (c) Facebook, Inc. and its affiliates"
            ],
            "file-count": 533,
            "sha256": "915f41829cf9ed1512ed2af6077ebc72032efd21e6185d86fdf8479db08dfef8",
            "source": "https://github.com/kulshekhar/ts-jest/archive/refs/tags/v29.2.5.zip",
            "status": "approved"
        }
    ]
}