{
    "id": "go/golang/cloud.google.com/go/v0.46.3",
    "license": "Apache-2.0 AND (Apache-2.0 AND BSD-3-Clause) AND BSD-2-Clause",
    "authority": "https://gitlab.eclipse.org/eclipsefdn/emo-team/iplab/-/issues/5586",
    "source": "https://proxy.golang.org/cloud.google.com/go/@v/v0.46.3.zip",
    "status": "approved",
    "scans": [
        {
            "date": "December 9, 2022 at 9:11:44 p.m. GMT",
            "authority": "https://gitlab.eclipse.org/eclipsefdn/emo-team/iplab/-/issues/5586",
            "scancode-version": "31.2.1",
            "licenses-discovered": [
                "Apache-2.0",
                "Apache-2.0 AND BSD-3-Clause",
                "BSD-2-Clause"
            ],
            "copyrights": [
                "Copyright (c) 1996-1998 John D. Polstra",
                "Copyright (c) 2001 David E. O'Brien",
                "Copyright 2014 Google LLC",
                "Copyright 2016 Google LLC",
                "Copyright 2017 Google LLC",
                "Copyright 2017, Google Inc.",
                "Copyright 2017, Google LLC",
                "Copyright 2018 Google Inc.",
                "Copyright 2018 Google LLC",
                "Copyright 2019 Google Inc.",
                "Copyright 2019 Google LLC",
                "Portions Copyright 2018 Google LLC."
            ],
            "file-count": 550,
            "sha256": "0ae6690ee7d95f96d39de30bec56047d1e91b9ffafd0d55508ef564e1dfc13b2",
            "source": "https://proxy.golang.org/cloud.google.com/go/@v/v0.46.3.zip",
            "status": "approved"
        }
    ]
}