{
    "id": "maven/mavencentral/org.eclipse.dataspaceconnector/core-boot/0.0.1-20220922.4-20230220.143048-2",
    "license": "Apache-2.0",
    "authority": "https://gitlab.eclipse.org/eclipsefdn/emo-team/iplab/-/issues/7655",
    "source": "https://search.maven.org/remotecontent?filepath=org/eclipse/dataspaceconnector/core-boot/0.0.1-milestone-6/core-boot-0.0.1-milestone-6-sources.jar",
    "status": "approved",
    "scans": [
        {
            "date": "March 28, 2023 at 9:41:30 p.m. GMT",
            "authority": "https://gitlab.eclipse.org/eclipsefdn/emo-team/iplab/-/issues/7655",
            "scancode-version": "31.2.1",
            "licenses-discovered": [
                "Apache-2.0"
            ],
            "copyrights": [
                "Copyright (c) 1995-2018 Mort Bay Consulting Pty. Ltd.",
                "Copyright (c) 2020 - 2022 Microsoft Corporation",
                "Copyright (c) 2020, 2021 Microsoft Corporation",
                "Copyright (c) 2021 Microsoft Corporation",
                "Copyright (c) 2022 Microsoft Corporation"
            ],
            "file-count": 19,
            "sha256": "e394112ee9159a51720ab546b8b99cb4ffa6d37d76d1d9ad3a06ff6caa494e0a",
            "source": "https://search.maven.org/remotecontent?filepath=org/eclipse/dataspaceconnector/core-boot/0.0.1-milestone-6/core-boot-0.0.1-milestone-6-sources.jar",
            "status": "approved"
        }
    ]
}