{
    "id": "maven/mavencentral/io.quarkus/quarkus-vertx-http/3.17.4",
    "license": "Apache-2.0 AND EPL-1.0 AND Apache-2.0",
    "authority": "https://gitlab.eclipse.org/eclipsefdn/emo-team/iplab/-/issues/17882",
    "source": "https://repo1.maven.org/maven2/io/quarkus/quarkus-vertx-http/3.17.4/quarkus-vertx-http-3.17.4-sources.jar",
    "status": "approved",
    "scans": [
        {
            "date": "December 13, 2024 at 1:30:18 p.m. GMT",
            "authority": "https://gitlab.eclipse.org/eclipsefdn/emo-team/iplab/-/issues/17882",
            "scancode-version": "31.2.1",
            "licenses-discovered": [
                "Apache-2.0 AND EPL-1.0",
                "Apache-2.0"
            ],
            "copyrights": [
                "Copyright (c) 2020-2023, Aayush Atharva",
                "Copyright 2014 Red Hat, Inc.",
                "Copyright 2014 Red Hat, Inc., and individual contributors"
            ],
            "file-count": 226,
            "sha256": "9b00d8c16938ee443d241cf48409464dbfbccba13aedf348a5c874635c90b0d5",
            "source": "https://repo1.maven.org/maven2/io/quarkus/quarkus-vertx-http/3.17.4/quarkus-vertx-http-3.17.4-sources.jar",
            "status": "approved"
        }
    ]
}