{
    "id": "maven/mavencentral/com.pinterest.ktlint/ktlint-reporter-plain-summary/0.49.0",
    "license": "MIT",
    "authority": "https://gitlab.eclipse.org/eclipsefdn/emo-team/iplab/-/issues/10214",
    "source": "https://repo.maven.apache.org/maven2/com/pinterest/ktlint/ktlint-reporter-plain-summary/0.49.0/ktlint-reporter-plain-summary-0.49.0-sources.jar",
    "status": "approved",
    "scans": [
        {
            "date": "August 23, 2023 at 11:38:48 a.m. GMT",
            "authority": "https://gitlab.eclipse.org/eclipsefdn/emo-team/iplab/-/issues/10214",
            "scancode-version": "31.2.1",
            "licenses-discovered": [
            ],
            "copyrights": [
            ],
            "file-count": 4,
            "sha256": "58cdcff422d8bf97895da9d06fd425a0f952a77a80bd7522eb88a74d4e06a061",
            "source": "https://repo.maven.apache.org/maven2/com/pinterest/ktlint/ktlint-reporter-plain-summary/0.49.0/ktlint-reporter-plain-summary-0.49.0-sources.jar",
            "status": "restricted"
        }
    ]
}
