{
    "id": "maven/mavencentral/org.jboss.arquillian.protocol/arquillian-protocol-servlet-jakarta/1.8.0.Final",
    "license": "Apache-2.0",
    "authority": "https://gitlab.eclipse.org/eclipsefdn/emo-team/iplab/-/issues/15150",
    "source": "https://repo1.maven.org/maven2/org/jboss/arquillian/protocol/arquillian-protocol-servlet-jakarta/1.8.0.Final/arquillian-protocol-servlet-jakarta-1.8.0.Final-sources.jar",
    "status": "approved",
    "scans": [
        {
            "date": "June 10, 2024 at 5:09:05 p.m. GMT",
            "authority": "https://gitlab.eclipse.org/eclipsefdn/emo-team/iplab/-/issues/15150",
            "scancode-version": "31.2.1",
            "licenses-discovered": [
                "Apache-2.0"
            ],
            "copyrights": [
                "Copyright 2009 Red Hat Inc. and/or its affiliates and other contributors by the authors",
                "Copyright 2010 Red Hat Inc. and/or its affiliates and other contributors by the authors",
                "Copyright 2011 Red Hat Inc. and/or its affiliates and other contributors as indicated by the authors tag",
                "Copyright 2011 Red Hat Inc. and/or its affiliates and other contributors by the authors",
                "Copyright 2022 Red Hat Inc. and/or its affiliates and other contributors by the authors"
            ],
            "file-count": 38,
            "sha256": "2a8be9e2a245e6694c89ab4c0167452b139d3011c23816ae0a39d6fffba4f1a3",
            "source": "https://repo1.maven.org/maven2/org/jboss/arquillian/protocol/arquillian-protocol-servlet-jakarta/1.8.0.Final/arquillian-protocol-servlet-jakarta-1.8.0.Final-sources.jar",
            "status": "approved"
        }
    ]
}