{
    "id": "npm/npmjs/-/langium-cli/3.2.0",
    "license": "MIT",
    "authority": "https://gitlab.eclipse.org/eclipsefdn/emo-team/iplab/-/issues/16610",
    "source": "https://github.com/eclipse-langium/langium/archive/refs/tags/v3.2.0.zip",
    "status": "approved",
    "scans": [
        {
            "date": "October 10, 2024, 10:37:42 p.m. GMT",
            "authority": "https://gitlab.eclipse.org/eclipsefdn/emo-team/iplab/-/issues/16610",
            "scancode-version": "31.2.1",
            "licenses-discovered": [
                "MIT"
            ],
            "copyrights": [
                "Copyright (c) Microsoft Corporation",
                "Copyright 2021 TypeFox GmbH",
                "Copyright 2021-2022 TypeFox GmbH",
                "Copyright 2022 TypeFox GmbH",
                "Copyright 2023 TypeFox GmbH",
                "Copyright 2024 TypeFox GmbH"
            ],
            "file-count": 480,
            "sha256": "1de2affce9edeedfc90dc92378481f1c8b3e88138fab7d91933b8f484c9a8dac",
            "source": "https://github.com/eclipse-langium/langium/archive/refs/tags/v3.2.0.zip",
            "status": "approved"
        }
    ]
}