{
    "id": "maven/mavencentral/io.grpc/grpc-rls/1.59.1",
    "license": "Apache-2.0",
    "authority": "https://gitlab.eclipse.org/eclipsefdn/emo-team/iplab/-/issues/12033",
    "source": "https://repo1.maven.org/maven2/io/grpc/grpc-rls/1.59.1/grpc-rls-1.59.1-sources.jar",
    "status": "approved",
    "scans": [
        {
            "date": "December 14, 2023 at 11:05:59 a.m. GMT",
            "authority": "https://gitlab.eclipse.org/eclipsefdn/emo-team/iplab/-/issues/12033",
            "scancode-version": "31.2.1",
            "licenses-discovered": [
                "Apache-2.0"
            ],
            "copyrights": [
                "Copyright 2020 The gRPC"
            ],
            "file-count": 35,
            "sha256": "c38564986e6547c1576bc9859b3fa892ef326de59ffe7b8b84c897d5e6435c64",
            "source": "https://repo1.maven.org/maven2/io/grpc/grpc-rls/1.59.1/grpc-rls-1.59.1-sources.jar",
            "status": "approved"
        }
    ]
}