{
    "id": "p2/orbit/p2.eclipse-plugin/junit-platform-commons.source/1.9.1",
    "license": "EPL-2.0",
    "authority": "https://gitlab.eclipse.org/eclipsefdn/emo-team/iplab/-/issues/5334",
    "source": "https://search.maven.org/remotecontent?filepath=org/junit/platform/junit-platform-commons/1.9.1/junit-platform-commons-1.9.1-sources.jar",
    "status": "approved",
    "scans": [
        {
            "date": "December 5, 2022 at 6:22:02 p.m. GMT",
            "authority": "https://gitlab.eclipse.org/eclipsefdn/emo-team/iplab/-/issues/5334",
            "scancode-version": "31.2.1",
            "licenses-discovered": [
                "EPL-2.0"
            ],
            "copyrights": [
                "Copyright 2015-2021 the original author or authors",
                "Copyright 2015-2022 the original author or authors"
            ],
            "file-count": 45,
            "sha256": "fcfdc6414619e323031ebeb2ecca00e230b3817019be08a588c6492ece5aa204",
            "source": "https://search.maven.org/remotecontent?filepath=org/junit/platform/junit-platform-commons/1.9.1/junit-platform-commons-1.9.1-sources.jar",
            "status": "approved"
        }
    ]
}