{
    "id": "maven/mavencentral/software.amazon.awssdk/annotations/2.23.12",
    "license": "Apache-2.0",
    "authority": "https://gitlab.eclipse.org/eclipsefdn/emo-team/iplab/-/issues/13157",
    "source": "https://repo1.maven.org/maven2/software/amazon/awssdk/annotations/2.23.12/annotations-2.23.12-sources.jar",
    "status": "approved",
    "scans": [
        {
            "date": "February 4, 2024 at 11:01:34 a.m. GMT",
            "authority": "https://gitlab.eclipse.org/eclipsefdn/emo-team/iplab/-/issues/13157",
            "scancode-version": "31.2.1",
            "licenses-discovered": [
                "Apache-2.0"
            ],
            "copyrights": [
                "Copyright Amazon.com, Inc. or its affiliates"
            ],
            "file-count": 18,
            "sha256": "bbe894a159388bc937cd1c9cca82dbde9d2c56fffb639c5c0a8f1abdf5adc537",
            "source": "https://repo1.maven.org/maven2/software/amazon/awssdk/annotations/2.23.12/annotations-2.23.12-sources.jar",
            "status": "approved"
        }
    ]
}