{
    "id": "npm/npmjs/-/dotenv-expand/11.0.7",
    "license": "BSD-2-Clause",
    "authority": "https://gitlab.eclipse.org/eclipsefdn/emo-team/iplab/-/issues/17737",
    "source": "https://github.com/motdotla/dotenv-expand/archive/refs/tags/v11.0.7.zip",
    "status": "approved",
    "scans": [
        {
            "date": "December 5, 2024 at 6:22:48 a.m. GMT",
            "authority": "https://gitlab.eclipse.org/eclipsefdn/emo-team/iplab/-/issues/17737",
            "scancode-version": "31.2.1",
            "licenses-discovered": [
                "BSD-2-Clause"
            ],
            "copyrights": [
                "Copyright (c) 2016, Scott Motte"
            ],
            "file-count": 18,
            "sha256": "fb526579c916f593493ea728ce4b8fa9fd277039557345212bd62cc0ad21ae6d",
            "source": "https://github.com/motdotla/dotenv-expand/archive/refs/tags/v11.0.7.zip",
            "status": "approved"
        }
    ]
}