{
    "id": "npm/npmjs/-/stylelint-config-recommended/12.0.0",
    "license": "MIT",
    "authority": "https://gitlab.eclipse.org/eclipsefdn/emo-team/iplab/-/issues/8039",
    "source": "https://registry.yarnpkg.com/stylelint-config-recommended/-/stylelint-config-recommended-12.0.0.tgz",
    "status": "approved",
    "scans": [
        {
            "date": "April 28, 2023 at 5:54:37 p.m. GMT",
            "authority": "https://gitlab.eclipse.org/eclipsefdn/emo-team/iplab/-/issues/8039",
            "scancode-version": "31.2.1",
            "licenses-discovered": [
                "MIT"
            ],
            "copyrights": [
                "Copyright (c) 2018 - present stylelint"
            ],
            "file-count": 4,
            "sha256": "14cc91df786b3bbdcf276d427fabde82a3c88b00b0a9c038dfb4b11c6fcf3e80",
            "source": "https://registry.yarnpkg.com/stylelint-config-recommended/-/stylelint-config-recommended-12.0.0.tgz",
            "status": "approved"
        }
    ]
}