{
    "id": "maven/mavencentral/org.apache.activemq/artemis-server/2.27.1",
    "license": "Apache-2.0",
    "authority": "https://gitlab.eclipse.org/eclipsefdn/emo-team/iplab/-/issues/6746",
    "source": "https://search.maven.org/remotecontent?filepath=org/apache/activemq/artemis-server/2.27.1/artemis-server-2.27.1-sources.jar",
    "status": "approved",
    "scans": [
        {
            "date": "January 27, 2023 at 12:11:06 p.m. GMT",
            "authority": "https://gitlab.eclipse.org/eclipsefdn/emo-team/iplab/-/issues/6746",
            "scancode-version": "31.2.1",
            "licenses-discovered": [
                "Apache-2.0"
            ],
            "copyrights": [
                "Copyright 2011 Glenn Maynard",
                "Copyright 2016 Ognyan Bankov"
            ],
            "file-count": 614,
            "sha256": "43c52ea66331f6503256ae1fe038691629c8e4b79d21b0ad32dfa318797320c2",
            "source": "https://search.maven.org/remotecontent?filepath=org/apache/activemq/artemis-server/2.27.1/artemis-server-2.27.1-sources.jar",
            "status": "approved"
        }
    ]
}