{
    "id": "maven/mavencentral/org.apache.xmlgraphics/batik-script/1.18",
    "license": "Apache-2.0",
    "authority": "https://gitlab.eclipse.org/eclipsefdn/emo-team/iplab/-/issues/16577",
    "source": "https://repo1.maven.org/maven2/org/apache/xmlgraphics/batik-script/1.18/batik-script-1.18-sources.jar",
    "status": "approved",
    "scans": [
        {
            "date": "October 9, 2024, 2:47:34 p.m. GMT",
            "authority": "https://gitlab.eclipse.org/eclipsefdn/emo-team/iplab/-/issues/16577",
            "scancode-version": "31.2.1",
            "licenses-discovered": [
                "Apache-2.0"
            ],
            "copyrights": [
            ],
            "file-count": 23,
            "sha256": "a384418bdef8a1399a986eb15a108ba0a9f51f6e15af8fb94c220e38bec19107",
            "source": "https://repo1.maven.org/maven2/org/apache/xmlgraphics/batik-script/1.18/batik-script-1.18-sources.jar",
            "status": "approved"
        }
    ]
}