{
    "id": "maven/mavencentral/com.yahoo.elide/elide-datastore-jms/7.1.2",
    "license": "Apache-2.0",
    "authority": "https://gitlab.eclipse.org/eclipsefdn/emo-team/iplab/-/issues/17466",
    "source": "https://repo1.maven.org/maven2/com/yahoo/elide/elide-datastore-jms/7.1.2/elide-datastore-jms-7.1.2-sources.jar",
    "status": "approved",
    "scans": [
        {
            "date": "November 26, 2024 at 10:25:28 p.m. GMT",
            "authority": "https://gitlab.eclipse.org/eclipsefdn/emo-team/iplab/-/issues/17466",
            "scancode-version": "31.2.1",
            "licenses-discovered": [
                "Apache-2.0"
            ],
            "copyrights": [
                "Copyright 2021, Yahoo Inc.",
                "Copyright 2023, the original author or authors"
            ],
            "file-count": 10,
            "sha256": "767352c25e5e059d16538b44d235bbee9050578f8d991fd7553c54c44b0337d0",
            "source": "https://repo1.maven.org/maven2/com/yahoo/elide/elide-datastore-jms/7.1.2/elide-datastore-jms-7.1.2-sources.jar",
            "status": "approved"
        }
    ]
}