{
    "id": "maven/mavencentral/io.cucumber/cucumber-spring/7.21.0",
    "license": "MIT",
    "authority": "https://gitlab.eclipse.org/eclipsefdn/emo-team/iplab/-/issues/19284",
    "source": "https://repo1.maven.org/maven2/io/cucumber/cucumber-spring/7.21.0/cucumber-spring-7.21.0-sources.jar",
    "status": "approved",
    "scans": [
        {
            "date": "February 4, 2025 at 8:14:27 a.m. GMT",
            "authority": "https://gitlab.eclipse.org/eclipsefdn/emo-team/iplab/-/issues/19284",
            "scancode-version": "31.2.1",
            "licenses-discovered": [
            ],
            "copyrights": [
            ],
            "file-count": 14,
            "sha256": "5ff6f94bd5bffcc9922e6c4def48e1b7583df67a5af318575aa49f3a3e9155c5",
            "source": "https://repo1.maven.org/maven2/io/cucumber/cucumber-spring/7.21.0/cucumber-spring-7.21.0-sources.jar",
            "status": "restricted"
        }
    ]
}