{
    "id": "maven/mavencentral/biz.aQute.bnd/biz.aQute.bnd.annotation/7.1.0",
    "license": "Apache-2.0 OR EPL-2.0",
    "authority": "https://gitlab.eclipse.org/eclipsefdn/emo-team/iplab/-/issues/17521",
    "source": "https://repo1.maven.org/maven2/biz/aQute/bnd/biz.aQute.bnd.annotation/7.1.0/biz.aQute.bnd.annotation-7.1.0-sources.jar",
    "status": "approved",
    "scans": [
        {
            "date": "November 28, 2024 at 7:23:34 a.m. GMT",
            "authority": "https://gitlab.eclipse.org/eclipsefdn/emo-team/iplab/-/issues/17521",
            "scancode-version": "31.2.1",
            "licenses-discovered": [
                "Apache-2.0 AND BSD-2-Clause AND BSD-3-Clause AND CDDL-1.0 AND EPL-1.0 AND GPL-2.0-only AND GPL-3.0-only AND LGPL-2.1-only AND MIT",
                "Apache-2.0",
                "BSD-2-Clause AND BSD-2-Clause-Views",
                "BSD-3-Clause",
                "CDDL-1.0",
                "CPL-1.0",
                "EPL-1.0",
                "EPL-2.0 AND LicenseRef-scancode-free-unknown",
                "GPL-2.0-only",
                "GPL-2.0-or-later",
                "GPL-3.0-only",
                "GPL-3.0-or-later",
                "LGPL-2.1-only",
                "LGPL-2.1-or-later",
                "MIT",
                "MPL-2.0"
            ],
            "copyrights": [
            ],
            "file-count": 67,
            "sha256": "a60b7ec93ec278fff28ab8c6792a8fb738e0c7c0a9f8cab22dc3730b776adb36",
            "source": "https://repo1.maven.org/maven2/biz/aQute/bnd/biz.aQute.bnd.annotation/7.1.0/biz.aQute.bnd.annotation-7.1.0-sources.jar",
            "status": "restricted"
        }
    ]
}