{
    "id": "maven/mavencentral/org.osgi/org.osgi.util.position/1.0.1",
    "license": "Apache-1.1 AND Apache-2.0",
    "authority": "https://gitlab.eclipse.org/eclipsefdn/emo-team/iplab/-/issues/17683",
    "source": "https://repo1.maven.org/maven2/org/osgi/org.osgi.util.position/1.0.1/org.osgi.util.position-1.0.1-sources.jar",
    "status": "approved",
    "scans": [
        {
            "date": "December 4, 2024 at 12:30:50 p.m. GMT",
            "authority": "https://gitlab.eclipse.org/eclipsefdn/emo-team/iplab/-/issues/17683",
            "scancode-version": "31.2.1",
            "licenses-discovered": [
                "Apache-1.1",
                "Apache-2.0"
            ],
            "copyrights": [
                "Copyright (c) OSGi Alliance (2000, 2015)",
                "Copyright (c) OSGi Alliance (2002, 2013)",
                "Copyright (c) OSGi Alliance (2010, 2013)"
            ],
            "file-count": 6,
            "sha256": "f8cd648aa75a4ce68b11c4077e3cccfd61a9b47a6308463283b4b3b5271fcb73",
            "source": "https://repo1.maven.org/maven2/org/osgi/org.osgi.util.position/1.0.1/org.osgi.util.position-1.0.1-sources.jar",
            "status": "approved"
        }
    ]
}