{
    "id": "maven/mavencentral/io.micrometer/micrometer-core/1.9.9",
    "license": "Apache-2.0 AND (Apache-2.0 AND MIT)",
    "authority": "https://gitlab.eclipse.org/eclipsefdn/emo-team/iplab/-/issues/7711",
    "source": "https://search.maven.org/remotecontent?filepath=io/micrometer/micrometer-core/1.9.9/micrometer-core-1.9.9-sources.jar",
    "status": "approved",
    "scans": [
        {
            "date": "March 31, 2023 at 5:35:43 a.m. GMT",
            "authority": "https://gitlab.eclipse.org/eclipsefdn/emo-team/iplab/-/issues/7711",
            "scancode-version": "31.2.1",
            "licenses-discovered": [
                "Apache-2.0",
                "Apache-2.0 AND MIT"
            ],
            "copyrights": [
                "Copyright (c) 2004-2011 QOS.ch",
                "Copyright 2002-2017 the original author or authors",
                "Copyright 2010 Google Inc.",
                "Copyright 2012 The Netty Project",
                "Copyright 2012-2019 the original author or authors",
                "Copyright 2013 The Netty Project",
                "Copyright 2017 The Netty Project",
                "Copyright 2017 VMware, Inc.",
                "Copyright 2017-2021 VMware, Inc.",
                "Copyright 2018 VMware, Inc.",
                "Copyright 2019 VMware, Inc.",
                "Copyright 2020 VMware, Inc.",
                "Copyright 2021 VMware, Inc.",
                "Copyright 2022 VMware, Inc."
            ],
            "file-count": 285,
            "sha256": "75e667a532d71b18eb4db9b24b70205222cce68bb47a0c40e3241252b1e27919",
            "source": "https://search.maven.org/remotecontent?filepath=io/micrometer/micrometer-core/1.9.9/micrometer-core-1.9.9-sources.jar",
            "status": "approved"
        }
    ]
}