{
    "id": "maven/mavencentral/org.flowable/flowable-bpmn-model/6.8.0",
    "license": "Apache-2.0",
    "authority": "https://gitlab.eclipse.org/eclipsefdn/emo-team/iplab/-/issues/6467",
    "source": "https://search.maven.org/remotecontent?filepath=org/flowable/flowable-bpmn-model/6.8.0/flowable-bpmn-model-6.8.0-sources.jar",
    "status": "approved",
    "scans": [
        {
            "date": "January 23, 2023 at 7:57:57 p.m. GMT",
            "authority": "https://gitlab.eclipse.org/eclipsefdn/emo-team/iplab/-/issues/6467",
            "scancode-version": "31.2.1",
            "licenses-discovered": [
                "Apache-2.0"
            ],
            "copyrights": [
            ],
            "file-count": 117,
            "sha256": "d44bda2670793d3cdea9ab69df8e4da2097fcc2fd92ef44b0e81c6e6800260db",
            "source": "https://search.maven.org/remotecontent?filepath=org/flowable/flowable-bpmn-model/6.8.0/flowable-bpmn-model-6.8.0-sources.jar",
            "status": "approved"
        }
    ]
}