{
    "id": "pypi/pypi/-/debugpy/1.8.12",
    "license": "MIT AND CC0-1.0 AND (Apache-2.0 AND BSD-3-Clause AND BSD-3-Clause-Clear AND EPL-1.0 AND GPL-2.0-only AND LicenseRef-scancode-intel-bsd AND LicenseRef-scancode-python-cwi AND LicenseRef-scancode-secret-labs-2011 AND MIT AND Python-2.0) AND Apache-2.0 AND BSD-2-Clause AND BSD-3-Clause",
    "authority": "https://gitlab.eclipse.org/eclipsefdn/emo-team/iplab/-/issues/19903",
    "source": "https://files.pythonhosted.org/packages/68/25/c74e337134edf55c4dfc9af579eccb45af2393c40960e2795a94351e8140/debugpy-1.8.12.tar.gz",
    "status": "restricted",
    "scans": [
        {
            "date": "March 4, 2025 at 12:15:13 p.m. GMT",
            "authority": "https://gitlab.eclipse.org/eclipsefdn/emo-team/iplab/-/issues/19903",
            "scancode-version": "31.2.1",
            "licenses-discovered": [
                "MIT",
                "CC0-1.0",
                "Apache-2.0 AND BSD-3-Clause AND BSD-3-Clause-Clear AND EPL-1.0 AND GPL-2.0-only AND LicenseRef-scancode-intel-bsd AND LicenseRef-scancode-python-cwi AND LicenseRef-scancode-secret-labs-2011 AND MIT AND Python-2.0",
                "Apache-2.0",
                "BSD-2-Clause",
                "BSD-3-Clause"
            ],
            "copyrights": [
                "Copyright (c) 1995-2001 Corporation for National Research Initiatives",
                "Copyright (c) 1999-2002 by Fredrik Lundh",
                "Copyright (c) 1999-2002 by Secret Labs AB",
                "Copyright (c) 2001, 2002, 2003, 2004, 2005, 2006, 2007, 2008, 2009, 2010, 2011, 2012, 2013, 2014, 2015, 2016, 2017 Python Software Foundation",
                "Copyright (c) 2001, Janko Hauser <jhauser@zscout.de>",
                "Copyright (c) 2001, Nathaniel Gray <n8gray@caltech.edu>",
                "Copyright (c) 2001-2007, Fernando Perez. <fernando.perez@colorado.edu>",
                "Copyright (c) 2006-2010 Python Software Foundation",
                "Copyright (c) 2008-2010, IPython Development Team",
                "Copyright (c) 2008-2011 The IPython Development Team",
                "Copyright (c) 2009-2012 Pierre Raybaut",
                "Copyright (c) 2009-2014, Mario Vilas",
                "Copyright (c) 2010-2014 Benjamin Peterson",
                "Copyright (c) 2010-2018 Benjamin Peterson",
                "Copyright (c) 2011 The IPython Development Team",
                "Copyright (c) 2012, Ben Hoyt",
                "Copyright (c) 2012, the IPython Development Team",
                "Copyright (c) 2016 Red Hat",
                "Copyright (c) Brainwy software Ltda",
                "Copyright (c) Microsoft Corporation",
                "Copyright (c) Yuli Fitterman",
                "Copyright Brainwy Software",
                "Copyright Brainwy Software Ltda",
                "copyright Brainwy Software Ltda",
                "copyright Brainwy software Ltda",
                "copyright Microsoft Corporation"
            ],
            "file-count": 293,
            "sha256": "646530b04f45c830ceae8e491ca1c9320a2d2f0efea3141487c82130aba70dce",
            "source": "https://files.pythonhosted.org/packages/68/25/c74e337134edf55c4dfc9af579eccb45af2393c40960e2795a94351e8140/debugpy-1.8.12.tar.gz",
            "status": "restricted"
        }
    ]
}