{
    "id": "maven/mavencentral/org.apache.httpcomponents.client5/httpclient5/5.4.1",
    "license": "Apache-2.0 AND MPL-2.0",
    "authority": "https://gitlab.eclipse.org/eclipsefdn/emo-team/iplab/-/issues/16947",
    "source": "https://repo1.maven.org/maven2/org/apache/httpcomponents/client5/httpclient5/5.4.1/httpclient5-5.4.1-sources.jar",
    "status": "approved",
    "scans": [
        {
            "date": "October 29, 2024, 5:53:31 a.m. GMT",
            "authority": "https://gitlab.eclipse.org/eclipsefdn/emo-team/iplab/-/issues/16947",
            "scancode-version": "31.2.1",
            "licenses-discovered": [
                "Apache-2.0",
                "MPL-2.0"
            ],
            "copyrights": [
            ],
            "file-count": 384,
            "sha256": "eeecccbfe76ee20ac0902ae776ba3df0fe343fa0488e013031a5e3b505b495b6",
            "source": "https://repo1.maven.org/maven2/org/apache/httpcomponents/client5/httpclient5/5.4.1/httpclient5-5.4.1-sources.jar",
            "status": "approved"
        }
    ]
}