{
    "id": "maven/mavencentral/org.apache.lucene/lucene-highlighter/9.9.2",
    "license": "Apache-2.0",
    "authority": "https://gitlab.eclipse.org/eclipsefdn/emo-team/iplab/-/issues/15804",
    "source": "https://repo1.maven.org/maven2/org/apache/lucene/lucene-highlighter/9.9.2/lucene-highlighter-9.9.2-sources.jar",
    "status": "approved",
    "scans": [
        {
            "date": "July 24, 2024 at 4:45:18 p.m. GMT",
            "authority": "https://gitlab.eclipse.org/eclipsefdn/emo-team/iplab/-/issues/15804",
            "scancode-version": "31.2.1",
            "licenses-discovered": [
                "Apache-2.0"
            ],
            "copyrights": [
            ],
            "file-count": 95,
            "sha256": "071dff4ab667290f5ded6ac1b459ca7be697b60eeba22f65631035be3eeaf822",
            "source": "https://repo1.maven.org/maven2/org/apache/lucene/lucene-highlighter/9.9.2/lucene-highlighter-9.9.2-sources.jar",
            "status": "approved"
        }
    ]
}