{
    "id": "npm/npmjs/@es-joy/jsdoccomment/0.37.1",
    "license": "MIT",
    "authority": "https://gitlab.eclipse.org/eclipsefdn/emo-team/iplab/-/issues/8023",
    "source": "https://github.com/es-joy/jsdoccomment/archive/v0.37.1.zip",
    "status": "approved",
    "scans": [
        {
            "date": "April 28, 2023 at 7:12:33 p.m. GMT",
            "authority": "https://gitlab.eclipse.org/eclipsefdn/emo-team/iplab/-/issues/8023",
            "scancode-version": "31.2.1",
            "licenses-discovered": [
                "MIT"
            ],
            "copyrights": [
                "Copyright (c) 2021 Brett Zamir",
                "Copyright JS Foundation and other contributors, https://js.foundation"
            ],
            "file-count": 27,
            "sha256": "270a0a68c02ea1141b2222fa0dc21a1e877bfddfe40b3226bad52dd46bc26847",
            "source": "https://github.com/es-joy/jsdoccomment/archive/v0.37.1.zip",
            "status": "approved"
        }
    ]
}