{
    "id": "maven/mavencentral/org.codehaus.mojo/animal-sniffer-annotations/1.9",
    "license": "MIT",
    "authority": "https://gitlab.eclipse.org/eclipsefdn/emo-team/iplab/-/issues/17663",
    "source": "https://repo1.maven.org/maven2/org/codehaus/mojo/animal-sniffer-annotations/1.9/animal-sniffer-annotations-1.9-sources.jar",
    "status": "approved",
    "scans": [
        {
            "date": "December 4, 2024 at 12:13:24 p.m. GMT",
            "authority": "https://gitlab.eclipse.org/eclipsefdn/emo-team/iplab/-/issues/17663",
            "scancode-version": "31.2.1",
            "licenses-discovered": [
                "MIT"
            ],
            "copyrights": [
                "Copyright (c) 2008 Kohsuke Kawaguchi and codehaus.org"
            ],
            "file-count": 2,
            "sha256": "fca50efa78b78336811eeaa7b0b603537df49a75880905d5327b071e1f65e3cb",
            "source": "https://repo1.maven.org/maven2/org/codehaus/mojo/animal-sniffer-annotations/1.9/animal-sniffer-annotations-1.9-sources.jar",
            "status": "approved"
        }
    ]
}