{
    "id": "git/github/nodejs/node/v18.18.0",
    "license": "MIT AND Apache-2.0 AND BSD-3-Clause AND BSD-2-Clause AND ISC AND Unlicense AND (CC0-1.0 OR BSD-2-Clause) AND Artistic-2.0 AND Unicode-TOU AND ICU AND X11 AND Zlib AND (OpenSSL AND LicenseRef-Cryptograms) AND W3C AND LicenseRef-Public-Domain",
    "source": "https://github.com/nodejs/node/archive/refs/tags/v18.18.0.zip",
    "status": "approved",
    "scans": [
        {
            "date": "September 20, 2023 at 5:29:38 a.m. GMT",
            "authority": "https://gitlab.eclipse.org/eclipsefdn/emo-team/iplab/-/issues/10592",
            "scancode-version": "31.2.1",
            "licenses-discovered": [
                "Apache-2.0 AND Artistic-2.0 AND BSD-2-Clause AND BSD-3-Clause AND CC0-1.0 AND GPL-2.0-or-later AND ICU AND ISC AND LicenseRef-scancode-autoconf-simple-exception-2.0 AND LicenseRef-scancode-public-domain-disclaimer AND LicenseRef-scancode-unicode AND MIT AND NAIST-2003 AND NTP AND Zlib",
                "MIT",
                "LicenseRef-scancode-proprietary-license",
                "CC0-1.0",
                "BSD-2-Clause",
                "FSFULLR AND LicenseRef-scancode-fsf-unlimited-no-warranty",
                "GPL-2.0-or-later AND LicenseRef-scancode-autoconf-simple-exception-2.0",
                "GPL-3.0-or-later AND LicenseRef-scancode-autoconf-simple-exception AND LicenseRef-scancode-free-unknown",
                "FSFUL AND GPL-2.0-or-later AND Libtool-exception",
                "X11",
                "NTP",
                "GPL-2.0-only AND Libtool-exception AND MIT",
                "LicenseRef-scancode-fsf-unlimited-no-warranty",
                "FSFAP",
                "LGPL-2.1-or-later",
                "Autoconf-exception-2.0 AND GPL-3.0-or-later",
                "FSFUL AND FSFULLR AND GPL-2.0-or-later AND Libtool-exception",
                "FSFULLR",
                "ISC",
                "BSD-3-Clause",
                "BSD-3-Clause AND LicenseRef-scancode-unknown",
                "BSD-2-Clause AND BSD-3-Clause AND MIT",
                "BSD-2-Clause AND CC0-1.0",
                "GPL-2.0-or-later AND GPL-3.0-or-later AND LicenseRef-scancode-autoconf-simple-exception AND LicenseRef-scancode-autoconf-simple-exception-2.0 AND LicenseRef-scancode-unicode AND LicenseRef-scancode-unicode-icu-58 AND NTP",
                "LicenseRef-scancode-unicode",
                "LicenseRef-scancode-other-permissive AND LicenseRef-scancode-unicode",
                "LicenseRef-scancode-proprietary-license AND LicenseRef-scancode-unicode",
                "LicenseRef-scancode-unicode AND NGPL",
                "ICU AND LicenseRef-scancode-unicode",
                "BSD-3-Clause AND LicenseRef-scancode-unicode",
                "LicenseRef-scancode-fsf-unlimited-no-warranty AND MIT",
                "BSD-3-Clause AND MIT",
                "Artistic-2.0",
                "LicenseRef-scancode-unknown-spdx",
                "GPL-1.0-or-later",
                "ISC AND MIT",
                "Apache-2.0 AND BSD-2-Clause AND BSD-3-Clause AND GPL-3.0-only AND ISC AND LicenseRef-scancode-free-unknown AND MIT",
                "Apache-2.0",
                "MIT-0",
                "CC-BY-SA-4.0",
                "BlueOak-1.0.0",
                "CC-BY-SA-4.0 AND ISC",
                "BSD-2-Clause AND BSD-3-Clause",
                "Apache-2.0 AND MIT",
                "AGPL-1.0-only AND AGPL-3.0-or-later AND Apache-2.0 AND BSD-2-Clause AND BSD-3-Clause AND BSD-3-Clause-Clear AND GPL-1.0-only AND GPL-2.0-only AND GPL-3.0-or-later AND LGPL-2.0-only AND LGPL-2.1-only AND LGPL-3.0-or-later AND LicenseRef-scancode-agpl-2.0 AND LicenseRef-scancode-other-permissive AND MPL-1.0",
                "Classpath-exception-2.0 AND GPL-3.0-linking-exception AND GPL-3.0-only AND LLVM-exception AND LZMA-exception AND OCaml-LGPL-linking-exception AND Qt-GPL-exception-1.0 AND Qt-LGPL-exception-1.1 AND Swift-exception",
                "CC-BY-3.0",
                "AGPL-3.0-only AND AGPL-3.0-or-later AND APSL-1.0 AND APSL-1.1 AND Apache-1.1 AND Apache-2.0 AND BSD-2-Clause AND BSD-2-Clause-Views AND BSD-3-Clause AND BSD-3-Clause-Modification AND BSD-3-Clause-No-Military-License AND BSD-4-Clause AND BSD-4-Clause-Shortened AND BSD-4-Clause-UC AND CAL-1.0 AND CAL-1.0-Combined-Work-Exception AND CC-BY-3.0 AND CC-BY-SA-2.0 AND CC-BY-SA-4.0 AND CC0-1.0 AND CDDL-1.0 AND CDDL-1.1 AND CECILL-2.0 AND CECILL-2.1 AND CERN-OHL-1.1 AND CERN-OHL-1.2 AND CERN-OHL-P-2.0 AND CERN-OHL-S-2.0 AND CERN-OHL-W-2.0 AND CPOL-1.02 AND EFL-2.0 AND EPL-1.0 AND Frameworx-1.0 AND GFDL-1.1-invariants-only AND GFDL-1.1-invariants-or-later AND GFDL-1.1-no-invariants-only AND GFDL-1.1-no-invariants-or-later AND GFDL-1.2-invariants-only AND GFDL-1.2-invariants-or-later AND GFDL-1.2-no-invariants-only AND GFDL-1.2-no-invariants-or-later AND GFDL-1.3-invariants-only AND GFDL-1.3-invariants-or-later AND GFDL-1.3-no-invariants-only AND GFDL-1.3-no-invariants-or-later AND GPL-2.0-only AND HPND AND HPND-sell-variant AND HaskellReport AND IBM-pibs AND Interbase-1.0 AND LicenseRef-scancode-d-fsl-1.0-en AND LicenseRef-scancode-free-unknown AND LicenseRef-scancode-mulanpsl-1.0-en AND LicenseRef-scancode-mulanpsl-2.0-en AND Linux-man-pages-copyleft AND MS-PL AND MS-RL AND NAIST-2003 AND NCGL-UK-2.0 AND NGPL AND NIST-PD AND NIST-PD-fallback AND NTP-0 AND OFL-1.1-no-RFN AND OGC-1.0 AND OGDL-Taiwan-1.0 AND OGL-Canada-2.0 AND OGL-UK-1.0 AND OGL-UK-2.0 AND OGL-UK-3.0 AND PSF-2.0 AND Parity-6.0.0 AND Parity-7.0.0 AND PolyForm-Noncommercial-1.0.0 AND PolyForm-Small-Business-1.0.0 AND SSPL-1.0 AND Spencer-86 AND TAPR-OHL-1.0 AND TMate AND TU-Berlin-1.0 AND TU-Berlin-2.0 AND UCL-1.0 AND Zimbra-1.3 AND Zimbra-1.4 AND copyleft-next-0.3.0 AND copyleft-next-0.3.1 AND etalab-2.0 AND libselinux-1.0",
                "LicenseRef-scancode-mit-synopsys",
                "LicenseRef-scancode-markus-kuhn-license",
                "OpenSSL",
                "BSD-3-Clause AND GPL-2.0-only AND OpenSSL",
                "BSD-3-Clause AND OpenSSL",
                "BSD-3-Clause AND GPL-1.0-or-later AND OpenSSL",
                "Apache-2.0 AND BSD-3-Clause AND LicenseRef-scancode-other-permissive AND LicenseRef-scancode-proprietary-license AND OpenSSL",
                "Apache-2.0 AND OpenSSL",
                "Apache-2.0 AND BSD-2-Clause AND OpenSSL",
                "LicenseRef-scancode-public-domain-disclaimer AND OpenSSL",
                "BSD-2-Clause AND OpenSSL",
                "LicenseRef-scancode-snprintf AND OpenSSL",
                "LicenseRef-scancode-other-permissive AND OpenSSL",
                "BSD-3-Clause AND GPL-2.0-or-later AND LGPL-2.1-or-later AND MPL-1.1 AND OpenSSL",
                "BSD-Source-Code AND OpenSSL",
                "CC0-1.0 AND OpenSSL",
                "Artistic-1.0 AND GPL-1.0-only AND GPL-1.0-or-later",
                "Artistic-1.0-Perl AND GPL-1.0-or-later",
                "Artistic-1.0 AND Artistic-1.0-Perl AND GPL-1.0-or-later",
                "Artistic-1.0 AND GPL-1.0-or-later",
                "CC-BY-4.0",
                "BSD-2-Clause AND ISC AND MIT",
                "Autoconf-exception-2.0 AND GPL-2.0-or-later",
                "Apache-2.0 AND BSD-3-Clause",
                "LicenseRef-scancode-sunpro",
                "BSD-3-Clause AND LicenseRef-scancode-google-patent-license-webm",
                "BSD-3-Clause AND LicenseRef-scancode-proprietary-license",
                "BSD-3-Clause AND LicenseRef-scancode-bsd-3-clause-jtag",
                "bzip2-1.0.6",
                "BSD-3-Clause AND GPL-2.0-only",
                "Apache-2.0 AND LicenseRef-scancode-mit-addition",
                "BSD-3-Clause AND LicenseRef-scancode-pcre",
                "BSD-2-Clause AND MIT",
                "BSD-3-Clause AND LicenseRef-scancode-json-pd",
                "GPL-2.0-only OR BSD-3-Clause",
                "GPL-2.0-only",
                "Python-2.0",
                "Zlib",
                "LicenseRef-scancode-info-zip-2009-01",
                "FSFAP AND MIT",
                "JSON",
                "MPL-2.0",
                "W3C",
                "BSD-3-Clause AND ICU AND MIT AND OpenSSL",
                "curl",
                "BSD-2-Clause-Views",
                "JSON AND MIT",
                "ISC AND JSON",
                "CC0-1.0 AND MIT"
            ],
            "copyrights": [
                "(c) (c) COMMA",
                "(c) (c) L",
                "(c) . + Received",
                "(c) . a Construct",
                "(c) . inline UBool",
                "(c) 1999 Entrust.net",
                "(c) 1999 VeriSign, Inc.",
                "(c) 2001 Harri Porten <porten@kde.org>",
                "(c) 2005 Scott Baxter. Course Outline. Basic CDMA Principles. Coding",
                "(c) 2006 Entrust",
                "(c) 2009 Entrust, Inc. - for",
                "(c) 2011 Gary Court",
                "(c) 2012 Entrust, Inc. - for",
                "(c) 2015 Entrust, Inc. - for",
                "(c) 2016 and later Unicode, Inc. and others",
                "(c) 2017 and later Unicode, Inc. and others",
                "(c) 2018 and later Unicode, Inc. and others",
                "(c) 2019 Denis Pushkarev",
                "(c) 2019 and later Unicode, Inc. and others",
                "(c) 2020 Andrea Giammarchi",
                "(c) 2020 and later Unicode, Inc. and others",
                "(c) 2021 and later Unicode, Inc. and others",
                "(c) 2022 and later Unicode, Inc. and others",
                "(c) CharacterEscape ControlEscape",
                "(c) IsSpace (c)",
                "(c) Ll (c)",
                "(c) Luke Edwards (https://lukeed.com)",
                "(c) Mg (c)",
                "(c) Petka Antonov, John-David Dalton, Sindre Sorhus",
                "(c) Rl (c)",
                "(c) Sindre Sorhus (http://sindresorhus.com)",
                "(c) Sindre Sorhus (https://sindresorhus.com)",
                "(c) T data-cp 56FF data-bytes AB",
                "(c) Titus Wormer",
                "(c) U data-cp 62DC data-bytes AB",
                "(c) d (c) D",
                "(c) data-cp 30AA data-bytes AB AA' a data-cp 30AB data-bytes AB",
                "(c) e (c) E",
                "(c) i (c) I",
                "(c) int putchar(int c) http://pubs.opengroup.org/onlinepubs/000095399/functions/putchar.html",
                "(c) l (c) L",
                "(c) r (c) R",
                "(c) t (c) T",
                "(c) u (c) U",
                "(c) web-platform-tests contributors",
                "(c) y (c) Y",
                "(c) z (c) Z",
                "(c) zbar', base' null, href' http://example.com/foo",
                "A9 DE' (c) Th",
                "AddRawLiteralChar (c) AddLiteralChar (c)",
                "CharCanBeKeyword (c) AddLiteralChar (c)",
                "Copyright (c) 1987-2001 The Regents of the University of California",
                "Copyright (c) 1989 Free Software Foundation, Inc.",
                "Copyright (c) 1989, 1991 Free Software Foundation, Inc.",
                "Copyright (c) 1990-2000 Info-ZIP.",
                "Copyright (c) 1991 - 1995, Stichting Mathematisch Centrum Amsterdam, The Netherlands",
                "Copyright (c) 1991-2023 Unicode, Inc.",
                "Copyright (c) 1992-1996, 1998-2017, 2020-2021 Free Software Foundation, Inc.",
                "Copyright (c) 1993 by Sun Microsystems, Inc.",
                "Copyright (c) 1993-2004 by Sun Microsystems, Inc.",
                "Copyright (c) 1994 X Consortium",
                "Copyright (c) 1994-2006 Sun Microsystems Inc.",
                "Copyright (c) 1994-2021 Free Software Foundation, Inc.",
                "Copyright (c) 1995, 1996, 1997, and 1998 WIDE Project",
                "Copyright (c) 1995-1998 Eric A. Young, Tim J. Hudson",
                "Copyright (c) 1995-2001 Corporation for National Research Initiatives",
                "Copyright (c) 1995-2003, 2010 Mark Adler",
                "Copyright (c) 1995-2003, 2010, 2014, 2016 Jean-loup Gailly, Mark Adler",
                "Copyright (c) 1995-2005, 2010 Mark Adler",
                "Copyright (c) 1995-2005, 2014, 2016 Jean-loup Gailly, Mark Adler",
                "Copyright (c) 1995-2006, 2010, 2011, 2012, 2016 Mark Adler",
                "Copyright (c) 1995-2011, 2016 Mark Adler",
                "Copyright (c) 1995-2016 International Business Machines Corporation and others",
                "Copyright (c) 1995-2016 Jean-loup Gailly",
                "Copyright (c) 1995-2016 Jean-loup Gailly, Mark Adler",
                "Copyright (c) 1995-2016 Mark Adler",
                "Copyright (c) 1995-2017 Jean-loup Gailly",
                "Copyright (c) 1995-2017 Jean-loup Gailly and Mark Adler",
                "Copyright (c) 1995-2017 Mark Adler",
                "Copyright (c) 1995-2018 Jean-loup Gailly",
                "Copyright (c) 1995-2019 Mark Adler",
                "Copyright (c) 1995-2021 Jean-loup Gailly",
                "Copyright (c) 1995-2022 Jean-loup Gailly and Mark Adler",
                "Copyright (c) 1995-2022 Jean-loup Gailly, Mark Adler",
                "Copyright (c) 1995-2022 Mark Adler",
                "Copyright (c) 1996 Henri Torgemane",
                "Copyright (c) 1996,1999 by Internet Software Consortium",
                "Copyright (c) 1996-1999 by Internet Software Consortium",
                "Copyright (c) 1996-2001, 2003-2019, 2021-2022 Free Software Foundation, Inc.",
                "Copyright (c) 1996-2008, International Business Machines Corporation and others",
                "Copyright (c) 1996-2012, International Business Machines Corporation and others",
                "Copyright (c) 1996-2013, International Business Machines Corporation and others",
                "Copyright (c) 1996-2014, International Business Machines Corporation and others",
                "Copyright (c) 1996-2015, International Business Machines Corporation and others",
                "Copyright (c) 1996-2016 Free Software Foundation, Inc.",
                "Copyright (c) 1996-2016, International Business Machines Corporation and others",
                "Copyright (c) 1996-2019, 2021-2022 Free Software Foundation, Inc.",
                "Copyright (c) 1996-2021 Free Software Foundation, Inc.",
                "Copyright (c) 1997-2005, International Business Machines Corporation and others",
                "Copyright (c) 1997-2006, International Business Machines Corporation and others",
                "Copyright (c) 1997-2007 University of Cambridge",
                "Copyright (c) 1997-2009,2014 International Business Machines Corporation and others",
                "Copyright (c) 1997-2010, International Business Machines Corporation and others",
                "Copyright (c) 1997-2011, International Business Machines Corporation and others",
                "Copyright (c) 1997-2011,2014-2015 International Business Machines Corporation and others",
                "Copyright (c) 1997-2012, International Business Machines Corporation and others",
                "Copyright (c) 1997-2013, International Business Machines Corporation and others",
                "Copyright (c) 1997-2014, International Business Machines Corporation and others",
                "Copyright (c) 1997-2015, International Business Machines Corporation and others",
                "Copyright (c) 1997-2016, International Business Machines Corporation and others",
                "Copyright (c) 1997-2021 Free Software Foundation, Inc.",
                "Copyright (c) 1998 - 2010 Gilles Vollant, Even Rouault, Mathias Svensson",
                "Copyright (c) 1998 - 2014, Daniel Stenberg, <daniel@haxx.se>",
                "Copyright (c) 1998-2004, International Business Machines Corporation and others",
                "Copyright (c) 1998-2005 Gilles Vollant",
                "Copyright (c) 1998-2005, International Business Machines Corporation and others",
                "Copyright (c) 1998-2008, International Business Machines Corporation and others",
                "Copyright (c) 1998-2010 Gilles Vollant (minizip) http://www.winimage.com/zLibDll/minizip.html",
                "Copyright (c) 1998-2011, International Business Machines Corporation and others",
                "Copyright (c) 1998-2012, International Business Machines Corporation and others",
                "Copyright (c) 1998-2014, International Business Machines Corporation and others",
                "Copyright (c) 1998-2015, International Business Machines Corporation and others",
                "Copyright (c) 1998-2016, International Business Machines Corporation and others",
                "Copyright (c) 1998-2022 The OpenSSL Project",
                "Copyright (c) 1999 Computer Systems and Communication Lab, Institute of Information Science, Academia Sinica",
                "Copyright (c) 1999 Pai-Hsiang Hsiao",
                "Copyright (c) 1999 TaBE Project",
                "Copyright (c) 1999-2001 Gregory P. Ward",
                "Copyright (c) 1999-2001, International Business Machines Corporation and others",
                "Copyright (c) 1999-2004, International Business Machines Corporation and others",
                "Copyright (c) 1999-2005, International Business Machines Corporation and others",
                "Copyright (c) 1999-2006, International Business Machines Corporation and others",
                "Copyright (c) 1999-2006,2013 IBM Corp.",
                "Copyright (c) 1999-2007, International Business Machines Corporation and others",
                "Copyright (c) 1999-2009, International Business Machines Corporation and others",
                "Copyright (c) 1999-2010, International Business Machines Corporation and others",
                "Copyright (c) 1999-2011, International Business Machines Corporation and others",
                "Copyright (c) 1999-2012, International Business Machines Corporation and others",
                "Copyright (c) 1999-2013, International Business Machines Corporation and others",
                "Copyright (c) 1999-2014 International Business Machines Corporation and others",
                "Copyright (c) 1999-2014, International Business Machines Corporation and others",
                "Copyright (c) 1999-2015 International Business Machines Corporation and others",
                "Copyright (c) 1999-2015, International Business Machines Corporation and others",
                "Copyright (c) 1999-2016 International Business Machines Corporation and others",
                "Copyright (c) 1999-2016, International Business Machines Corporation and others",
                "Copyright (c) 1999-2016, International Business Machines s Corporation and others",
                "Copyright (c) 1999-2021 Free Software Foundation, Inc.",
                "Copyright (c) 2000, International Business Machines Corporation and others",
                "Copyright (c) 2000-2003, International Business Machines Corporation and others",
                "Copyright (c) 2000-2004, International Business Machines Corporation and others",
                "Copyright (c) 2000-2005, International Business Machines Corporation and others",
                "Copyright (c) 2000-2006, International Business Machines Corporation and others",
                "Copyright (c) 2000-2006, The Perl Foundation",
                "Copyright (c) 2000-2007, International Business Machines Corporation and others",
                "Copyright (c) 2000-2010 Julian Seward",
                "Copyright (c) 2000-2010, International Business Machines Corporation and others",
                "Copyright (c) 2000-2011, International Business Machines Corporation and others",
                "Copyright (c) 2000-2012, International Business Machines Corporation and others",
                "Copyright (c) 2000-2013, International Business Machines Corporation and others",
                "Copyright (c) 2000-2015, International Business Machines Corporation and others",
                "Copyright (c) 2000-2016, International Business Machines Corporation and others",
                "Copyright (c) 2001, 2002, 2003, 2004, 2005, 2006, 2007, 2008, 2009, 2010, 2011, 2012, 2013, 2014, 2015, 2016, 2017, 2018 Python Software Foundation",
                "Copyright (c) 2001, 2002, 2003, 2004, 2005, 2006, 2007, 2008, 2009, 2010, 2011, 2012, 2013, 2014, 2015, 2016, 2017, 2018, 2019, 2020 Python Software Foundation",
                "Copyright (c) 2001, International Business Machines Corporation and others",
                "Copyright (c) 2001-2004 Idiap Research Institute (Ronan Collobert, Samy Bengio, Johnny Mariethoz)",
                "Copyright (c) 2001-2005, International Business Machines Corporation and others",
                "Copyright (c) 2001-2006, International Business Machines Corporation and others",
                "Copyright (c) 2001-2007, International Business Machines Corporation and others",
                "Copyright (c) 2001-2008, International Business Machines Corporation and others",
                "Copyright (c) 2001-2008,2010 IBM and others",
                "Copyright (c) 2001-2010 International Business Machines Corporation and others",
                "Copyright (c) 2001-2010, International Business Machines Corporation and others",
                "Copyright (c) 2001-2011 IBM and others",
                "Copyright (c) 2001-2011, International Business Machines Corporation",
                "Copyright (c) 2001-2011, International Business Machines Corporation and others",
                "Copyright (c) 2001-2011,2014 IBM and others",
                "Copyright (c) 2001-2012, International Business Machines Corporation and others",
                "Copyright (c) 2001-2013, International Business Machines Corporation and others",
                "Copyright (c) 2001-2014 IBM and others",
                "Copyright (c) 2001-2014, International Business Machines Corporation",
                "Copyright (c) 2001-2014, International Business Machines Corporation and others",
                "Copyright (c) 2001-2015 IBM and others",
                "Copyright (c) 2001-2015, International Business Machines Corporation and others",
                "Copyright (c) 2001-2016, International Business Machines Corporation and others",
                "Copyright (c) 2001-2021 Free Software Foundation, Inc.",
                "Copyright (c) 2002 The OpenTSA Project",
                "Copyright (c) 2002, 2003 Python Software Foundation",
                "Copyright (c) 2002, Oracle and/or its affiliates",
                "Copyright (c) 2002-$year International Business Machines Corporation",
                "Copyright (c) 2002-2003, International Business Machines Corporation and others",
                "Copyright (c) 2002-2004, International Business Machines Corporation and others",
                "Copyright (c) 2002-2005, International Business Machines Corporation and others",
                "Copyright (c) 2002-2006, International Business Machines Corporation and others",
                "Copyright (c) 2002-2007, International Business Machines Corporation and others",
                "Copyright (c) 2002-2008 International Business Machines Corporation and others",
                "Copyright (c) 2002-2008 Kris Kowal <http://cixar.com/~kris.kowal>",
                "Copyright (c) 2002-2008, International Business Machines Corporation and others",
                "Copyright (c) 2002-2010, International Business Machines Corporation and others",
                "Copyright (c) 2002-2011 International Business Machines Corporation and others",
                "Copyright (c) 2002-2011, International Business Machines Corporation and others",
                "Copyright (c) 2002-2012, International Business Machines Corporation and others",
                "Copyright (c) 2002-2013, International Business Machines Corporation and others",
                "Copyright (c) 2002-2014 International Business Machines Corporation and others",
                "Copyright (c) 2002-2014, International Business Machines Corporation and others",
                "Copyright (c) 2002-2015 International Business Machines Corporation and others",
                "Copyright (c) 2002-2015, International Business Machines Corporation and others",
                "Copyright (c) 2002-2016 International Business Machines Corporation",
                "Copyright (c) 2002-2016 International Business Machines Corporation and others",
                "Copyright (c) 2002-2016, International Business Machines Corporation and others",
                "Copyright (c) 2002-2017, and GNU",
                "Copyright (c) 2002-2021 Free Software Foundation, Inc.",
                "Copyright (c) 2003 - 2008, International Business Machines Corporation and others",
                "Copyright (c) 2003 - 2009, International Business Machines Corporation and others",
                "Copyright (c) 2003 - 2013, International Business Machines Corporation and others",
                "Copyright (c) 2003, International Business Machines Corporation and others",
                "Copyright (c) 2003-$year, print International Business Machines Corporation and others",
                "Copyright (c) 2003-2003, International Business Machines Corporation and others",
                "Copyright (c) 2003-2004, International Business Machines Corporation and others",
                "Copyright (c) 2003-2005 Tom Wu",
                "Copyright (c) 2003-2006, International Business Machines Corporation and others",
                "Copyright (c) 2003-2007, International Business Machines Corporation and others",
                "Copyright (c) 2003-2008, International Business Machines Corporation and others",
                "Copyright (c) 2003-2009, International Business Machines Corporation and others",
                "Copyright (c) 2003-2009,2012,2016 International Business Machines Corporation and others",
                "Copyright (c) 2003-2010 International Business Machines Corporation and others",
                "Copyright (c) 2003-2010, International Business Machines Corporation and others",
                "Copyright (c) 2003-2011, International Business Machines Corporation and others",
                "Copyright (c) 2003-2012, International Business Machines Corporation and others",
                "Copyright (c) 2003-2013, International Business Machines Corporation and others",
                "Copyright (c) 2003-2014, International Business Machines Corporation and others",
                "Copyright (c) 2003-2015, International Business Machines Corporation and others",
                "Copyright (c) 2003-2016, International Business Machines Corporation and others",
                "Copyright (c) 2003-2021 Free Software Foundation, Inc.",
                "Copyright (c) 2004 - 2008, International Business Machines Corporation and others",
                "Copyright (c) 2004 - 2011 by Daniel Stenberg",
                "Copyright (c) 2004 - 2012 by Daniel Stenberg",
                "Copyright (c) 2004 - 2013 by Daniel Stenberg",
                "Copyright (c) 2004 Kungliga Tekniska Hogskolan (Royal Institute of Technology, Stockholm, Sweden)",
                "Copyright (c) 2004 Scott James Remnant",
                "Copyright (c) 2004 Scott James Remnant <scott@netsplit.com>",
                "Copyright (c) 2004 by Daniel Stenberg",
                "Copyright (c) 2004 by Internet Systems Consortium, Inc.",
                "Copyright (c) 2004, 2005, 2010, 2011, 2012, 2013, 2016 Mark Adler",
                "Copyright (c) 2004, 2010 Mark Adler",
                "Copyright (c) 2004, 2011-2019, 2021-2022 Free Software Foundation, Inc.",
                "Copyright (c) 2004, 2018, Richard Levitte <richard@levitte.org>",
                "Copyright (c) 2004, EdelKey Project",
                "Copyright (c) 2004, International Business Machines Corporation and others",
                "Copyright (c) 2004, Richard Levitte <richard@levitte.org>",
                "Copyright (c) 2004-2005, 2007, 2009, 2011-2019, 2021-2022 Free Software Foundation, Inc.",
                "Copyright (c) 2004-2005, 2007-2008, 2011-2019, 2021-2022 Free Software Foundation, Inc.",
                "Copyright (c) 2004-2005, 2007-2009, 2011-2019, 2021-2022 Free Software Foundation, Inc.",
                "Copyright (c) 2004-2005, International Business Machines Corporation and others",
                "Copyright (c) 2004-2006, International Business Machines Corporation and others",
                "Copyright (c) 2004-2007, International Business Machines Corporation and others",
                "Copyright (c) 2004-2009 by Daniel Stenberg",
                "Copyright (c) 2004-2010 by Daniel Stenberg",
                "Copyright (c) 2004-2010, International Business Machines Corporation and others",
                "Copyright (c) 2004-2011 by Daniel Stenberg",
                "Copyright (c) 2004-2012, International Business Machines Corporation and others",
                "Copyright (c) 2004-2014 International Business Machines Corporation and others",
                "Copyright (c) 2004-2014, International Business Machines Corporation and others",
                "Copyright (c) 2004-2015, International Business Machines Corporation and others",
                "Copyright (c) 2004-2016, International Business Machines Corporation and others",
                "Copyright (c) 2004-2017 Mark Adler",
                "Copyright (c) 2004-2017 by Daniel Stenberg",
                "Copyright (c) 2004-2019 Mark Adler",
                "Copyright (c) 2004-2019, 2021 Bootstrap",
                "Copyright (c) 2004-2021 Free Software Foundation, Inc.",
                "Copyright (c) 2005 - 2010, Daniel Stenberg",
                "Copyright (c) 2005 Tom Wu",
                "Copyright (c) 2005 by Dominick Meglio",
                "Copyright (c) 2005, 2006, 2007, 2008, 2009 Apple Inc.",
                "Copyright (c) 2005, 2013 by Dominick Meglio",
                "Copyright (c) 2005, International Business Machines Corporation and others",
                "Copyright (c) 2005,O WISeKey,C CH Not Valid Before",
                "Copyright (c) 2005,O WISeKey,C CH Serial",
                "Copyright (c) 2005-2006, International Business Machines Corporation and others",
                "Copyright (c) 2005-2007, Nick Galbreath",
                "Copyright (c) 2005-2008, International Business Machines Corporation and others",
                "Copyright (c) 2005-2011, International Business Machines Corporation and others",
                "Copyright (c) 2005-2012 Intel Corporation",
                "Copyright (c) 2005-2012, International Business Machines Corporation and others",
                "Copyright (c) 2005-2013 by Daniel Stenberg",
                "Copyright (c) 2005-2013, International Business Machines Corporation and others",
                "Copyright (c) 2005-2014, International Business Machines Corporation and others",
                "Copyright (c) 2005-2015, International Business Machines Corporation and others",
                "Copyright (c) 2005-2016, International Business Machines Corporation and others",
                "Copyright (c) 2005-2017 Intel Corporation",
                "Copyright (c) 2005-2019 Intel Corporation",
                "Copyright (c) 2006 Apple Computer, Inc.",
                "Copyright (c) 2006 Idiap Research Institute",
                "Copyright (c) 2006 International Business Machines Corporation and others",
                "Copyright (c) 2006, International Business Machines Corporation and others",
                "Copyright (c) 2006, Ivan Sagalaev",
                "Copyright (c) 2006, Network Resonance, Inc.",
                "Copyright (c) 2006-2008 Diego Petteno",
                "Copyright (c) 2006-2008 xine project",
                "Copyright (c) 2006-2008, Google Inc.",
                "Copyright (c) 2006-2010 NEC Laboratories America (Ronan Collobert, Leon Bottou, Iain Melvin, Jason Weston)",
                "Copyright (c) 2006-2012, International Business Machines Corporation and others",
                "Copyright (c) 2006-2014, International Business Machines Corporation and others",
                "Copyright (c) 2006-2016, International Business Machines Corporation and others",
                "Copyright (c) 2006-2021 Free Software Foundation, Inc.",
                "Copyright (c) 2007 - 2018, Daniel Stenberg",
                "Copyright (c) 2007 Apple Inc.",
                "Copyright (c) 2007 KISA(Korea Information Security Agency)",
                "Copyright (c) 2007, Google Inc.",
                "Copyright (c) 2007, International Business Machines Corporation and others",
                "Copyright (c) 2007-2008 Even Rouault",
                "Copyright (c) 2007-2008, International Business Machines Corporation and others",
                "Copyright (c) 2007-2010 Baptiste Lepilleur",
                "Copyright (c) 2007-2010 by Baptiste Lepilleur",
                "Copyright (c) 2007-2012, International Business Machines Corporation and others",
                "Copyright (c) 2007-2013 by Daniel Stenberg",
                "Copyright (c) 2007-2013, International Business Machines Corporation and others",
                "Copyright (c) 2007-2014, International Business Machines Corporation and others",
                "Copyright (c) 2007-2015, International Business Machines Corporation and others",
                "Copyright (c) 2007-2016, International Business Machines Corporation and others",
                "Copyright (c) 2008 - 2009 by Daniel Stenberg",
                "Copyright (c) 2008 - 2012 by Daniel Stenberg",
                "Copyright (c) 2008 - 2013 by Daniel Stenberg",
                "Copyright (c) 2008 Andy Polyakov <appro@openssl.org>",
                "Copyright (c) 2008 Apple Inc.",
                "Copyright (c) 2008 Benjamin Kosnik <bkoz@redhat.com>",
                "Copyright (c) 2008 John Darrington <j.darrington@elvis.murdoch.edu.au>",
                "Copyright (c) 2008 Steven G. Johnson <stevenj@alum.mit.edu>",
                "Copyright (c) 2008 Tom Howard <tomhoward@users.sf.net>",
                "Copyright (c) 2008 by Daniel Stenberg",
                "Copyright (c) 2008, Google, International Business Machines Corporation and others",
                "Copyright (c) 2008, International Business Machines Corporation and others",
                "Copyright (c) 2008-2009 Bjoern Hoehrmann <bjoern@hoehrmann.de>",
                "Copyright (c) 2008-2009, International Business Machines Corporation and others",
                "Copyright (c) 2008-2010 by Daniel Stenberg",
                "Copyright (c) 2008-2010, International Business Machines Corporation and others",
                "Copyright (c) 2008-2011, International Business Machines Corporation and others",
                "Copyright (c) 2008-2011, International Business Machines Corporation, Google and others",
                "Copyright (c) 2008-2012, International Business Machines Corporation and others",
                "Copyright (c) 2008-2013 by Daniel Stenberg",
                "Copyright (c) 2008-2013, International Business Machines Corporation and others",
                "Copyright (c) 2008-2014, Google, International Business Machines Corporation and others",
                "Copyright (c) 2008-2015, Google, International Business Machines Corporation and others",
                "Copyright (c) 2008-2015, International Business Machines Corporation and others",
                "Copyright (c) 2008-2016, International Business Machines Corporation and others",
                "Copyright (c) 2009 - 2021 by Daniel Stenberg",
                "Copyright (c) 2009 Allan Caffee <allan.caffee@gmail.com>",
                "Copyright (c) 2009 Google Inc.",
                "Copyright (c) 2009 Kazuhiko Arase",
                "Copyright (c) 2009 The Chromium Authors",
                "Copyright (c) 2009 Thomas Robinson <280north.com>",
                "Copyright (c) 2009 Tom Howard <tomhoward@users.sf.net>",
                "Copyright (c) 2009 by Jakub Hrozek <jhrozek@redhat.com>",
                "Copyright (c) 2009 by the Jinja Team",
                "Copyright (c) 2009, 2010, 2013-2016 by the Brotli Authors",
                "Copyright (c) 2009, International Business Machines Corporation and others",
                "Copyright (c) 2009-2010 Mathias Svensson http://result42.com",
                "Copyright (c) 2009-2010, Google, International Business Machines Corporation and others",
                "Copyright (c) 2009-2010, International Business Machines Corporation and others",
                "Copyright (c) 2009-2011, International Business Machines Corporation and others",
                "Copyright (c) 2009-2012, International Business Machines Corporation and others",
                "Copyright (c) 2009-2013 by Daniel Stenberg",
                "Copyright (c) 2009-2013, International Business Machines Corporation and others",
                "Copyright (c) 2009-2014 International Business Machines Corporation and others",
                "Copyright (c) 2009-2014, International Business Machines Corporation and others",
                "Copyright (c) 2009-2015, International Business Machines Corporation and others",
                "Copyright (c) 2009-2015, Kevin Decker <kpdecker@gmail.com>",
                "Copyright (c) 2009-2016, International Business Machines Corporation and others",
                "Copyright (c) 2009-2016, International Business Machines Corporation, Google, and others",
                "Copyright (c) 2009-2017, International Business Machines Corporation, Google, and others",
                "Copyright (c) 2009-2021 Free Software Foundation, Inc.",
                "Copyright (c) 2009-2021 by Daniel Stenberg",
                "Copyright (c) 2009-2023 Isaac Z. Schlueter and Contributors",
                "Copyright (c) 2010 - 2017, The Regents of the University of",
                "Copyright (c) 2010 Google Inc.",
                "Copyright (c) 2010 Jeremy Lal <kapouer@melix.org>",
                "Copyright (c) 2010 Jonathan Hartley",
                "Copyright (c) 2010 by Armin Ronacher and contributors",
                "Copyright (c) 2010, Google Inc.",
                "Copyright (c) 2010, International Business Machines Corporation and others",
                "Copyright (c) 2010, Yahoo! Inc.",
                "Copyright (c) 2010-2011 Google Inc.",
                "Copyright (c) 2010-2011, International Business Machines Corporation and others",
                "Copyright (c) 2010-2012 Mikeal Rogers",
                "Copyright (c) 2010-2012 by Daniel Stenberg",
                "Copyright (c) 2010-2012, International Business Machines Corporation and others",
                "Copyright (c) 2010-2012,2014, International Business Machines Corporation and others",
                "Copyright (c) 2010-2012,2015 International Business Machines Corporation and others",
                "Copyright (c) 2010-2013 by Daniel Stenberg",
                "Copyright (c) 2010-2013, International Business Machines Corporation and others",
                "Copyright (c) 2010-2014, International Business Machines Corporation and others",
                "Copyright (c) 2010-2015, International Business Machines Corporation and others",
                "Copyright (c) 2010-2016, International Business Machines Corporation and others",
                "Copyright (c) 2010-2017, The Regents of the University of California (Regents)",
                "Copyright (c) 2010-2019, 2021 Bootstrap",
                "Copyright (c) 2010-2020 Python Software Foundation",
                "Copyright (c) 2010-2023 Isaac Z. Schlueter and Contributors",
                "Copyright (c) 2011 Alexander Shtuchkin",
                "Copyright (c) 2011 Daniel Richard G. <skunk@iSKUNK.ORG>",
                "Copyright (c) 2011 Daniel Stenberg <daniel@haxx.se>",
                "Copyright (c) 2011 Dominic Tarr",
                "Copyright (c) 2011 Einar Otto Stangvik <einaros@gmail.com>",
                "Copyright (c) 2011 Free Software Foundation, Inc.",
                "Copyright (c) 2011 Google Inc.",
                "Copyright (c) 2011 TJ Holowaychuk <tj@vision-media.ca>",
                "Copyright (c) 2011 The Chromium Authors",
                "Copyright (c) 2011 Tim Koschutzki (tim@debuggable.com) Felix Geisendorfer (felix@debuggable.com)",
                "Copyright (c) 2011, 2016 Mark Adler",
                "Copyright (c) 2011, 2018 Ben Noordhuis <info@bnoordhuis.nl>",
                "Copyright (c) 2011, International Business Machines Corporation and others",
                "Copyright (c) 2011, RTFM, Inc.",
                "Copyright (c) 2011-2012 NEC Laboratories America (Koray Kavukcuoglu)",
                "Copyright (c) 2011-2012, International Business Machines Corporation and others",
                "Copyright (c) 2011-2013 NYU",
                "Copyright (c) 2011-2013, International Business Machines Corporation and others",
                "Copyright (c) 2011-2014 Idiap Research Institute",
                "Copyright (c) 2011-2014 International Business Machines Corporation and others",
                "Copyright (c) 2011-2014, International Business Machines Corporation and others",
                "Copyright (c) 2011-2015 Paul Vorbach <paul@vorba.ch>",
                "Copyright (c) 2011-2015 by Vitaly Puzrin",
                "Copyright (c) 2011-2015, International Business Machines Corporation and others",
                "Copyright (c) 2011-2016 Heather Arthur <fayearthur@gmail.com>",
                "Copyright (c) 2011-2016, International Business Machines Corporation and others",
                "Copyright (c) 2011-2017 JP Richardson",
                "Copyright (c) 2011-2021, Christopher Jeffrey. (MIT Licensed) https://github.com/markedjs/marked",
                "Copyright (c) 2011-2022 Isaac Z. Schlueter, Ben Noordhuis, and Contributors",
                "Copyright (c) 2011-2023 Isaac Z. Schlueter and Contributors",
                "Copyright (c) 2012 - 2015 fengmk2 <fengmk2@gmail.com>",
                "Copyright (c) 2012 Ariya Hidayat <ariya.hidayat@gmail.com>",
                "Copyright (c) 2012 Christian Persch",
                "Copyright (c) 2012 Dan Winship",
                "Copyright (c) 2012 Ecma International",
                "Copyright (c) 2012 Federico Romero",
                "Copyright (c) 2012 Google Inc.",
                "Copyright (c) 2012 International Business Machines Corporation and others",
                "Copyright (c) 2012 Isaac Z. Schlueter",
                "Copyright (c) 2012 James Halliday <mail@substack.net>",
                "Copyright (c) 2012 Marko Kreen <markokr@gmail.com>",
                "Copyright (c) 2012 Nathan Rajlich <nathan@tootallnate.net>",
                "Copyright (c) 2012 Paolo Borelli",
                "Copyright (c) 2012 Tatsuhiro Tsujikawa",
                "Copyright (c) 2012 The Chromium Authors",
                "Copyright (c) 2012 Tim Caswell",
                "Copyright (c) 2012 Xan Lopez",
                "Copyright (c) 2012 Zack Weinberg <zackw@panix.com>",
                "Copyright (c) 2012 by Gilles Chehade <gilles@openbsd.org>",
                "Copyright (c) 2012 by Jun Woong",
                "Copyright (c) 2012 nghttp2 contributors",
                "Copyright (c) 2012, 2013 Tatsuhiro Tsujikawa",
                "Copyright (c) 2012, 2013 Thorsten Lorenz <thlorenz@gmx.de>",
                "Copyright (c) 2012, 2013, 2014 Gil Tene",
                "Copyright (c) 2012, 2014, 2015, 2016 Tatsuhiro Tsujikawa",
                "Copyright (c) 2012, 2014, 2015, 2016 nghttp2 contributors",
                "Copyright (c) 2012, 2016 Philip Withnall",
                "Copyright (c) 2012, Ben Noordhuis <info@bnoordhuis.nl>",
                "Copyright (c) 2012, Intel Corporation",
                "Copyright (c) 2012,2014 International Business Machines Corporation and others",
                "Copyright (c) 2012-2013 Ecma International",
                "Copyright (c) 2012-2013 Yusuke Suzuki (twitter Constellation) and other contributors",
                "Copyright (c) 2012-2013 Yusuke Suzuki <utatane.tea@gmail.com>",
                "Copyright (c) 2012-2014 Andris Reinman",
                "Copyright (c) 2012-2014 Daniel J. Bernstein",
                "Copyright (c) 2012-2014 Deepmind Technologies",
                "Copyright (c) 2012-2014 Federico Romero",
                "Copyright (c) 2012-2014 Isaac Z. Schlueter",
                "Copyright (c) 2012-2014 Yusuke Suzuki <utatane.tea@gmail.com>",
                "Copyright (c) 2012-2014 by various contributors",
                "Copyright (c) 2012-2014, International Business Machines Corporation and others",
                "Copyright (c) 2012-2015 Dan Nicholson",
                "Copyright (c) 2012-2015 Dan Nicholson <dbn.lists@gmail.com>",
                "Copyright (c) 2012-2015, International Business Machines Corporation and others",
                "Copyright (c) 2012-2016 Jean-Philippe Aumasson",
                "Copyright (c) 2012-2016, International Business Machines Corporation and others",
                "Copyright (c) 2012-2017 by Ingvar Stepanyan",
                "Copyright (c) 2012-2018 Aseem Kishore, and others",
                "Copyright (c) 2012-2018 by various contributors",
                "Copyright (c) 2012-2020 by various contributors",
                "Copyright (c) 2012-2022 by various contributors",
                "Copyright (c) 2013 Alex Seville <hi@alexanderseville.com>",
                "Copyright (c) 2013 Arnout Kazemier and contributors",
                "Copyright (c) 2013 Brian Eugene Wilson, Robert Martin Campbell",
                "Copyright (c) 2013 Daniel Stenberg <daniel@haxx.se>",
                "Copyright (c) 2013 Dariusz Dwornikowski",
                "Copyright (c) 2013 Google Inc.",
                "Copyright (c) 2013 Intel Corporation",
                "Copyright (c) 2013 Intel Corporation + Authors",
                "Copyright (c) 2013 Intel Corporation Jim Kukunas",
                "Copyright (c) 2013 James Halliday",
                "Copyright (c) 2013 Josh Glazebrook",
                "Copyright (c) 2013 Julian Gruber <julian@juliangruber.com>",
                "Copyright (c) 2013 Kael Zhang <i@kael.me> , contributors http://kael.me",
                "Copyright (c) 2013 Ramesh Nair (http://www.hiddentao.com/)",
                "Copyright (c) 2013 Raynos",
                "Copyright (c) 2013 Roman Shtylman <shtylman@gmail.com>",
                "Copyright (c) 2013 Roy Stogner <roystgnr@ices.utexas.edu>",
                "Copyright (c) 2013 Tatsuhiro Tsujikawa",
                "Copyright (c) 2013 The Chromium Authors",
                "Copyright (c) 2013 Thiago de Arruda",
                "Copyright (c) 2013 Tim Oxley",
                "Copyright (c) 2013 Yusuke Suzuki <utatane.tea@gmail.com>",
                "Copyright (c) 2013 by Daniel Stenberg",
                "Copyright (c) 2013 by Mark Jason Dominus <mjd@cpan.org>",
                "Copyright (c) 2013 nghttp2 contributors",
                "Copyright (c) 2013, 2014 Tatsuhiro Tsujikawa",
                "Copyright (c) 2013, Ben Noordhuis <info@bnoordhuis.nl>",
                "Copyright (c) 2013, International Business Machines Corporation and others",
                "Copyright (c) 2013, Joel Feenstra",
                "Copyright (c) 2013, LeRoy Benjamin Sharon",
                "Copyright (c) 2013-2014 Timo Teras <timo.teras@gmail.com>",
                "Copyright (c) 2013-2014 Yusuke Suzuki <utatane.tea@gmail.com>",
                "Copyright (c) 2013-2014, International Business Machines Corporation and others",
                "Copyright (c) 2013-2015, International Business Machines Corporation and others",
                "Copyright (c) 2013-2016, International Business Machines Corporation and others",
                "Copyright (c) 2013-2017 Josh Glazebrook",
                "Copyright (c) 2013-2019, Alfred Klomp",
                "Copyright (c) 2014",
                "Copyright (c) 2014 Dave Justice",
                "Copyright (c) 2014 Federico Romero",
                "Copyright (c) 2014 Free Software Foundation, Inc.",
                "Copyright (c) 2014 Google Inc.",
                "Copyright (c) 2014 IBM Corporation and Others",
                "Copyright (c) 2014 IndigoUnited",
                "Copyright (c) 2014 Intel Corporation",
                "Copyright (c) 2014 International Business Machines Corporation and others",
                "Copyright (c) 2014 Ivan Nikulin <ifaaan@gmail.com>",
                "Copyright (c) 2014 James Talmage <james.talmage@jrtechnical.com>",
                "Copyright (c) 2014 Jameson Little",
                "Copyright (c) 2014 Matt Warren",
                "Copyright (c) 2014 Michael Barker",
                "Copyright (c) 2014 Mike Frysinger <vapier@gentoo.org>",
                "Copyright (c) 2014 Nathan Rajlich <nathan@tootallnate.net>",
                "Copyright (c) 2014 Petka Antonov 2015 Sindre Sorhus",
                "Copyright (c) 2014 Robin Berjon",
                "Copyright (c) 2014 Sergii Iavorskyi",
                "Copyright (c) 2014 Tatsuhiro Tsujikawa",
                "Copyright (c) 2014 Thiago de Arruda <tpadilha84@gmail.com>",
                "Copyright (c) 2014 Yusuke Suzuki <utatane.tea@gmail.com>",
                "Copyright (c) 2014 nghttp2 contributors",
                "Copyright (c) 2014 the Dart project",
                "Copyright (c) 2014, 2015 Google Inc.",
                "Copyright (c) 2014, 2015, 2016, 2017, 2018 Simon Lydell",
                "Copyright (c) 2014, Ben Noordhuis <info@bnoordhuis.nl>",
                "Copyright (c) 2014, Intel Corporation",
                "Copyright (c) 2014, International Business Machines Corporation and others",
                "Copyright (c) 2014, Rebecca Turner <me@re-becca.org>",
                "Copyright (c) 2014, StrongLoop Inc.",
                "Copyright (c) 2014- Facebook, Inc",
                "Copyright (c) 2014-2015 Douglas Christopher Wilson",
                "Copyright (c) 2014-2015, International Business Machines Corporation and others",
                "Copyright (c) 2014-2016, International Business Machines Corporation and others",
                "Copyright (c) 2014-2016, Jon Schlinkert",
                "Copyright (c) 2014-2017 TJ Holowaychuk <tj@vision-media.ca>",
                "Copyright (c) 2014-2017, Jon Schlinkert",
                "Copyright (c) 2014-2018 Douglas Christopher Wilson",
                "Copyright (c) 2014-2023, Jon Schlinkert",
                "Copyright (c) 2014-present Sebastian McKenzie and other contributors",
                "Copyright (c) 2014-present, Facebook, Inc.",
                "Copyright (c) 2015 CloudFlare, Inc.",
                "Copyright (c) 2015 Dmitry Ivanov",
                "Copyright (c) 2015 Douglas Christopher Wilson",
                "Copyright (c) 2015 Elijah Insua",
                "Copyright (c) 2015 Enrico M. Crisostomo <enrico.m.crisostomo@gmail.com>",
                "Copyright (c) 2015 Free Software Foundation, Inc.",
                "Copyright (c) 2015 International Business Machines Corporation and others",
                "Copyright (c) 2015 Julian Gruber <julian@juliangruber.com>",
                "Copyright (c) 2015 Kevin Decker",
                "Copyright (c) 2015 Kyle E. Mitchell",
                "Copyright (c) 2015 Matteo Collina",
                "Copyright (c) 2015 Moritz Klammler <moritz@klammler.eu>",
                "Copyright (c) 2015 Paul Norman <penorman@mac.com>",
                "Copyright (c) 2015 Rich Harris",
                "Copyright (c) 2015 Roy Riojas",
                "Copyright (c) 2015 Saul Ibarra Corretge <saghul@gmail.com>",
                "Copyright (c) 2015 TJ Holowaychuk <tj@vision-media.ca>",
                "Copyright (c) 2015 Tatsuhiro Tsujikawa",
                "Copyright (c) 2015 Titus Wormer",
                "Copyright (c) 2015 Titus Wormer <tituswormer@gmail.com>",
                "Copyright (c) 2015 Toru Nagashima",
                "Copyright (c) 2015 Yusuke Suzuki <utatane.tea@gmail.com>",
                "Copyright (c) 2015 nghttp2 contributors",
                "Copyright (c) 2015 the V8 project authors",
                "Copyright (c) 2015, 2019 Elan Shanker, 2021 Blaine Bublitz <blaine.bublitz@gmail.com> , Eric Schoffstall <yo@contra.io> and other contributors",
                "Copyright (c) 2015, Ben Noordhuis <info@bnoordhuis.nl>",
                "Copyright (c) 2015, CloudFlare, Inc.",
                "Copyright (c) 2015, Contributors",
                "Copyright (c) 2015, International Business Machines Corporation and others",
                "Copyright (c) 2015, Rebecca Turner",
                "Copyright (c) 2015, Rebecca Turner <me@re-becca.org>",
                "Copyright (c) 2015, npm, Inc",
                "Copyright (c) 2015,2018 Bastien ROUCARIES",
                "Copyright (c) 2015-2016, International Business Machines Corporation and others",
                "Copyright (c) 2015-2017 Evgeny Poberezkin",
                "Copyright (c) 2015-2017, Wojciech Mula",
                "Copyright (c) 2015-2018, Jon Schlinkert",
                "Copyright (c) 2015-2020, Matteo Collina <matteo.collina@gmail.com>",
                "Copyright (c) 2015-2023 Benjamin Coe, Isaac Z. Schlueter, and Contributors",
                "Copyright (c) 2015-2023 Isaac Z. Schlueter and Contributors",
                "Copyright (c) 2015-present libuv project contributors",
                "Copyright (c) 2016 Ben Noordhuis <info@bnoordhuis.nl>",
                "Copyright (c) 2016 David Frank",
                "Copyright (c) 2016 Jean-Philippe Aumasson <jeanphilippe.aumasson@gmail.com>",
                "Copyright (c) 2016 Luigi Pinca and contributors",
                "Copyright (c) 2016 Tatsuhiro Tsujikawa",
                "Copyright (c) 2016 The Chromium Authors",
                "Copyright (c) 2016 The WebRTC project authors",
                "Copyright (c) 2016 Titus Wormer <tituswormer@gmail.com>",
                "Copyright (c) 2016 Viktor Dukhovni <openssl-users@dukhovni.org>",
                "Copyright (c) 2016 Zeit, Inc.",
                "Copyright (c) 2016 and later Unicode, Inc. and others",
                "Copyright (c) 2016 angus croll",
                "Copyright (c) 2016 by Daniel Stenberg",
                "Copyright (c) 2016 nghttp2 contributors",
                "Copyright (c) 2016 ngtcp2 contributors",
                "Copyright (c) 2016, 2018 Krzesimir Nowak <qdlacz@gmail.com>",
                "Copyright (c) 2016, Contributors",
                "Copyright (c) 2016, International Business Machines Corporation and others",
                "Copyright (c) 2016- Facebook, Inc",
                "Copyright (c) 2016-2017 Thomas Watson Steen",
                "Copyright (c) 2016-2017, Matthieu Darbois",
                "Copyright (c) 2016-2023 Thomas Watson Steen",
                "Copyright (c) 2017 - 2018 by Christian Ammer",
                "Copyright (c) 2017 ARM, Inc.",
                "Copyright (c) 2017 Evgeny Poberezkin",
                "Copyright (c) 2017 Joseph Wynn",
                "Copyright (c) 2017 National Security Research Institute",
                "Copyright (c) 2017 Sergey Rubanov (https://github.com/chicoxyzzy)",
                "Copyright (c) 2017 Toru Nagashima",
                "Copyright (c) 2017 by John Schember",
                "Copyright (c) 2017 by John Schember <john@nachtimwald.com>",
                "Copyright (c) 2017 nghttp2 contributors",
                "Copyright (c) 2017 ngtcp2 contributors",
                "Copyright (c) 2017 the V8 project authors",
                "Copyright (c) 2017, Oracle and/or its affiliates",
                "Copyright (c) 2017, Rebecca Turner <me@re-becca.org>",
                "Copyright (c) 2017-2020 Intel Corporation",
                "Copyright (c) 2017-2022 npm, Inc., Isaac Z. Schlueter, and Contributors",
                "Copyright (c) 2017-2023 npm, Inc., Isaac Z. Schlueter, and Contributors",
                "Copyright (c) 2018 Agoric",
                "Copyright (c) 2018 Intel Corporation",
                "Copyright (c) 2018 Made With MOXY Lda",
                "Copyright (c) 2018 Nikita Skovoroda <chalkerx@gmail.com>",
                "Copyright (c) 2018 The Android Open Source Project",
                "Copyright (c) 2018 Toru Nagashima",
                "Copyright (c) 2018 and later Unicode, Inc. and others",
                "Copyright (c) 2018 by John Schember <john@nachtimwald.com>",
                "Copyright (c) 2018 nghttp3 contributors",
                "Copyright (c) 2018 ngtcp2 contributors",
                "Copyright (c) 2018, Gajus Kuizinas (http://gajus.com/)",
                "Copyright (c) 2018, Oracle and/or its affiliates",
                "Copyright (c) 2018-2019, Oracle and/or its affiliates",
                "Copyright (c) 2018-2020 Guy Bedford",
                "Copyright (c) 2018-2020, Andrea Giammarchi",
                "Copyright (c) 2018-2020, Oracle and/or its affiliates",
                "Copyright (c) 2018-2021 Josh Junon",
                "Copyright (c) 2018-2021, Andrea Giammarchi",
                "Copyright (c) 2019 Colin Ihrig and Contributors",
                "Copyright (c) 2019 Enji Cooper <yaneurabeya@gmail.com>",
                "Copyright (c) 2019 Intel Corporation",
                "Copyright (c) 2019 Marc Stevens <marc.stevens@cwi.nl>",
                "Copyright (c) 2019 Refael Ackeramnn <refack@gmail.com>",
                "Copyright (c) 2019 Sindre Sorhus <sindresorhus@gmail.com> (https://sindresorhus.com), Paul Miller (https://paulmillr.com)",
                "Copyright (c) 2019 Ujjwal Sharma <usharma1998@gmail>",
                "Copyright (c) 2019 by Andrew Selivanov",
                "Copyright (c) 2019 nghttp3 contributors",
                "Copyright (c) 2019 ngtcp2 contributors",
                "Copyright (c) 2019, Human Who Codes",
                "Copyright (c) 2019, Oracle and/or its affiliates",
                "Copyright (c) 2019-2020, Oracle and/or its affiliates",
                "Copyright (c) 2020 Ethan Arrowood",
                "Copyright (c) 2020 Jason Merrill <jason@redhat.com>",
                "Copyright (c) 2020 Kasper Unn Weihe",
                "Copyright (c) 2020 Nathan Rajlich",
                "Copyright (c) 2020 Node.js contributors",
                "Copyright (c) 2020 Titus Wormer <tituswormer@gmail.com>",
                "Copyright (c) 2020 Vercel, Inc.",
                "Copyright (c) 2020 argparse.js authors",
                "Copyright (c) 2020 ngtcp2 contributors",
                "Copyright (c) 2020, Intel Corporation",
                "Copyright (c) 2021 Alexey Raspopov, Kostiantyn Denysov, Anton Verinov",
                "Copyright (c) 2021 Brett Zamir",
                "Copyright (c) 2021 Free Software Foundation, Inc.",
                "Copyright (c) 2021 Jorn Heusipp <osmanx@problemloesungsmaschine.de>",
                "Copyright (c) 2021 Permission",
                "Copyright (c) 2021 Simon Seyock",
                "Copyright (c) 2021 by Brad House",
                "Copyright (c) 2021 libuv project",
                "Copyright (c) 2021 ngtcp2 contributors",
                "Copyright (c) 2022 GitHub and the TUF Contributors",
                "Copyright (c) 2022 Postman, Inc",
                "Copyright (c) 2022 Sindre Sorhus",
                "Copyright (c) 2022 The Chromium Authors",
                "Copyright (c) 2022 nghttp2 contributors",
                "Copyright (c) 2022 nghttp3 contributors",
                "Copyright (c) 2022 ngtcp2 contributors",
                "Copyright (c) < <2012> > < >",
                "Copyright (c) Ben Briggs <beneb.info@gmail.com> (http://beneb.info)",
                "Copyright (c) Corepack contributors",
                "Copyright (c) DABH (https://github.com/DABH)",
                "Copyright (c) Denis Malinochkin",
                "Copyright (c) Feross Aboukhadijeh",
                "Copyright (c) Feross Aboukhadijeh, and other contributors",
                "Copyright (c) George Zahariev",
                "Copyright (c) GitHub Inc.",
                "Copyright (c) GitHub, Inc.",
                "Copyright (c) IBM Corporation and Others",
                "Copyright (c) IBM Corporation, 2000-2010",
                "Copyright (c) IBM Corporation, 2000-2011",
                "Copyright (c) IBM Corporation, 2000-2012",
                "Copyright (c) IBM Corporation, 2000-2014",
                "Copyright (c) IBM Corporation, 2000-2016",
                "Copyright (c) International Business Machines Corporation and others",
                "Copyright (c) Isaac Z. Schlueter",
                "Copyright (c) Isaac Z. Schlueter and Contributors",
                "Copyright (c) Isaac Z. Schlueter, Kat Marchan, npm, Inc., and Contributors",
                "Copyright (c) Kevin Martensson <kevinmartensson@gmail.com>",
                "Copyright (c) Luke Edwards <luke.edwards05@gmail.com> (lukeed.com)",
                "Copyright (c) Marak Squires",
                "Copyright (c) Mathias Pettersson and Brian Hammond",
                "Copyright (c) Matteo Collina and Undici contributors",
                "Copyright (c) Meryn Stol 'Author",
                "Copyright (c) Microsoft Corporation",
                "Copyright (c) Open JS Foundation",
                "Copyright (c) Paul Johnston 1999 - 2002",
                "Copyright (c) Paul Johnston 1999 - 2002. Other contributors Greg Holt, Andrew Kepert, Ydnar, Lostinet",
                "Copyright (c) Robert Kowalski",
                "Copyright (c) Robert Kowalski and Isaac Z. Schlueter 'Authors",
                "Copyright (c) Shannon Moeller <me@shannonmoeller.com> (shannonmoeller.com)",
                "Copyright (c) Sindre Sorhus <sindresorhus@gmail.com> (https://sindresorhus.com)",
                "Copyright (c) Sindre Sorhus <sindresorhus@gmail.com> (https:/sindresorhus.com)",
                "Copyright (c) Sindre Sorhus <sindresorhus@gmail.com> (sindresorhus.com)",
                "Copyright (c) The Regents of the University of California",
                "Copyright (c) Tjarda Koster, https://jelloween.deviantart.com",
                "Copyright (c) and later Unicode, Inc.",
                "Copyright (c) jQuery Foundation, Inc. and Contributors",
                "Copyright (c) node-modules and other contributors",
                "Copyright (c) npm Inc.",
                "Copyright (c) npm, Inc.",
                "Copyright (c) npm, Inc. and Contributors",
                "Copyright (c) silverwind",
                "Copyright 1991 by the Massachusetts Institute of Technology",
                "Copyright 1992-2022 Free Software Foundation, Inc.",
                "Copyright 1995-$YEAR The OpenSSL Project Authors",
                "Copyright 1995-2016 The OpenSSL Project Authors",
                "Copyright 1995-2017 Jean-loup Gailly and Mark Adler",
                "Copyright 1995-2017 Mark Adler",
                "Copyright 1995-2017 The OpenSSL Project Authors",
                "Copyright 1995-2018 The OpenSSL Project Authors",
                "Copyright 1995-2019 The OpenSSL Project Authors",
                "Copyright 1995-2020 The OpenSSL Project Authors",
                "Copyright 1995-2021 The OpenSSL Project Authors",
                "Copyright 1995-2022 Jean-loup Gailly and Mark Adler",
                "Copyright 1995-2022 Mark Adler",
                "Copyright 1995-2022 The OpenSSL Project Authors",
                "Copyright 1995-2023 The OpenSSL Project Authors",
                "Copyright 1996 Chih-Hao Tsai Beckman Institute, University of Illinois c-tsai4@uiuc.edu http://casper.beckman.uiuc.edu/~c-tsai4",
                "Copyright 1998 by Daniel Stenberg",
                "Copyright 1998 by the Massachusetts Institute of Technology",
                "Copyright 1998, 2000 by the Massachusetts Institute of Technology",
                "Copyright 1998, 2011 by the Massachusetts Institute of Technology",
                "Copyright 1998, 2011, 2013 by the Massachusetts Institute of Technology",
                "Copyright 1998-$YEAR The OpenSSL Authors",
                "Copyright 1998-$YEAR The OpenSSL Project Authors",
                "Copyright 1998-2004 Gilles Vollant - http://www.winimage.com/zLibDll",
                "Copyright 1998-2016 The OpenSSL Project Authors",
                "Copyright 1998-2017 The OpenSSL Project Authors",
                "Copyright 1998-2020 The OpenSSL Project Authors",
                "Copyright 1998-2021 The OpenSSL Project Authors",
                "Copyright 1998-2022 The OpenSSL Project Authors",
                "Copyright 1998-2023 The OpenSSL Project Authors",
                "Copyright 1999-$YEAR The OpenSSL Project Authors",
                "Copyright 1999-2016 The OpenSSL Project Authors",
                "Copyright 1999-2018 The OpenSSL Project Authors",
                "Copyright 1999-2020 The OpenSSL Project Authors",
                "Copyright 1999-2021 The OpenSSL Project Authors",
                "Copyright 1999-2022 The OpenSSL Project Authors",
                "Copyright 1999-2023 The OpenSSL Project Authors",
                "Copyright 2000 by the Massachusetts Institute of Technology",
                "Copyright 2000, 2001, 2002, 2003 Nara Institute of Science and Technology",
                "Copyright 2000-$YEAR The OpenSSL Project Authors",
                "Copyright 2000-2016 The OpenSSL Project Authors",
                "Copyright 2000-2017 The OpenSSL Project Authors",
                "Copyright 2000-2018 The OpenSSL Project Authors",
                "Copyright 2000-2019 The OpenSSL Project Authors",
                "Copyright 2000-2020 The OpenSSL Project Authors",
                "Copyright 2000-2021 The OpenSSL Project Authors",
                "Copyright 2000-2022 The OpenSSL Project Authors",
                "Copyright 2000-2023 The OpenSSL Project Authors",
                "Copyright 2001 and onwards Google Inc.",
                "Copyright 2001-2016 The OpenSSL Project Authors",
                "Copyright 2001-2017 The OpenSSL Project Authors",
                "Copyright 2001-2018 The OpenSSL Project Authors",
                "Copyright 2001-2020 The OpenSSL Project Authors",
                "Copyright 2001-2021 The OpenSSL Project Authors",
                "Copyright 2001-2022 The OpenSSL Project Authors",
                "Copyright 2001-2023 The OpenSSL Project Authors",
                "Copyright 2002 Niels Provos <provos@citi.umich.edu>",
                "Copyright 2002-2016 The OpenSSL Project Authors",
                "Copyright 2002-2018 The OpenSSL Project Authors",
                "Copyright 2002-2020 The OpenSSL Project Authors",
                "Copyright 2002-2021 The OpenSSL Project Authors",
                "Copyright 2002-2022 The OpenSSL Project Authors",
                "Copyright 2002-2023 The OpenSSL Project Authors",
                "Copyright 2003-2021 The OpenSSL Project Authors",
                "Copyright 2003-2022 The OpenSSL Project Authors",
                "Copyright 2003-2023 The OpenSSL Project Authors",
                "Copyright 2004 and onwards Google Inc.",
                "Copyright 2004 by Daniel Stenberg",
                "Copyright 2004-2014, Akamai Technologies",
                "Copyright 2004-2016 The OpenSSL Project Authors",
                "Copyright 2004-2017 The OpenSSL Project Authors",
                "Copyright 2004-2018 The OpenSSL Project Authors",
                "Copyright 2004-2020 The OpenSSL Project Authors",
                "Copyright 2004-2021 The OpenSSL Project Authors",
                "Copyright 2004-2022 The OpenSSL Project Authors",
                "Copyright 2004-2023 The OpenSSL Project Authors",
                "Copyright 2005 Dominick Meglio",
                "Copyright 2005 Nokia",
                "Copyright 2005 by Dominick Meglio",
                "Copyright 2005, 2006 Nick Galbreath",
                "Copyright 2005, Google Inc.",
                "Copyright 2005-2016 The OpenSSL Project Authors",
                "Copyright 2005-2018 The OpenSSL Project Authors",
                "Copyright 2005-2020 The OpenSSL Project Authors",
                "Copyright 2005-2021 The OpenSSL Project Authors",
                "Copyright 2005-2022 The OpenSSL Project Authors",
                "Copyright 2005-2023 The OpenSSL Project Authors",
                "Copyright 2006 NTT (Nippon Telegraph and Telephone Corporation)",
                "Copyright 2006, Google Inc.",
                "Copyright 2006-2008 the V8 project authors",
                "Copyright 2006-2009 the V8 project authors",
                "Copyright 2006-2011, the V8 project authors",
                "Copyright 2006-2013 the V8 project authors",
                "Copyright 2006-2016 The OpenSSL Project Authors",
                "Copyright 2006-2017 The OpenSSL Project Authors",
                "Copyright 2006-2018 The OpenSSL Project Authors",
                "Copyright 2006-2020 The OpenSSL Project Authors",
                "Copyright 2006-2021 The OpenSSL Project Authors",
                "Copyright 2006-2022 The OpenSSL Project Authors",
                "Copyright 2006-2023 The OpenSSL Project Authors",
                "Copyright 2007 Google Inc.",
                "Copyright 2007 Pallets",
                "Copyright 2007, Google Inc.",
                "Copyright 2007-2008 the V8 project authors",
                "Copyright 2007-2010 the V8 project authors",
                "Copyright 2007-2011 the V8 project authors",
                "Copyright 2007-2016 The OpenSSL Project Authors",
                "Copyright 2007-2018 The OpenSSL Project Authors",
                "Copyright 2007-2019 The OpenSSL Project Authors",
                "Copyright 2007-2020 The OpenSSL Project Authors",
                "Copyright 2007-2021 The OpenSSL Project Authors",
                "Copyright 2007-2022 The OpenSSL Project Authors",
                "Copyright 2007-2023 The OpenSSL Project Authors",
                "Copyright 2008 Fair Oaks Labs, Inc.",
                "Copyright 2008 Google Inc.",
                "Copyright 2008 the V8 project authors",
                "Copyright 2008, Google Inc.",
                "Copyright 2008-2009 the V8 project authors",
                "Copyright 2008-2016 The OpenSSL Project Authors",
                "Copyright 2008-2018 The OpenSSL Project Authors",
                "Copyright 2008-2020 The OpenSSL Project Authors",
                "Copyright 2008-2021 The OpenSSL Project Authors",
                "Copyright 2008-2022 The OpenSSL Project Authors",
                "Copyright 2008-2023 The OpenSSL Project Authors",
                "Copyright 2009 The Closure Library Authors",
                "Copyright 2009 The Go Authors",
                "Copyright 2009 the Sputnik authors",
                "Copyright 2009 the V8 project authors",
                "Copyright 2009-2010 the V8 project authors",
                "Copyright 2009-2020 The OpenSSL Project Authors",
                "Copyright 2009-2021 The OpenSSL Project Authors",
                "Copyright 2009-2022 The OpenSSL Project Authors",
                "Copyright 2009-2023 The OpenSSL Project Authors",
                "Copyright 2010 Google Inc.",
                "Copyright 2010 by Ben Greear <greearb@candelatech.com>",
                "Copyright 2010 the V8 project authors",
                "Copyright 2010-2015 the V8 project authors",
                "Copyright 2010-2016 The OpenSSL Project Authors",
                "Copyright 2010-2020 The OpenSSL Project Authors",
                "Copyright 2010-2021 The OpenSSL Project Authors",
                "Copyright 2010-2022 The OpenSSL Project Authors",
                "Copyright 2011 Gary Court",
                "Copyright 2011 Google Inc.",
                "Copyright 2011 The Chromium Authors",
                "Copyright 2011 by Google, Inc.",
                "Copyright 2011 the V8 project authors",
                "Copyright 2011-2016 The OpenSSL Project Authors",
                "Copyright 2011-2020 The OpenSSL Project Authors",
                "Copyright 2011-2021 The OpenSSL Project Authors",
                "Copyright 2011-2022 The OpenSSL Project Authors",
                "Copyright 2011-2023 The OpenSSL Project Authors",
                "Copyright 2012 Mozilla Corporation",
                "Copyright 2012 The Chromium Authors",
                "Copyright 2012 the V8 project authors",
                "Copyright 2012, Samuel Neves <sneves@dei.uc.pt>",
                "Copyright 2012-2015 Acorn",
                "Copyright 2012-2015 the V8 project authors",
                "Copyright 2012-2016 The OpenSSL Project Authors",
                "Copyright 2012-2020 The OpenSSL Project Authors",
                "Copyright 2012-2021 The OpenSSL Project Authors",
                "Copyright 2012-2022 The OpenSSL Project Authors",
                "Copyright 2012-2023 The OpenSSL Project Authors",
                "Copyright 2013 Google Inc.",
                "Copyright 2013 M. J. Dominus",
                "Copyright 2013 The Chromium Authors",
                "Copyright 2013 Thorsten Lorenz",
                "Copyright 2013 by the Jinja team",
                "Copyright 2013 the V8 project authors",
                "Copyright 2013-2016 Dulin Marat and other contributors",
                "Copyright 2013-2017 The OpenSSL Project Authors",
                "Copyright 2013-2018 The OpenSSL Project Authors",
                "Copyright 2013-2020 The OpenSSL Project Authors",
                "Copyright 2013-2021 The OpenSSL Project Authors",
                "Copyright 2013-2022 The OpenSSL Project Authors",
                "Copyright 2013-2023 The OpenSSL Project Authors",
                "Copyright 2014 Andrey Sitnik <andrey@sitnik.ru> and other contributors",
                "Copyright 2014 Cryptography Research, Inc.",
                "Copyright 2014 Google Inc.",
                "Copyright 2014 Kevin Decker <https://github.com/kpdecker/six-speed/>",
                "Copyright 2014 The Chromium Authors",
                "Copyright 2014 by Sam Mikes",
                "Copyright 2014 the V8 project authors",
                "Copyright 2014, 2015, 2016, 2017, 2018 Simon Lydell",
                "Copyright 2014, the V8 project authors",
                "Copyright 2014-2015 Sebastian McKenzie <sebmck@gmail.com>",
                "Copyright 2014-2015 the V8 project authors",
                "Copyright 2014-2015 various",
                "Copyright 2014-2016 Cryptography Research, Inc.",
                "Copyright 2014-2016 The OpenSSL Project Authors",
                "Copyright 2014-2017 The OpenSSL Project Authors",
                "Copyright 2014-2018 The OpenSSL Project Authors",
                "Copyright 2014-2020 The OpenSSL Project Authors",
                "Copyright 2014-2021 The OpenSSL Project Authors",
                "Copyright 2014-2022 The OpenSSL Project Authors",
                "Copyright 2014-2023 The OpenSSL Project Authors",
                "Copyright 2015 Cryptography Research, Inc.",
                "Copyright 2015 Google Inc.",
                "Copyright 2015 The Chromium Authors",
                "Copyright 2015 the V8 project authors",
                "Copyright 2015, Google Inc.",
                "Copyright 2015-2016 Cryptography Research, Inc.",
                "Copyright 2015-2016 The OpenSSL Project Authors",
                "Copyright 2015-2017 The OpenSSL Project Authors",
                "Copyright 2015-2018 The OpenSSL Project Authors",
                "Copyright 2015-2020 The OpenSSL Project Authors",
                "Copyright 2015-2021 The OpenSSL Project Authors",
                "Copyright 2015-2022 The OpenSSL Project Authors",
                "Copyright 2015-2023 The OpenSSL Project Authors",
                "Copyright 2016 Cryptography Research, Inc.",
                "Copyright 2016 Google Inc.",
                "Copyright 2016 The Chromium Authors",
                "Copyright 2016 The OpenSSL Project Authors",
                "Copyright 2016 The V8 project authors",
                "Copyright 2016 VMS Software, Inc.",
                "Copyright 2016 the V8 project authors",
                "Copyright 2016-2016 The OpenSSL Project Authors",
                "Copyright 2016-2017 The OpenSSL Project Authors",
                "Copyright 2016-2018 Kornel Lesinski",
                "Copyright 2016-2018 The OpenSSL Project Authors",
                "Copyright 2016-2019 The OpenSSL Project Authors",
                "Copyright 2016-2020 The OpenSSL Project Authors",
                "Copyright 2016-2021 The OpenSSL Project Authors",
                "Copyright 2016-2022 The OpenSSL Project Authors",
                "Copyright 2016-2023 The OpenSSL Project Authors",
                "Copyright 2017 - 2022 Quarkslab",
                "Copyright 2017 - 2022 R. Thomas",
                "Copyright 2017 - Refael Ackermann",
                "Copyright 2017 BaishanCloud",
                "Copyright 2017 Google Inc.",
                "Copyright 2017 Kat Marchan",
                "Copyright 2017 Matthieu Darbois",
                "Copyright 2017 Ribose Inc.",
                "Copyright 2017 Ribose Inc. (https://www.ribose.com)",
                "Copyright 2017 The Chromium Authors",
                "Copyright 2017 The OpenSSL Project Authors",
                "Copyright 2017 the V8 project authors",
                "Copyright 2017-2018 The OpenSSL Project Authors",
                "Copyright 2017-2019 The OpenSSL Project Authors",
                "Copyright 2017-2020 The OpenSSL Project Authors",
                "Copyright 2017-2021 The OpenSSL Project Authors",
                "Copyright 2017-2022 (c) npm, Inc.",
                "Copyright 2017-2022 The OpenSSL Project Authors",
                "Copyright 2017-2023 The OpenSSL Project Authors",
                "Copyright 2018 Google Inc.",
                "Copyright 2018 Kilian Valkhof",
                "Copyright 2018 Logan Smyth <loganfsmyth@gmail.com>",
                "Copyright 2018 The Chromium Authors",
                "Copyright 2018 The OpenSSL Project Authors",
                "Copyright 2018 The V8 project authors",
                "Copyright 2018 the V8 project authors",
                "Copyright 2018-2019 The OpenSSL Project Authors",
                "Copyright 2018-2020 The OpenSSL Project Authors",
                "Copyright 2018-2021 The OpenSSL Project Authors",
                "Copyright 2018-2022 The OpenSSL Project Authors",
                "Copyright 2018-2023 The OpenSSL Project Authors",
                "Copyright 2019 Andreas Rossberg",
                "Copyright 2019 Google LLC",
                "Copyright 2019 Justin Ridgewell <jridgewell@google.com>",
                "Copyright 2019 Red Hat, Inc.",
                "Copyright 2019 The Chromium Authors",
                "Copyright 2019 The OpenSSL Project Authors",
                "Copyright 2019 The V8 Authors",
                "Copyright 2019 The V8 project authors",
                "Copyright 2019 the V8 project authors",
                "Copyright 2019 web-platform-tests contributors",
                "Copyright 2019-2020 The OpenSSL Project Authors",
                "Copyright 2019-2021 The OpenSSL Project Authors",
                "Copyright 2019-2022 The OpenSSL Project Authors",
                "Copyright 2019-2023 The OpenSSL Project Authors",
                "Copyright 2020 Danny Sonnenschein <my.card.god@web.de>",
                "Copyright 2020 Filament Anomalous Technologies",
                "Copyright 2020 The Chromium Authors",
                "Copyright 2020 The OpenSSL Project Authors",
                "Copyright 2020 The V8 project authors",
                "Copyright 2020 by <danny.sonnenschein@platynum.ch>",
                "Copyright 2020 the V8 project authors",
                "Copyright 2020-$YEAR The OpenSSL Project Authors",
                "Copyright 2020-2021 The OpenSSL Project Authors",
                "Copyright 2020-2022 The OpenSSL Project Authors",
                "Copyright 2020-2023 The OpenSSL Project Authors",
                "Copyright 2021 (c) npm, Inc.",
                "Copyright 2021 The OpenSSL Project Authors",
                "Copyright 2021 The V8 project authors",
                "Copyright 2021 The simdutf",
                "Copyright 2021 UnionTech",
                "Copyright 2021 UnionTech (https://www.uniontech.com)",
                "Copyright 2021 the V8 project authors",
                "Copyright 2021-2022 The OpenSSL Project Authors",
                "Copyright 2021-2023 The OpenSSL Project Authors",
                "Copyright 2022 Andrey Sitnik <andrey@sitnik.ru> and other contributors",
                "Copyright 2022 Justin Ridgewell <jridgewell@google.com>",
                "Copyright 2022 Justin Ridgewell <justin@ridgewell.name>",
                "Copyright 2022 Nicolo Ribaudo",
                "Copyright 2022 The Chromium Authors",
                "Copyright 2022 The OpenSSL Project Authors",
                "Copyright 2022 The Sigstore Authors",
                "Copyright 2022 The V8 project authors",
                "Copyright 2022 the V8 project authors",
                "Copyright 2022-2023 The OpenSSL Project Authors",
                "Copyright 2023 Ada",
                "Copyright 2023 The Chromium Authors",
                "Copyright 2023 The OpenSSL Project Authors",
                "Copyright 2023 The Sigstore Authors",
                "Copyright 2023 Yagiz Nizipli and Daniel Lemire",
                "Copyright 2023 the V8 project authors",
                "Copyright 2023The OpenSSL Project Authors",
                "Copyright 20xx-20yy The OpenSSL Project Authors",
                "Copyright Bert Belder",
                "Copyright Brian White",
                "Copyright Deno authors",
                "Copyright Domenic Denicola",
                "Copyright Fedor Indutny",
                "Copyright Fedor Indutny, 2018",
                "Copyright GitHub Inc.",
                "Copyright IBM Corp. 2018",
                "Copyright IBM Corp. 2018-2019",
                "Copyright IBM Corp. 2019",
                "Copyright Isaac Z.",
                "Copyright Isaac Z. Schlueter",
                "Copyright Isaac Z. Schlueter and Contributors",
                "Copyright JS Foundation and other contributors, https://js.foundation",
                "Copyright James Halliday (mail@substack.net) and Isaac Z. Schlueter (i@izs.me)",
                "Copyright Jeremy Ashkenas, DocumentCloud and Investigative Reporters & Editors",
                "Copyright Joyent, Inc. and other Node contributors",
                "Copyright Mathias Bynens <https://mathiasbynens.be/>",
                "Copyright Node.js contributors",
                "Copyright Nokia 2007-2018",
                "Copyright Nokia 2007-2019",
                "Copyright Nokia 2007-2020",
                "Copyright OpenJS Foundation and other contributors <https://openjsf.org/>",
                "Copyright OpenJS Foundation and other contributors, <www.openjsf.org>",
                "Copyright Patrick Powell 1995",
                "Copyright Siemens AG 2015-2019",
                "Copyright Siemens AG 2015-2020",
                "Copyright Siemens AG 2015-2022",
                "Copyright Siemens AG 2018-2020",
                "Copyright Siemens AG 2019-2022",
                "Copyright Siemens AG 2020",
                "Copyright The libuv project and contributors",
                "Copyright datetime.now .year the V8 project authors",
                "Copyright libuv contributors",
                "Copyright libuv project and contributors",
                "Copyright libuv project and other Node contributors",
                "Copyright libuv project contributors",
                "Copyright npm, Inc",
                "Copyright npm, Inc.",
                "Copyright spdx-correct.js contributors",
                "Copyright the libuv project contributors",
                "Copyright year the V8 project authors",
                "DeoptimizeFunction (c) ClearFunctionFeedback (c)",
                "GetPromiseResolve (c)",
                "NewPromiseCapability (c)",
                "UnicodeString src (c) UnicodeString",
                "copyright (c) 2010 by Armin Ronacher",
                "copyright (c) 2013 by Armin Ronacher",
                "copyright (c) 2013 by Mark Jason Dominus <mjd@cpan.org>",
                "copyright (c) 2017 by the Jinja Team",
                "copyright (c) 2019 Denis Pushkarev",
                "copyright 2015 Titus Wormer",
                "copyright 2015 Toru Nagashima",
                "copyright 2016 Titus Wormer",
                "copyright Jeremy Ashkenas, DocumentCloud and Investigative Reporters & Editors <http://underscorejs.org/>",
                "copyright Niels Provos. Two",
                "copyright by Steven Levithan",
                "copyright the Internet Systems Consortium, Inc.",
                "copyright u'2014-present, libuv contributors",
                "copyrighted by Apple Computer, Inc.",
                "copyrighted by Sun Microsystems Inc.",
                "copyrighted by the Free Software Foundation",
                "copyrighted by the University of Cambridge and Google, Inc.",
                "r'Copyright d- 20 0-2 0-9 the V8 project authors"
            ],
            "file-count": 39041,
            "sha256": "d4273615e7f1bf97fea1e2c931ed0917995b1dc0267888196b768bd0664c937d",
            "source": "https://github.com/nodejs/node/archive/refs/tags/v18.18.0.zip",
            "status": "restricted"
        }
    ]
}
