{
    "id": "npm/npmjs/@babel/plugin-transform-computed-properties/7.21.5",
    "license": "MIT AND (BSD-2-Clause AND ISC AND MIT) AND BSD-2-Clause AND BSD-3-Clause",
    "authority": "https://gitlab.eclipse.org/eclipsefdn/emo-team/iplab/-/issues/8227",
    "source": "https://github.com/babel/babel/archive/v7.21.5.zip",
    "status": "approved",
    "scans": [
        {
            "date": "May 5, 2023 at 2:07:33 a.m. GMT",
            "authority": "https://gitlab.eclipse.org/eclipsefdn/emo-team/iplab/-/issues/8227",
            "scancode-version": "31.2.1",
            "licenses-discovered": [
                "MIT",
                "BSD-2-Clause AND ISC AND MIT",
                "BSD-2-Clause",
                "BSD-3-Clause"
            ],
            "copyrights": [
                "Copyright (c) 2011-2017 KARASZI Istvan <github@spam.raszi.hu>",
                "Copyright (c) 2012 Yusuke Suzuki <utatane.tea@gmail.com>",
                "Copyright (c) 2012-2013 Ecma International",
                "Copyright (c) 2012-2014 by various contributors",
                "Copyright (c) 2014-2015 Jason Quense <jason@quense.me>",
                "Copyright (c) 2014-present Sebastian McKenzie and other contributors",
                "Copyright (c) 2014-present, Facebook, Inc.",
                "Copyright (c) 2015 Jed Watson",
                "Copyright (c) jQuery Foundation, Inc. and Contributors",
                "Copyright 2013-2015, Facebook, Inc.",
                "Copyright 2020 Bloomberg Finance L.P.",
                "Copyright JS Foundation and other contributors",
                "Copyright OpenJS Foundation and other contributors",
                "copyright (c) 2014-2022 Denis Pushkarev"
            ],
            "file-count": 28996,
            "sha256": "9f9e8d3db573dea5b023e23a5491ae630339bcfbb4fac621837d18cde8395b5c",
            "source": "https://github.com/babel/babel/archive/v7.21.5.zip",
            "status": "approved"
        }
    ]
}