{
    "id": "crate/cratesio/-/rusqlite/0.32.1",
    "license": "MIT AND (BSD-3-Clause AND MIT)",
    "authority": "https://gitlab.eclipse.org/eclipsefdn/emo-team/iplab/-/issues/17799",
    "source": "https://crates.io/api/v1/crates/rusqlite/0.32.1/download",
    "status": "approved",
    "scans": [
        {
            "date": "December 10, 2024 at 9:50:12 p.m. GMT",
            "authority": "https://gitlab.eclipse.org/eclipsefdn/emo-team/iplab/-/issues/17799",
            "scancode-version": "31.2.1",
            "licenses-discovered": [
                "MIT",
                "BSD-3-Clause AND MIT"
            ],
            "copyrights": [
                "Copyright (c) 2014-2021 The rusqlite"
            ],
            "file-count": 64,
            "sha256": "7753b721174eb8ff87a9a0e799e2d7bc3749323e773db92e0984debb00019d6e",
            "source": "https://crates.io/api/v1/crates/rusqlite/0.32.1/download",
            "status": "approved"
        }
    ]
}