{
    "id": "npm/npmjs/-/xmlhttprequest-ssl/2.1.1",
    "license": "MIT",
    "authority": "https://gitlab.eclipse.org/eclipsefdn/emo-team/iplab/-/issues/16345",
    "source": "https://github.com/mjwwit/node-XMLHttpRequest/archive/refs/tags/2.1.1.zip",
    "status": "approved",
    "scans": [
        {
            "date": "September 26, 2024, 2:32:02 p.m. GMT",
            "authority": "https://gitlab.eclipse.org/eclipsefdn/emo-team/iplab/-/issues/16345",
            "scancode-version": "31.2.1",
            "licenses-discovered": [
                "MIT"
            ],
            "copyrights": [
                "Copyright (c) 2010 passive.ly LLC"
            ],
            "file-count": 21,
            "sha256": "27fcc1fcf1c132397ba8cddb8fdabbc5f8ae7c62d39f212b9032f8ffd3204ff6",
            "source": "https://github.com/mjwwit/node-XMLHttpRequest/archive/refs/tags/2.1.1.zip",
            "status": "approved"
        }
    ]
}