{
    "id": "npm/npmjs/-/alien-signals/1.0.3",
    "license": "MIT",
    "authority": "https://gitlab.eclipse.org/eclipsefdn/emo-team/iplab/-/issues/19470",
    "source": "https://github.com/stackblitz/alien-signals/archive/refs/tags/v1.0.3.zip",
    "status": "approved",
    "scans": [
        {
            "date": "February 15, 2025 at 9:10:22 p.m. GMT",
            "authority": "https://gitlab.eclipse.org/eclipsefdn/emo-team/iplab/-/issues/19470",
            "scancode-version": "31.2.1",
            "licenses-discovered": [
                "MIT"
            ],
            "copyrights": [
                "Copyright (c) 2022-present Preact Team",
                "Copyright (c) 2024-present Johnson Chu"
            ],
            "file-count": 18,
            "sha256": "b44db37c82e7c610790ca5d7978285dd64f4d94977d59aba30fc2be7532d7c4d",
            "source": "https://github.com/stackblitz/alien-signals/archive/refs/tags/v1.0.3.zip",
            "status": "approved"
        }
    ]
}