{
    "id": "maven/mavencentral/org.geotools/gt-metadata/28.2",
    "license": "LGPL-2.1-only AND LicenseRef-scancode-public-domain-disclaimer",
    "authority": "https://gitlab.eclipse.org/eclipsefdn/emo-team/iplab/-/issues/7186",
    "source": "https://repo.osgeo.org/repository/geotools-releases/org/geotools/gt-metadata/28.2/gt-metadata-28.2-sources.jar",
    "status": "approved",
    "scans": [
        {
            "date": "February 23, 2023 at 5:53:18 p.m. GMT",
            "authority": "https://gitlab.eclipse.org/eclipsefdn/emo-team/iplab/-/issues/7186",
            "scancode-version": "31.2.1",
            "licenses-discovered": [
                "LGPL-2.1-only",
                "LGPL-2.1-only AND LicenseRef-scancode-public-domain-disclaimer"
            ],
            "copyrights": [
                "(c) . Chargement",
                "(c) . La",
                "(c) 1992-2008, Open Source Geospatial Foundation",
                "(c) 1998-2015, Open Source Geospatial Foundation",
                "(c) 1999-2008, Open Source Geospatial Foundation",
                "(c) 2000-2008, Open Source Geospatial Foundation",
                "(c) 2001-2008, Open Source Geospatial Foundation",
                "(c) 2001-2015, Open Source Geospatial Foundation",
                "(c) 2002-2008, Open Source Geospatial Foundation",
                "(c) 2003-2008, Open Source Geospatial Foundation",
                "(c) 2003-2008, Open Source Geospatial Foundation, OSGeo http://osgeo.org",
                "(c) 2003-2008, Open Source Geospatial Foundation, OSGeo http://osgeo.org ABOUT About",
                "(c) 2003-2008, Open Source Geospatial Foundation, OSGeo http://osgeo.org ABOUT Acerca ALL Tudo",
                "(c) 2003-2008, Open Source Geospatial Foundation, OSGeo http://osgeo.org ABOUT Sobre",
                "(c) 2004-2008, Open Source Geospatial Foundation",
                "(c) 2005-2008, Open Source Geospatial Foundation",
                "(c) 2005-2016, Open Source Geospatial Foundation",
                "(c) 2006, Open Source Geospatial Foundation",
                "(c) 2006-2008, Open Source Geospatial Foundation",
                "(c) 2006-2016, Open Source Geospatial Foundation",
                "(c) 2007-2008, Open Source Geospatial Foundation",
                "(c) 2007-2016, Open Source Geospatial Foundation",
                "(c) 2008, Open Source Geospatial Foundation",
                "(c) 2016, Open Source Geospatial Foundation",
                "(c) 2017, Open Source Geospatial Foundation",
                "(c) 2019, Open Source Geospatial Foundation",
                "(c) 2021, Open Source Geospatial Foundation",
                "(c) 2022, Open Source Geospatial Foundation",
                "(c) crA (c) A",
                "copyright of Rob Harder"
            ],
            "file-count": 332,
            "sha256": "2b6aa1b5db76d3295f633c01a5d645f66863071df1bed1215ee04b44af5c2320",
            "source": "https://repo.osgeo.org/repository/geotools-releases/org/geotools/gt-metadata/28.2/gt-metadata-28.2-sources.jar",
            "status": "restricted"
        }
    ]
}
