{
    "id": "maven/mavencentral/com.opencsv/opencsv/5.10",
    "license": "Apache-2.0",
    "authority": "https://gitlab.eclipse.org/eclipsefdn/emo-team/iplab/-/issues/18664",
    "source": "https://repo1.maven.org/maven2/com/opencsv/opencsv/5.10/opencsv-5.10-sources.jar",
    "status": "approved",
    "scans": [
        {
            "date": "January 14, 2025 at 6:40:08 a.m. GMT",
            "authority": "https://gitlab.eclipse.org/eclipsefdn/emo-team/iplab/-/issues/18664",
            "scancode-version": "31.2.1",
            "licenses-discovered": [
                "Apache-2.0"
            ],
            "copyrights": [
                "Copyright 2005 Bytecode Pty Ltd.",
                "Copyright 2007 Kyle Miller",
                "Copyright 2007,2010 Kyle Miller",
                "Copyright 2013 Mark Rogers",
                "Copyright 2015 Bytecode Pty Ltd.",
                "Copyright 2015 Scott Conway",
                "Copyright 2016 Andrew Rucker Jones",
                "Copyright 2017 Andrew Rucker Jones",
                "Copyright 2017 arjones",
                "Copyright 2018 Andre Levandovski Rosot",
                "Copyright 2018 Andrew Rucker Jones",
                "Copyright 2018 Bytecode Pty Ltd."
            ],
            "file-count": 168,
            "sha256": "f99deea74bba9b19160d14f323f58cdc273ae95fccd13903b20bada2030c1a01",
            "source": "https://repo1.maven.org/maven2/com/opencsv/opencsv/5.10/opencsv-5.10-sources.jar",
            "status": "approved"
        }
    ]
}