{
    "id": "maven/mavencentral/org.infinispan.protostream/protostream-types/5.0.10.Final",
    "license": "Apache-2.0",
    "authority": "https://gitlab.eclipse.org/eclipsefdn/emo-team/iplab/-/issues/16550",
    "source": "https://repo1.maven.org/maven2/org/infinispan/protostream/protostream-types/5.0.10.Final/protostream-types-5.0.10.Final-sources.jar",
    "status": "approved",
    "scans": [
        {
            "date": "October 9, 2024, 8:51:35 a.m. GMT",
            "authority": "https://gitlab.eclipse.org/eclipsefdn/emo-team/iplab/-/issues/16550",
            "scancode-version": "31.2.1",
            "licenses-discovered": [
            ],
            "copyrights": [
            ],
            "file-count": 106,
            "sha256": "af77f193badcb27d65230a1289bf3d5a2f6df953147925d0f137a257958e14f1",
            "source": "https://repo1.maven.org/maven2/org/infinispan/protostream/protostream-types/5.0.10.Final/protostream-types-5.0.10.Final-sources.jar",
            "status": "restricted"
        }
    ]
}