{
    "id": "maven/mavencentral/com.google.devtools.ksp/symbol-processing/1.9.0-1.0.11",
    "license": "Apache-2.0",
    "authority": "https://gitlab.eclipse.org/eclipsefdn/emo-team/iplab/-/issues/11180",
    "source": "https://repo.maven.apache.org/maven2/com/google/devtools/ksp/symbol-processing/1.9.0-1.0.11/symbol-processing-1.9.0-1.0.11-sources.jar",
    "status": "approved",
    "scans": [
        {
            "date": "October 25, 2023 at 9:29:02 a.m. GMT",
            "authority": "https://gitlab.eclipse.org/eclipsefdn/emo-team/iplab/-/issues/11180",
            "scancode-version": "31.2.1",
            "licenses-discovered": [
                "Apache-2.0"
            ],
            "copyrights": [
                "Copyright 2010-2020 JetBrains s.r.o. and Kotlin Programming Language contributors",
                "Copyright 2010-2021 JetBrains s.r.o. and Kotlin Programming Language contributors",
                "Copyright 2010-2022 JetBrains s.r.o. and Kotlin Programming Language contributors",
                "Copyright 2020 Google LLC",
                "Copyright 2021 Google LLC",
                "Copyright 2022 Google LLC"
            ],
            "file-count": 91,
            "sha256": "5603c02d320dc837a8b9d6a69f7ff26104c7a2bc5df3f9205c0151616e281aff",
            "source": "https://repo.maven.apache.org/maven2/com/google/devtools/ksp/symbol-processing/1.9.0-1.0.11/symbol-processing-1.9.0-1.0.11-sources.jar",
            "status": "approved"
        }
    ]
}