{
    "id": "maven/mavencentral/org.jboss.weld.servlet/weld-servlet-core/6.0.0.Beta4",
    "license": "Apache-2.0",
    "authority": "https://gitlab.eclipse.org/eclipsefdn/emo-team/iplab/-/issues/16394",
    "source": "https://repo1.maven.org/maven2/org/jboss/weld/servlet/weld-servlet-core/6.0.0.Beta4/weld-servlet-core-6.0.0.Beta4-sources.jar",
    "status": "approved",
    "scans": [
        {
            "date": "September 29, 2024, 11:29:56 a.m. GMT",
            "authority": "https://gitlab.eclipse.org/eclipsefdn/emo-team/iplab/-/issues/16394",
            "scancode-version": "31.2.1",
            "licenses-discovered": [
                "Apache-2.0 AND CDDL-1.0 AND EPL-2.0 AND (GPL-2.0-only WITH Classpath-exception-2.0)",
                "Apache-2.0"
            ],
            "copyrights": [
                "Copyright 2008, Red Hat Middleware LLC, and individual contributors by the authors",
                "Copyright 2010, Red Hat, Inc., and individual contributors by the authors",
                "Copyright 2014, Red Hat Middleware LLC, and individual contributors by the authors",
                "Copyright 2014, Red Hat, Inc.",
                "Copyright 2014, Red Hat, Inc., and individual contributors by the authors",
                "Copyright 2015, Red Hat, Inc.",
                "Copyright 2015, Red Hat, Inc., and individual contributors by the authors"
            ],
            "file-count": 47,
            "sha256": "ff404932b78bb41bb45b8dc3bc36a69d17f5589288000bb3fce59db6839b0848",
            "source": "https://repo1.maven.org/maven2/org/jboss/weld/servlet/weld-servlet-core/6.0.0.Beta4/weld-servlet-core-6.0.0.Beta4-sources.jar",
            "status": "restricted"
        }
    ]
}