{
    "id": "p2/orbit/p2.eclipse-plugin/org.apache.httpcomponents.client5.httpclient5-win/5.1.2",
    "license": "Apache-2.0",
    "licenses-discovered": [
        "Apache-2.0"
    ],
    "copyrights": [
    ],
    "file-count": 9,
    "scancode-version": "31.2.1",
    "authority": "https://gitlab.eclipse.org/eclipsefdn/emo-team/iplab/-/issues/3930",
    "source": "https://search.maven.org/remotecontent?filepath=org/apache/httpcomponents/client5/httpclient5-win/5.1.2/httpclient5-win-5.1.2-sources.jar",
    "status": "approved"
}