{
    "id": "nuget/nuget/-/RestAssured.Net/4.5.1",
    "license": "Apache-2.0",
    "authority": "https://gitlab.eclipse.org/eclipsefdn/emo-team/iplab/-/issues/17434",
    "source": "https://github.com/basdijkstra/rest-assured-net/archive/refs/tags/rest-assured-net-4.5.1.zip",
    "status": "approved",
    "scans": [
        {
            "date": "November 26, 2024 at 4:05:29 p.m. GMT",
            "authority": "https://gitlab.eclipse.org/eclipsefdn/emo-team/iplab/-/issues/17434",
            "scancode-version": "31.2.1",
            "licenses-discovered": [
                "Apache-2.0"
            ],
            "copyrights": [
                "Copyright 2019 the original author or authors"
            ],
            "file-count": 90,
            "sha256": "995d049350a3314a96f5b7da3e3e2061271ba3df7d6be5dd4de0cf0ae1dc0c5f",
            "source": "https://github.com/basdijkstra/rest-assured-net/archive/refs/tags/rest-assured-net-4.5.1.zip",
            "status": "approved"
        }
    ]
}