{
    "id": "go/golang/github.com%2Fgo-chi/chi/v4.0.2",
    "license": "MIT",
    "authority": "https://gitlab.eclipse.org/eclipsefdn/emo-team/iplab/-/issues/12315",
    "source": "https://github.com/go-chi/chi/archive/refs/tags/v4.0.2.zip",
    "status": "approved",
    "scans": [
        {
            "date": "December 20, 2023 at 1:58:58 p.m. GMT",
            "authority": "https://gitlab.eclipse.org/eclipsefdn/emo-team/iplab/-/issues/12315",
            "scancode-version": "31.2.1",
            "licenses-discovered": [
                "MIT"
            ],
            "copyrights": [
                "Copyright (c) 2015-present Peter Kieltyka (https://github.com/pkieltyka)",
                "Copyright (c) 2015-present Peter Kieltyka (https://github.com/pkieltyka), Google Inc."
            ],
            "file-count": 62,
            "sha256": "a4b7ea0d433931358cf1730edc6f8c95fea525c43e315056f800156e993547ca",
            "source": "https://github.com/go-chi/chi/archive/refs/tags/v4.0.2.zip",
            "status": "approved"
        }
    ]
}