{
    "id": "p2/orbit/p2.eclipse-plugin/org.apache.httpcomponents.core5.httpcore5-h2/5.1.2",
    "license": "Apache-2.0",
    "licenses-discovered": [
        "Apache-2.0"
    ],
    "copyrights": [
    ],
    "file-count": 112,
    "scancode-version": "31.2.1",
    "authority": "https://gitlab.eclipse.org/eclipsefdn/emo-team/iplab/-/issues/3934",
    "source": "https://search.maven.org/remotecontent?filepath=org/apache/httpcomponents/core5/httpcore5-h2/5.1.2/httpcore5-h2-5.1.2-sources.jar",
    "status": "approved"
}