{
    "id": "maven/mavencentral/com.oracle.database.jdbc/ucp/21.6.0.0.1",
    "license": "LicenseRef-FUTC",
    "licenses-discovered": [
    ],
    "copyrights": [
    ],
    "file-count": 1,
    "scancode-version": "30.1.0",
    "authority": "https://gitlab.eclipse.org/eclipsefdn/emo-team/iplab/-/issues/3350",
    "source": "https://search.maven.org/remotecontent?filepath=com/oracle/database/jdbc/ucp/21.6.0.0.1/ucp-21.6.0.0.1-sources.jar",
    "status": "restricted",
    "workswith": [
        "ee4j.eclipselink"
    ]
}
