{
    "id": "pypi/pypi/-/pycairo/1.16.2",
    "license": "LGPL-2.1-only OR MPL-1.1",
    "authority": "https://gitlab.eclipse.org/eclipsefdn/emo-team/iplab/-/issues/6316",
    "source": "https://files.pythonhosted.org/packages/5d/a0/506edea18d3951c35f6c370a902dfe5bfc356260354aeed1480f40c6a9ba/pycairo-1.16.2.tar.gz",
    "status": "approved",
    "scans": [
        {
            "date": "January 12, 2023 at 5:28:48 p.m. GMT",
            "authority": "https://gitlab.eclipse.org/eclipsefdn/emo-team/iplab/-/issues/6316",
            "scancode-version": "31.2.1",
            "licenses-discovered": [
                "LGPL-2.1-only AND LicenseRef-scancode-other-permissive AND MPL-1.1",
                "LGPL-2.1-only",
                "MPL-1.1",
                "LGPL-2.0-or-later AND LGPL-2.1-only",
                "LGPL-2.0-only AND LGPL-2.1-only AND MPL-1.1",
                "LGPL-2.0-only AND MPL-1.1",
                "LGPL-2.1-only AND MPL-1.1",
                "MIT"
            ],
            "copyrights": [
                "Copyright (c) 1991, 1999 Free Software Foundation, Inc.",
                "Copyright (c) 2003 James Henstridge",
                "Copyright (c) 2003 James Henstridge, Steven Chaplin",
                "Copyright (c) 2004-2006 Steve Chaplin",
                "Copyright (c) 2004-2011 Steven Chaplin",
                "Copyright (c) 2005 Steve Chaplin",
                "Copyright (c) 2005,2010 Steve Chaplin",
                "Copyright (c) 2006 Cairo Lover",
                "Copyright (c) 2017 Christoph Reiter",
                "Copyright 2017 Christoph Reiter",
                "copyrighted by the Free Software Foundation"
            ],
            "file-count": 113,
            "sha256": "49a3cf8737c009852e97289d43e952bf228d8df53a7ddb840d4deeb4d0cc1ea7",
            "source": "https://files.pythonhosted.org/packages/5d/a0/506edea18d3951c35f6c370a902dfe5bfc356260354aeed1480f40c6a9ba/pycairo-1.16.2.tar.gz",
            "status": "restricted"
        }
    ]
}
