{
    "id": "maven/mavencentral/io.vertx/vertx-rabbitmq-client/4.3.4",
    "license": "Apache-2.0",
    "licenses-discovered": [
        "Apache-2.0"
    ],
    "copyrights": [
        "Copyright 2019 Eclipse"
    ],
    "file-count": 27,
    "scancode-version": "31.2.1",
    "authority": "https://gitlab.eclipse.org/eclipsefdn/emo-team/iplab/-/issues/4371",
    "source": "https://search.maven.org/remotecontent?filepath=io/vertx/vertx-rabbitmq-client/4.3.4/vertx-rabbitmq-client-4.3.4-sources.jar",
    "status": "approved"
}