{
    "id": "npm/npmjs/-/vite/5.4.0",
    "license": "MIT AND (ISC AND MIT) AND (Apache-2.0 AND BSD-2-Clause AND BlueOak-1.0.0 AND CC0-1.0 AND ISC AND MIT) AND (BSD-3-Clause AND MIT) AND ISC AND (BSD-2-Clause AND BSD-3-Clause)",
    "authority": "https://gitlab.eclipse.org/eclipsefdn/emo-team/iplab/-/issues/15844",
    "source": "https://github.com/vitejs/vite/archive/refs/tags/v5.4.0.zip",
    "status": "approved",
    "scans": [
        {
            "date": "August 12, 2024 at 7:15:32 a.m. GMT",
            "authority": "https://gitlab.eclipse.org/eclipsefdn/emo-team/iplab/-/issues/15844",
            "scancode-version": "31.2.1",
            "licenses-discovered": [
                "MIT",
                "ISC AND MIT",
                "Apache-2.0 AND BSD-2-Clause AND BlueOak-1.0.0 AND CC0-1.0 AND ISC AND MIT",
                "BSD-3-Clause AND MIT",
                "ISC",
                "BSD-2-Clause AND BSD-3-Clause"
            ],
            "copyrights": [
                "Copyright (c) 2009-2023 Isaac Z. Schlueter and Contributors",
                "Copyright (c) 2010 Sencha Inc.",
                "Copyright (c) 2010-2016 Charlie Robbins, Jarrett Cruger & the Contributors",
                "Copyright (c) 2010-2023 Isaac Z. Schlueter and Contributors",
                "Copyright (c) 2011 Einar Otto Stangvik <einaros@gmail.com>",
                "Copyright (c) 2011 LearnBoost",
                "Copyright (c) 2011-2014 TJ Holowaychuk",
                "Copyright (c) 2011-2022 Isaac Z. Schlueter, Ben Noordhuis, and Contributors https://github.com/isaacs/node-graceful-fs/blob/main/LICENSE",
                "Copyright (c) 2011-2023 Isaac Z. Schlueter and Contributors",
                "Copyright (c) 2012-2013 TJ Holowaychuk",
                "Copyright (c) 2012-2019 Paul Miller (https://paulmillr.com), Elan Shanker",
                "Copyright (c) 2012-2019 Thorsten Lorenz, Paul Miller (https://paulmillr.com)",
                "Copyright (c) 2013 Arnout Kazemier and contributors",
                "Copyright (c) 2013 James Halliday (mail@substack.net)",
                "Copyright (c) 2013 Jonathan Ong <me@jongleberry.com>",
                "Copyright (c) 2013 Julian Gruber <julian@juliangruber.com>",
                "Copyright (c) 2013 Troy Goode <troygoode@gmail.com>",
                "Copyright (c) 2013-2017 Jared Hanson",
                "Copyright (c) 2013-2019 Ivan Nikulin (ifaaan@gmail.com, https://github.com/inikulin)",
                "Copyright (c) 2014 Arnout Kazemier",
                "Copyright (c) 2014 Douglas Christopher Wilson <doug@somethingdoug.com>",
                "Copyright (c) 2014 Jonathan Ong <me@jongleberry.com>",
                "Copyright (c) 2014 Jonathan Ong me@jongleberry.com",
                "Copyright (c) 2014 Maxime Thirouin, Jason Campbell & Kevin Martensson",
                "Copyright (c) 2014 Nathan Rajlich <nathan@tootallnate.net>",
                "Copyright (c) 2014, 2015, 2016, 2017, 2018, 2019, 2020, 2021, 2022, 2023, 2024 Simon Lydell",
                "Copyright (c) 2014-2016 Douglas Christopher Wilson",
                "Copyright (c) 2014-2016, Jon Schlinkert",
                "Copyright (c) 2014-2017 Douglas Christopher Wilson",
                "Copyright (c) 2014-2017 Douglas Christopher Wilson <doug@somethingdoug.com>",
                "Copyright (c) 2014-2017 TJ Holowaychuk <tj@vision-media.ca>",
                "Copyright (c) 2014-2017, Jon Schlinkert",
                "Copyright (c) 2014-2018, Jon Schlinkert",
                "Copyright (c) 2014-2020 Teambition",
                "Copyright (c) 2014-present, Jon Schlinkert",
                "Copyright (c) 2015 Alexey Litvinov",
                "Copyright (c) 2015 Andreas Lubbe",
                "Copyright (c) 2015 Douglas Christopher Wilson",
                "Copyright (c) 2015 Douglas Christopher Wilson <doug@somethingdoug.com>",
                "Copyright (c) 2015 Matteo Collina",
                "Copyright (c) 2015 Rich Harris",
                "Copyright (c) 2015 Tiancheng Timothy Gu",
                "Copyright (c) 2015 Unshift.io, Arnout Kazemier",
                "Copyright (c) 2015, 2019 Elan Shanker",
                "Copyright (c) 2015, David Bonnet <david@bonnet.cc>",
                "Copyright (c) 2015, Glen Maddern",
                "Copyright (c) 2015, Scott Motte",
                "Copyright (c) 2015-20 these people (https://github.com/Rich-Harris/estree-walker/graphs/contributors)",
                "Copyright (c) 2015-2020, Matteo Collina <matteo.collina@gmail.com>",
                "Copyright (c) 2015-present, Facebook, Inc.",
                "Copyright (c) 2015-present, Facebook, Inc. https://github.com/facebook/create-react-app/blob/master/LICENSE",
                "Copyright (c) 2015-present, Jon Schlinkert",
                "Copyright (c) 2016 Douglas Christopher Wilson",
                "Copyright (c) 2016 Douglas Christopher Wilson <doug@somethingdoug.com>",
                "Copyright (c) 2016 Luigi Pinca and contributors",
                "Copyright (c) 2016 Zeit, Inc.",
                "Copyright (c) 2016, Scott Motte",
                "Copyright (c) 2017 Larry Bahr",
                "Copyright (c) 2017 these people (https://github.com/rollup/rollup/graphs/contributors)",
                "Copyright (c) 2017-2023 npm, Inc., Isaac Z. Schlueter, and Contributors",
                "Copyright (c) 2017-present, Jon Schlinkert",
                "Copyright (c) 2017-present, Yuxi",
                "Copyright (c) 2018 Made With MOXY Lda",
                "Copyright (c) 2018 Terkel Gjervig Nielsen",
                "Copyright (c) 2018-2021 Guy Bedford",
                "Copyright (c) 2018-2021 Josh Junon",
                "Copyright (c) 2018-2022 Guy Bedford",
                "Copyright (c) 2019 Elan Shanker, Paul Miller (https://paulmillr.com)",
                "Copyright (c) 2019 Rich Harris",
                "Copyright (c) 2019 RollupJS",
                "Copyright (c) 2019 Sindre Sorhus <sindresorhus@gmail.com> (https://sindresorhus.com), Paul Miller (https://paulmillr.com)",
                "Copyright (c) 2019-present Evan",
                "Copyright (c) 2019-present, Yuxi",
                "Copyright (c) 2020 The Preact Authors",
                "Copyright (c) 2020-present Marvin Hagemeister",
                "Copyright (c) 2020-present, Yuxi",
                "Copyright (c) 2021 Alexey Raspopov, Kostiantyn Denysov, Anton Verinov",
                "Copyright (c) 2021-present dominikg and contributors (https://github.com/dominikg/tsconfck/graphs/contributors)",
                "Copyright (c) 2022 Anthony Fu <https://github.com/antfu>",
                "Copyright (c) 2022 Anton Kastritskiy",
                "Copyright (c) 2023-present, sapphi-red",
                "Copyright (c) Ben Briggs <beneb.info@gmail.com> (http://beneb.info)",
                "Copyright (c) Bogdan Chadkin <trysound@yandex.ru>",
                "Copyright (c) Denis Malinochkin",
                "Copyright (c) EGOIST",
                "Copyright (c) Felix Bohm",
                "Copyright (c) Feross Aboukhadijeh",
                "Copyright (c) Isaac Z. Schlueter and Contributors",
                "Copyright (c) Kevin Martensson <kevinmartensson@gmail.com>",
                "Copyright (c) Luke Edwards <luke.edwards05@gmail.com> (https://lukeed.com)",
                "Copyright (c) Luke Edwards <luke.edwards05@gmail.com> (lukeed.com)",
                "Copyright (c) Pooya Parsa <pooya@pi0.io>",
                "Copyright (c) Sindre Sorhus <sindresorhus@gmail.com> (https://sindresorhus.com)",
                "Copyright (c) Sindre Sorhus <sindresorhus@gmail.com> (sindresorhus.com)",
                "Copyright 2012-2018 (c) Mihai Bazon <mihai.bazon@gmail.com>",
                "Copyright 2013 Thorsten Lorenz",
                "Copyright 2014-present Olivier Lalonde <olalonde@gmail.com> , James Talmage <james@talmage.io> , Ruben Verborgh",
                "Copyright 2015 Glen Maddern",
                "Copyright 2015 Mark Dalgleish <mark.john.dalgleish@gmail.com>",
                "Copyright 2015-present Alexander Madyankin <alexander@madyankin.name>",
                "Copyright 2016 Bogdan Chadkin <trysound@yandex.ru>",
                "Copyright 2018 Glen Maddern",
                "Copyright 2018 Rich Harris",
                "Copyright 2019 Justin Ridgewell <jridgewell@google.com>",
                "Copyright 2022 Justin Ridgewell <jridgewell@google.com>",
                "Copyright 2022 Justin Ridgewell <justin@ridgewell.name>",
                "Copyright Eemeli Aro <eemeli@gmail.com>",
                "Copyright JS Foundation and other contributors",
                "Copyright Mathias Bynens <https://mathiasbynens.be/>",
                "Copyright Michael Ciniawsky <michael.ciniawsky@gmail.com>",
                "Copyright jQuery Foundation and other contributors <https://jquery.org/>",
                "copyright Jeremy Ashkenas, DocumentCloud and Investigative Reporters & Editors <http://underscorejs.org/>"
            ],
            "file-count": 2037,
            "sha256": "b486a83b402378328b215751e5e4066764417022f6b3c83a07658d8d4ee3adb5",
            "source": "https://github.com/vitejs/vite/archive/refs/tags/v5.4.0.zip",
            "status": "approved"
        }
    ]
}