{
    "id": "maven/mavencentral/org.apache.spark/spark-unsafe_2.13/3.2.1",
    "license": "Apache-2.0",
    "licenses-discovered": [
        "Apache-2.0"
    ],
    "copyrights": [
    ],
    "file-count": 22,
    "scancode-version": "31.2.1",
    "authority": "https://gitlab.eclipse.org/eclipsefdn/emo-team/iplab/-/issues/4441",
    "source": "https://search.maven.org/remotecontent?filepath=org/apache/spark/spark-unsafe_2.13/3.2.1/spark-unsafe_2.13-3.2.1-sources.jar",
    "status": "approved"
}