{
    "id": "maven/mavencentral/org.bouncycastle/bcpkix-jdk18on/1.74",
    "license": "MIT",
    "authority": "https://gitlab.eclipse.org/eclipsefdn/emo-team/iplab/-/issues/9090",
    "source": "https://repo.maven.apache.org/maven2/org/bouncycastle/bcpkix-jdk18on/1.74/bcpkix-jdk18on-1.74-sources.jar",
    "status": "approved",
    "scans": [
        {
            "date": "June 18, 2023 at 2:10:54 p.m. GMT",
            "authority": "https://gitlab.eclipse.org/eclipsefdn/emo-team/iplab/-/issues/9090",
            "scancode-version": "31.2.1",
            "licenses-discovered": [
            ],
            "copyrights": [
            ],
            "file-count": 669,
            "sha256": "766a7cc3f8e68caa22e2e67ad52c474dc2fc8ac7550de77ceab1475a6b4c9da6",
            "source": "https://repo.maven.apache.org/maven2/org/bouncycastle/bcpkix-jdk18on/1.74/bcpkix-jdk18on-1.74-sources.jar",
            "status": "restricted"
        }
    ]
}
