{
    "id": "npm/npmjs/@octokit/openapi-types/17.2.0",
    "license": "MIT",
    "authority": "https://gitlab.eclipse.org/eclipsefdn/emo-team/iplab/-/issues/8770",
    "source": "https://github.com/octokit/openapi-types.ts/archive/refs/tags/v17.2.0.zip",
    "status": "approved",
    "scans": [
        {
            "date": "June 9, 2023 at 4:00:27 a.m. GMT",
            "authority": "https://gitlab.eclipse.org/eclipsefdn/emo-team/iplab/-/issues/8770",
            "scancode-version": "31.2.1",
            "licenses-discovered": [
                "MIT",
                "AGPL-3.0-only AND Apache-2.0 AND CC0-1.0 AND GPL-3.0-only AND LGPL-3.0-only AND LicenseRef-scancode-proprietary-license AND MIT AND MPL-2.0 AND Unlicense",
                "AGPL-3.0-only AND Apache-2.0 AND GPL-3.0-only AND LGPL-3.0-only AND LicenseRef-scancode-proprietary-license AND MIT AND MPL-2.0 AND Unlicense",
                "CC0-1.0 AND LicenseRef-scancode-proprietary-license AND MIT",
                "LicenseRef-scancode-proprietary-license AND MIT"
            ],
            "copyrights": [
                "Copyright 2020 Gregor Martynus"
            ],
            "file-count": 61,
            "sha256": "7a2e4b8661b26f91245f2c648b7e8ff267215c73613f4bd615aeebd6e7dc8d02",
            "source": "https://github.com/octokit/openapi-types.ts/archive/refs/tags/v17.2.0.zip",
            "status": "restricted"
        }
    ]
}
