{
    "id": "maven/mavencentral/com.huaweicloud.sdk/huaweicloud-sdk-aom/3.1.71",
    "license": "MIT",
    "authority": "https://gitlab.eclipse.org/eclipsefdn/emo-team/iplab/-/issues/11930",
    "source": "https://repo1.maven.org/maven2/com/huaweicloud/sdk/huaweicloud-sdk-aom/3.1.71/huaweicloud-sdk-aom-3.1.71-sources.jar",
    "status": "approved",
    "scans": [
        {
            "date": "December 13, 2023 at 5:33:54 a.m. GMT",
            "authority": "https://gitlab.eclipse.org/eclipsefdn/emo-team/iplab/-/issues/11930",
            "scancode-version": "31.2.1",
            "licenses-discovered": [
            ],
            "copyrights": [
            ],
            "file-count": 265,
            "sha256": "6399eb72b9de71ac78f32f01232b79d41a315d96b0c27d718c84c21673af69d1",
            "source": "https://repo1.maven.org/maven2/com/huaweicloud/sdk/huaweicloud-sdk-aom/3.1.71/huaweicloud-sdk-aom-3.1.71-sources.jar",
            "status": "restricted"
        }
    ]
}
