{
    "id": "maven/mavencentral/biz.aQute.bnd/biz.aQute.remote.launcher/6.4.0",
    "license": "Apache-2.0",
    "authority": "https://gitlab.eclipse.org/eclipsefdn/emo-team/iplab/-/issues/6362",
    "source": "https://search.maven.org/remotecontent?filepath=biz/aQute/bnd/biz.aQute.remote.launcher/6.4.0/biz.aQute.remote.launcher-6.4.0-sources.jar",
    "status": "approved",
    "scans": [
        {
            "date": "January 14, 2023 at 12:59:15 p.m. GMT",
            "authority": "https://gitlab.eclipse.org/eclipsefdn/emo-team/iplab/-/issues/6362",
            "scancode-version": "31.2.1",
            "licenses-discovered": [
                "Apache-2.0"
            ],
            "copyrights": [
                "Copyright (c) OSGi Alliance (2012, 2013)",
                "Copyright (c) OSGi Alliance (2012, 2014)",
                "Copyright (c) OSGi Alliance (2012, 2017)"
            ],
            "file-count": 141,
            "sha256": "3471ac75fa211ef1097720874aafdd6841e5227d2d3253a9f2d684eee48b0c16",
            "source": "https://search.maven.org/remotecontent?filepath=biz/aQute/bnd/biz.aQute.remote.launcher/6.4.0/biz.aQute.remote.launcher-6.4.0-sources.jar",
            "status": "approved"
        }
    ]
}