{
    "id": "maven/mavencentral/biz.aQute.bnd/biz.aQute.bnd.util/7.0.0",
    "license": "Apache-2.0",
    "authority": "https://gitlab.eclipse.org/eclipsefdn/emo-team/iplab/-/issues/10939",
    "source": "https://repo.maven.apache.org/maven2/biz/aQute/bnd/biz.aQute.bnd.util/7.0.0/biz.aQute.bnd.util-7.0.0-sources.jar",
    "status": "approved",
    "scans": [
        {
            "date": "October 6, 2023 at 8:38:59 p.m. GMT",
            "authority": "https://gitlab.eclipse.org/eclipsefdn/emo-team/iplab/-/issues/10939",
            "scancode-version": "31.2.1",
            "licenses-discovered": [
                "Apache-2.0"
            ],
            "copyrights": [
                "Copyright 2016 Rene Perschon <rperschon85@gmail.com>",
                "Copyright 2017 Rene Perschon <rperschon85@gmail.com>"
            ],
            "file-count": 133,
            "sha256": "565592608f7a3d7abddc022d32e9419363fcfbeea322e784fc42dfcee877b4f5",
            "source": "https://repo.maven.apache.org/maven2/biz/aQute/bnd/biz.aQute.bnd.util/7.0.0/biz.aQute.bnd.util-7.0.0-sources.jar",
            "status": "approved"
        }
    ]
}