{
    "id": "maven/mavencentral/io.fabric8/kubernetes-model-flowcontrol/6.5.1",
    "license": "Apache-2.0",
    "authority": "https://gitlab.eclipse.org/eclipsefdn/emo-team/iplab/-/issues/7617",
    "source": "https://search.maven.org/remotecontent?filepath=io/fabric8/kubernetes-model-flowcontrol/6.5.1/kubernetes-model-flowcontrol-6.5.1-sources.jar",
    "status": "approved",
    "scans": [
        {
            "date": "March 28, 2023 at 12:21:34 p.m. GMT",
            "authority": "https://gitlab.eclipse.org/eclipsefdn/emo-team/iplab/-/issues/7609",
            "scancode-version": "31.2.1",
            "licenses-discovered": [
                "Apache-2.0"
            ],
            "copyrights": [
                "Copyright (c) 2015 Red Hat, Inc."
            ],
            "file-count": 361,
            "sha256": "b86863168f96e37ecc99f5cc28c34b05fafbbc1ff398687f79933f8960706cc4",
            "source": "https://search.maven.org/remotecontent?filepath=io/fabric8/kubernetes-model-flowcontrol/6.5.1/kubernetes-model-flowcontrol-6.5.1-sources.jar",
            "status": "approved"
        },
        {
            "date": "March 28, 2023 at 1:03:50 p.m. GMT",
            "authority": "https://gitlab.eclipse.org/eclipsefdn/emo-team/iplab/-/issues/7617",
            "scancode-version": "31.2.1",
            "licenses-discovered": [
                "Apache-2.0"
            ],
            "copyrights": [
                "Copyright (c) 2015 Red Hat, Inc."
            ],
            "file-count": 361,
            "sha256": "b86863168f96e37ecc99f5cc28c34b05fafbbc1ff398687f79933f8960706cc4",
            "source": "https://search.maven.org/remotecontent?filepath=io/fabric8/kubernetes-model-flowcontrol/6.5.1/kubernetes-model-flowcontrol-6.5.1-sources.jar",
            "status": "approved"
        }
    ]
}