{
    "id": "npm/npmjs/-/node-abi/3.45.0",
    "license": "MIT",
    "authority": "https://gitlab.eclipse.org/eclipsefdn/emo-team/iplab/-/issues/9083",
    "source": "https://registry.yarnpkg.com/node-abi/-/node-abi-3.45.0.tgz",
    "status": "approved",
    "scans": [
        {
            "date": "June 15, 2023 at 6:39:50 p.m. GMT",
            "authority": "https://gitlab.eclipse.org/eclipsefdn/emo-team/iplab/-/issues/9083",
            "scancode-version": "31.2.1",
            "licenses-discovered": [
                "MIT"
            ],
            "copyrights": [
                "Copyright (c) 2016 Lukas Geiger"
            ],
            "file-count": 14,
            "sha256": "4cd6ddd8da8e99b2c02dfe7ba04fed8c5630ea84359edd6a07523c460e761c4b",
            "source": "https://registry.yarnpkg.com/node-abi/-/node-abi-3.45.0.tgz",
            "status": "approved"
        }
    ]
}