{
    "id": "maven/mavencentral/com.vaadin/vaadin-button-flow/24.3.7",
    "license": "Apache-2.0",
    "authority": "https://gitlab.eclipse.org/eclipsefdn/emo-team/iplab/-/issues/13724",
    "source": "https://repo1.maven.org/maven2/com/vaadin/vaadin-button-flow/24.3.7/vaadin-button-flow-24.3.7-sources.jar",
    "status": "approved",
    "scans": [
        {
            "date": "March 15, 2024 at 2:29:44 p.m. GMT",
            "authority": "https://gitlab.eclipse.org/eclipsefdn/emo-team/iplab/-/issues/13724",
            "scancode-version": "31.2.1",
            "licenses-discovered": [
                "Apache-2.0"
            ],
            "copyrights": [
                "Copyright 2000-2023 Vaadin Ltd."
            ],
            "file-count": 6,
            "sha256": "650ad7c5ab02cda97af60c3523641c76880865e54684a71c93d7fed83f362efd",
            "source": "https://repo1.maven.org/maven2/com/vaadin/vaadin-button-flow/24.3.7/vaadin-button-flow-24.3.7-sources.jar",
            "status": "approved"
        }
    ]
}