{
    "id": "maven/mavencentral/io.fabric8/kubernetes-client-api/6.4.0",
    "license": "Apache-2.0",
    "authority": "https://gitlab.eclipse.org/eclipsefdn/emo-team/iplab/-/issues/6580",
    "source": "https://search.maven.org/remotecontent?filepath=io/fabric8/kubernetes-client-api/6.4.0/kubernetes-client-api-6.4.0-sources.jar",
    "status": "approved",
    "scans": [
        {
            "date": "January 24, 2023 at 9:27:22 a.m. GMT",
            "authority": "https://gitlab.eclipse.org/eclipsefdn/emo-team/iplab/-/issues/6580",
            "scancode-version": "31.2.1",
            "licenses-discovered": [
                "Apache-2.0"
            ],
            "copyrights": [
                "Copyright (c) 2015 Red Hat, Inc."
            ],
            "file-count": 253,
            "sha256": "c7af1d845d01d69f729fcce82fb95c2df0c49796f1fc9ea08088fe5b0ff796d4",
            "source": "https://search.maven.org/remotecontent?filepath=io/fabric8/kubernetes-client-api/6.4.0/kubernetes-client-api-6.4.0-sources.jar",
            "status": "approved"
        }
    ]
}