{
    "id": "pypi/pypi/-/pyspellchecker/0.8.2",
    "license": "MIT AND (LicenseRef-scancode-free-unknown AND MIT) AND (LGPL-2.0-or-later AND LicenseRef-scancode-proprietary-license) AND LicenseRef-scancode-proprietary-license AND AGPL-3.0-or-later",
    "authority": "https://gitlab.eclipse.org/eclipsefdn/emo-team/iplab/-/issues/19886",
    "source": "https://files.pythonhosted.org/packages/42/5d/86d94aceb9c0813f27004ec71c036d8ec6a6324d989854ff0fe13fe036dc/pyspellchecker-0.8.2.tar.gz",
    "status": "restricted",
    "scans": [
        {
            "date": "March 4, 2025 at 10:22:59 a.m. GMT",
            "authority": "https://gitlab.eclipse.org/eclipsefdn/emo-team/iplab/-/issues/19886",
            "scancode-version": "31.2.1",
            "licenses-discovered": [
                "MIT",
                "LicenseRef-scancode-free-unknown AND MIT",
                "LGPL-2.0-or-later AND LicenseRef-scancode-proprietary-license",
                "LicenseRef-scancode-proprietary-license",
                "AGPL-3.0-or-later"
            ],
            "copyrights": [
                "Copyright (c) 2018-2021 Tyler Barrus"
            ],
            "file-count": 37,
            "sha256": "2b026be14a162ba810bdda8e5454c56e364f42d3b9e14aeff31706e5ebcdc78f",
            "source": "https://files.pythonhosted.org/packages/42/5d/86d94aceb9c0813f27004ec71c036d8ec6a6324d989854ff0fe13fe036dc/pyspellchecker-0.8.2.tar.gz",
            "status": "restricted"
        }
    ]
}