{
    "license": "Apache-2.0",
    "file-count": 2,
    "authority": "https://gitlab.eclipse.org/eclipsefdn/emo-team/iplab/-/issues/1650",
    "scancode-version": "30.1.0",
    "licenses-discovered": [
        "Apache-2.0"
    ],
    "id": "maven/mavencentral/org.webjars/swagger-ui/3.26.0",
    "source": "https://github.com/webjars/swagger-ui/archive/refs/tags/swagger-ui-3.26.0.zip",
    "status": "approved"
}