{
    "id": "maven/mavencentral/org.wildfly.security/wildfly-elytron-auth/2.4.2.Final",
    "license": "Apache-2.0",
    "authority": "https://gitlab.eclipse.org/eclipsefdn/emo-team/iplab/-/issues/15766",
    "source": "https://repo1.maven.org/maven2/org/wildfly/security/wildfly-elytron-auth/2.4.2.Final/wildfly-elytron-auth-2.4.2.Final-sources.jar",
    "status": "approved",
    "scans": [
        {
            "date": "July 24, 2024 at 2:06:17 p.m. GMT",
            "authority": "https://gitlab.eclipse.org/eclipsefdn/emo-team/iplab/-/issues/15766",
            "scancode-version": "31.2.1",
            "licenses-discovered": [
                "Apache-2.0"
            ],
            "copyrights": [
                "Copyright 2013 Red Hat, Inc., and individual contributors",
                "Copyright 2014 Red Hat, Inc., and individual contributors",
                "Copyright 2015 Red Hat, Inc., and individual contributors",
                "Copyright 2016 Red Hat, Inc., and individual contributors",
                "Copyright 2018 Red Hat, Inc., and individual contributors"
            ],
            "file-count": 14,
            "sha256": "c771b920f408616af146ff838eb29012d9e9db4343ae058890b32a69a3cdcaa4",
            "source": "https://repo1.maven.org/maven2/org/wildfly/security/wildfly-elytron-auth/2.4.2.Final/wildfly-elytron-auth-2.4.2.Final-sources.jar",
            "status": "approved"
        }
    ]
}