{
    "id": "maven/mavencentral/org.bouncycastle/bcprov-jdk18on/1.72",
    "license": "MIT AND CC0-1.0",
    "licenses-discovered": [
        "MIT",
        "CC0-1.0"
    ],
    "copyrights": [
        "(c) ECFieldElement A1",
        "(c) Nat224.isOne",
        "Copyright (c) The Legion Of The Bouncy Castle Inc. (https://www.bouncycastle.org)",
        "Copyright (c) Tim Buktu (tbuktu@hotmail.com)",
        "Copyright Dr B. R Gladman (gladman@seven77.demon.co.uk) and Sam Simpson (s.simpson@mia.co.uk)",
        "IntegerPolynomial (c) IntegerPolynomial"
    ],
    "file-count": 2438,
    "scancode-version": "30.1.0",
    "authority": "https://gitlab.eclipse.org/eclipsefdn/emo-team/iplab/-/issues/3538",
    "source": "https://search.maven.org/remotecontent?filepath=org/bouncycastle/bcprov-jdk18on/1.72/bcprov-jdk18on-1.72-sources.jar",
    "status": "approved"
}