{
    "id": "go/golang/mvdan.cc/gofumpt/v0.1.1",
    "license": "BSD-3-Clause",
    "authority": "https://gitlab.eclipse.org/eclipsefdn/emo-team/iplab/-/issues/12403",
    "source": "https://proxy.golang.org/mvdan.cc/gofumpt/@v/v0.1.1.zip",
    "status": "approved",
    "scans": [
        {
            "date": "December 21, 2023 at 11:46:23 a.m. GMT",
            "authority": "https://gitlab.eclipse.org/eclipsefdn/emo-team/iplab/-/issues/12403",
            "scancode-version": "31.2.1",
            "licenses-discovered": [
                "BSD-3-Clause"
            ],
            "copyrights": [
                "Copyright (c) 2009 The Go Authors",
                "Copyright (c) 2019, Daniel Marti",
                "Copyright (c) 2019, Daniel Marti <mvdan@mvdan.cc>",
                "Copyright (c) 2020, Daniel Marti <mvdan@mvdan.cc>",
                "Copyright 2009 The Go Authors",
                "Copyright 2010 The Go Authors",
                "Copyright 2013 The Go Authors",
                "Copyright 2015 The Go Authors",
                "Copyright 2016 The Go Authors",
                "Copyright 2018 The Go Authors",
                "Copyright 2019 The Go Authors",
                "Copyright 2020 The Go Authors"
            ],
            "file-count": 77,
            "sha256": "59c5e589d0d14397da7311958867395c1b5dc4c3e02a3def56d606658de5fcea",
            "source": "https://proxy.golang.org/mvdan.cc/gofumpt/@v/v0.1.1.zip",
            "status": "approved"
        }
    ]
}