{
    "id": "npm/npmjs/-/eslint-utils/1.4.3",
    "license": "MIT",
    "licenses-discovered": [
        "MIT"
    ],
    "copyrights": [
        "Copyright (c) 2018 Toru Nagashima"
    ],
    "file-count": 7,
    "scancode-version": "31.2.1",
    "authority": "https://gitlab.eclipse.org/eclipsefdn/emo-team/iplab/-/issues/4556",
    "source": "https://registry.npmjs.org/eslint-utils/-/eslint-utils-1.4.3.tgz",
    "status": "approved"
}