{
    "id": "npm/npmjs/-/webpack/5.95.0",
    "license": "MIT",
    "authority": "https://gitlab.eclipse.org/eclipsefdn/emo-team/iplab/-/issues/16295",
    "source": "https://github.com/webpack/webpack/archive/refs/tags/v5.95.0.zip",
    "status": "approved",
    "scans": [
        {
            "date": "September 25, 2024, 8:09:50 p.m. GMT",
            "authority": "https://gitlab.eclipse.org/eclipsefdn/emo-team/iplab/-/issues/16295",
            "scancode-version": "31.2.1",
            "licenses-discovered": [
                "MIT",
                "AFL-3.0 AND AGPL-3.0-only AND AGPL-3.0-or-later AND Apache-1.1 AND Apache-2.0 AND BSD-2-Clause AND BSD-3-Clause AND CAL-1.0 AND CC-BY-SA-4.0 AND CC0-1.0 AND CDDL-1.0 AND GPL-2.0-only AND LGPL-2.1-only AND LGPL-3.0-only AND PSF-2.0"
            ],
            "copyrights": [
                "(c) 1990 RSA Data Security, Inc.",
                "Copyright (c) 2016 Stephan Brumme",
                "Copyright JS Foundation and other contributors"
            ],
            "file-count": 8234,
            "sha256": "71580545298c7e794e6ecceb497e04759bc4fc50a05d1a1fa5d4053edf842ee2",
            "source": "https://github.com/webpack/webpack/archive/refs/tags/v5.95.0.zip",
            "status": "restricted"
        }
    ]
}