{
    "id": "maven/mavencentral/com.github.jtidy/jtidy/1.0.5",
    "license": "HTMLTIDY",
    "authority": "https://gitlab.eclipse.org/eclipsefdn/emo-team/iplab/-/issues/15599",
    "source": "https://repo1.maven.org/maven2/com/github/jtidy/jtidy/1.0.5/jtidy-1.0.5-sources.jar",
    "status": "approved",
    "scans": [
        {
            "date": "July 3, 2024 at 4:35:19 p.m. GMT",
            "authority": "https://gitlab.eclipse.org/eclipsefdn/emo-team/iplab/-/issues/15599",
            "scancode-version": "31.2.1",
            "licenses-discovered": [
                "HTMLTIDY"
            ],
            "copyrights": [
                "Copyright (c) 1998-2000 World Wide Web Consortium (Massachusetts Institute of Technology, Institut National de Recherche en Informatique et en Automatique, Keio University)",
                "Copyright (c) 2023 Bernhard Haumacher et al",
                "Copyright (c) 2023 Business Operation Systems GmbH."
            ],
            "file-count": 64,
            "sha256": "92b5ec9601171015a0c90fbddf460eb4a9f205f0b4447793ee6f9b08e261e067",
            "source": "https://repo1.maven.org/maven2/com/github/jtidy/jtidy/1.0.5/jtidy-1.0.5-sources.jar",
            "status": "restricted"
        }
    ]
}