{
    "id": "maven/mavencentral/org.bytedeco/leptonica-platform/1.82.0-1.5.8",
    "license": "Apache-2.0 OR GPL-2.0-only WITH Classpath-exception-2.0",
    "authority": "https://gitlab.eclipse.org/eclipsefdn/emo-team/iplab/-/issues/6789",
    "source": "https://search.maven.org/remotecontent?filepath=org/bytedeco/leptonica-platform/1.82.0-1.5.8/leptonica-platform-1.82.0-1.5.8-sources.jar",
    "status": "approved",
    "scans": [
        {
            "date": "January 27, 2023 at 10:25:42 p.m. GMT",
            "authority": "https://gitlab.eclipse.org/eclipsefdn/emo-team/iplab/-/issues/6789",
            "scancode-version": "31.2.1",
            "licenses-discovered": [
            ],
            "copyrights": [
            ],
            "file-count": 3,
            "sha256": "2c5d722fc04adcec8b13fa30cfaae53dd124387f9a8cd986685b6643349d9971",
            "source": "https://search.maven.org/remotecontent?filepath=org/bytedeco/leptonica-platform/1.82.0-1.5.8/leptonica-platform-1.82.0-1.5.8-sources.jar",
            "status": "restricted"
        }
    ]
}
