{
    "id": "maven/mavencentral/es.weso/converter_2.12/0.2.2",
    "license": "MIT",
    "authority": "https://gitlab.eclipse.org/eclipsefdn/emo-team/iplab/-/issues/8857",
    "source": "https://repo.maven.apache.org/maven2/es/weso/converter_2.12/0.2.2/converter_2.12-0.2.2-sources.jar",
    "status": "approved",
    "scans": [
        {
            "date": "June 14, 2023 at 7:22:38 p.m. GMT",
            "authority": "https://gitlab.eclipse.org/eclipsefdn/emo-team/iplab/-/issues/8857",
            "scancode-version": "31.2.1",
            "licenses-discovered": [
            ],
            "copyrights": [
            ],
            "file-count": 8,
            "sha256": "73b275aa5fad94b5881d3520dac12df86bce3bc776a4bcd253c480d6eac62473",
            "source": "https://repo.maven.apache.org/maven2/es/weso/converter_2.12/0.2.2/converter_2.12-0.2.2-sources.jar",
            "status": "restricted"
        }
    ]
}
