{
    "id": "go/golang/k8s.io/kube-openapi/v0.0.0-20220803162953-67bda5d908f1",
    "license": "Apache-2.0 AND MIT AND CC-BY-4.0",
    "authority": "https://gitlab.eclipse.org/eclipsefdn/emo-team/iplab/-/issues/6389",
    "source": "https://proxy.golang.org/k8s.io/kube-openapi/@v/v0.0.0-20220803162953-67bda5d908f1.zip",
    "status": "approved",
    "scans": [
        {
            "date": "January 20, 2023 at 6:36:59 p.m. GMT",
            "authority": "https://gitlab.eclipse.org/eclipsefdn/emo-team/iplab/-/issues/6389",
            "scancode-version": "31.2.1",
            "licenses-discovered": [
                "Apache-2.0",
                "LicenseRef-scancode-proprietary-license",
                "Apache-2.0 AND MIT",
                "Apache-2.0 AND CC-BY-4.0"
            ],
            "copyrights": [
                "Copyright (c) 2004, 2006 The Linux Foundation and its contributors",
                "Copyright (c) MongoDB, Inc. 2017-present",
                "Copyright 2015 go-swagger",
                "Copyright 2016 The Kubernetes Authors",
                "Copyright 2017 The Kubernetes Authors",
                "Copyright 2017 go-swagger",
                "Copyright 2018 The Kubernetes Authors",
                "Copyright 2019 The Kubernetes Authors",
                "Copyright 2020 The Kubernetes Authors",
                "Copyright 2021 The Kubernetes Authors",
                "Copyright 2022 The Kubernetes Authors"
            ],
            "file-count": 295,
            "sha256": "ad3a783a5e06ceaf791bdafd6626561e327202d9964e035c237297268f15cc6b",
            "source": "https://proxy.golang.org/k8s.io/kube-openapi/@v/v0.0.0-20220803162953-67bda5d908f1.zip",
            "status": "restricted"
        }
    ]
}
