{
    "id": "npm/npmjs/-/lockfile/1.0.4",
    "license": "ISC",
    "licenses-discovered": [
        "ISC"
    ],
    "file-count": 14,
    "scancode-version": "30.1.0",
    "authority": "https://gitlab.eclipse.org/eclipsefdn/emo-team/iplab/-/issues/1982",
    "source": "https://github.com/npm/lockfile/archive/v1.0.4.zip",
    "status": "approved"
}