{
    "id": "npm/npmjs/@typescript-eslint/typescript-estree/8.2.0",
    "license": "BSD-2-Clause AND MIT AND (BSD-2-Clause AND ISC AND MIT)",
    "authority": "https://gitlab.eclipse.org/eclipsefdn/emo-team/iplab/-/issues/15985",
    "source": "https://github.com/typescript-eslint/typescript-eslint/archive/refs/tags/v8.2.0.zip",
    "status": "approved",
    "scans": [
        {
            "date": "August 23, 2024 at 10:24:52 a.m. GMT",
            "authority": "https://gitlab.eclipse.org/eclipsefdn/emo-team/iplab/-/issues/15985",
            "scancode-version": "31.2.1",
            "licenses-discovered": [
                "BSD-2-Clause",
                "MIT",
                "BSD-2-Clause AND ISC AND MIT"
            ],
            "copyrights": [
                "(c) Sindre Sorhus",
                "Copyright (c) 2016 unional",
                "Copyright (c) 2019 typescript-eslint and other contributors",
                "Copyright (c) 2021 typescript-eslint and other contributors",
                "Copyright (c) 2023 typescript-eslint and other contributors",
                "Copyright (c) Facebook, Inc. and its affiliates",
                "Copyright JS Foundation and other contributors, https://js.foundation",
                "Copyright Jeremy Ashkenas, DocumentCloud and Investigative Reporters & Editors",
                "Copyright Joyent, Inc. and other Node contributors",
                "Copyright OpenJS Foundation and other contributors <https://openjsf.org/>",
                "Pp (c) Ac",
                "Tv (c) Gn"
            ],
            "file-count": 7596,
            "sha256": "353f8e347d99b6426ef0e8924417bd19095a31e013a01c1724294843011dd7bc",
            "source": "https://github.com/typescript-eslint/typescript-eslint/archive/refs/tags/v8.2.0.zip",
            "status": "approved"
        }
    ]
}