{
    "id": "maven/mavencentral/io.github.classgraph/classgraph/4.6.32",
    "license": "MIT AND (CDDL-1.0 AND MIT)",
    "licenses-discovered": [
        "MIT",
        "CDDL-1.0 AND MIT"
    ],
    "copyrights": [
        "Copyright (c) Harith Elrufaie",
        "Copyright (c) Johno Crawford",
        "Copyright (c) Luke Hutchison",
        "Copyright (c) R. Kempees",
        "Copyright (c) Sergey Bespalov",
        "Copyright (c) jacobg, Luke Hutchison"
    ],
    "file-count": 120,
    "scancode-version": "30.1.0",
    "authority": "https://gitlab.eclipse.org/eclipsefdn/emo-team/iplab/-/issues/2943",
    "source": "https://search.maven.org/remotecontent?filepath=io/github/classgraph/classgraph/4.6.32/classgraph-4.6.32-sources.jar",
    "status": "approved"
}