{
    "id": "pypi/pypi/-/pip/24.0",
    "license": "MIT AND ISC AND Apache-2.0 AND (BSD-2-Clause OR Apache-2.0) AND BSD-2-Clause AND BSD-3-Clause AND Python-2.0 AND LGPL-2.1-or-later AND MPL-2.0",
    "authority": "https://gitlab.eclipse.org/eclipsefdn/emo-team/iplab/-/issues/14695",
    "source": "https://files.pythonhosted.org/packages/94/59/6638090c25e9bc4ce0c42817b5a234e183872a1129735a9330c472cc2056/pip-24.0.tar.gz",
    "status": "approved",
    "scans": [
        {
            "date": "May 14, 2024 at 4:55:22 a.m. GMT",
            "authority": "https://gitlab.eclipse.org/eclipsefdn/emo-team/iplab/-/issues/14695",
            "scancode-version": "31.2.1",
            "licenses-discovered": [
                "MIT",
                "BSD-3-Clause",
                "Apache-2.0 AND BSD-2-Clause AND BSD-3-Clause AND MIT",
                "BSD-3-Clause AND Python-2.0 AND Python-2.0.1",
                "Apache-2.0",
                "MPL-2.0",
                "LGPL-2.1-or-later",
                "LGPL-2.1-only",
                "Python-2.0",
                "Apache-2.0 AND BSD-2-Clause AND BSD-3-Clause",
                "Apache-2.0 AND BSD-3-Clause",
                "BSD-2-Clause",
                "ISC"
            ],
            "copyrights": [
                "(c) 1999 Entrust.net Limited",
                "(c) 1999 Entrust.net Limited Label Entrust.net Premium 2048 Secure Server CA Serial",
                "(c) 2006 Entrust, Inc.",
                "(c) 2006 Entrust, Inc. Label Entrust Root Certification",
                "(c) 2006-2023 by Georg Brandl, Matthaus Chajdas and contributors",
                "(c) 2009 Entrust, Inc. - for",
                "(c) 2012 Entrust, Inc. - for",
                "(c) 2015 Entrust, Inc. - for",
                "Copyright (c) 1991 - 1995, Stichting Mathematisch Centrum Amsterdam, The Netherlands",
                "Copyright (c) 1991, 1999 Free Software Foundation, Inc.",
                "Copyright (c) 1995-2001 Corporation for National Research Initiatives",
                "Copyright (c) 1998 the Initial Developer",
                "Copyright (c) 2001 the Initial Developer",
                "Copyright (c) 2001, 2002, 2003, 2004, 2005, 2006, 2007, 2008, 2009, 2010 Python Software Foundation",
                "Copyright (c) 2001, 2002, 2003, 2004, 2005, 2006, 2007, 2008, 2009, 2010, 2011, 2012, 2013, 2014, 2015, 2016, 2017, 2018, 2019, 2020, 2021, 2022, 2023 Python Software Foundation",
                "Copyright (c) 2003-2022 Paul T. McGuire",
                "Copyright (c) 2005 the Initial Developer",
                "Copyright (c) 2006-2022 by the",
                "Copyright (c) 2008-2011 INADA Naoki <songofacandy@gmail.com>",
                "Copyright (c) 2008-2020 Andrey Petrov and contributors",
                "Copyright (c) 2008-2020 The pip",
                "Copyright (c) 2008-present The pip",
                "Copyright (c) 2010 Jonathan Hartley",
                "Copyright (c) 2010-2020 Benjamin Peterson",
                "Copyright (c) 2010-202x The platformdirs",
                "Copyright (c) 2012 The Python Software Foundation",
                "Copyright (c) 2012 by Simon Sapin",
                "Copyright (c) 2012-2023 Python Software Foundation",
                "Copyright (c) 2012-2023 The Python Software Foundation",
                "Copyright (c) 2012-2023 Vinay Sajip",
                "Copyright (c) 2013-2017 Vinay Sajip",
                "Copyright (c) 2013-2021, Kim Davies",
                "Copyright (c) 2013-2023 Vinay Sajip",
                "Copyright (c) 2015-2016 Will Bond <will@wbond.net>",
                "Copyright (c) 2017 Thomas Kluyver",
                "Copyright (c) 2018, Tzu-ping Chung <uranusjr@gmail.com>",
                "Copyright (c) 2020 Will McGugan",
                "Copyright (c) 2021 Taneli Hukkinen",
                "Copyright (c) 2022 Seth Michael Larson",
                "Copyright (c) Donald Stufft and individual contributors",
                "Copyright (c) Simple Launcher",
                "Copyright (c) Sindre Sorhus <sindresorhus@gmail.com> (sindresorhus.com)",
                "Copyright 2006-2023 by the Pygments team",
                "Copyright 2012 by Simon Sapin",
                "Copyright 2012-2021 Eric Larson",
                "Copyright 2013-2014 Ray",
                "Copyright 2015 Eric Larson",
                "Copyright 2015,2016,2017 Nir Cohen",
                "Copyright 2016 Etienne Bersac",
                "Copyright 2016 Joshua Harlow",
                "Copyright 2016 Julien Danjou",
                "Copyright 2016-2018 Julien Danjou",
                "Copyright 2016-2021 Julien Danjou",
                "Copyright 2017 Elisey Zanko",
                "Copyright 2021 Taneli Hukkinen",
                "Copyright Jason R. Coombs",
                "Copyright Jonathan Hartley 2013",
                "Copyright Kenneth Reitz",
                "copyright (c) 2012 by Kenneth Reitz",
                "copyright (c) 2017 by Kenneth Reitz",
                "copyright 2014-2019 s",
                "copyrighted by the Free Software Foundation"
            ],
            "file-count": 653,
            "sha256": "ea9bd1a847e8c5774a5777bb398c19e80bcd4e2aa16a4b301b718fe6f593aba2",
            "source": "https://files.pythonhosted.org/packages/94/59/6638090c25e9bc4ce0c42817b5a234e183872a1129735a9330c472cc2056/pip-24.0.tar.gz",
            "status": "restricted"
        }
    ]
}