{
    "id": "maven/mavencentral/org.apache.camel/camel-base/3.22.2",
    "license": "Apache-2.0",
    "authority": "https://gitlab.eclipse.org/eclipsefdn/emo-team/iplab/-/issues/14943",
    "source": "https://repo1.maven.org/maven2/org/apache/camel/camel-base/3.22.2/camel-base-3.22.2-sources.jar",
    "status": "approved",
    "scans": [
        {
            "date": "May 29, 2024 at 10:26:36 a.m. GMT",
            "authority": "https://gitlab.eclipse.org/eclipsefdn/emo-team/iplab/-/issues/14943",
            "scancode-version": "31.2.1",
            "licenses-discovered": [
                "Apache-2.0"
            ],
            "copyrights": [
            ],
            "file-count": 112,
            "sha256": "1ca204bbff0b66e0b51752eee5cf39cabe033016398b05ab01f1a6b3b81a9c91",
            "source": "https://repo1.maven.org/maven2/org/apache/camel/camel-base/3.22.2/camel-base-3.22.2-sources.jar",
            "status": "approved"
        }
    ]
}