{
    "id": "maven/mavencentral/io.netty/netty-resolver-dns-classes-macos/4.1.87.Final",
    "license": "Apache-2.0",
    "authority": "https://gitlab.eclipse.org/eclipsefdn/emo-team/iplab/-/issues/6367",
    "source": "https://search.maven.org/remotecontent?filepath=io/netty/netty-resolver-dns-classes-macos/4.1.87.Final/netty-resolver-dns-classes-macos-4.1.87.Final-sources.jar",
    "status": "approved",
    "scans": [
        {
            "date": "January 14, 2023 at 4:31:32 p.m. GMT",
            "authority": "https://gitlab.eclipse.org/eclipsefdn/emo-team/iplab/-/issues/6367",
            "scancode-version": "31.2.1",
            "licenses-discovered": [
                "Apache-2.0"
            ],
            "copyrights": [
                "Copyright 2019 The Netty Project",
                "Copyright 2021 The Netty Project"
            ],
            "file-count": 6,
            "sha256": "a16c212a77d1775912e2a0d8ceb8bd58c9742399f6fda4918ae75a795a87a8d2",
            "source": "https://search.maven.org/remotecontent?filepath=io/netty/netty-resolver-dns-classes-macos/4.1.87.Final/netty-resolver-dns-classes-macos-4.1.87.Final-sources.jar",
            "status": "approved"
        }
    ]
}