{
    "id": "p2/orbit/p2.eclipse-plugin/org.apache.sshd.osgi/2.7.0.v20210623-0618",
    "license": "Apache-2.0 AND ISC",
    "licenses-discovered": [
        "Apache-2.0",
        "ISC"
    ],
    "file-count": 720,
    "scancode-version": "30.1.0",
    "authority": "https://gitlab.eclipse.org/eclipsefdn/emo-team/iplab/-/issues/2108",
    "source": "https://search.maven.org/remotecontent?filepath=org/apache/sshd/sshd-osgi/2.7.0/sshd-osgi-2.7.0-sources.jar",
    "status": "approved"
}