{
    "id": "maven/mavencentral/androidx.compose.ui/ui-text/1.5.0",
    "license": "Apache-2.0",
    "authority": "https://gitlab.eclipse.org/eclipsefdn/emo-team/iplab/-/issues/10379",
    "source": "https://dl.google.com/android/maven2/androidx/compose/ui/ui-text/1.5.0/ui-text-1.5.0-sources.jar",
    "status": "approved",
    "scans": [
        {
            "date": "September 11, 2023 at 9:49:39 p.m. GMT",
            "authority": "https://gitlab.eclipse.org/eclipsefdn/emo-team/iplab/-/issues/10379",
            "scancode-version": "31.2.1",
            "licenses-discovered": [
                "Apache-2.0"
            ],
            "copyrights": [
                "Copyright 2018 The Android Open Source Project",
                "Copyright 2019 The Android Open Source Project",
                "Copyright 2020 The Android Open Source Project",
                "Copyright 2020 The Android Source Project",
                "Copyright 2021 The Android Open Source Project",
                "Copyright 2022 The Android Open Source Project",
                "Copyright 2023 The Android Open Source Project"
            ],
            "file-count": 77,
            "sha256": "70a8705a1faec90147cafa0eab8460146bfc67bb70aceb736d6d477faeff08a1",
            "source": "https://dl.google.com/android/maven2/androidx/compose/ui/ui-text/1.5.0/ui-text-1.5.0-sources.jar",
            "status": "approved"
        }
    ]
}