{
    "id": "npm/npmjs/-/react-dropzone/11.7.1",
    "license": "MIT",
    "licenses-discovered": [
        "MIT"
    ],
    "copyrights": [
        "Copyright (c) Param Aggarwal"
    ],
    "file-count": 64,
    "scancode-version": "30.1.0",
    "authority": "https://gitlab.eclipse.org/eclipsefdn/emo-team/iplab/-/issues/3016",
    "source": "https://github.com/react-dropzone/react-dropzone/archive/v11.7.1.zip",
    "status": "approved"
}