{
    "id": "npm/npmjs/@typescript-eslint/eslint-plugin/6.11.0",
    "license": "BSD-2-Clause AND (BSD-2-Clause AND ISC AND MIT) AND MIT",
    "authority": "https://gitlab.eclipse.org/eclipsefdn/emo-team/iplab/-/issues/11690",
    "source": "https://github.com/typescript-eslint/typescript-eslint/archive/refs/tags/v6.11.0.zip",
    "status": "approved",
    "scans": [
        {
            "date": "November 24, 2023 at 9:45:15 a.m. GMT",
            "authority": "https://gitlab.eclipse.org/eclipsefdn/emo-team/iplab/-/issues/11690",
            "scancode-version": "31.2.1",
            "licenses-discovered": [
                "BSD-2-Clause",
                "BSD-2-Clause AND ISC AND MIT",
                "MIT"
            ],
            "copyrights": [
                "Copyright (c) 2016 unional",
                "Copyright (c) 2019 typescript-eslint and other contributors",
                "Copyright (c) 2021 typescript-eslint and other contributors",
                "Copyright (c) 2023 typescript-eslint and other contributors",
                "Copyright JS Foundation and other contributors, https://js.foundation",
                "Copyright Joyent, Inc. and other Node contributors"
            ],
            "file-count": 7607,
            "sha256": "bc8aacd8a2d61ca52611652ef46a490cfd76fb265afce639ee72fff35b271e5b",
            "source": "https://github.com/typescript-eslint/typescript-eslint/archive/refs/tags/v6.11.0.zip",
            "status": "approved"
        }
    ]
}