{
    "id": "go/golang/github.com%2FMicrosoft/go-winio/v0.4.11",
    "license": "MIT AND BSD-3-Clause",
    "authority": "https://gitlab.eclipse.org/eclipsefdn/emo-team/iplab/-/issues/12401",
    "source": "https://github.com/Microsoft/go-winio/archive/refs/tags/v0.4.11.zip",
    "status": "approved",
    "scans": [
        {
            "date": "December 21, 2023 at 11:47:58 a.m. GMT",
            "authority": "https://gitlab.eclipse.org/eclipsefdn/emo-team/iplab/-/issues/12401",
            "scancode-version": "31.2.1",
            "licenses-discovered": [
                "MIT",
                "BSD-3-Clause"
            ],
            "copyrights": [
                "Copyright (c) 2012 The Go Authors",
                "Copyright (c) 2015 Microsoft",
                "Copyright 2009 The Go Authors",
                "Copyright 2012 The Go Authors",
                "Copyright 2013 The Go Authors"
            ],
            "file-count": 87,
            "sha256": "310166330e84df35ee79ecd9075542c6d2f0ffde85248e64bf6bcf51f75c2591",
            "source": "https://github.com/Microsoft/go-winio/archive/refs/tags/v0.4.11.zip",
            "status": "approved"
        }
    ]
}