{
    "license": "BSD-3-Clause",
    "file-count": 455,
    "authority": "https://gitlab.eclipse.org/eclipsefdn/emo-team/iplab/-/issues/1109",
    "scancode-version": "30.1.0",
    "licenses-discovered": [
        "BSD-3-Clause"
    ],
    "id": "maven/mavencentral/net.sourceforge.pmd/pmd-core/6.15.0",
    "source": "https://search.maven.org/remotecontent?filepath=net/sourceforge/pmd/pmd-core/6.15.0/pmd-core-6.15.0-sources.jar",
    "status": "approved"
}