{
    "id": "p2/orbit/p2.eclipse.plugin/org.apache.batik.util/1.18.0.v20241009-1200",
    "license": "Apache-2.0",
    "authority": "https://gitlab.eclipse.org/eclipsefdn/emo-team/iplab/-/issues/16592",
    "source": "https://repo1.maven.org/maven2/org/apache/xmlgraphics/batik-util/1.18/batik-util-1.18-sources.jar",
    "status": "approved",
    "scans": [
        {
            "date": "October 15, 2024, 4:20:35 a.m. GMT",
            "authority": "https://gitlab.eclipse.org/eclipsefdn/emo-team/iplab/-/issues/16592",
            "scancode-version": "31.2.1",
            "licenses-discovered": [
                "Apache-2.0"
            ],
            "copyrights": [
            ],
            "file-count": 60,
            "sha256": "54438f5a4dfe0dad566f76098f9595ba0eb87511fc0a173e6dc6c9914f48f1cd",
            "source": "https://repo1.maven.org/maven2/org/apache/xmlgraphics/batik-util/1.18/batik-util-1.18-sources.jar",
            "status": "approved"
        }
    ]
}