{
    "id": "maven/mavencentral/com.github.pureconfig/pureconfig_2.12/0.17.2",
    "license": "MPL-2.0",
    "authority": "https://gitlab.eclipse.org/eclipsefdn/emo-team/iplab/-/issues/6503",
    "source": "https://search.maven.org/remotecontent?filepath=com/github/pureconfig/pureconfig_2.12/0.17.2/pureconfig_2.12-0.17.2-sources.jar",
    "status": "approved",
    "scans": [
        {
            "date": "January 26, 2023 at 5:44:39 a.m. GMT",
            "authority": "https://gitlab.eclipse.org/eclipsefdn/emo-team/iplab/-/issues/6503",
            "scancode-version": "31.2.1",
            "licenses-discovered": [
            ],
            "copyrights": [
            ],
            "file-count": 1,
            "sha256": "11d87583c96ba735d736e208310296c13a72fffef02ec52d71abc44f38b98688",
            "source": "https://search.maven.org/remotecontent?filepath=com/github/pureconfig/pureconfig_2.12/0.17.2/pureconfig_2.12-0.17.2-sources.jar",
            "status": "restricted"
        }
    ]
}
