{
    "id": "npm/npmjs/@ag-grid-community/infinite-row-model/32.3.3",
    "license": "MIT",
    "authority": "https://gitlab.eclipse.org/eclipsefdn/emo-team/iplab/-/issues/17729",
    "source": "https://registry.yarnpkg.com/@ag-grid-community/infinite-row-model/-/infinite-row-model-32.3.3.tgz",
    "status": "approved",
    "scans": [
        {
            "date": "December 5, 2024 at 2:39:36 a.m. GMT",
            "authority": "https://gitlab.eclipse.org/eclipsefdn/emo-team/iplab/-/issues/17729",
            "scancode-version": "31.2.1",
            "licenses-discovered": [
                "MIT",
                "LicenseRef-scancode-commercial-license AND LicenseRef-scancode-proprietary-license",
                "LicenseRef-scancode-proprietary-license"
            ],
            "copyrights": [
                "(c) AG Grid Ltd. 2015",
                "(c) winnings2022",
                "(c) winnings2023",
                "Copyright (c) 2015-2024 AG GRID LTD"
            ],
            "file-count": 9751,
            "sha256": "6c2452cf76d39d7d6cf7407bb8f0991b459a448397c1367cbb2ec8d37aeebb2c",
            "source": "https://github.com/ag-grid/ag-grid/archive/refs/tags/v32.3.3.zip",
            "status": "restricted"
        },
        {
            "date": "December 17, 2024 at 4:41:25 a.m. GMT",
            "authority": "https://gitlab.eclipse.org/eclipsefdn/emo-team/iplab/-/issues/17729",
            "scancode-version": "31.2.1",
            "licenses-discovered": [
                "MIT"
            ],
            "copyrights": [
                "Copyright (c) 2015-2024 AG GRID LTD"
            ],
            "file-count": 19,
            "sha256": "62814a7768c78240dc3e18b90269cc601ad99bb29c940c591e3e81f1581607b5",
            "source": "https://registry.yarnpkg.com/@ag-grid-community/infinite-row-model/-/infinite-row-model-32.3.3.tgz",
            "status": "approved"
        }
    ]
}