{
    "id": "maven/mavencentral/com.giffing.bucket4j.spring.boot.starter/bucket4j-spring-boot-starter-context/0.9.0",
    "license": "Apache-2.0",
    "authority": "https://gitlab.eclipse.org/eclipsefdn/emo-team/iplab/-/issues/9640",
    "source": "https://repo.maven.apache.org/maven2/com/giffing/bucket4j/spring/boot/starter/bucket4j-spring-boot-starter-context/0.9.0/bucket4j-spring-boot-starter-context-0.9.0-sources.jar",
    "status": "approved",
    "scans": [
        {
            "date": "July 19, 2023 at 12:24:42 p.m. GMT",
            "authority": "https://gitlab.eclipse.org/eclipsefdn/emo-team/iplab/-/issues/9640",
            "scancode-version": "31.2.1",
            "licenses-discovered": [
                "Apache-2.0"
            ],
            "copyrights": [
            ],
            "file-count": 22,
            "sha256": "95a7e84154c15b6df183ef2e5a2175d61b9c7ae44d8ca24521b930d5cf23a260",
            "source": "https://repo.maven.apache.org/maven2/com/giffing/bucket4j/spring/boot/starter/bucket4j-spring-boot-starter-context/0.9.0/bucket4j-spring-boot-starter-context-0.9.0-sources.jar",
            "status": "approved"
        }
    ]
}