{
    "license": "Apache-2.0 AND (EPL-2.0 OR GPL-2.0-with-classpath-exception)",
    "file-count": 140,
    "authority": "https://gitlab.eclipse.org/eclipsefdn/emo-team/iplab/-/issues/921",
    "scancode-version": "21.3.31",
    "licenses-discovered": [
        "Apache-2.0",
        "Classpath-exception-2.0",
        "EPL-2.0",
        "GPL-2.0-only",
        "LicenseRef-scancode-unknown-license-reference"
    ],
    "id": "maven/mavencentral/org.apache.tomcat/tomcat-servlet-api/10.0.0",
    "source": "https://search.maven.org/remotecontent?filepath=org/apache/tomcat/tomcat-servlet-api/10.0.0/tomcat-servlet-api-10.0.0-sources.jar",
    "status": "approved"
}
