{
    "id": "npm/npmjs/-/rimraf/4.4.1",
    "license": "ISC",
    "authority": "https://gitlab.eclipse.org/eclipsefdn/emo-team/iplab/-/issues/7576",
    "source": "https://github.com/isaacs/rimraf/archive/v4.4.1.zip",
    "status": "approved",
    "scans": [
        {
            "date": "March 27, 2023 at 5:06:37 p.m. GMT",
            "authority": "https://gitlab.eclipse.org/eclipsefdn/emo-team/iplab/-/issues/7576",
            "scancode-version": "31.2.1",
            "licenses-discovered": [
                "ISC"
            ],
            "copyrights": [
                "Copyright (c) 2011-2023 Isaac Z. Schlueter and Contributors",
                "Copyright (c) Isaac Z. Schlueter and Contributors"
            ],
            "file-count": 73,
            "sha256": "1f559d12349305d8c0127d6c3a5219a622505ca0b79180a2e279f1fbce26185c",
            "source": "https://github.com/isaacs/rimraf/archive/v4.4.1.zip",
            "status": "approved"
        }
    ]
}