{
    "id": "project/technology.xfsc/eclipse-xfsc-dct/dct/34a967038aa5632ea6a763f4ddf639ab0fb8a238",
    "license": "Apache-2.0",
    "authority": "https://gitlab.eclipse.org/eclipsefdn/emo-team/iplab/-/issues/9534",
    "source": "https://gitlab.eclipse.org/api/v4/projects/eclipse%2Fxfsc%2Fdct%2Fdct/repository/archive.zip?sha=34a967038aa5632ea6a763f4ddf639ab0fb8a238",
    "status": "approved",
    "scans": [
        {
            "date": "July 18, 2023 at 10:32:14 a.m. GMT",
            "authority": "https://gitlab.eclipse.org/eclipsefdn/emo-team/iplab/-/issues/9534",
            "scancode-version": "31.2.1",
            "licenses-discovered": [
            ],
            "copyrights": [
            ],
            "file-count": 192,
            "sha256": "0d3aafd270d614f6d188a7fd8c957c1060a8635875c759caba3bf332945aeca5",
            "source": "https://gitlab.eclipse.org/api/v4/projects/eclipse%2Fxfsc%2Fdct%2Fdct/repository/archive.zip?sha=34a967038aa5632ea6a763f4ddf639ab0fb8a238",
            "status": "restricted"
        }
    ]
}
