{
    "id": "maven/mavencentral/org.jboss.arquillian.config/arquillian-config-api/1.8.0.Final",
    "license": "Apache-2.0",
    "authority": "https://gitlab.eclipse.org/eclipsefdn/emo-team/iplab/-/issues/14282",
    "source": "https://repo1.maven.org/maven2/org/jboss/arquillian/config/arquillian-config-api/1.8.0.Final/arquillian-config-api-1.8.0.Final-sources.jar",
    "status": "approved",
    "scans": [
        {
            "date": "April 12, 2024 at 5:14:58 p.m. GMT",
            "authority": "https://gitlab.eclipse.org/eclipsefdn/emo-team/iplab/-/issues/14282",
            "scancode-version": "31.2.1",
            "licenses-discovered": [
                "Apache-2.0"
            ],
            "copyrights": [
                "Copyright 2010 Red Hat Inc. and/or its affiliates and other contributors by the authors",
                "Copyright 2011 Red Hat Inc. and/or its affiliates and other contributors as indicated by the authors tag",
                "Copyright 2013 Red Hat Inc. and/or its affiliates and other contributors as indicated by the authors tag"
            ],
            "file-count": 12,
            "sha256": "d688d4f5798b0b2567a4ab15f0a534b45d5703ed8d3f107b1edd2c3603d2031e",
            "source": "https://repo1.maven.org/maven2/org/jboss/arquillian/config/arquillian-config-api/1.8.0.Final/arquillian-config-api-1.8.0.Final-sources.jar",
            "status": "approved"
        }
    ]
}