{
    "id": "maven/mavencentral/io.gatling/gatling-commons/3.10.5",
    "license": "Apache-2.0",
    "authority": "https://gitlab.eclipse.org/eclipsefdn/emo-team/iplab/-/issues/14476",
    "source": "https://repo1.maven.org/maven2/io/gatling/gatling-commons/3.10.5/gatling-commons-3.10.5-sources.jar",
    "status": "approved",
    "scans": [
        {
            "date": "April 19, 2024 at 1:51:57 p.m. GMT",
            "authority": "https://gitlab.eclipse.org/eclipsefdn/emo-team/iplab/-/issues/14476",
            "scancode-version": "31.2.1",
            "licenses-discovered": [
                "Apache-2.0"
            ],
            "copyrights": [
                "Copyright 2011-2024 GatlingCorp (https://gatling.io)"
            ],
            "file-count": 25,
            "sha256": "9ccda695c36e64e2e0b67b395e77e0144904ec84557a128f29edcd72edde21dc",
            "source": "https://repo1.maven.org/maven2/io/gatling/gatling-commons/3.10.5/gatling-commons-3.10.5-sources.jar",
            "status": "approved"
        }
    ]
}