{
    "id": "npm/npmjs/-/level-js/2.2.4",
    "license": "BSD-2-Clause AND BSD-3-Clause",
    "authority": "https://gitlab.eclipse.org/eclipsefdn/emo-team/iplab/-/issues/7448",
    "source": "https://github.com/maxogden/level.js/archive/v2.2.4.zip",
    "status": "approved",
    "scans": [
        {
            "date": "March 22, 2023 at 10:23:09 a.m. GMT",
            "authority": "https://gitlab.eclipse.org/eclipsefdn/emo-team/iplab/-/issues/7448",
            "scancode-version": "31.2.1",
            "licenses-discovered": [
                "BSD-2-Clause",
                "BSD-3-Clause"
            ],
            "copyrights": [
            ],
            "file-count": 12,
            "sha256": "15a559bcd8420efc52fa105f1fcf7b21014afb9cc5fa95b19b17cd6c898404e9",
            "source": "https://github.com/maxogden/level.js/archive/v2.2.4.zip",
            "status": "approved"
        }
    ]
}