{
    "id": "nuget/nuget/-/JsonSchema.Net/7.3.0",
    "license": "MIT AND OFL-1.1",
    "authority": "https://gitlab.eclipse.org/eclipsefdn/emo-team/iplab/-/issues/17607",
    "source": "https://github.com/json-everything/json-everything/archive/refs/tags/schema-v7.3.0.zip",
    "status": "approved",
    "scans": [
        {
            "date": "December 3, 2024 at 9:33:59 a.m. GMT",
            "authority": "https://gitlab.eclipse.org/eclipsefdn/emo-team/iplab/-/issues/17607",
            "scancode-version": "31.2.1",
            "licenses-discovered": [
                "MIT",
                "JSON",
                "OFL-1.1",
                "MIT AND OFL-1.1",
                "CC-BY-SA-4.0",
                "GPL-3.0-only"
            ],
            "copyrights": [
                "Copyright (c) .NET Foundation and Contributors",
                "Copyright (c) 2014 Waybury",
                "Copyright 2011-2021 The Bootstrap Authors",
                "Copyright 2011-2021 Twitter, Inc."
            ],
            "file-count": 1099,
            "sha256": "622b243d0d4b20d4bdc8c6c421cc1fa3909acca17dc5335d95c64907e5325d2f",
            "source": "https://github.com/json-everything/json-everything/archive/refs/tags/schema-v7.3.0.zip",
            "status": "restricted"
        }
    ]
}