{
    "id": "git/github/gobwas/pool/v0.2.0",
    "license": "MIT",
    "licenses-discovered": [
    ],
    "copyrights": [
    ],
    "file-count": 17,
    "scancode-version": "30.1.0",
    "authority": "https://gitlab.eclipse.org/eclipsefdn/emo-team/iplab/-/issues/3555",
    "source": "https://github.com/gobwas/pool/archive/refs/tags/v0.2.0.zip",
    "status": "approved"
}
