{
    "id": "npm/npmjs/@esbuild/android-arm/0.20.2",
    "license": "Apache-2.0 AND MIT AND BSD-3-Clause AND (BSD-2-Clause AND BSD-3-Clause)",
    "authority": "https://gitlab.eclipse.org/eclipsefdn/emo-team/iplab/-/issues/15302",
    "source": "https://github.com/evanw/esbuild/archive/refs/tags/v0.20.2.zip",
    "status": "approved",
    "scans": [
        {
            "date": "March 21, 2024 at 1:03:26 p.m. GMT",
            "authority": "https://gitlab.eclipse.org/eclipsefdn/emo-team/iplab/-/issues/13952",
            "scancode-version": "31.2.1",
            "licenses-discovered": [
                "Apache-2.0",
                "MIT",
                "BSD-3-Clause",
                "BSD-2-Clause AND BSD-3-Clause"
            ],
            "copyrights": [
                "(c) Evil Software Corp",
                "(c) Good Software",
                "(c) Good Software Corp",
                "(c) expectPrintedTarget t, 2019",
                "Copyright (c) 2009 The Go Authors",
                "Copyright (c) 2016 Caleb Spare",
                "Copyright (c) 2020 Evan Wallace",
                "Copyright (c) Microsoft Corporation",
                "Copyright 2012-2019 (c) Mihai Bazon <mihai.bazon@gmail.com>"
            ],
            "file-count": 312,
            "sha256": "b501845d448dfda852dcbd9bab808bad51c4d7b08a18444a9d73fc44b002f008",
            "source": "https://github.com/evanw/esbuild/archive/refs/tags/v0.20.2.zip",
            "status": "approved"
        },
        {
            "date": "June 14, 2024 at 6:09:08 p.m. GMT",
            "authority": "https://gitlab.eclipse.org/eclipsefdn/emo-team/iplab/-/issues/15301",
            "scancode-version": "31.2.1",
            "licenses-discovered": [
                "Apache-2.0",
                "MIT",
                "BSD-3-Clause",
                "BSD-2-Clause AND BSD-3-Clause"
            ],
            "copyrights": [
                "(c) Evil Software Corp",
                "(c) Good Software",
                "(c) Good Software Corp",
                "(c) expectPrintedTarget t, 2019",
                "Copyright (c) 2009 The Go Authors",
                "Copyright (c) 2016 Caleb Spare",
                "Copyright (c) 2020 Evan Wallace",
                "Copyright (c) Microsoft Corporation",
                "Copyright 2012-2019 (c) Mihai Bazon <mihai.bazon@gmail.com>"
            ],
            "file-count": 312,
            "sha256": "b501845d448dfda852dcbd9bab808bad51c4d7b08a18444a9d73fc44b002f008",
            "source": "https://github.com/evanw/esbuild/archive/refs/tags/v0.20.2.zip",
            "status": "approved"
        },
        {
            "date": "June 14, 2024 at 6:16:05 p.m. GMT",
            "authority": "https://gitlab.eclipse.org/eclipsefdn/emo-team/iplab/-/issues/15302",
            "scancode-version": "31.2.1",
            "licenses-discovered": [
                "Apache-2.0",
                "MIT",
                "BSD-3-Clause",
                "BSD-2-Clause AND BSD-3-Clause"
            ],
            "copyrights": [
                "(c) Evil Software Corp",
                "(c) Good Software",
                "(c) Good Software Corp",
                "(c) expectPrintedTarget t, 2019",
                "Copyright (c) 2009 The Go Authors",
                "Copyright (c) 2016 Caleb Spare",
                "Copyright (c) 2020 Evan Wallace",
                "Copyright (c) Microsoft Corporation",
                "Copyright 2012-2019 (c) Mihai Bazon <mihai.bazon@gmail.com>"
            ],
            "file-count": 312,
            "sha256": "b501845d448dfda852dcbd9bab808bad51c4d7b08a18444a9d73fc44b002f008",
            "source": "https://github.com/evanw/esbuild/archive/refs/tags/v0.20.2.zip",
            "status": "approved"
        }
    ]
}