{
    "id": "maven/mavencentral/com.azure/azure-storage-blob/12.23.0",
    "license": "MIT",
    "authority": "https://gitlab.eclipse.org/eclipsefdn/emo-team/iplab/-/issues/9632",
    "source": "https://repo.maven.apache.org/maven2/com/azure/azure-storage-blob/12.23.0/azure-storage-blob-12.23.0-sources.jar",
    "status": "approved",
    "scans": [
        {
            "date": "July 19, 2023 at 1:04:54 p.m. GMT",
            "authority": "https://gitlab.eclipse.org/eclipsefdn/emo-team/iplab/-/issues/9632",
            "scancode-version": "31.2.1",
            "licenses-discovered": [
                "MIT"
            ],
            "copyrights": [
                "(c) 2008 VeriSign, Inc.",
                "Copyright (c) Microsoft Corporation"
            ],
            "file-count": 335,
            "sha256": "085a9dc5c9bee676effa4b3c817a8ba7b36614cd95e6895d58727a45f66fef5b",
            "source": "https://repo.maven.apache.org/maven2/com/azure/azure-storage-blob/12.23.0/azure-storage-blob-12.23.0-sources.jar",
            "status": "approved"
        }
    ]
}