{
    "id": "npm/npmjs/@babel/code-frame/7.24.2",
    "license": "MIT AND (BSD-2-Clause AND ISC AND MIT) AND BSD-2-Clause AND BSD-3-Clause",
    "authority": "https://gitlab.eclipse.org/eclipsefdn/emo-team/iplab/-/issues/13943",
    "source": "https://github.com/babel/babel/archive/refs/tags/v7.24.2.zip",
    "status": "approved",
    "scans": [
        {
            "date": "March 21, 2024 at 3:02:00 p.m. GMT",
            "authority": "https://gitlab.eclipse.org/eclipsefdn/emo-team/iplab/-/issues/13943",
            "scancode-version": "31.2.1",
            "licenses-discovered": [
                "MIT",
                "BSD-2-Clause AND ISC AND MIT",
                "BSD-2-Clause",
                "BSD-3-Clause"
            ],
            "copyrights": [
                "(c) 2014-2023 Denis Pushkarev",
                "Copyright (c) 2011-2017 KARASZI Istvan <github@spam.raszi.hu>",
                "Copyright (c) 2012 Yusuke Suzuki <utatane.tea@gmail.com>",
                "Copyright (c) 2012-2013 Ecma International",
                "Copyright (c) 2012-2014 by various contributors",
                "Copyright (c) 2014-2015 Jason Quense <jason@quense.me>",
                "Copyright (c) 2014-present Sebastian McKenzie and other contributors",
                "Copyright (c) 2014-present, Facebook, Inc.",
                "Copyright (c) 2015 Jed Watson",
                "Copyright (c) jQuery Foundation, Inc. and Contributors",
                "Copyright 2013-2015, Facebook, Inc.",
                "Copyright 2020 Bloomberg Finance L.P.",
                "Copyright JS Foundation and other contributors",
                "Copyright OpenJS Foundation and other contributors"
            ],
            "file-count": 31268,
            "sha256": "7f83d7af5b12d49c9a23c956878c01a8188782df91f350a013a0bad640d7499c",
            "source": "https://github.com/babel/babel/archive/refs/tags/v7.24.2.zip",
            "status": "approved"
        }
    ]
}