{
    "id": "maven/mavencentral/org.apache.lucene/lucene-queries/8.9.0",
    "license": "Apache-2.0",
    "authority": "https://gitlab.eclipse.org/eclipsefdn/emo-team/iplab/-/issues/6149",
    "source": "https://search.maven.org/remotecontent?filepath=org/apache/lucene/lucene-queries/8.9.0/lucene-queries-8.9.0-sources.jar",
    "status": "approved",
    "scans": [
        {
            "date": "January 6, 2023 at 10:51:41 p.m. GMT",
            "authority": "https://gitlab.eclipse.org/eclipsefdn/emo-team/iplab/-/issues/6149",
            "scancode-version": "31.2.1",
            "licenses-discovered": [
                "Apache-2.0"
            ],
            "copyrights": [
            ],
            "file-count": 127,
            "sha256": "d0248a57c48df8740559d7d93c53b21552212e970c4ee352d8ce4d6b6a0ddc77",
            "source": "https://search.maven.org/remotecontent?filepath=org/apache/lucene/lucene-queries/8.9.0/lucene-queries-8.9.0-sources.jar",
            "status": "approved"
        }
    ]
}