{
    "id": "maven/mavencentral/org.apache.camel/camel-util/3.22.2",
    "license": "Apache-2.0",
    "authority": "https://gitlab.eclipse.org/eclipsefdn/emo-team/iplab/-/issues/14906",
    "source": "https://repo1.maven.org/maven2/org/apache/camel/camel-util/3.22.2/camel-util-3.22.2-sources.jar",
    "status": "approved",
    "scans": [
        {
            "date": "May 29, 2024 at 9:36:44 a.m. GMT",
            "authority": "https://gitlab.eclipse.org/eclipsefdn/emo-team/iplab/-/issues/14906",
            "scancode-version": "31.2.1",
            "licenses-discovered": [
                "Apache-2.0"
            ],
            "copyrights": [
            ],
            "file-count": 78,
            "sha256": "d9ba5e2f04d83179cdfa5f695099093e2c32125e2b2adab111a0228ab873170a",
            "source": "https://repo1.maven.org/maven2/org/apache/camel/camel-util/3.22.2/camel-util-3.22.2-sources.jar",
            "status": "approved"
        }
    ]
}