{
    "id": "npm/npmjs/-/ol/9.2.0",
    "license": "BSD-2-Clause AND MIT AND Apache-2.0 AND CC-BY-NC-SA-4.0 AND CC-BY-SA-2.0 AND LGPL-2.1-only AND CC-BY-NC-2.5 AND ODbL-1.0 AND CC-BY-3.0 AND LicenseRef-Permission-Notice",
    "authority": "https://gitlab.eclipse.org/eclipsefdn/emo-team/iplab/-/issues/14734",
    "source": "https://github.com/openlayers/openlayers/archive/refs/tags/v9.2.0.zip",
    "status": "approved",
    "scans": [
        {
            "date": "May 16, 2024 at 11:29:10 a.m. GMT",
            "authority": "https://gitlab.eclipse.org/eclipsefdn/emo-team/iplab/-/issues/14734",
            "scancode-version": "31.2.1",
            "licenses-discovered": [
                "BSD-2-Clause",
                "BSD-2-Clause AND LicenseRef-scancode-free-unknown",
                "MIT",
                "Apache-2.0",
                "LicenseRef-scancode-proprietary-license AND ODbL-1.0",
                "ODbL-1.0",
                "LicenseRef-scancode-proprietary-license",
                "OGC-1.0",
                "CC-BY-SA-2.0 AND CC-BY-SA-3.0",
                "BSD-2-Clause AND CC-BY-3.0 AND MIT",
                "LicenseRef-scancode-softsurfer",
                "CC-BY-SA-4.0 AND LicenseRef-scancode-proprietary-license AND OGC-1.0"
            ],
            "copyrights": [
                "(c) + a href https://www.openstreetmap.org/copyright",
                "(c) ,1132,1958,19.916670,56.250000 Hale Center (no. 1),610,1936,34.050000,-101.750000 Hale Center",
                "(c) 2012 DigitalGlobe', coverageAreas' bbox",
                "(c) 2015 Aerials",
                "(c) 2015 Blom', coverageAreas' bbox",
                "(c) 2015 DigitalGlobe', coverageAreas' bbox",
                "(c) 2015 Eurosense', coverageAreas' bbox",
                "(c) 2015 GeoEye', coverageAreas' bbox",
                "(c) 2015 HERE', coverageAreas' bbox",
                "(c) 2015 IGN', coverageAreas' bbox",
                "(c) 2015 IGP', coverageAreas' bbox",
                "(c) 2015 InterAtlas', coverageAreas' bbox",
                "(c) 2015 Intermap', coverageAreas' bbox",
                "(c) 2015 MapData Sciences Pty Ltd",
                "(c) 2015 Microsoft",
                "(c) 2015 Pasco', coverageAreas' bbox",
                "(c) 2015 Zenrin', coverageAreas' bbox",
                "(c) Acme Inc.",
                "(c) Bacme Inc.",
                "(c) Crown",
                "(c) Harris Corp, Earthstar Geographics",
                "(c) OpenStreetMap contributors",
                "(c) OpenStreetMap contributors and others",
                "(c) OpenStreetMap contributors, Who's On First",
                "(c) Province of British",
                "(c) a href https://mrdata.usgs.gov/geology/state",
                "(c) a href https://openmaptiles.org",
                "(c) a href https://services.arcgisonline.com/ArcGIS",
                "(c) a href https://shop.swisstopo.admin.ch/en/products/maps/national/lk1000",
                "(c) a href https://stamen.com",
                "(c) a href https://www.hydrodaten.admin.ch/en/notes-on-the-flood-alert-maps.html",
                "(c) a href https://www.stadiamaps.com",
                "(c) https://www.mapbox.com/map-feedback/'>",
                "(c) https://www.opencyclemap.org/'>",
                "(c) https://www.openseamap.org/'>",
                "(c) https://www.openstreetmap.org/copyright'> + OpenStreetMap contributors",
                "(c) https://xkcd.com/license.html'>",
                "Copyright (c) 2012, Vladimir Agafonkin",
                "Copyright (c) 2015 Microsoft and its suppliers",
                "Copyright (c) OpenStreetMap Contributors",
                "Copyright (c) OpenStreetMap Contributors https://www.openstreetmap.org",
                "Copyright 2000 softSurfer, 2012 Dan",
                "Copyright 2005-present, OpenLayers Contributors",
                "Copyright 2007-2010 Tim Schaub",
                "Copyright 2011 Canonical Ltd.",
                "Copyright https://www.openstreetmap.org/' OpenStreetMap Contributors"
            ],
            "file-count": 2076,
            "sha256": "c15d09be206b48f9812591757503f5b8b49a219b19b11ea6d0a7b93d564b25b2",
            "source": "https://github.com/openlayers/openlayers/archive/refs/tags/v9.2.0.zip",
            "status": "restricted"
        }
    ]
}