{
    "id": "maven/mavencentral/org.springframework.boot/spring-boot-starter-data-rest/3.1.0",
    "license": "Apache-2.0",
    "authority": "https://gitlab.eclipse.org/eclipsefdn/emo-team/iplab/-/issues/9105",
    "source": "https://repo.maven.apache.org/maven2/org/springframework/boot/spring-boot-starter-data-rest/3.1.0/spring-boot-starter-data-rest-3.1.0-sources.jar",
    "status": "approved",
    "scans": [
        {
            "date": "June 20, 2023 at 11:24:00 a.m. GMT",
            "authority": "https://gitlab.eclipse.org/eclipsefdn/emo-team/iplab/-/issues/9105",
            "scancode-version": "31.2.1",
            "licenses-discovered": [
                "Apache-2.0"
            ],
            "copyrights": [
            ],
            "file-count": 2,
            "sha256": "339b4a736051e8610c331721194e8aacc2754177e5330f06ffbbe7e13a576b44",
            "source": "https://repo.maven.apache.org/maven2/org/springframework/boot/spring-boot-starter-data-rest/3.1.0/spring-boot-starter-data-rest-3.1.0-sources.jar",
            "status": "approved"
        }
    ]
}