{
    "id": "maven/mavencentral/com.marcnuri.helm-java/lib-api/0.0.7",
    "license": "Apache-2.0",
    "authority": "https://gitlab.eclipse.org/eclipsefdn/emo-team/iplab/-/issues/14487",
    "source": "https://repo1.maven.org/maven2/com/marcnuri/helm-java/lib-api/0.0.7/lib-api-0.0.7-sources.jar",
    "status": "approved",
    "scans": [
        {
            "date": "April 23, 2024 at 6:40:01 a.m. GMT",
            "authority": "https://gitlab.eclipse.org/eclipsefdn/emo-team/iplab/-/issues/14487",
            "scancode-version": "31.2.1",
            "licenses-discovered": [
            ],
            "copyrights": [
            ],
            "file-count": 23,
            "sha256": "2e4c2e2d78145bd9bba39e87451fd1e4cbe4807b7f5991dc113fe4b094049b9a",
            "source": "https://repo1.maven.org/maven2/com/marcnuri/helm-java/lib-api/0.0.7/lib-api-0.0.7-sources.jar",
            "status": "restricted"
        }
    ]
}
