{
    "id": "maven/mavencentral/io.grpc/grpc-netty-shaded/1.68.0",
    "license": "Apache-2.0",
    "authority": "https://gitlab.eclipse.org/eclipsefdn/emo-team/iplab/-/issues/16742",
    "source": "https://repo1.maven.org/maven2/io/grpc/grpc-netty-shaded/1.68.0/grpc-netty-shaded-1.68.0-sources.jar",
    "status": "approved",
    "scans": [
        {
            "date": "October 15, 2024, 6:11:52 p.m. GMT",
            "authority": "https://gitlab.eclipse.org/eclipsefdn/emo-team/iplab/-/issues/16742",
            "scancode-version": "31.2.1",
            "licenses-discovered": [
            ],
            "copyrights": [
            ],
            "file-count": 1,
            "sha256": "31d4fc1054b5c0bc75924e82ca425dcf624f895e7525da900b94cfa87a2bea53",
            "source": "https://repo1.maven.org/maven2/io/grpc/grpc-netty-shaded/1.68.0/grpc-netty-shaded-1.68.0-sources.jar",
            "status": "restricted"
        }
    ]
}