{
    "id": "pypi/pypi/-/chardet/3.0.4",
    "license": "LGPL-2.1-or-later",
    "authority": "https://gitlab.eclipse.org/eclipsefdn/emo-team/iplab/-/issues/6306",
    "source": "https://files.pythonhosted.org/packages/fc/bb/a5768c230f9ddb03acc9ef3f0d4a3cf93462473795d18e9535498c8f929d/chardet-3.0.4.tar.gz",
    "status": "approved",
    "scans": [
        {
            "date": "January 12, 2023 at 8:21:08 p.m. GMT",
            "authority": "https://gitlab.eclipse.org/eclipsefdn/emo-team/iplab/-/issues/6306",
            "scancode-version": "31.2.1",
            "licenses-discovered": [
                "LGPL-2.1-only",
                "LGPL-2.0-or-later",
                "LGPL-2.1-or-later",
                "CC-BY-SA-2.5",
                "LicenseRef-scancode-proprietary-license"
            ],
            "copyrights": [
                "(c) !C/ http://www.aozora.gr.jp/cards/000160/card3344.html' AEEEUAU3/4aI|oiAi !C/ http://www.aozora.gr.jp/cards/000160/card3342.html' $?I$?i$?I$?iE$?AAE$?IPAdegU !C/ http://www.aozora.gr.jp/cards/000160/card3345.html' oPSAI$?D$?E$?*Eu1cE1/4AA !C/ http://www.aozora.gr.jp/cards/000160/card3347.html' Ai thI11O3o !C/ http://www.aozora.gr.jp/cards/000160/card3346.html' AEC'$? UE-IA'+- !E$?!,o3 <$?u$?i$??!PS!O http://www.aozora.gr.jp/cards/000160/card3343.html'>",
                "(c) !C/ http://www.aozora.gr.jp/cards/001166/card43723.html",
                "(c) !E http://blog.livedoor.jp/facilitators/",
                "(c) !E http://www.pinkupa.com/cgi-bin/weblog/archives/000612.php",
                "(c) !PS ODE$?uAECPS!Google 1OuODgooglesucks.com",
                "(c) !a http://furusatonoeki.cutegirl.jp/main/archives/001177.html",
                "(c) !eI (c) FE",
                "(c) !x!C/!O http://www.aozora.gr.jp/cards/000160/card3344.html' AEEEUAU3/4aI|oiAi !x!C/!O http://www.aozora.gr.jp/cards/000160/card3342.html' $?I$?i$?I$?iE$?AAE$?IPAdegU !x!C/!O http://www.aozora.gr.jp/cards/000160/card3345.html' oPSAI$?D$?E$?*Eu1cE1/4AA !x!C/!O http://www.aozora.gr.jp/cards/000160/card3347.html' Ai thI11O3o !x!C/!O http://www.aozora.gr.jp/cards/000160/card3346.html",
                "(c) !x!O http://www.aozora.gr.jp/cards/000050/card1174.html",
                "(c) \"aae \" (r)aY aa(r)C/ea http://money.rin.ru/content/news/?id",
                "(c) \"aae http://money.rin.ru/content/news/?id",
                "(c) $?\"SS (c) Y",
                "(c) $?A$?a$?A$?$?$?O OP!$?e$?*$?-$?E$?A$?AE$?$??$?E x$?$?$?Th$?1$?!$?$?$? $?!$?C$?*$?c$?|! (c) PS2Y",
                "(c) $?A3/4a$?2$?e http://club.h14m.org/kenji/diary/?200512b",
                "(c) $?AE http://mimizun.com:81/blog/archives/000314.html",
                "(c) $?C/\"|(r)a a(r)aa! \"a-(r) iSSaY aY ?? http://forum.template-toolkit.ru/view_topic/topic_id-114.html?rss",
                "(c) $?IIo E PEa!U1993.2.",
                "(c) $?cAAAzEnPaEC/I (c) HAASS",
                "(c) (c) A",
                "(c) (c) AA+-C/IAtBGCg http://www.1affliate.com",
                "(c) (c) AA+-C/IAtBGCgxI j AaaAAEIieUu1/2B http://www.1affilaite.com",
                "(c) (c) AAEE",
                "(c) (c) O1981|~Y H!iuUA !j",
                "(c) (r)IE bvAbvAi'u'I",
                "(c) *-deg!Ao ?PoAI degOAOA CO",
                "(c) *-deg!Ao http://jowchung.oolim.net/index.php?pl",
                "(c) *C/AEd http://cosoft.org.cn/projects/webpm/",
                "(c) *F!ASSUI (c) IY",
                "(c) *I1/4OCAAE(r)deg! http://research.microsoft.com/barc/mediapresence/MyLifeBits.aspx",
                "(c) +-,degO AIu?Ca http://deholexp.mizc.com/wp",
                "(c) ,!C2001|~ao!mx",
                "(c) ,(r)1/2oA A-'O http://www.acnnewswire.net/Article.Asp?lang",
                "(c) ,SSCI'A http://kysky.com",
                "(c) ,oua 1/2o+-o KM http://pm2.ww.to",
                "(c) ,oua http://jungti1234.netcci.net",
                "(c) ,oua http://sosa0sa.com",
                "(c) ,oua'O http://archmond.mizc.com/tt",
                "(c) - (r)e $?\" aPS$?\"$?\" http://www.newsru.com/world/03jan2006/knifer.html",
                "(c) -|n!Adeg\"dege|P\"AEA'+-o|VSSUY (c) U",
                "(c) . AI",
                "(c) . Y",
                "(c) . authors@template-toolkit.ru http://forum.template-toolkit.ru/view_topic/topic_id-44.html",
                "(c) 1/21... REBOOTED http://andore.com/money",
                "(c) 1/2A'U http://chisato.info/blog/index.php?pl",
                "(c) 1/2oDDOth2OIO br a http://www.softsea.net/cat/3.htm IuI31$?3/4ss /a a http://www.softsea.net/cat/305.htm IuI31UAi /a a http://www.softsea.net/cat/30514.htm",
                "(c) 1/4<<PE!PSEc1uPaO>>D (c) PO2",
                "(c) 13/4!O http://www.aozora.gr.jp/cards/000275/card45513.html",
                "(c) 13/4!O http://www.aozora.gr.jp/cards/000275/card45514.html",
                "(c) 13/4!O http://www.aozora.gr.jp/cards/000275/card4715.html",
                "(c) 1OOUWikiuAIoA?PS!xOE http://ccca.nctu.edu.tw/~hlb/tavi/WiKi",
                "(c) 1Uua$?B src http://www.beginnersrack.com/mt/images/20050429_soba.jpg",
                "(c) 1n2n?Th1/2n'U$?E$?A$?$?$?AE !C/ http://www.aozora.gr.jp/cards/001166/card43728.html' ?Th1/2n'UE!3U2degIA !C/ http://www.aozora.gr.jp/cards/001166/card43729.html",
                "(c) 1o,deg AI 1/2AdegPSAo A degE,(r)degUAo,, 1/2AAU,, CN'U,e 1 Ao AndegIdegO CO",
                "(c) 2$?PS$?H1D!BAEuo$?HAvao!y1/4E$?O|ae!deg!z$? (c) Y",
                "(c) 2E$?I OP! !E!C/AIEO21$?!PS+-oiEE!E http://www.aozora.gr.jp/cards/000020/card44722.html",
                "(c) 2uA http://10e.org/mt/archives/200512/280410.php http://10e.org/samcimg3/nekonekoneko.jpg",
                "(c) 3/4ss CN'U... http://kina.egloos.com/655614",
                "(c) 3IeU1nB src http://www.beginnersrack.com/mt/images/20050716_kisuke03.jpg",
                "(c) 3OCi IEo1P3AEo*- !x!O http://www.aozora.gr.jp/cards/000042/card42258.html",
                "(c) 3U!A http://furusatonoeki.cutegirl.jp/main/archives/001182.html",
                "(c) ?A$?I1/4Pedegi$?I EAI,oEaY iY $?Y o http://www.aivy.co.jp/BLOG_TEST/kobakoba/archives/003047.html",
                "(c) ?idegE http://klutzy.x-y.net",
                "(c) A $?IPS3PS2oiEE$?!,o3 $?u$?i$??$?3$?E$?E$?E$?e!EdegiI/$?I http://www.aozora.gr.jp/index_pages/person157.html",
                "(c) A <$?!PS2oiEE!E http://www.aozora.gr.jp/cards/000157/card45237.html'>",
                "(c) A IUnUi'Eu AIEuEIAuAEC/A*aeEB src http://www.beginnersrack.com/mt/images/20050811_sumi1.jpg",
                "(c) A |ae http://www.ebao.us/portal/showcontent.asp?INDEX",
                "(c) A$?AE+-eEnA*aAu http://px.a8.net/svt/ejp?a8mat",
                "(c) A1/2 http://www.cycle-yoshida.com/trek/nike/shoes/mtb/5kato3_page.htm",
                "(c) A3AIei (c)",
                "(c) A<<$?!PS2oiEE!E http://www.aozora.gr.jp/cards/000157/card45397.html'> oa$?EE3!EAEaAAEOAIdegAIo!E !C/ http://www.aozora.gr.jp/cards/000157/card45396.html'>",
                "(c) A<<$?I!C/!O http://www.aozora.gr.jp/cards/000157/card43482.html'> AUAC!1!EPS+-!E !x!O http://www.aozora.gr.jp/cards/000157/card43483.html'> AUAC!1!EPS2!E !x!O http://www.aozora.gr.jp/cards/000157/card43488.html' EUOO$?I i?A$?o x$?O !x!O http://www.aozora.gr.jp/cards/000157/card43489.html' I!,AdegiSS !x!O http://www.aozora.gr.jp/cards/000157/card43505.html",
                "(c) A<<$?I!C/PS,oiEE!E http://www.aozora.gr.jp/cards/000157/card45238.html'> 3AE?I?'uUAEa$?IEeuU !C/ http://www.aozora.gr.jp/cards/000157/card45379.html'> uOuiPoI? !C/ http://www.aozora.gr.jp/cards/000157/card45474.html' u'?'Eou'? !E1/4E1!E !C/ http://www.aozora.gr.jp/cards/000157/card45239.html",
                "(c) AAACiE (c)",
                "(c) AAe (c)",
                "(c) AAeAE WEd",
                "(c) AAw http://affiliate-school.com/products/letter.html target",
                "(c) AE!PS br a http://www.softsea.net/cat/3.htm IuI31$?3/4ss /a a http://www.softsea.net/cat/306.htm",
                "(c) AEAAIAo AaAI",
                "(c) AEC/lIU, (c) A",
                "(c) AEI1/2A* (c) B",
                "(c) AEnT~I..... http://andore.com/money/archives/003302.html",
                "(c) AIc (c)",
                "(c) AO,c u?E3 ?eA ue*AAO degIAI'U. +-x*A3/4ss CO",
                "(c) AU Ass CN",
                "(c) AU*-CAE (c) E",
                "(c) AU+-a 1/4?i?! ?APodeg! oA3/4ss CO",
                "(c) AU.",
                "(c) AUueAI PEdegdegAo",
                "(c) AUueAo AI",
                "(c) AUueAo AoY *I PEdegdegAo ?EA AOAo",
                "(c) AUueAo PEdegdegAo",
                "(c) AaAAYeUAi (c)",
                "(c) Aad (c)",
                "(c) Ac?I $?E$?I!C/ http://iriz.hanazono.ac.jp/frame/k_room_f1.html",
                "(c) Ae \"u !C/ http://www.aozora.gr.jp/cards/000157/card45240.html' 1/4c$?I$?A$?E$?a !C/ http://www.aozora.gr.jp/cards/000157/card45242.html' ?'u!I-EN$?oIA$?o !C/ http://www.aozora.gr.jp/cards/000157/card45243.html' 3/43|$?ED$?1$?e'NCdeg !C/ http://www.aozora.gr.jp/cards/000157/card45475.html",
                "(c) Ae,A !x!C/Y EY $?Y e!O http://www.aozora.gr.jp/cards/000009/card45340.html",
                "(c) AeHa (c)",
                "(c) Ai1c,|uae1/2e$?IBLOG2oAa http://artifact-jp.com/mt/archives/000472.html",
                "(c) Am (c)",
                "(c) Ao ,oCN'U Ao COdegauE",
                "(c) ApbAE (c)",
                "(c) Au IUAEnCIeAEai",
                "(c) B OEo1/2, L-IEzIaAUCUe Ch bvEm",
                "(c) B Pool Game",
                "(c) B http://sasuga.biz/pages/index.php?refid",
                "(c) BJoel on SoftwareICgEaA",
                "(c) BaAAE (c)",
                "(c) Bv",
                "(c) BvA*",
                "(c) C*P\"Y !C http://willythecop.blogspot.com",
                "(c) C/ 1996",
                "(c) C/ 2006",
                "(c) C/ 2006 PS(r)$?a",
                "(c) C/AE'PeBOExI http://px.a8.net/svt/ejp?a8mat",
                "(c) C/Y aa(r) Y a $?C/(r)Y -(r)PS\"!e\"a http://www.newsru.com/world/03jan2006/heli.html",
                "(c) CD Land",
                "(c) CIAEdeg MSAC Classified",
                "(c) CO",
                "(c) CSSUn (c)",
                "(c) Ca http://blog.bd-lab.com/blog/archives/000130.html Ao3 +-Y?aAI Au3a",
                "(c) Ca!ae,N Yxaae!iC, !o! O! eCa!,Oe http://money.rin.ru/content/news/?id",
                "(c) CaA AE'A, *13/4ioIA degCA(r)?A degI ?U?! CO",
                "(c) CaA CO",
                "(c) CaAU Audegi",
                "(c) Copyright 2005, Sharks.co.il",
                "(c) DA!a!aE<<ECAaAeEoAiIauAA(r)EuuA!PS IOEuAEPS!ACO1/2EIuAxOIa>>1oUOEAU http://www.blogcn.com/User14/xyl5400/blog/26093815.html",
                "(c) Dau (c)",
                "(c) E<<*1/2I>>+-\",ae http://www.coverer.com/archives/000830.shtml",
                "(c) EAE$?a$?AE,'$?1/2P H http://www.coolloud.org.tw/news/database/interface/detailstander.asp?ID",
                "(c) EAiE (c)",
                "(c) EDiETCgDi Hiro",
                "(c) EH http://tamuyou.haun.org/mt/archives/2006/01/post_383.html",
                "(c) EHEnAE (c)",
                "(c) ESSO!A (c) ESSOY",
                "(c) EY Ij",
                "(c) Eac Aaef",
                "(c) Eao (c)",
                "(c) Eao3B (c)",
                "(c) Ee (c)",
                "(c) EeAoq (c)",
                "(c) Eee ESS1/23eAeIAua$? (c) B",
                "(c) Eeg (c)",
                "(c) Eep, (c)",
                "(c) EmeEBu (c)",
                "(c) En (c)",
                "(c) EuL2a (c)",
                "(c) EvAEod (c)",
                "(c) FlAE (c)",
                "(c) H U3",
                "(c) H@ a?enALb'Aag|U*B uri http://www.sixapart.com/movabletype/' Movable Type",
                "(c) HAAIIGGEIAEi (c)",
                "(c) HAAId (c)",
                "(c) HOoeI (c)",
                "(c) HTML-$?(r)aa!Y a http://forum.template-toolkit.ru/view_topic/topic_id-88.html?rss",
                "(c) Hp X",
                "(c) HxA (c)",
                "(c) HxAE (c)",
                "(c) I\"IauAWi http://www.cnblog.org/blog/archives/2004_08_22_cnblog_archive.html",
                "(c) I3 3QPAZP-'PSY Xao",
                "(c) I3 Y",
                "(c) IA3!C*U!O|31/2i!C http://www.upsaid.com/isis/index.php?action",
                "(c) IAE~(r)uY ~?aAD1qPx http://www.coolloud.org.tw/news/database/interface/detailstander.asp?ID",
                "(c) IAOAiPS!O ODEyAaEu iOU?-uAED1/2o*OeuAACAEa!P http://blogbus.com/blogbus/blog/diary.php?diaryid",
                "(c) IAno (c)",
                "(c) ID1UA1/2 http://www.cnblog.org/blog/archives/2004_08_22_cnblog_archive.html",
                "(c) Ierd (c)",
                "(c) IoA3/4!E !C/ http://www.aozora.gr.jp/cards/001154/card44333.html",
                "(c) L FWaIoaXs J",
                "(c) Lionhard Technologies 2003",
                "(c) Lionhardt Technologies 2003, www.lionhardt.com/bb Wed, 04 Jan",
                "(c) M http://www.literature.org/authors/carroll-lewis/' Lewis Carroll",
                "(c) M-u (c)",
                "(c) M1960~1980|~Y Nao|e!voq|+-|W2ae/$?PS$?FAo Y!AY y e|3SSo$?W!K3/4d\"u|U",
                "(c) M2 Y",
                "(c) MY LIao",
                "(c) MdAAae (c)",
                "(c) N3/4-CAZNV GvdaIuAeAC/e http://ore-1gpy.cocolog-nifty.com",
                "(c) NOPhAE (c)",
                "(c) O$?E2n$?A$?AE$?$?Th$?*$?? http://akaname.main.jp/mt/archives/000127.html",
                "(c) O'1N!3/4N21O I?uiaCAia http://www.opentle.org/modules.php?op",
                "(c) O3 Y",
                "(c) OA!PEyI IA -O3/4!*dPS?AEuuAIoO*IaPSo http://mag.udn.com/mag/dc/make_rss.jsp' http://mag.udn.com/mag/dc/make_rss.jsp",
                "(c) OA1au$?yaoSSU u!nEr redete mit dem Vieh, den Vogeln und den Fischen King Solomon's Ring ^AP King Solomon's",
                "(c) OAAnPaE I",
                "(c) OPiaa (c)",
                "(c) OY H2",
                "(c) OY HAySSU",
                "(c) Oa,o*thInuAIoO3/4EC http://www.messagecast.net",
                "(c) OaD (c)",
                "(c) OdegAE (c)",
                "(c) OeI'uO o1/2th1yEEIauAPS!Oa2AECIOEuO,IyO,IAuA!PS zh rdf:resource http://b2evolution.net/?v",
                "(c) Oq (c)",
                "(c) O| http://www.acnnewswire.net/Article.Asp?lang",
                "(c) O|p|o O3y!H /p p a http://photos1.blogger.com/blogger/2953/388/1600/all.jpg",
                "(c) PS CUP3O?\"OssuAOOuUO 'IOUEO+-3/4IiEUE1OAATMIocuAE\"Au http://www.acnnewswire.net/Article.Asp?lang",
                "(c) PS!+-iIO3oE !PS br a http://www.softsea.net/cat/3.htm IuI31$?3/4ss /a a http://www.softsea.net/cat/303.htm IuI3OoC? /a a http://www.softsea.net/cat/30390.htm",
                "(c) PSC/ a$?\"\" http://www.aviaport.ru/news/2006/01/02/99276.html",
                "(c) PSoOD http://wiki.planetoid.info/index.php/WikiWiki' WikiWiki IoA?oI http://wiki.planetoid.info/index.php/WikiWatchList",
                "(c) PaOOOON-APSE1/2!PS br a http://www.softsea.net/cat/3.htm IuI31$?3/4ss /a a http://www.softsea.net/cat/304.htm deg2E<<*A>>$? /a a http://www.softsea.net/cat/30407.htm",
                "(c) PaOOxa2EEi1/4thIOOEOOA!PS br a http://www.softsea.net/cat/3.htm IuI31$?3/4ss /a a http://www.softsea.net/cat/309.htm 1/4OIY DYID /a a http://www.softsea.net/cat/30912.htm",
                "(c) Pao (c)",
                "(c) Pssn (c)",
                "(c) Qa-EOdwuBu (c)",
                "(c) R1B!n!@The Nature and Destiny of Man",
                "(c) RIcY (c)",
                "(c) Take IT",
                "(c) U. John",
                "(c) Uu (c)",
                "(c) Y $?Y a ae\"\" http://money.rin.ru/content/news/?id",
                "(c) ZuMao (c)",
                "(c) a http://konkurs.susu.ru",
                "(c) a http://www.amefoot.net/archives/2005/05/13_000876.html",
                "(c) a http://www.greek.ru/ru/news/news_detail.php?ID",
                "(c) a\"C/Y aa\"aY a http://susu.ac.ru",
                "(c) a(r)$?Y aa http://money.rin.ru/content/news/?id",
                "(c) a? http://andore.com/inami/mtarchives/003381.html",
                "(c) aA\"AE (c) 1AE",
                "(c) aA* (c) B",
                "(c) aA* (c) H",
                "(c) aA* (c) I",
                "(c) aAua$? (c) B",
                "(c) aAua$? (c) HH",
                "(c) aEaIAua$? (c) EH",
                "(c) aa\" (c) PS",
                "(c) aa(r) (c) Y",
                "(c) ae O!o!SS http://www.greek.ru/ru/news/news_detail.php?ID",
                "(c) ae ol li a http://www.tipilp.susu.ac.ru",
                "(c) agA1/2 (c) I",
                "(c) ao A$?lI!nMidnight's Children!U1981",
                "(c) assAAaaE AoI~AEEeUu1/2B http://www.moon-light.ne.jp/weblog/archives/2005/12/post_133.html http://www.moon-light.ne.jp/weblog/archives/2005/12/post_133.html",
                "(c) aueEC/a http://tamuyou.haun.org/mt/archives/2005/12/post_377.html",
                "(c) aueU1nB 2006-01-02",
                "(c) aueU1nEB 2006-01-03",
                "(c) aueU1naAE (c) E",
                "(c) authors@template-toolkit.ru http://forum.template-toolkit.ru/view_topic/topic_id-93.html Template Toolkit",
                "(c) authors@template-toolkit.ru http://forum.template-toolkit.ru/view_topic/topic_id-99.html Template Toolkit",
                "(c) c AgI(r)|I135.4A242.9Au1/2B http://www.moon-light.ne.jp/weblog/archives/2006/01/2005_2.html http://www.moon-light.ne.jp/weblog/archives/2006/01/2005_2.html",
                "(c) c http://itpro.nikkeibp.co.jp/free/NT/NEWS/20050225/1/",
                "(c) c http://www.topre.co.jp/products/comp/key_list.html",
                "(c) c\"euAPOaocuAA(r)!B src http://www.beginnersrack.com/mt/images/20050716_seapirafu03.jpg",
                "(c) c'iAAeIIlPEI (c) B",
                "(c) c1N2aossuA (c) E",
                "(c) c@ http://www.businessnetwork.co.jp/HTM/i-4.html' http://www.businessnetwork.co.jp/HTM/i-4.html",
                "(c) c@ http://www.teizouteiki.jp/contact.html' http://www.teizouteiki.jp/contact.html",
                "(c) cA Cga*aoeTCgEPUeIiA1/2u http://tanoshi.chance.com/reg_tanoshi.php?I",
                "(c) cAa$?@3B,E33/43o (c) O",
                "(c) cC$?1/4 SRC http://inkase.net/if/docomo.html",
                "(c) cC$?1/4I http://sasuga.biz/pages/index.php?refid",
                "(c) cC$?1/4o < http://www.cycle-surf.com/?ref 11'> SRC http://inkase.net/images/traffic/cycle.gif",
                "(c) cC$?1/4o http://www.motionlink.jp/clk.php?pt",
                "(c) cEEEEE http://tamuyou.haun.org/mt/archives/2005/12/post_379.html",
                "(c) cIpibx http://www.mag2.com/m/0000103697.htm",
                "(c) cao http://www.daihung.com/blog/?p",
                "(c) d$?SSP!'N13!OAy2yao+-D1/2m (c) MY",
                "(c) deg!uE+-i? http://jely.pe.kr/archives/2004/10/20041021_000236.html",
                "(c) degAAE (c) E",
                "(c) degO!A*iuM!O (c) MY",
                "(c) degi3/4uI*PS!u<<ECe|2>>NUe$?!PS!P http://www.blogchina.com/new/display/57469.html",
                "(c) e 'a!AdegN P 'aY AP!oE1iY PTAp*u! Hong Kong People's Alliance",
                "(c) e e!nPortnoy's Complaint!U1969",
                "(c) e http://webryblog.biglobe.ne.jp/2/d/2d5396c6b9.html",
                "(c) e http://webryblog.biglobe.ne.jp/7/5/75575704c2.html",
                "(c) e\" (c) SS",
                "(c) e\"|O\"eOO\" OconAE DiOO\" *o| O*\" http://music.peeps.ru",
                "(c) e(r)*PW1L$?@$?d|WdegN P (c) MY Y",
                "(c) e+-AEaA U*B\" http://www.monsterhunter.us/beastof7chutes/creatureOriginal-message.jpg",
                "(c) e+-AEaA eIAua$? (c) B",
                "(c) e+-AEaoe (c) AEB",
                "(c) eAEAu http://fudemame-guide.com/fude15/faq/fmF15106.html",
                "(c) eE-uAISEI (c) E",
                "(c) eEue1/2 http://px.a8.net/svt/ejp?a8mat",
                "(c) eIAua$? (c) H",
                "(c) eU*B src http://clickablewords.com/archives/img/yomo_051020.jpg",
                "(c) eaOOc, a\"o\"O http://money.rin.ru/content/news/?id",
                "(c) eaY (c) Y",
                "(c) g(r)R'Nn?o$?F!I!v!A (c) OY",
                "(c) http://andore.com/money/archives/003398.html",
                "(c) http://azoz.org/archives/200512031633.php alt 05120301.jpg src http://azoz.org/archives/pic/05120301.jpg",
                "(c) http://blog.mlmaster.com/?p",
                "(c) http://ch.kitaguni.tv/u/8280",
                "(c) http://contents-factory.com/blog/archives/200511301334.php",
                "(c) http://flickr.com",
                "(c) http://forum.template-toolkit.ru/view_topic/topic_id-115.html?rss",
                "(c) http://furusatonoeki.cutegirl.jp/main/archives/001172.html",
                "(c) http://kapranoff.ru/archives/003650.html",
                "(c) http://nanana.moo.jp/archives/000922.html Y ThY",
                "(c) http://susu.ac.ru/gerb2.gif",
                "(c) http://www.acnnewswire.net/Article.Asp?lang",
                "(c) http://www.bphrs.net/mesi/archives/2005/04/post_110.html",
                "(c) http://www.bphrs.net/mesi/archives/2005/07/post_116.html",
                "(c) http://www.newsru.com/crime/03jan2006/germanz.html",
                "(c) http://www.newsru.com/crime/03jan2006/minsk.html",
                "(c) http://www.pinkupa.com/cgi-bin/weblog/archives/000611.php",
                "(c) http://www.pinkupa.com/cgi-bin/weblog/archives/000616.php",
                "(c) iO http://10e.org/mt/archives/200512/280341.php http://anime.livedoor.com/theater/2.html",
                "(c) jao C!K!nThe Prime of Miss Jean Brodie!U1961",
                "(c) l$?F2A$?GO!G\"AE!M|W|rY s!m http://blog.yam.com/youandme/' \"S|3|W|rao\"k$?kY D\"$? !n |y!O2A$?@O!G\"AE!m http://pingfandegushi.blogspot.com/",
                "(c) l+-u\"u3o|W http://www.ebao.us/portal/showcontent.asp?INDEX",
                "(c) lEEe (c) AE",
                "(c) lPi$?JotAAdege!A1962|~otY Xao!iau",
                "(c) mp3A'IyIyPS!*C/IO!PEc1uODO Ii!* 12 'i http://cappuccinos.3322.org/wp-commentsrss2.php?p",
                "(c) n(r)a (c) M",
                "(c) nEJW (c) EHI",
                "(c) nPEE|U (c) T",
                "(c) o (c) P",
                "(c) o a http://www.pots.com.tw",
                "(c) o aSS1I http://www.coolloud.org.tw/news/database/interface/detailstander.asp?ID",
                "(c) o$?@$?e$?@$?e$?W$?E$?Q(r)EA |ae http://www.ebao.us/portal/showcontent.asp?INDEX",
                "(c) o*R+-!!B$?H (c) EY",
                "(c) o, (c) MY",
                "(c) o1/4!Y http://artifact-jp.com",
                "(c) o1998|~07$?eP!?iY X$?FY Y !o$?@|E$?j^$?a$?p !!C3oY /+-AE|W(r)N3ae$?@$?1/2Y",
                "(c) o3oY /ICASHao$?oSSta Y iY H\"PS a http://www.wretch.cc/blog/iamryan",
                "(c) oSS http://music.peeps.ru/news/s/2003/03/12/1366.html",
                "(c) oW3Ooo' W3Ooo http://www.coolloud.org.tw",
                "(c) pAh (c) ASSU",
                "(c) sY (c) OY",
                "(c) u (c) OY",
                "(c) u (c) OY H",
                "(c) u 1/2NY Y oY ?!1/4 http://www.ycf.nanet.co.jp/~dre/cgi-bin/diary/archives/000422.html",
                "(c) u http://www.coolloud.org.tw/news/database/interface/detailstander.asp?ID",
                "(c) u(r)EP!!A3/4aO$?$?AI|x'o (c) M",
                "(c) u1AoCI degIAI AIdegPSAC ,A*AI+-auu CO degIAI'U.",
                "(c) u2oAuIa http://club.h14m.org/kenji/diary/?200512b",
                "(c) uA\"AE (c) R",
                "(c) uA1OOUGoogleOA -uADAIC http://www.coverer.com/archives/000832.shtml",
                "(c) uAA!EINuE1/2AD+-i http://www.w3cn.org/article/tips/2005/116.html",
                "(c) uAe (c) PY",
                "(c) uIEC/ (c) EHI",
                "(c) uUAae47nu R haUa 3eUu1/2B http://www.moon-light.ne.jp/weblog/archives/2006/01/47_1.html http://www.moon-light.ne.jp/weblog/archives/2006/01/47_1.html",
                "(c) ua CCAU cA* http://xenix.egloos.com/1213811",
                "(c) uu?i 1/41o 2003",
                "(c) uu?i 1/41o 2003A Intel",
                "(c) uu?i 2003A",
                "(c) uu?i XP*I AE/,aCO http://jowchung.oolim.net/index.php?pl",
                "(c) v+-D1IAe|b (c) T",
                "(c) w'Au AASSQY",
                "(c) w+-uoTh1/4OY I!C http://www.coolloud.org.tw/news/database/interface/detailstander.asp?ID",
                "(c) xi'ouA+-PS $?,uEuEuEuE... br a http://www.softsea.net/cat/3.htm IuI31$?3/4ss /a a http://www.softsea.net/cat/303.htm IuI3OoC? /a a http://www.softsea.net/cat/30305.htm",
                "(c) |U* (c) H",
                "(c), 1998 br",
                "AdegeP dege!o (c) Ao",
                "CIAth ?uA,PoA (c)",
                "CN1o o,? (c) AOdegi",
                "Copyright (c) 1991, 1999 Free Software Foundation, Inc.",
                "Copyright (c) 1998 the Initial Developer",
                "Copyright (c) 2001 the Initial Developer",
                "Copyright (c) 2004-2005",
                "Copyright (c) 2005 AmbitUSA Inc.",
                "Copyright (c) 2005 Carshops",
                "Copyright (c) 2005 the Initial Developer",
                "Copyright (c) 2005, CigarMinds Kft. 2006",
                "Copyright (c) 2005, E",
                "Copyright (c) 2005, accessoriesbrand u BLOOMj",
                "Copyright (c) 2005, ambits",
                "Copyright (c) 2005, b-admin",
                "Copyright (c) 2005, beaut",
                "Copyright (c) 2005, dogsinn",
                "Copyright (c) 2005, kabunavi",
                "Copyright (c) 2005, majo",
                "Copyright (c) 2005, seicha",
                "Copyright (c) 2005, shusaku",
                "Copyright (c) 2005, takako",
                "Copyright (c) 2005, takato",
                "Copyright (c) 2005, usukage",
                "Copyright (c) 2005, wasshari",
                "Copyright (c) 2006 Herczeg Jozsef Tamas Wed",
                "Copyright (c) 2006, AND0",
                "Copyright (c) 2006, Grebeweb",
                "Copyright (c) 2006, overQ",
                "Copyright (c) 2006, y-moto",
                "Copyright 1999-2004, Slavei Karadjov slaff@linux-bg.org support@linux-bg.org",
                "Copyright 2001, Nikolay Hristov",
                "Copyright 2003, Greenline, Kazan, Russia Wed",
                "Copyright 2003-2005 A Muvelodes Haza - Sarospatak http://www.sarospatak.hu/muvhaz/ Sarospataki",
                "Copyright 2003-2006, sHaMaLt shamalt@shamalt.tk",
                "Copyright 2004 Mon",
                "Copyright 2004 Sun",
                "Copyright 2005",
                "Copyright 2005 Dow Jones & Company, Inc.",
                "Copyright 2005 Thu",
                "Copyright 2005 Tue",
                "Copyright 2005 Wed",
                "Copyright 2005 rdf:resource http://blog.empas.com",
                "Copyright 2005 url http://wordpress.org",
                "Copyright 2005, ACN Newswire corp@asiacorpnet.com tim.mckinnon@asiacorpnet.com",
                "Copyright 2006 Mon",
                "Copyright 2006, C IAOOAIDINEEC - D. AEAIAOEAACO OEA A.A. webmaster@naftemporiki.gr Wed, 4 Jan",
                "Ee (c) EAEvAACAEe",
                "Hx wCnE$?iaeU* (c) Hx",
                "IPueTVcd (c) (c)",
                "O-o (c) I3",
                "OOaacOAEc. (c) Oc",
                "Oa (c) (c)",
                "SINFLAIae (c) (c)",
                "SSea aaaae\" (c) Perl",
                "UAEIOa (c) (c)",
                "UnionPayPS (c) Ie3EATMIo1ODOeuAC (c)",
                "copyright 2015, Mark Pilgrim, Dan Blanchard, Ian Cordasco",
                "copyright BBCHungarian.com",
                "copyright rules http://www.bbc.co.uk/go/wsy/pub/rss/1.0/-/hungarian/learningenglish/witn/2005/05/050527_google.shtml",
                "copyrighted by the Free Software Foundation"
            ],
            "file-count": 451,
            "sha256": "84ab92ed1c4d4f16916e05906b6b75a6c0fb5db821cc65e70cbd64a3e2a5eaae",
            "source": "https://files.pythonhosted.org/packages/fc/bb/a5768c230f9ddb03acc9ef3f0d4a3cf93462473795d18e9535498c8f929d/chardet-3.0.4.tar.gz",
            "status": "restricted"
        }
    ]
}
