{
    "id": "npm/npmjs/@octokit/types/2.11.1",
    "license": "MIT",
    "licenses-discovered": [
        "MIT"
    ],
    "copyrights": [
        "Copyright (c) 2019 Octokit"
    ],
    "file-count": 25,
    "scancode-version": "31.2.1",
    "authority": "https://gitlab.eclipse.org/eclipsefdn/emo-team/iplab/-/issues/4558",
    "source": "https://registry.npmjs.org/@octokit/types/-/types-2.11.1.tgz",
    "status": "approved"
}