{
    "id": "maven/mavencentral/org.flowable/flowable-entitylink-service-api/6.8.0",
    "license": "Apache-2.0",
    "authority": "https://gitlab.eclipse.org/eclipsefdn/emo-team/iplab/-/issues/6443",
    "source": "https://search.maven.org/remotecontent?filepath=org/flowable/flowable-entitylink-service-api/6.8.0/flowable-entitylink-service-api-6.8.0-sources.jar",
    "status": "approved",
    "scans": [
        {
            "date": "January 23, 2023 at 8:19:18 p.m. GMT",
            "authority": "https://gitlab.eclipse.org/eclipsefdn/emo-team/iplab/-/issues/6443",
            "scancode-version": "31.2.1",
            "licenses-discovered": [
                "Apache-2.0"
            ],
            "copyrights": [
            ],
            "file-count": 10,
            "sha256": "66641fb332b904278f14cac4ccf3f825b730d8b57b9d2ea9838efa0cc4b0329f",
            "source": "https://search.maven.org/remotecontent?filepath=org/flowable/flowable-entitylink-service-api/6.8.0/flowable-entitylink-service-api-6.8.0-sources.jar",
            "status": "approved"
        }
    ]
}