{
    "id": "npm/npmjs/-/node-fetch-native/1.2.0",
    "license": "MIT",
    "authority": "https://gitlab.eclipse.org/eclipsefdn/emo-team/iplab/-/issues/9052",
    "source": "https://registry.yarnpkg.com/node-fetch-native/-/node-fetch-native-1.2.0.tgz",
    "status": "approved",
    "scans": [
        {
            "date": "June 15, 2023 at 4:36:42 p.m. GMT",
            "authority": "https://gitlab.eclipse.org/eclipsefdn/emo-team/iplab/-/issues/9052",
            "scancode-version": "31.2.1",
            "licenses-discovered": [
                "MIT"
            ],
            "copyrights": [
                "Copyright (c) Pooya Parsa <pooya@pi0.io>",
                "copyright 2015 Toru Nagashima"
            ],
            "file-count": 20,
            "sha256": "188c773c84aaf0fbc70e2509f987da9d4d53af70427dffb6089249643cb72513",
            "source": "https://registry.yarnpkg.com/node-fetch-native/-/node-fetch-native-1.2.0.tgz",
            "status": "approved"
        }
    ]
}