{
    "id": "npm/npmjs/@typescript-eslint/visitor-keys/8.18.0",
    "license": "MIT AND (BSD-2-Clause AND ISC AND MIT) AND BSD-2-Clause",
    "authority": "https://gitlab.eclipse.org/eclipsefdn/emo-team/iplab/-/issues/17784",
    "source": "https://github.com/typescript-eslint/typescript-eslint/archive/refs/tags/v8.18.0.zip",
    "status": "approved",
    "scans": [
        {
            "date": "December 10, 2024 at 6:01:20 p.m. GMT",
            "authority": "https://gitlab.eclipse.org/eclipsefdn/emo-team/iplab/-/issues/17784",
            "scancode-version": "31.2.1",
            "licenses-discovered": [
                "MIT",
                "BSD-2-Clause AND ISC AND MIT",
                "BSD-2-Clause"
            ],
            "copyrights": [
                "(c) Sindre Sorhus",
                "Copyright (c) 2016 unional",
                "Copyright (c) 2019 typescript-eslint and other contributors",
                "Copyright (c) 2021 typescript-eslint and other contributors",
                "Copyright (c) 2023 typescript-eslint and other contributors",
                "Copyright (c) Facebook, Inc. and its affiliates",
                "Copyright Jeremy Ashkenas, DocumentCloud and Investigative Reporters & Editors",
                "Copyright Joyent, Inc. and other Node contributors",
                "Copyright OpenJS Foundation and other contributors <https://openjsf.org/>",
                "Pp (c) Ac",
                "Tv (c) Gn"
            ],
            "file-count": 7796,
            "sha256": "d763db947904b1e42628c4953d412b10cd8a197029356076c82f0605e3f7ee38",
            "source": "https://github.com/typescript-eslint/typescript-eslint/archive/refs/tags/v8.18.0.zip",
            "status": "approved"
        }
    ]
}