{
    "id": "maven/mavencentral/org.bouncycastle/bcutil-jdk18on/1.76",
    "license": "MIT",
    "authority": "https://gitlab.eclipse.org/eclipsefdn/emo-team/iplab/-/issues/9828",
    "source": "https://repo.maven.apache.org/maven2/org/bouncycastle/bcutil-jdk18on/1.76/bcutil-jdk18on-1.76-sources.jar",
    "status": "approved",
    "scans": [
        {
            "date": "July 31, 2023 at 9:00:27 a.m. GMT",
            "authority": "https://gitlab.eclipse.org/eclipsefdn/emo-team/iplab/-/issues/9828",
            "scancode-version": "31.2.1",
            "licenses-discovered": [
            ],
            "copyrights": [
            ],
            "file-count": 488,
            "sha256": "897cc65df5e79dfc31add6a61016b189d51718bc5e914bc78cb0948c45327b14",
            "source": "https://repo.maven.apache.org/maven2/org/bouncycastle/bcutil-jdk18on/1.76/bcutil-jdk18on-1.76-sources.jar",
            "status": "restricted"
        }
    ]
}
