{
    "id": "npm/npmjs/-/vue-cli-plugin-vuestic-ui/1.0.11",
    "license": "MIT",
    "authority": "https://gitlab.eclipse.org/eclipsefdn/emo-team/iplab/-/issues/7435",
    "source": "https://registry.yarnpkg.com/vue-cli-plugin-vuestic-ui/-/vue-cli-plugin-vuestic-ui-1.0.11.tgz",
    "status": "approved",
    "scans": [
        {
            "date": "March 22, 2023 at 10:38:08 a.m. GMT",
            "authority": "https://gitlab.eclipse.org/eclipsefdn/emo-team/iplab/-/issues/7435",
            "scancode-version": "31.2.1",
            "licenses-discovered": [
                "MIT"
            ],
            "copyrights": [
            ],
            "file-count": 15,
            "sha256": "6862d5ade80f1b8360aa09c514afcca92d1bfec468a3bce1772a1fe8209a8df2",
            "source": "https://registry.yarnpkg.com/vue-cli-plugin-vuestic-ui/-/vue-cli-plugin-vuestic-ui-1.0.11.tgz",
            "status": "approved"
        }
    ]
}