{
    "id": "go/golang/google.golang.org/protobuf/v1.22.0",
    "license": "BSD-3-Clause",
    "authority": "https://gitlab.eclipse.org/eclipsefdn/emo-team/iplab/-/issues/5696",
    "source": "https://proxy.golang.org/google.golang.org/protobuf/@v/v1.22.0.zip",
    "status": "approved",
    "scans": [
        {
            "date": "December 12, 2022 at 11:21:55 p.m. GMT",
            "authority": "https://gitlab.eclipse.org/eclipsefdn/emo-team/iplab/-/issues/5696",
            "scancode-version": "31.2.1",
            "licenses-discovered": [
                "BSD-3-Clause"
            ],
            "copyrights": [
                "Copyright (c) 2018 The Go Authors",
                "Copyright 2008 Google Inc.",
                "Copyright 2018 The Go Authors",
                "Copyright 2019 The Go Authors",
                "Copyright 2020 The Go Authors",
                "Copyright d d d d Google Inc",
                "Copyright d d d d The Go Authors"
            ],
            "file-count": 414,
            "sha256": "52757d6a9b7b8b2006668030846f69cfa39241cc4ec4991c57e6266c9949a239",
            "source": "https://proxy.golang.org/google.golang.org/protobuf/@v/v1.22.0.zip",
            "status": "approved"
        }
    ]
}