{
    "id": "npm/npmjs/@microsoft/applicationinsights-core-js/2.8.4",
    "license": "MIT",
    "licenses-discovered": [
        "MIT"
    ],
    "copyrights": [
        "Copyright (c) Microsoft Corporation",
        "Copyright (c) Microsoft and contributors"
    ],
    "file-count": 221,
    "scancode-version": "30.1.0",
    "authority": "https://gitlab.eclipse.org/eclipsefdn/emo-team/iplab/-/issues/3280",
    "source": "https://registry.npmjs.org/@microsoft/applicationinsights-core-js/-/applicationinsights-core-js-2.8.4.tgz",
    "status": "approved"
}