{
    "id": "npm/npmjs/@typescript-eslint/eslint-plugin/8.8.0",
    "license": "BSD-2-Clause AND MIT AND (BSD-2-Clause AND ISC AND MIT)",
    "authority": "https://gitlab.eclipse.org/eclipsefdn/emo-team/iplab/-/issues/16481",
    "source": "https://github.com/typescript-eslint/typescript-eslint/archive/refs/tags/v8.8.0.zip",
    "status": "approved",
    "scans": [
        {
            "date": "October 8, 2024, 9:13:33 a.m. GMT",
            "authority": "https://gitlab.eclipse.org/eclipsefdn/emo-team/iplab/-/issues/16481",
            "scancode-version": "31.2.1",
            "licenses-discovered": [
                "BSD-2-Clause",
                "MIT",
                "BSD-2-Clause AND ISC AND MIT"
            ],
            "copyrights": [
                "(c) Sindre Sorhus",
                "Copyright (c) 2016 unional",
                "Copyright (c) 2019 typescript-eslint and other contributors",
                "Copyright (c) 2021 typescript-eslint and other contributors",
                "Copyright (c) 2023 typescript-eslint and other contributors",
                "Copyright (c) Facebook, Inc. and its affiliates",
                "Copyright JS Foundation and other contributors, https://js.foundation",
                "Copyright Jeremy Ashkenas, DocumentCloud and Investigative Reporters & Editors",
                "Copyright Joyent, Inc. and other Node contributors",
                "Copyright OpenJS Foundation and other contributors <https://openjsf.org/>",
                "Pp (c) Ac",
                "Tv (c) Gn"
            ],
            "file-count": 7618,
            "sha256": "f65524cdb2beed9a595dca1fc040963d9107894464b1a45c30041ebdf9ab1787",
            "source": "https://github.com/typescript-eslint/typescript-eslint/archive/refs/tags/v8.8.0.zip",
            "status": "approved"
        }
    ]
}