{
    "id": "maven/mavencentral/org.geotools/gt-process/30.4",
    "license": "LGPL-2.1-only",
    "authority": "https://gitlab.eclipse.org/eclipsefdn/emo-team/iplab/-/issues/15568",
    "source": "https://repo.osgeo.org/repository/geotools-releases/org/geotools/gt-process/30.4/gt-process-30.4-sources.jar",
    "status": "approved",
    "scans": [
        {
            "date": "July 3, 2024 at 2:32:19 p.m. GMT",
            "authority": "https://gitlab.eclipse.org/eclipsefdn/emo-team/iplab/-/issues/15568",
            "scancode-version": "31.2.1",
            "licenses-discovered": [
                "LGPL-2.1-only"
            ],
            "copyrights": [
                "(c) 2007 TOPP - www.openplans.org",
                "(c) 2008, Open Source Geospatial Foundation",
                "(c) 2008-2016, Open Source Geospatial Foundation",
                "(c) 2009, Open Source Geospatial Foundation",
                "(c) 2009-2011, Open Source Geospatial Foundation",
                "(c) 2011-2012, Open Source Geospatial Foundation",
                "(c) 2016, Open Source Geospatial Foundation",
                "(c) 2019, Open Source Geospatial Foundation"
            ],
            "file-count": 38,
            "sha256": "2bbd3739ed1b56a0b079ef5e4142b4bd49b4a587a8349138c42344f4ca1d636e",
            "source": "https://repo.osgeo.org/repository/geotools-releases/org/geotools/gt-process/30.4/gt-process-30.4-sources.jar",
            "status": "approved"
        }
    ]
}