{
    "id": "maven/mavencentral/org.apache.shiro/shiro-lang/1.10.0",
    "license": "Apache-2.0 AND Beerware",
    "licenses-discovered": [
        "Apache-2.0",
        "Apache-2.0 AND Beerware"
    ],
    "copyrights": [
    ],
    "file-count": 31,
    "scancode-version": "31.2.1",
    "authority": "https://gitlab.eclipse.org/eclipsefdn/emo-team/iplab/-/issues/3806",
    "source": "https://search.maven.org/remotecontent?filepath=org/apache/shiro/shiro-lang/1.10.0/shiro-lang-1.10.0-sources.jar",
    "status": "approved"
}
