{
    "id": "maven/mavencentral/org.apache.arrow/arrow-memory-netty-buffer-patch/18.1.0",
    "license": "Apache-2.0",
    "authority": "https://gitlab.eclipse.org/eclipsefdn/emo-team/iplab/-/issues/17687",
    "source": "https://repo1.maven.org/maven2/org/apache/arrow/arrow-memory-netty-buffer-patch/18.1.0/arrow-memory-netty-buffer-patch-18.1.0-sources.jar",
    "status": "approved",
    "scans": [
        {
            "date": "December 4, 2024 at 2:25:51 p.m. GMT",
            "authority": "https://gitlab.eclipse.org/eclipsefdn/emo-team/iplab/-/issues/17687",
            "scancode-version": "31.2.1",
            "licenses-discovered": [
                "Apache-2.0"
            ],
            "copyrights": [
            ],
            "file-count": 11,
            "sha256": "ef22d12cd2c7f250373e381db176657eceb0be2fd3b01abc85e8c2f41feb970b",
            "source": "https://repo1.maven.org/maven2/org/apache/arrow/arrow-memory-netty-buffer-patch/18.1.0/arrow-memory-netty-buffer-patch-18.1.0-sources.jar",
            "status": "approved"
        }
    ]
}