{
    "id": "npm/npmjs/@typescript-eslint/types/5.49.0",
    "license": "BSD-2-Clause AND MIT",
    "authority": "https://gitlab.eclipse.org/eclipsefdn/emo-team/iplab/-/issues/7080",
    "source": "https://github.com/typescript-eslint/typescript-eslint/archive/v5.49.0.zip",
    "status": "approved",
    "scans": [
        {
            "date": "February 9, 2023 at 4:48:59 p.m. GMT",
            "authority": "https://gitlab.eclipse.org/eclipsefdn/emo-team/iplab/-/issues/7080",
            "scancode-version": "31.2.1",
            "licenses-discovered": [
                "BSD-2-Clause",
                "MIT"
            ],
            "copyrights": [
                "Copyright (c) 2016 unional",
                "Copyright (c) 2019 typescript-eslint and other contributors",
                "Copyright (c) 2021 typescript-eslint and other contributors",
                "Copyright JS Foundation and other contributors, https://js.foundation",
                "Copyright Joyent, Inc. and other Node contributors"
            ],
            "file-count": 5167,
            "sha256": "f91614b09c879cf1b2d14c02ef7d27346875f2b35ec045b6e0f42aae98febd33",
            "source": "https://github.com/typescript-eslint/typescript-eslint/archive/v5.49.0.zip",
            "status": "approved"
        }
    ]
}