{
    "id": "npm/npmjs/-/rxjs-compat/6.3.3",
    "license": "Apache-2.0",
    "licenses-discovered": [
        "Apache-2.0",
        "AGPL-3.0-or-later AND Apache-2.0"
    ],
    "copyrights": [
        "(c) this.destination.error",
        "(c) this.destination.next",
        "Copyright (c) Google, Inc., Netflix, Inc., Microsoft Corp. and contributors",
        "Copyright (c) Microsoft Corporation"
    ],
    "file-count": 3128,
    "scancode-version": "30.1.0",
    "authority": "https://gitlab.eclipse.org/eclipsefdn/emo-team/iplab/-/issues/2883",
    "source": "https://registry.npmjs.org/rxjs-compat/-/rxjs-compat-6.3.3.tgz",
    "status": "approved"
}
