{
    "id": "maven/mavencentral/org.geotools.xsd/gt-xsd-core/28.0",
    "license": "LGPL-2.1-only",
    "authority": "https://gitlab.eclipse.org/eclipsefdn/emo-team/iplab/-/issues/6537",
    "source": "https://repo.osgeo.org/repository/geotools-releases/org/geotools/xsd/gt-xsd-core/28.0/gt-xsd-core-28.0-sources.jar",
    "status": "approved",
    "scans": [
        {
            "date": "January 26, 2023 at 5:11:00 a.m. GMT",
            "authority": "https://gitlab.eclipse.org/eclipsefdn/emo-team/iplab/-/issues/6537",
            "scancode-version": "31.2.1",
            "licenses-discovered": [
                "LGPL-2.1-only"
            ],
            "copyrights": [
                "(c) 2002-2008, Open Source Geospatial Foundation",
                "(c) 2002-2009, Open Source Geospatial Foundation",
                "(c) 2002-2010, Open Source Geospatial Foundation",
                "(c) 2002-2011, Open Source Geospatial Foundation",
                "(c) 2002-2012, Open Source Geospatial Foundation",
                "(c) 2002-2014, Open Source Geospatial Foundation",
                "(c) 2002-2015, Open Source Geospatial Foundation",
                "(c) 2002-2016, Open Source Geospatial Foundation",
                "(c) 2007-2008, Open Source Geospatial Foundation",
                "(c) 2008, Open Source Geospatial Foundation",
                "(c) 2009-2015, Open Source Geospatial Foundation",
                "(c) 2012-2015, Open Source Geospatial Foundation",
                "(c) 2019, Open Source Geospatial Foundation"
            ],
            "file-count": 197,
            "sha256": "d9500c832eb5f7566db12f504c09bba1dbdea3cfd2e8c46b98918fe353c01d8b",
            "source": "https://repo.osgeo.org/repository/geotools-releases/org/geotools/xsd/gt-xsd-core/28.0/gt-xsd-core-28.0-sources.jar",
            "status": "approved"
        }
    ]
}