{
    "id": "maven/mavencentral/com.trilead/trilead-ssh2/1.0.0-build221",
    "license": "MIT AND RSA-MD",
    "licenses-discovered": [
        "MIT",
        "RSA-MD"
    ],
    "file-count": 129,
    "scancode-version": "30.1.0",
    "authority": "https://gitlab.eclipse.org/eclipsefdn/emo-team/iplab/-/issues/2160",
    "source": "https://search.maven.org/remotecontent?filepath=com/trilead/trilead-ssh2/1.0.0-build221/trilead-ssh2-1.0.0-build221-sources.jar",
    "status": "restricted"
}