{
    "id": "maven/mavencentral/io.fabric8/openshift-model-whereabouts/6.8.0",
    "license": "Apache-2.0",
    "authority": "https://gitlab.eclipse.org/eclipsefdn/emo-team/iplab/-/issues/9729",
    "source": "https://repo.maven.apache.org/maven2/io/fabric8/openshift-model-whereabouts/6.8.0/openshift-model-whereabouts-6.8.0-sources.jar",
    "status": "approved",
    "scans": [
        {
            "date": "July 26, 2023 at 3:49:00 a.m. GMT",
            "authority": "https://gitlab.eclipse.org/eclipsefdn/emo-team/iplab/-/issues/9729",
            "scancode-version": "31.2.1",
            "licenses-discovered": [
                "Apache-2.0"
            ],
            "copyrights": [
                "Copyright (c) 2015 Red Hat, Inc."
            ],
            "file-count": 29,
            "sha256": "c3cdfd523e30f4b1ce34da1f259126ac41d22fe54c047946f5b9d1435777b6ae",
            "source": "https://repo.maven.apache.org/maven2/io/fabric8/openshift-model-whereabouts/6.8.0/openshift-model-whereabouts-6.8.0-sources.jar",
            "status": "approved"
        }
    ]
}