{
    "id": "npm/npmjs/-/keycloak-js/22.0.4",
    "license": "Apache-2.0 AND MIT AND EPL-1.0 AND LicenseRef-scancode-oasis-ws-security-spec AND W3C AND LicenseRef-scancode-ws-policy-specification AND W3C AND W3C-19980720 AND (AFL-2.1 OR LGPL-2.0-only) AND (Apache-2.0 AND MIT) AND (Apache-2.0 AND MIT)",
    "authority": "https://gitlab.eclipse.org/eclipsefdn/emo-team/iplab/-/issues/11663",
    "source": "https://github.com/keycloak/keycloak/archive/refs/tags/22.0.4.zip",
    "status": "approved",
    "scans": [
        {
            "date": "November 22, 2023 at 1:07:11 p.m. GMT",
            "authority": "https://gitlab.eclipse.org/eclipsefdn/emo-team/iplab/-/issues/11663",
            "scancode-version": "31.2.1",
            "licenses-discovered": [
                "Apache-2.0",
                "Apache-2.0 AND GPL-2.0-or-later",
                "EPL-1.0 AND LGPL-2.1-only",
                "LicenseRef-scancode-public-domain-disclaimer",
                "MIT",
                "BSD-2-Clause AND BSD-3-Clause AND CC-BY-2.5 AND FSFAP AND MPL-2.0",
                "BSD-3-Clause AND MIT",
                "Apache-2.0 AND LGPL-2.0-or-later",
                "AFL-2.1 AND AFL-3.0 AND LGPL-2.0-only",
                "EPL-1.0",
                "W3C-19980720",
                "LicenseRef-scancode-oasis-ws-security-spec",
                "W3C",
                "LicenseRef-scancode-ws-policy-specification",
                "Apache-2.0 AND LicenseRef-scancode-bitzi-pd",
                "Apache-2.0 AND MIT",
                "Apache-2.0 AND MIT AND MPL-1.0"
            ],
            "copyrights": [
                "(c) 1998 VeriSign, Inc.",
                "(c) 1999 Entrust.net Limited1301 Entrust.net Certification",
                "(c) 1999 VeriSign, Inc.",
                "(c) 2001-2006 BEA Systems Inc., International Business Machines Corporation, Microsoft Corporation, Inc., SAP AG, Sonic Software, and VeriSign, Inc.",
                "(c) 2006 Entrust",
                "(c) 2006 VeriSign, Inc.",
                "(c) 2006 thawte, Inc.",
                "(c) 2007 GeoTrust Inc.",
                "(c) 2007 VeriSign, Inc.",
                "(c) 2007 thawte, Inc.",
                "(c) 2008 GeoTrust Inc.",
                "(c) 2008 VeriSign, Inc.",
                "(c) 2008 thawte, Inc.",
                "(c) 2009 Entrust, Inc. - for",
                "(c) 2010-2012 Google, Inc. http://angularjs.org",
                "(c) 2010-2014 Google, Inc. http://angularjs.org",
                "(c) 2011 Red Hat Inc.",
                "(c) 2012 Entrust, Inc. - for",
                "(c) 2012 Red Hat Inc.",
                "(c) 2013 Red Hat Inc.",
                "(c) 2014 Red Hat Inc.",
                "(c) 2015 Red Hat Inc.",
                "(c) 2016 Red Hat Inc.",
                "(c) 2018 Red Hat Inc.",
                "(c) 2019 Red Hat Inc.",
                "(c) Aral",
                "Copyright (c) 1991 Free Software Foundation, Inc.",
                "Copyright (c) 2003-2004 Lawrence E. Rosen",
                "Copyright (c) 2005 World Wide Web Consortium",
                "Copyright (c) 20051'0 OISTE Foundation",
                "Copyright (c) 2006 Google Inc.",
                "Copyright (c) 2009, Sun Microsystems, Inc.",
                "Copyright (c) Frank Appel 2016-2021",
                "Copyright (c) OASIS Open 2002-2004",
                "Copyright (c) OASIS Open 2002-2006",
                "Copyright 2001 The Internet Society and W3C (Massachusetts Institute of Technology, Institut National de Recherche en Informatique et en Automatique, Keio University)",
                "Copyright 2001-2005 The Apache Software Foundation",
                "Copyright 2002-2018 the original author or authors",
                "Copyright 2002-2019 the original author or authors",
                "Copyright 2011, Sun Microsystems, Inc.",
                "Copyright 2013 jQuery Foundation, Inc. and other contributors",
                "Copyright 2014 Red Hat, Inc. and/or its affiliates",
                "Copyright 2014, R. Tyler Croy, Sun Microsystems, Inc.",
                "Copyright 2015 Red Hat Inc. and/or its affiliates and other contributors as indicated by the author tags",
                "Copyright 2015 Red Hat, Inc. and/or its affiliates",
                "Copyright 2016 Analytical Graphics, Inc. and/or its affiliates and other contributors",
                "Copyright 2016 Red Hat Inc. and/or its affiliates and other contributors as indicated by the author tags",
                "Copyright 2016 Red Hat, Inc. and/or its affiliates and other contributors",
                "Copyright 2016 Red Hat, Inc. and/or its affiliates ~ and other contributors",
                "Copyright 2016 Red Hat, Inc., and individual contributors",
                "Copyright 2016, Red Hat, Inc.",
                "Copyright 2017 Analytical Graphics, Inc. and/or its affiliates and other contributors",
                "Copyright 2017 Brett Epps <https://github.com/eppsilon>",
                "Copyright 2017 Red Hat, Inc. and/or its affiliates and other contributors",
                "Copyright 2017 Red Hat, Inc. and/or its affiliates ~ and other contributors",
                "Copyright 2017, Red Hat, Inc.",
                "Copyright 2018 Analytical Graphics, Inc. and/or its affiliates and other contributors",
                "Copyright 2018 Bosch Software Innovations GmbH and other contributors",
                "Copyright 2018 Red Hat Inc. and/or its affiliates and other contributors as indicated by the author tags",
                "Copyright 2018 Red Hat Inc. and/or its affiliates and other contributors as indicated by the authors tag",
                "Copyright 2018 Red Hat, Inc. and/or its affiliates",
                "Copyright 2018 Red Hat, Inc. and/or its affiliates and other contributors",
                "Copyright 2018 Red Hat, Inc. and/or its affiliates ~ and other contributors",
                "Copyright 2019 Red Hat Inc. and/or its affiliates and other contributors by the authors",
                "Copyright 2019 Red Hat, Inc. and/or its affiliates",
                "Copyright 2019 Red Hat, Inc. and/or its affiliates and other contributors",
                "Copyright 2019 Red Hat, Inc. and/or its affiliates ~ and other contributors",
                "Copyright 2019 Red Hat, Inc., and individual contributors",
                "Copyright 2020 Analytical Graphics, Inc. and/or its affiliates and other contributors",
                "Copyright 2020 Red Hat, Inc. and/or its affiliates",
                "Copyright 2020 Red Hat, Inc. and/or its affiliates and other contributors",
                "Copyright 2020 Red Hat, Inc. and/or its affiliates ~ and other contributors",
                "Copyright 2021 Red Hat, Inc. and/or its affiliates and other contributors",
                "Copyright 2021 Red Hat, Inc. and/or its affiliates ~ and other contributors",
                "Copyright 2021 Red Hat, Inc., and individual contributors",
                "Copyright 2022 Red Hat, Inc.",
                "Copyright 2022 Red Hat, Inc. and/or its affiliates and other contributors",
                "Copyright 2022 Red Hat, Inc. and/or its affiliates ~ and other contributors",
                "Copyright 2022 Red Hat, Inc., and individual contributors",
                "Copyright 2022. Red Hat, Inc. and/or its affiliates and other contributors",
                "Copyright 2023 Red Hat Inc. and/or its affiliates and other contributors as indicated by the author tags",
                "Copyright 2023 Red Hat Inc. and/or its affiliates and other contributors by the authors",
                "Copyright 2023 Red Hat, Inc. and/or its affiliates and other contributors",
                "Copyright 2023 Red Hat, Inc. and/or its affiliates ~ and other contributors",
                "Copyright YEAR Red Hat, Inc. and/or its affiliates and other contributors",
                "copyrighted by the Free Software Foundation"
            ],
            "file-count": 10966,
            "sha256": "ecff814d7216ce4b645603242509ffc577773e8f5a07924ba86c35fcac35facb",
            "source": "https://github.com/keycloak/keycloak/archive/refs/tags/22.0.4.zip",
            "status": "restricted"
        }
    ]
}
