{
    "id": "npm/npmjs/-/strict-event-emitter/0.4.4",
    "license": "MIT",
    "authority": "https://gitlab.eclipse.org/eclipsefdn/emo-team/iplab/-/issues/7077",
    "source": "https://registry.yarnpkg.com/strict-event-emitter/-/strict-event-emitter-0.4.4.tgz",
    "status": "approved",
    "scans": [
        {
            "date": "February 9, 2023 at 5:28:23 p.m. GMT",
            "authority": "https://gitlab.eclipse.org/eclipsefdn/emo-team/iplab/-/issues/7077",
            "scancode-version": "31.2.1",
            "licenses-discovered": [
                "MIT"
            ],
            "copyrights": [
            ],
            "file-count": 8,
            "sha256": "1e2a381d224841bf036bc0b975176b4a5734fa1edbd786da928fbdd11d44ce3f",
            "source": "https://registry.yarnpkg.com/strict-event-emitter/-/strict-event-emitter-0.4.4.tgz",
            "status": "approved"
        }
    ]
}