{
    "id": "go/golang/github.com%2Fmwitkow/go-proto-validators/v0.0.0-20180403085117-0950a7990007",
    "license": "Apache-2.0",
    "authority": "https://gitlab.eclipse.org/eclipsefdn/emo-team/iplab/-/issues/12553",
    "source": "https://proxy.golang.org/github.com%2Fmwitkow/go-proto-validators/@v/v0.0.0-20180403085117-0950a7990007.zip",
    "status": "approved",
    "scans": [
        {
            "date": "December 26, 2023 at 10:53:48 a.m. GMT",
            "authority": "https://gitlab.eclipse.org/eclipsefdn/emo-team/iplab/-/issues/12553",
            "scancode-version": "31.2.1",
            "licenses-discovered": [
                "Apache-2.0"
            ],
            "copyrights": [
                "Copyright 2016 Michal Witkowski"
            ],
            "file-count": 19,
            "sha256": "a2a5bbb770b5455f12a1ed512704db70f845dfdf29bf96b641e66afbc0893c5e",
            "source": "https://proxy.golang.org/github.com%2Fmwitkow/go-proto-validators/@v/v0.0.0-20180403085117-0950a7990007.zip",
            "status": "approved"
        }
    ]
}