{
    "id": "npm/npmjs/-/electron-to-chromium/1.4.66",
    "license": "ISC",
    "licenses-discovered": [
        "ISC"
    ],
    "file-count": 21,
    "scancode-version": "30.1.0",
    "authority": "https://gitlab.eclipse.org/eclipsefdn/emo-team/iplab/-/issues/1950",
    "source": "https://github.com/kilian/electron-to-chromium/archive/v1.4.66.zip",
    "status": "approved"
}