{
    "id": "npm/npmjs/-/aws4/1.12.0",
    "license": "MIT AND ISC",
    "authority": "https://gitlab.eclipse.org/eclipsefdn/emo-team/iplab/-/issues/6221",
    "source": "https://github.com/mhart/aws4/archive/v1.12.0.zip",
    "status": "approved",
    "scans": [
        {
            "date": "January 9, 2023 at 11:32:44 p.m. GMT",
            "authority": "https://gitlab.eclipse.org/eclipsefdn/emo-team/iplab/-/issues/6221",
            "scancode-version": "31.2.1",
            "licenses-discovered": [
                "MIT",
                "ISC"
            ],
            "copyrights": [
                "Copyright 2013 Michael Hart (michael.hart.au@gmail.com)"
            ],
            "file-count": 172,
            "sha256": "a0ed8aa77f87084ffab5b38808572110711acd6e13428f4520420af329baab68",
            "source": "https://github.com/mhart/aws4/archive/v1.12.0.zip",
            "status": "approved"
        }
    ]
}