{
    "id": "maven/mavencentral/org.graalvm.sdk/graal-sdk/23.0.1",
    "license": "UPL-1.0",
    "authority": "https://gitlab.eclipse.org/eclipsefdn/emo-team/iplab/-/issues/9850",
    "source": "https://repo.maven.apache.org/maven2/org/graalvm/sdk/graal-sdk/23.0.1/graal-sdk-23.0.1-sources.jar",
    "status": "approved",
    "scans": [
        {
            "date": "August 7, 2023 at 2:30:45 p.m. GMT",
            "authority": "https://gitlab.eclipse.org/eclipsefdn/emo-team/iplab/-/issues/9850",
            "scancode-version": "31.2.1",
            "licenses-discovered": [
                "UPL-1.0"
            ],
            "copyrights": [
                "Copyright (c) 2007, 2019, Oracle and/or its affiliates",
                "Copyright (c) 2007, 2022, Oracle and/or its affiliates",
                "Copyright (c) 2009, 2021, Oracle and/or its affiliates",
                "Copyright (c) 2010, 2022, Oracle and/or its affiliates",
                "Copyright (c) 2011, 2022, Oracle and/or its affiliates",
                "Copyright (c) 2012, 2018, Oracle and/or its affiliates",
                "Copyright (c) 2012, 2019, Oracle and/or its affiliates",
                "Copyright (c) 2012, 2022, Oracle and/or its affiliates",
                "Copyright (c) 2013, 2019, Oracle and/or its affiliates",
                "Copyright (c) 2013, 2021, Oracle and/or its affiliates",
                "Copyright (c) 2013, 2022, Oracle and/or its affiliates",
                "Copyright (c) 2013, 2023, Oracle and/or its affiliates",
                "Copyright (c) 2014, 2019, Oracle and/or its affiliates",
                "Copyright (c) 2014, 2021, Oracle and/or its affiliates",
                "Copyright (c) 2014, 2022, Oracle and/or its affiliates",
                "Copyright (c) 2015, 2019, Oracle and/or its affiliates",
                "Copyright (c) 2016, 2020, Oracle and/or its affiliates",
                "Copyright (c) 2016, 2022, Oracle and/or its affiliates",
                "Copyright (c) 2017, 2018, Oracle and/or its affiliates",
                "Copyright (c) 2017, 2019, Oracle and/or its affiliates",
                "Copyright (c) 2017, 2020, Oracle and/or its affiliates",
                "Copyright (c) 2017, 2021, Oracle and/or its affiliates",
                "Copyright (c) 2017, 2022, Oracle and/or its affiliates",
                "Copyright (c) 2017, 2023, Oracle and/or its affiliates",
                "Copyright (c) 2018, 2019, Oracle and/or its affiliates",
                "Copyright (c) 2018, 2020, Oracle and/or its affiliates",
                "Copyright (c) 2018, 2021, Oracle and/or its affiliates",
                "Copyright (c) 2018, 2022, Oracle and/or its affiliates",
                "Copyright (c) 2018, 2023, Oracle and/or its affiliates",
                "Copyright (c) 2018, Oracle and/or its affiliates",
                "Copyright (c) 2019, 2020, Oracle and/or its affiliates",
                "Copyright (c) 2019, 2021, Oracle and/or its affiliates",
                "Copyright (c) 2019, 2022, Oracle and/or its affiliates",
                "Copyright (c) 2019, 2023, Oracle and/or its affiliates",
                "Copyright (c) 2019, Oracle and/or its affiliates",
                "Copyright (c) 2020, 2020, Oracle and/or its affiliates",
                "Copyright (c) 2020, 2021, Oracle and/or its affiliates",
                "Copyright (c) 2020, Oracle and/or its affiliates",
                "Copyright (c) 2021, 2022, Oracle and/or its affiliates",
                "Copyright (c) 2021, 2023, Oracle and/or its affiliates",
                "Copyright (c) 2021, Oracle and/or its affiliates",
                "Copyright (c) 2022, 2023, Oracle and/or its affiliates",
                "Copyright (c) 2022, Oracle and/or its affiliates",
                "Copyright (c) 2023, Oracle and/or its affiliates"
            ],
            "file-count": 209,
            "sha256": "1fb509f499e4f616b476f19284d90e4dbc4c1f9538a6a182884e1700c54a72d6",
            "source": "https://repo.maven.apache.org/maven2/org/graalvm/sdk/graal-sdk/23.0.1/graal-sdk-23.0.1-sources.jar",
            "status": "approved"
        }
    ]
}