{
    "id": "npm/npmjs/-/eslint-plugin-jest/25.7.0",
    "license": "MIT AND (BSD-2-Clause AND MIT)",
    "licenses-discovered": [
        "MIT",
        "BSD-2-Clause AND MIT"
    ],
    "copyrights": [
        "(c) Sindre Sorhus",
        "Copyright (c) Facebook, Inc. and its affiliates",
        "Copyright (c) Jonathan Kim",
        "Copyright Jeremy Ashkenas, DocumentCloud and Investigative Reporters & Editors",
        "Copyright OpenJS Foundation and other contributors <https://openjsf.org/>"
    ],
    "file-count": 183,
    "scancode-version": "30.1.0",
    "authority": "https://gitlab.eclipse.org/eclipsefdn/emo-team/iplab/-/issues/2961",
    "source": "https://github.com/jest-community/eslint-plugin-jest/archive/v25.7.0.zip",
    "status": "approved"
}