{
    "id": "maven/mavencentral/androidx.annotation/annotation-experimental/1.4.1",
    "license": "Apache-2.0",
    "authority": "https://gitlab.eclipse.org/eclipsefdn/emo-team/iplab/-/issues/19651",
    "source": "https://dl.google.com/android/maven2/androidx/annotation/annotation-experimental/1.4.1/annotation-experimental-1.4.1-sources.jar",
    "status": "approved",
    "scans": [
        {
            "date": "February 28, 2025 at 11:14:20 p.m. GMT",
            "authority": "https://gitlab.eclipse.org/eclipsefdn/emo-team/iplab/-/issues/19651",
            "scancode-version": "31.2.1",
            "licenses-discovered": [
                "Apache-2.0"
            ],
            "copyrights": [
                "Copyright 2019 The Android Open Source Project",
                "Copyright 2020 The Android Open Source Project"
            ],
            "file-count": 5,
            "sha256": "783a221a7c1093ff8932053998a69a24489f7930806a32b55366108146d29c1d",
            "source": "https://dl.google.com/android/maven2/androidx/annotation/annotation-experimental/1.4.1/annotation-experimental-1.4.1-sources.jar",
            "status": "approved"
        }
    ]
}