{
    "id": "pypi/pypi/-/charset-normalizer/3.3.2",
    "license": "MIT AND (LGPL-2.1-only AND MIT) AND LGPL-2.1-only AND CC-BY-SA-3.0",
    "authority": "https://gitlab.eclipse.org/eclipsefdn/emo-team/iplab/-/issues/13067",
    "source": "https://files.pythonhosted.org/packages/63/09/c1bc53dab74b1816a00d8d030de5bf98f724c52c1635e07681d312f20be8/charset-normalizer-3.3.2.tar.gz",
    "status": "approved",
    "scans": [
        {
            "date": "February 1, 2024 at 9:23:47 p.m. GMT",
            "authority": "https://gitlab.eclipse.org/eclipsefdn/emo-team/iplab/-/issues/13067",
            "scancode-version": "31.2.1",
            "licenses-discovered": [
                "MIT",
                "LGPL-2.1-only AND MIT",
                "LGPL-2.1-only",
                "CC-BY-SA-3.0"
            ],
            "copyrights": [
                "(c) 2012 Denny Vrandecic (http://simia.net/letters/)",
                "(c) https://stackoverflow.com/questions/3041986/apt-command-line-interface-like-yes-no-input",
                "COPYRIGHT (c) FOOBAR",
                "Copyright (c) 2019 TAHRI Ahmed R.",
                "Copyright (c) 2023 Ahmed TAHRI",
                "Copyright (c) Ahmed TAHRI Ousret (https://github.com/Ousret)",
                "copyright (c) 2021 by Ahmed TAHRI",
                "copyright 2023, Ahmed TAHRI"
            ],
            "file-count": 74,
            "sha256": "f30c3cb33b24454a82faecaf01b19c18562b1e89558fb6c56de4d9118a032fd5",
            "source": "https://files.pythonhosted.org/packages/63/09/c1bc53dab74b1816a00d8d030de5bf98f724c52c1635e07681d312f20be8/charset-normalizer-3.3.2.tar.gz",
            "status": "approved"
        }
    ]
}