{
    "id": "npm/npmjs/-/eslint-plugin-vue/9.31.0",
    "license": "MIT",
    "authority": "https://gitlab.eclipse.org/eclipsefdn/emo-team/iplab/-/issues/17368",
    "source": "https://github.com/vuejs/eslint-plugin-vue/archive/refs/tags/v9.31.0.zip",
    "status": "approved",
    "scans": [
        {
            "date": "November 20, 2024, 8:56:45 a.m. GMT",
            "authority": "https://gitlab.eclipse.org/eclipsefdn/emo-team/iplab/-/issues/17368",
            "scancode-version": "31.2.1",
            "licenses-discovered": [
                "MIT"
            ],
            "copyrights": [
                "Copyright (c) 2014 Yannick Croissant",
                "Copyright (c) 2017 Toru Nagashima",
                "copyright 2016 Toru Nagashima",
                "copyright 2017 Toru Nagashima",
                "copyright 2017 Xie Ding E De Mao",
                "copyright 2018 Michal Sajnog",
                "copyright 2020 Flo Edelmann",
                "copyright 2021 Flo Edelmann",
                "copyright 2021 Yosuke Ota",
                "copyright 2022 Yosuke Ota",
                "copyright 2023 Perry Song",
                "copyright 2023- Wei Ran"
            ],
            "file-count": 1545,
            "sha256": "5029043ed702f999a4d587d863d7085698abe9d6db2e45fba52d21c391f11ada",
            "source": "https://github.com/vuejs/eslint-plugin-vue/archive/refs/tags/v9.31.0.zip",
            "status": "approved"
        }
    ]
}