{
    "id": "p2/orbit/p2.eclipse.plugin/org.eclipse.ecf.provider.filetransfer.ssl/1.0.201.v20210409-2301",
    "license": "EPL-1.0 AND EPL-2.0",
    "licenses-discovered": [
        "EPL-1.0",
        "EPL-2.0"
    ],
    "copyrights": [
        "Copyright (c) 2008 Composent, Inc. and others"
    ],
    "file-count": 4,
    "scancode-version": "31.2.1",
    "authority": "https://gitlab.eclipse.org/eclipsefdn/emo-team/iplab/-/issues/3980",
    "source": "https://search.maven.org/remotecontent?filepath=org/eclipse/ecf/org.eclipse.ecf.provider.filetransfer.ssl/1.0.201/org.eclipse.ecf.provider.filetransfer.ssl-1.0.201-sources.jar",
    "status": "approved"
}