{
    "id": "maven/mavencentral/org.apache.jena/jena-tdb/4.7.0",
    "license": "Apache-2.0",
    "authority": "https://gitlab.eclipse.org/eclipsefdn/emo-team/iplab/-/issues/8148",
    "source": "https://search.maven.org/remotecontent?filepath=org/apache/jena/jena-tdb/4.7.0/jena-tdb-4.7.0-sources.jar",
    "status": "approved",
    "scans": [
        {
            "date": "May 3, 2023 at 8:54:51 a.m. GMT",
            "authority": "https://gitlab.eclipse.org/eclipsefdn/emo-team/iplab/-/issues/8148",
            "scancode-version": "31.2.1",
            "licenses-discovered": [
                "Apache-2.0"
            ],
            "copyrights": [
            ],
            "file-count": 241,
            "sha256": "7cff33b31ccd9d9c6339fb119daa0e6a80bbe15a3110e11a60f4e34e6f54fc5c",
            "source": "https://search.maven.org/remotecontent?filepath=org/apache/jena/jena-tdb/4.7.0/jena-tdb-4.7.0-sources.jar",
            "status": "approved"
        }
    ]
}