{
    "id": "maven/mavencentral/org.graalvm.polyglot/python-community/23.1.1",
    "license": "Python-2.0 AND (PSF-2.0 AND 0BSD) AND (Apache-2.0 OR BSD-2-Clause) AND Apache-2.0 AND (UPL-1.0 AND LicenseRef-MIT-style) AND blessing AND BSD-2-Clause AND BSD-3-Clause AND BSD-Source-Code AND CNRI-Python AND PSF-2.0 AND (GPL-2.0-only OR LicenseRef-Python-2.2) AND (LicenseRef-Python-2.2 AND LicenseRef-Permission-Notice) AND MIT-CMU AND LGPL-2.1-or-later AND MIT AND HPND AND UPL-1.0 AND  AND OpenSSL AND X11 AND LicenseRef-Public-domain AND Python-2.0 AND Zlib AND CC0-1.0 AND bzip2-1.0.6 AND NAIST-2003 AND LicenseRef-MIT-style AND LicenseRef-Permission-Notice",
    "authority": "https://gitlab.eclipse.org/eclipsefdn/emo-team/iplab/-/issues/11252",
    "source": "https://github.com/oracle/graalpython/archive/refs/tags/graal-23.1.1.zip",
    "status": "approved",
    "scans": [
        {
            "date": "October 27, 2023 at 6:17:53 a.m. GMT",
            "authority": "https://gitlab.eclipse.org/eclipsefdn/emo-team/iplab/-/issues/11252",
            "scancode-version": "31.2.1",
            "licenses-discovered": [
                "GPL-3.0-only AND UPL-1.0",
                "UPL-1.0",
                "Apache-2.0 AND BSD-2-Clause AND BSD-3-Clause AND BSD-4-Clause-UC AND DOC AND GPL-2.0-only AND GPL-3.0-only AND HPND AND ICU AND LGPL-2.1-only AND LicenseRef-scancode-jpython-1.1 AND LicenseRef-scancode-jython AND LicenseRef-scancode-llnl AND LicenseRef-scancode-other-copyleft AND LicenseRef-scancode-other-permissive AND LicenseRef-scancode-proprietary-license AND LicenseRef-scancode-pybench AND LicenseRef-scancode-secret-labs-2011 AND LicenseRef-scancode-unicode AND LicenseRef-scancode-x11-lucent AND MIT AND MIT-open-group AND NAIST-2003 AND OpenSSL AND Python-2.0 AND Python-2.0.1 AND X11 AND Zlib AND bzip2-1.0.6",
                "BSD-2-Clause",
                "Python-2.0",
                "LLVM-exception AND UPL-1.0",
                "BSD-3-Clause AND Python-2.0",
                "BSD-3-Clause",
                "MIT",
                "CC0-1.0",
                "BSD-Source-Code",
                "LicenseRef-scancode-secret-labs-2011 AND Python-2.0",
                "CNRI-Python AND Python-2.0",
                "Zlib",
                "blessing",
                "LicenseRef-scancode-x11-lucent AND UPL-1.0",
                "Python-2.0 AND UPL-1.0",
                "MIT AND Python-2.0",
                "CNRI-Python",
                "MIT AND UPL-1.0",
                "LicenseRef-scancode-free-unknown",
                "HPND",
                "Apache-2.0",
                "LicenseRef-scancode-other-permissive",
                "Apache-2.0 AND Python-2.0",
                "LicenseRef-scancode-python-cwi",
                "MIT AND PSF-2.0",
                "LicenseRef-scancode-unknown",
                "LGPL-2.1-or-later",
                "Apache-2.0 AND BSD-2-Clause AND BSD-3-Clause",
                "Apache-2.0 AND BSD-3-Clause",
                "LicenseRef-scancode-other-permissive AND Python-2.0",
                "GPL-2.0-only AND Python-2.0",
                "Apache-2.0 AND MIT AND Python-2.0",
                "LicenseRef-scancode-secret-labs-2011",
                "Apache-2.0 AND BSD-2-Clause AND BSD-3-Clause AND (GPL-2.0-only WITH Classpath-exception-2.0) AND LGPL-2.0-or-later AND MIT AND Python-2.0",
                "GPL-2.0-only WITH Classpath-exception-2.0 AND Python-2.0 AND UPL-1.0"
            ],
            "copyrights": [
                "(c) 1999 Entrust.net Limited",
                "(c) 1999 Entrust.net Limited Label Entrust.net Premium 2048 Secure Server CA Serial",
                "(c) 2005 Ian Bicking and contributors",
                "(c) 2006 Entrust, Inc.",
                "(c) 2006 Entrust, Inc. Label Entrust Root Certification",
                "(c) 2006-2022 by Georg Brandl, Matthaus Chajdas and contributors",
                "(c) 2009 Entrust, Inc. - for",
                "(c) 2012 Entrust, Inc. - for",
                "(c) 2015 Entrust, Inc. - for",
                "(c) Copyright 2000 Guido van Rossum",
                "(c) Copyright CNRI",
                "Copyright (c ) (20 0-9 0-9 ) (20 0-9 0-9 ), Oracle and /or its affiliates",
                "Copyright (c ) (20 0-9 0-9 ) (20 0-9 0-9 ), Oracle and/or its affiliates",
                "Copyright (c ) 2008-2009, Google Inc",
                "Copyright (c) -2016 Jython Developers",
                "Copyright (c) 1991 - 1995, Stichting Mathematisch Centrum Amsterdam, The Netherlands",
                "Copyright (c) 1991, 2000, 2001 by Lucent Technologies",
                "Copyright (c) 1991-2020 Unicode, Inc.",
                "Copyright (c) 1991-2021 Unicode, Inc.",
                "Copyright (c) 1993 George V. Neville-Neil",
                "Copyright (c) 1994 X Consortium",
                "Copyright (c) 1995 Sun Microsystems, Inc.",
                "Copyright (c) 1995, 1996, 1997, and 1998 WIDE Project",
                "Copyright (c) 1995-1998 Eric Young (eay@cryptsoft.com)",
                "Copyright (c) 1995-2001 Corporation for National Research Initiatives",
                "Copyright (c) 1995-2010 Jean-loup Gailly and Mark Adler",
                "Copyright (c) 1995-2011 Jean-loup Gailly and Mark Adler",
                "Copyright (c) 1995-2016 International Business Machines Corporation and others",
                "Copyright (c) 1996-1999 Corporation for National Research Initiatives",
                "Copyright (c) 1996-2008 Red Hat, Inc and others",
                "Copyright (c) 1996-2017 Python Software Foundation",
                "Copyright (c) 1996-2020 Python Software Foundation",
                "Copyright (c) 1996-2021 Python Software Foundation",
                "Copyright (c) 1996-2022 Python Software Foundation",
                "Copyright (c) 1996-2023 Python Software Foundation",
                "Copyright (c) 1996. The Regents of the University of California",
                "Copyright (c) 1997 - 2002, Makoto Matsumoto and Takuji Nishimura",
                "Copyright (c) 1997 by Fredrik Lundh",
                "Copyright (c) 1997, 2002, 2003 Martin von Loewis",
                "Copyright (c) 1997-1998 Greg Stein",
                "Copyright (c) 1997-2000 Thai Open Source Software Center Ltd",
                "Copyright (c) 1997-2001 by Secret Labs AB.",
                "Copyright (c) 1997-2002 by Secret Labs AB",
                "Copyright (c) 1998 The Open Group",
                "Copyright (c) 1998 the Initial Developer",
                "Copyright (c) 1998, 1999, 2000 Thai Open Source Software Center Ltd and Clark Cooper",
                "Copyright (c) 1998-2001 by Secret Labs AB.",
                "Copyright (c) 1998-2002 John Aycock",
                "Copyright (c) 1998-2008 The OpenSSL Project",
                "Copyright (c) 1999 Computer Systems and Communication Lab, Institute of Information Science, Academia Sinica",
                "Copyright (c) 1999 Pai-Hsiang Hsiao",
                "Copyright (c) 1999 TaBE Project",
                "Copyright (c) 1999 by Fredrik Lundh",
                "Copyright (c) 1999 by Secret Labs AB",
                "Copyright (c) 1999 by Secret Labs AB.",
                "Copyright (c) 1999, 2002 Aladdin Enterprises",
                "Copyright (c) 1999-2000, Marc-Andre Lemburg",
                "Copyright (c) 1999-2001 Gregory P. Ward",
                "Copyright (c) 1999-2001, Digital Creations, Fredericksburg, VA, USA and Andrew Kuchling",
                "Copyright (c) 1999-2002 by Fredrik Lundh",
                "Copyright (c) 1999-2002 by Secret Labs AB",
                "Copyright (c) 1999-2002 by Secret Labs AB.",
                "Copyright (c) 1999-2003 Steve Purcell",
                "Copyright (c) 1999-2008 by Fredrik Lundh",
                "Copyright (c) 1999-2009 by Fredrik Lundh",
                "Copyright (c) 2000 Bastian Kleineidam",
                "Copyright (c) 2000 Doug White, 2006 James Knight, 2007 Christian Heimes",
                "Copyright (c) 2000 Luke Kenneth Casson Leighton <lkcl@samba.org>",
                "Copyright (c) 2000-2009 Jython Developers",
                "Copyright (c) 2000-2010, eGenix.com Software GmbH",
                "Copyright (c) 2000-2017 Expat development team",
                "Copyright (c) 2000-2021 The Legion of the Bouncy Castle Inc. (https://www.bouncycastle.org)",
                "Copyright (c) 2001 Python Software Foundation Barry Warsaw <barry@python.org> , 2000",
                "Copyright (c) 2001 the Initial Developer",
                "Copyright (c) 2001, 2002, 2003, 2004, 2005, 2006 Python Software Foundation",
                "Copyright (c) 2001, 2002, 2003, 2004, 2005, 2006, 2007, 2008, 2009, 2010, 2011, 2012, 2013, 2014, 2015, 2016, 2017, 2018 Python Software Foundation",
                "Copyright (c) 2001, 2002, 2003, 2004, 2005, 2006, 2007, 2008, 2009, 2010, 2011, 2012, 2013, 2014, 2015, 2016, 2017, 2018, 2019, 2020, 2021, 2022 Python Software Foundation",
                "Copyright (c) 2001,2002 Python Software Foundation",
                "Copyright (c) 2001-2006 Gregory P. Ward",
                "Copyright (c) 2001-2006 Python Software Foundation",
                "Copyright (c) 2001-2006 Twisted Matrix Laboratories",
                "Copyright (c) 2001-2007 Python Software Foundation",
                "Copyright (c) 2001-2010 Python Software Foundation",
                "Copyright (c) 2001-2019 Vinay Sajip",
                "Copyright (c) 2001-2021 Vinay Sajip",
                "Copyright (c) 2001-2022 Vinay Sajip",
                "Copyright (c) 2002 Lars Gust?bel <lars@gustaebel.de>",
                "Copyright (c) 2002 Lars Gustaebel <lars@gustaebel.de>",
                "Copyright (c) 2002, 2003 Python Software Foundation",
                "Copyright (c) 2002-2004 Python Software Foundation",
                "Copyright (c) 2002-2006 Python Software Foundation",
                "Copyright (c) 2002-2007 Python Software Foundation",
                "Copyright (c) 2003 Python Software Foundation",
                "Copyright (c) 2003-2004 Federico Di Gregorio <fog@debian.org>",
                "Copyright (c) 2003-2004 by Fredrik Lundh",
                "Copyright (c) 2003-2005 by Peter Astrand <astrand@lysator.liu.se>",
                "Copyright (c) 2003-2009 by Fredrik Lundh",
                "Copyright (c) 2003-2010 Python Software Foundation",
                "Copyright (c) 2003-2013 Python Software Foundation",
                "Copyright (c) 2003-2022 Paul T. McGuire",
                "Copyright (c) 2004 Python Software Foundation",
                "Copyright (c) 2004-2005 Gerhard Haring <gh@ghaering.de>",
                "Copyright (c) 2004-2006 Python Software Foundation",
                "Copyright (c) 2004-2010 Gerhard Haring <gh@ghaering.de>",
                "Copyright (c) 2005 Don Owens",
                "Copyright (c) 2005 Gerhard H?ring <gh@ghaering.de>",
                "Copyright (c) 2005 Gerhard Haring <gh@ghaering.de>",
                "Copyright (c) 2005 Martin v. Lowis",
                "Copyright (c) 2005 the Initial Developer",
                "Copyright (c) 2005, 2006 Martin von Lowis",
                "Copyright (c) 2005, Carl Friedrich Bolz",
                "Copyright (c) 2005-2006 ActiveState Software Inc.",
                "Copyright (c) 2005-2007 Gerhard Haring <gh@ghaering.de>",
                "Copyright (c) 2005-2010 ActiveState Software Inc.",
                "Copyright (c) 2005-2010 Gerhard Haring <gh@ghaering.de>",
                "Copyright (c) 2005-2010 Gregory P. Smith (greg@krypto.org)",
                "Copyright (c) 2006 - 2010 Gregor Lingl",
                "Copyright (c) 2006-2007 Gerhard Haring <gh@ghaering.de>",
                "Copyright (c) 2006-2008, Google Inc.",
                "Copyright (c) 2006-2008, R Oudkerk",
                "Copyright (c) 2006-2010 Gerhard Haring <gh@ghaering.de>",
                "Copyright (c) 2006-2013 Python Software Foundation",
                "Copyright (c) 2007 Python Software Foundation",
                "Copyright (c) 2007-2012 Michael Foord",
                "Copyright (c) 2008 Sonatype, Inc.",
                "Copyright (c) 2008 The Android Open Source Project",
                "Copyright (c) 2008, Callum and Tony Garnock-Jones",
                "Copyright (c) 2008-2009, Google Inc.",
                "Copyright (c) 2008-2016 The pip",
                "Copyright (c) 2008-2020 Stefan Krah",
                "Copyright (c) 2008-present The pip",
                "Copyright (c) 2010-2020 Benjamin Peterson",
                "Copyright (c) 2011, abego Software GmbH, Germany (http://www.abego.org)",
                "Copyright (c) 2011-2012 Vinay Sajip",
                "Copyright (c) 2011-2013 Terence Parr",
                "Copyright (c) 2011-2014 Vinay Sajip",
                "Copyright (c) 2012 The Python Software Foundation",
                "Copyright (c) 2012-2013 Python Software Foundation",
                "Copyright (c) 2012-2015 Vinay Sajip",
                "Copyright (c) 2012-2017 The ANTLR Project",
                "Copyright (c) 2012-2017 The Python Software Foundation",
                "Copyright (c) 2012-2017 Vinay Sajip",
                "Copyright (c) 2012-2019 Vinay Sajip",
                "Copyright (c) 2012-2021 The Python Software Foundation",
                "Copyright (c) 2013 Brian Eugene Wilson, Robert Martin Campbell",
                "Copyright (c) 2013 Eddy Petrisor",
                "Copyright (c) 2013 International Business Machines Corporation and others",
                "Copyright (c) 2013 Marek Majkowski <marek@popcount.org>",
                "Copyright (c) 2013 Vinay Sajip",
                "Copyright (c) 2013 W3C(R) (MIT, ERCIM, Keio, Beihang)",
                "Copyright (c) 2013 W3C(r) (MIT, ERCIM, Keio, Beihang)",
                "Copyright (c) 2013, 2014, 2015, 2016, Regents of the University of California",
                "Copyright (c) 2013, 2014, Regents of the University of California",
                "Copyright (c) 2013, LeRoy Benjamin Sharon",
                "Copyright (c) 2013, Pablo Mouzo",
                "Copyright (c) 2013, Regents of the University of California",
                "Copyright (c) 2013-2015 Vinay Sajip",
                "Copyright (c) 2013-2017 Vinay Sajip",
                "Copyright (c) 2013-2020 Vinay Sajip",
                "Copyright (c) 2014 International Business Machines Corporation and others",
                "Copyright (c) 2014 by Bart Kiers",
                "Copyright (c) 2014, Regents of the University of California",
                "Copyright (c) 2015 International Business Machines Corporation and others",
                "Copyright (c) 2015, Regents of the University of California",
                "Copyright (c) 2015-2016 Will Bond <will@wbond.net>",
                "Copyright (c) 2016 Jython Developers",
                "Copyright (c) 2016 and later Unicode, Inc. and others",
                "Copyright (c) 2017, 2018, Oracle and/or its affiliates",
                "Copyright (c) 2017, 2021, Oracle and/or its affiliates",
                "Copyright (c) 2017, 2022, Oracle and/or its affiliates",
                "Copyright (c) 2017, 2023 Oracle and/or its affiliates",
                "Copyright (c) 2017, 2023, Oracle and/or its affiliates",
                "Copyright (c) 2017, The PyPy Project",
                "Copyright (c) 2018, 2019, Oracle and/or its affiliates",
                "Copyright (c) 2018, 2020, Oracle and/or its affiliates",
                "Copyright (c) 2018, 2021, Oracle and/or its affiliates",
                "Copyright (c) 2018, 2022, Oracle and/or its affiliates",
                "Copyright (c) 2018, 2023, Oracle and/or its affiliates",
                "Copyright (c) 2018, 2023, Oracle and/or its affiliates The Universal Permissive",
                "Copyright (c) 2018, Oracle and/or its affiliates",
                "Copyright (c) 2019 pyhandle",
                "Copyright (c) 2019, 2021, Oracle and/or its affiliates",
                "Copyright (c) 2019, 2022, Oracle and/or its affiliates",
                "Copyright (c) 2019, 2023, Oracle and/or its affiliates",
                "Copyright (c) 2019, Oracle and/or its affiliates",
                "Copyright (c) 2020, 2020, Oracle and/or its affiliates",
                "Copyright (c) 2020, 2021, Oracle and/or its affiliates",
                "Copyright (c) 2020, 2022, Oracle and/or its affiliates",
                "Copyright (c) 2020, 2023, Oracle and/or its affiliates",
                "Copyright (c) 2021",
                "Copyright (c) 2021, 2021, Oracle and/or its affiliates",
                "Copyright (c) 2021, 2022, Oracle and/or its affiliates",
                "Copyright (c) 2021, 2023, Oracle and/or its affiliates",
                "Copyright (c) 2021, Oracle and/or its affiliates",
                "Copyright (c) 2022, 2022, Oracle and/or its affiliates",
                "Copyright (c) 2022, 2023, Oracle and/or its affiliates",
                "Copyright (c) 2022, Oracle and/or its affiliates",
                "Copyright (c) 2023, 2023, Oracle and/or its affiliates",
                "Copyright (c) 2023, Oracle and/or its affiliates",
                "Copyright (c) 2023, The PyPy Project",
                "Copyright (c) Corporation for National Research Initiatives",
                "Copyright (c) IBM Corporation, 1981, 2008",
                "Copyright (c) IBM Corporation, 2000, 2008",
                "Copyright (c) IBM Corporation, 2001, 2008",
                "Copyright (c) IBM Corporation, 2003, 2008",
                "Copyright (c) IBM Corporation, 2004, 2008",
                "Copyright (c) IBM Corporation, 2005, 2008",
                "Copyright (c) IBM Corporation, 2005, 2009",
                "Copyright (c) Jython Developers",
                "Copyright (c) Oracle and/or its affiliates",
                "Copyright (c) Regents of the University of California and individual contributors",
                "Copyright (c) Simple Launcher",
                "Copyright (c) Sindre Sorhus <sindresorhus@gmail.com> (sindresorhus.com)",
                "Copyright (c), 1997-2006, Marc-Andre Lemburg (mal@lemburg.com)",
                "Copyright (c), 2000-2006, eGenix.com Software GmbH (info@egenix.com)",
                "Copyright 1991-1995, Stichting Mathematisch Centrum",
                "Copyright 1992-1994, David Gottner",
                "Copyright 1994 by Lance Ellinghouse Cathedral City, California Republic, United States of America",
                "Copyright 1995-1996 by Fred L. Drake, Jr. and Virginia Polytechnic Institute and State University, Blacksburg, Virginia",
                "Copyright 1995-1997, Automatrix, Inc.",
                "Copyright 1996 Chih-Hao Tsai Beckman Institute, University of Illinois c-tsai4@uiuc.edu http://casper.beckman.uiuc.edu/~c-tsai4",
                "Copyright 1996 by Sam Rushing",
                "Copyright 1999, Bioreason, Inc.",
                "Copyright 2000 by Timothy O'Malley <timo@alum.mit.edu>",
                "Copyright 2000, 2001, 2002, 2003 Nara Institute of Science and Technology",
                "Copyright 2000, Mojam Media, Inc.",
                "Copyright 2001-2005 The Apache Software Foundation. LICENSE Apache",
                "Copyright 2001-2009 by Vinay Sajip",
                "Copyright 2001-2018 The Apache Software Foundation LICENSE Apache",
                "Copyright 2001-2019 by Vinay Sajip",
                "Copyright 2001-2021 by Vinay Sajip",
                "Copyright 2001-2022 by Vinay Sajip",
                "Copyright 2001-2022, Python Software Foundation",
                "Copyright 2004-2005 Elemental Security, Inc.",
                "Copyright 2006 Georg Brandl",
                "Copyright 2006 Google, Inc.",
                "Copyright 2006-2011, the V8 project authors",
                "Copyright 2006-2014, 2016 by the Pygments team",
                "Copyright 2006-2022 by the Pygments team",
                "Copyright 2007 Georg Brandl",
                "Copyright 2007 Google Inc.",
                "Copyright 2007 Google, Inc.",
                "Copyright 2008 Armin Ronacher",
                "Copyright 2008 by Armin Ronacher",
                "Copyright 2008-2010 Isaac Gouy",
                "Copyright 2008-2010 Isaac Gouy Copyright (c ) (?:20 0-9 0-9 ) 201 0-9 Regents of the University of California Copyright (c ) (20 0-9 0-9 ) (20 0-9 0-9 ), Oracle and/or its affiliates",
                "Copyright 2009 Brian Quinlan",
                "Copyright 2012 Facebook",
                "Copyright 2012 by Simon Sapin",
                "Copyright 2012-2013 by Larry Hastings",
                "Copyright 2013-2014 Ray",
                "Copyright 2015 Eric Larson",
                "Copyright 2015,2016,2017 Nir Cohen",
                "Copyright 2016 Etienne Bersac",
                "Copyright 2016 Joshua Harlow",
                "Copyright 2016 Julien Danjou",
                "Copyright 2016-2018 Julien Danjou",
                "Copyright 2016-2021 Julien Danjou",
                "Copyright 2017 Elisey Zanko",
                "Copyright 2021 Taneli Hukkinen",
                "Copyright 2022 Kenneth Reitz",
                "Copyright Disney Enterprises, Inc.",
                "Copyright Jason R. Coombs",
                "Copyright Jonathan Hartley 2013",
                "Copyright Mathias Bynens <https://mathiasbynens.be/>",
                "Portions copyright 1991-1995 by Stichting Mathematisch Centrum, Amsterdam",
                "copyright (c) 1996-2019 Julian R Seward",
                "copyright (c) 2012 by Kenneth Reitz",
                "copyright (c) 2017 by Kenneth Reitz",
                "copyright 2014-2019 s",
                "copyrighted by the Python Software Foundation",
                "holder is Tim Hudson (tjh@cryptsoft.com)",
                "len (c) Explicit",
                "portions copyright 2001, Autonomous Zones Industries, Inc."
            ],
            "file-count": 6836,
            "sha256": "17cbf4e8e5ce1318a22986aa686f149c257163e5dbd13634ebec7bacb1a3325c",
            "source": "https://github.com/oracle/graalpython/archive/refs/tags/graal-23.1.1.zip",
            "status": "restricted"
        }
    ]
}
