{
    "id": "maven/mavencentral/io.confluent/kafka-avro-serializer/6.2.7",
    "license": "Apache-2.0",
    "authority": "https://gitlab.eclipse.org/eclipsefdn/emo-team/iplab/-/issues/6491",
    "source": "https://packages.confluent.io/maven/io/confluent/kafka-avro-serializer/6.2.7/kafka-avro-serializer-6.2.7-sources.jar",
    "status": "approved",
    "scans": [
        {
            "date": "January 26, 2023 at 5:24:52 a.m. GMT",
            "authority": "https://gitlab.eclipse.org/eclipsefdn/emo-team/iplab/-/issues/6491",
            "scancode-version": "31.2.1",
            "licenses-discovered": [
                "Apache-2.0"
            ],
            "copyrights": [
                "Copyright 2018 Confluent Inc.",
                "Copyright 2019 Confluent Inc."
            ],
            "file-count": 16,
            "sha256": "c9fdf23c4115c460cb5579f7d34e2bb99d932b352426cc5207b733c342969db6",
            "source": "https://packages.confluent.io/maven/io/confluent/kafka-avro-serializer/6.2.7/kafka-avro-serializer-6.2.7-sources.jar",
            "status": "approved"
        }
    ]
}