{
    "id": "maven/mavencentral/io.opentelemetry/opentelemetry-api/1.45.0",
    "license": "Apache-2.0",
    "authority": "https://gitlab.eclipse.org/eclipsefdn/emo-team/iplab/-/issues/19156",
    "source": "https://repo1.maven.org/maven2/io/opentelemetry/opentelemetry-api/1.45.0/opentelemetry-api-1.45.0-sources.jar",
    "status": "approved",
    "scans": [
        {
            "date": "January 22, 2025 at 3:17:24 a.m. GMT",
            "authority": "https://gitlab.eclipse.org/eclipsefdn/emo-team/iplab/-/issues/19156",
            "scancode-version": "31.2.1",
            "licenses-discovered": [
                "Apache-2.0"
            ],
            "copyrights": [
                "Copyright (c) 2008 The Guava Authors",
                "Copyright 2000-2021 JetBrains s.r.o.",
                "Copyright 2013-2020 The OpenZipkin Authors"
            ],
            "file-count": 120,
            "sha256": "fe27e8cdc50146772773b7ba760ef3e7c82d02a13a25fb11b266280cea3e925f",
            "source": "https://repo1.maven.org/maven2/io/opentelemetry/opentelemetry-api/1.45.0/opentelemetry-api-1.45.0-sources.jar",
            "status": "approved"
        }
    ]
}