{
    "id": "maven/mavencentral/org.jboss.weld.se/weld-se-shaded/6.0.0.CR1",
    "license": "Apache-2.0 AND (EPL-2.0 OR GPL-2.0 WITH Classpath-exception-2.0)",
    "authority": "https://gitlab.eclipse.org/eclipsefdn/emo-team/iplab/-/issues/17290",
    "source": "https://repo1.maven.org/maven2/org/jboss/weld/se/weld-se-shaded/6.0.0.CR1/weld-se-shaded-6.0.0.CR1-sources.jar",
    "status": "approved",
    "scans": [
        {
            "date": "November 19, 2024, 12:24:46 p.m. GMT",
            "authority": "https://gitlab.eclipse.org/eclipsefdn/emo-team/iplab/-/issues/17290",
            "scancode-version": "31.2.1",
            "licenses-discovered": [
                "CDDL-1.0 AND EPL-2.0 AND (GPL-2.0-only WITH Classpath-exception-2.0)",
                "Apache-2.0",
                "EPL-2.0 AND (GPL-2.0-only WITH Classpath-exception-2.0)",
                "Apache-2.0 AND BSD-3-Clause AND CDDL-1.0 AND EPL-2.0 AND (GPL-2.0-only WITH Classpath-exception-2.0) AND LGPL-3.0-only",
                "EPL-2.0 OR GPL-2.0-only WITH Classpath-exception-2.0",
                "LGPL-2.1-or-later"
            ],
            "copyrights": [
                "(c) Copyright International Business Machines Corporation 2002",
                "Copyright (c) 1989, 1991 Free Software Foundation, Inc.",
                "Copyright (c) 1997, 2019 Oracle and/or its affiliates",
                "Copyright (c) 1997, 2019 Oracle and/or its affiliates and others",
                "Copyright (c) 1997, 2020 Oracle and/or its affiliates",
                "Copyright (c) 1997, 2020 Oracle and/or its affiliates and others",
                "Copyright (c) 1997, 2021 Oracle and/or its affiliates and others",
                "Copyright (c) 1997, 2022 Oracle and/or its affiliates and others",
                "Copyright (c) 1997, 2023 Oracle and/or its affiliates and others",
                "Copyright (c) 1997, 2024 Oracle and/or its affiliates and others",
                "Copyright (c) 1999, 2018 Oracle and/or its affiliates",
                "Copyright (c) 2000, 2018 Oracle and/or its affiliates",
                "Copyright (c) 2005, 2020 Oracle and/or its affiliates",
                "Copyright (c) 2005, 2023 Oracle and/or its affiliates",
                "Copyright (c) 2008, 2023 Oracle and/or its affiliates and others",
                "Copyright (c) 2009 The JSR-330 Expert Group",
                "Copyright (c) 2009, 2020 Oracle and/or its affiliates",
                "Copyright (c) 2009, 2021 Oracle and/or its affiliates",
                "Copyright (c) 2009, 2023 Oracle and/or its affiliates",
                "Copyright (c) 2009, 2023 Oracle and/or its affiliates and others",
                "Copyright (c) 2010, 2020 Oracle and/or its affiliates and others",
                "Copyright (c) 2012, 2019 Oracle and/or its affiliates and others",
                "Copyright (c) 2012, 2020 Oracle and/or its affiliates",
                "Copyright (c) 2012, 2021 Oracle and/or its affiliates and others",
                "Copyright (c) 2012, 2022 Oracle and/or its affiliates and others",
                "Copyright (c) 2012, 2023 Oracle and/or its affiliates and others",
                "Copyright (c) 2012, 2024 Oracle and/or its affiliates",
                "Copyright (c) 2013, 2019 Oracle and/or its affiliates and others",
                "Copyright (c) 2013, 2020 Oracle and/or its affiliates",
                "Copyright (c) 2013, 2022 Oracle and/or its affiliates and others",
                "Copyright (c) 2017, 2020 Oracle and/or its affiliates and others",
                "Copyright (c) 2017, 2021 Oracle and/or its affiliates and others",
                "Copyright (c) 2017, 2023 Oracle and/or its affiliates and others",
                "Copyright (c) 2017, 2024 Oracle and/or its affiliates and others",
                "Copyright (c) 2018 Oracle and/or its affiliates",
                "Copyright (c) 2018, 2020 Oracle and/or its affiliates",
                "Copyright (c) 2018, 2022 Eclipse Foundation",
                "Copyright (c) 2018,2020 Eclipse Foundation",
                "Copyright (c) 2018,2023 Eclipse Foundation",
                "Copyright (c) 2019, 2024 Eclipse Foundation",
                "Copyright (c) 2021 Contributors",
                "Copyright (c) 2021 Oracle and/or its affiliates",
                "Copyright (c) 2021 Red Hat and others",
                "Copyright (c) 2021 Red Hat, Inc. and others",
                "Copyright (c) 2021, 2024 Contributors",
                "Copyright (c) 2022 Red Hat and others",
                "Copyright (c) 2023 Contributors",
                "Copyright (c) 2023 Red Hat, Inc. and others",
                "Copyright (c) 2024 Contributors",
                "Copyright (c) 2024 Red Hat and others",
                "Copyright 2004 The Apache Software Foundation",
                "Copyright 2008, Red Hat Middleware LLC, and individual contributors",
                "Copyright 2008, Red Hat Middleware LLC, and individual contributors by the authors",
                "Copyright 2008, Red Hat, Inc.",
                "Copyright 2008, Red Hat, Inc., and individual contributors",
                "Copyright 2008, Red Hat, Inc., and individual contributors by the authors",
                "Copyright 2008-2019, Red Hat, Inc., and individual contributors by the authors",
                "Copyright 2009, Red Hat, Inc.",
                "Copyright 2010, 2013 Red Hat, Inc., and individual contributors",
                "Copyright 2010, 2015 Red Hat, Inc., and individual contributors",
                "Copyright 2010, 2015, Red Hat, Inc., and individual contributors",
                "Copyright 2010, 2016, Red Hat, Inc., and individual contributors",
                "Copyright 2010, Red Hat, Inc.",
                "Copyright 2010, Red Hat, Inc., and individual contributors",
                "Copyright 2010, Red Hat, Inc., and individual contributors by the authors",
                "Copyright 2012 Red Hat, Inc.",
                "Copyright 2012, Red Hat, Inc., and individual contributors by the authors",
                "Copyright 2013, 2015 Red Hat, Inc., and individual contributors",
                "Copyright 2013, 2015, Red Hat, Inc., and individual contributors",
                "Copyright 2013, Red Hat, Inc., and individual contributors",
                "Copyright 2013, Red Hat, Inc., and individual contributors by the authors",
                "Copyright 2014 Red Hat, Inc., and individual contributors",
                "Copyright 2014, Red Hat, Inc.",
                "Copyright 2014, Red Hat, Inc., and individual contributors",
                "Copyright 2014, Red Hat, Inc., and individual contributors by the authors",
                "Copyright 2014-2019 Red Hat, Inc.",
                "Copyright 2014-2019, Red Hat, Inc.",
                "Copyright 2015 Red Hat, Inc.",
                "Copyright 2015 Red Hat, Inc., and individual contributors",
                "Copyright 2015, Red Hat Middleware LLC, and individual contributors by the authors",
                "Copyright 2015, Red Hat, Inc.",
                "Copyright 2015, Red Hat, Inc., and individual contributors",
                "Copyright 2015, Red Hat, Inc., and individual contributors by the authors",
                "Copyright 2016 Red Hat, Inc., and individual contributors",
                "Copyright 2016, Red Hat Middleware LLC, and individual contributors by the authors",
                "Copyright 2016, Red Hat, Inc.",
                "Copyright 2016, Red Hat, Inc., and individual contributors",
                "Copyright 2016, Red Hat, Inc., and individual contributors by the authors",
                "Copyright 2017, Red Hat, Inc., and individual contributors by the authors",
                "Copyright 2018, Red Hat, Inc.",
                "Copyright 2018, Red Hat, Inc., and individual contributors",
                "Copyright 2018, Red Hat, Inc., and individual contributors by the authors",
                "Copyright 2019 Red Hat, Inc.",
                "Copyright 2019, Red Hat, Inc., and individual contributors",
                "Copyright 2019, Red Hat, Inc., and individual contributors by the authors",
                "Copyright 2020, Red Hat, Inc., and individual contributors",
                "Copyright 2021, Red Hat, Inc., and individual contributors",
                "Copyright 2021, Red Hat, Inc., and individual contributors by the authors",
                "Copyright 2022, Red Hat, Inc., and individual contributors by the authors",
                "Copyright 2023 Red Hat, Inc.",
                "Copyright 2023 Red Hat, Inc., and individual contributors",
                "Copyright 2023, Red Hat, Inc., and individual contributors",
                "IterativeWorkerTaskFactory (c) Override",
                "copyrighted by the Free Software Foundation"
            ],
            "file-count": 1835,
            "sha256": "e3cb5bce1eb5d64db1d43fd4c3f058e9ccd2f262e38919b9598fd75b5b6b643f",
            "source": "https://repo1.maven.org/maven2/org/jboss/weld/se/weld-se-shaded/6.0.0.CR1/weld-se-shaded-6.0.0.CR1-sources.jar",
            "status": "restricted"
        }
    ]
}