{
    "id": "maven/mavencentral/org.apache.parquet/parquet-jackson/1.12.3",
    "license": "Apache-2.0",
    "authority": "https://gitlab.eclipse.org/eclipsefdn/emo-team/iplab/-/issues/6535",
    "source": "https://search.maven.org/remotecontent?filepath=org/apache/parquet/parquet-jackson/1.12.3/parquet-jackson-1.12.3-sources.jar",
    "status": "approved",
    "scans": [
        {
            "date": "January 24, 2023 at 12:08:08 a.m. GMT",
            "authority": "https://gitlab.eclipse.org/eclipsefdn/emo-team/iplab/-/issues/6535",
            "scancode-version": "31.2.1",
            "licenses-discovered": [
                "Apache-2.0"
            ],
            "copyrights": [
                "Copyright 2007-2015 Tatu Saloranta and other contributors"
            ],
            "file-count": 4,
            "sha256": "069b6faf78ec789a04fd5c9d0e710826523ba6fd9451ddbfa3365246b6d65c0f",
            "source": "https://search.maven.org/remotecontent?filepath=org/apache/parquet/parquet-jackson/1.12.3/parquet-jackson-1.12.3-sources.jar",
            "status": "approved"
        }
    ]
}