{
    "id": "maven/mavencentral/com.google.cloud/google-cloud-storage/2.34.0",
    "license": "Apache-2.0",
    "authority": "https://gitlab.eclipse.org/eclipsefdn/emo-team/iplab/-/issues/13413",
    "source": "https://repo1.maven.org/maven2/com/google/cloud/google-cloud-storage/2.34.0/google-cloud-storage-2.34.0-sources.jar",
    "status": "approved",
    "scans": [
        {
            "date": "February 26, 2024 at 8:55:44 a.m. GMT",
            "authority": "https://gitlab.eclipse.org/eclipsefdn/emo-team/iplab/-/issues/13413",
            "scancode-version": "31.2.1",
            "licenses-discovered": [
                "Apache-2.0"
            ],
            "copyrights": [
                "Copyright 2015 Google LLC",
                "Copyright 2016 Google LLC",
                "Copyright 2017 Google LLC",
                "Copyright 2018 Google LLC",
                "Copyright 2019 Google LLC",
                "Copyright 2020 Google LLC",
                "Copyright 2021 Google LLC",
                "Copyright 2022 Google LLC",
                "Copyright 2023 Google LLC"
            ],
            "file-count": 162,
            "sha256": "2d64a108fb2fee88dfbbb3625398a1b1278fdee6ac70417ee1b5a521be46ccf3",
            "source": "https://repo1.maven.org/maven2/com/google/cloud/google-cloud-storage/2.34.0/google-cloud-storage-2.34.0-sources.jar",
            "status": "approved"
        }
    ]
}