{
    "id": "project/runtime.jetty/-/jetty.website/0.0",
    "license": "EPL-2.0",
    "authority": "https://gitlab.eclipse.org/eclipsefdn/emo-team/iplab/-/issues/14595",
    "source": "https://github.com/webtide/jetty.website/commit/80f601c7e3b437429ec4fabb430d2b8472b61c69",
    "status": "restricted",
    "scans": [
        {
            "date": "April 30, 2024 at 4:52:20 p.m. GMT",
            "authority": "https://gitlab.eclipse.org/eclipsefdn/emo-team/iplab/-/issues/14595",
            "scancode-version": "31.2.1",
            "licenses-discovered": [
                "EPL-2.0"
            ],
            "copyrights": [
                "(c) 2024 GitHub,&nbsp Inc."
            ],
            "file-count": 1,
            "sha256": "f18c15413912e0ef1a56390f282ae4a15107049d0562940dbf6686377c03399a",
            "source": "https://github.com/webtide/jetty.website",
            "status": "restricted"
        },
        {
            "date": "May 6, 2024 at 3:51:47 p.m. GMT",
            "authority": "https://gitlab.eclipse.org/eclipsefdn/emo-team/iplab/-/issues/14595",
            "scancode-version": "31.2.1",
            "licenses-discovered": [
            ],
            "copyrights": [
                "(c) 2024 GitHub,&nbsp Inc."
            ],
            "file-count": 1,
            "sha256": "a380b1e9c336a015392c7ffba4eec9b96f61f630bfd071dbb6228f8f6afd209e",
            "source": "https://github.com/webtide/jetty.website/commit/80f601c7e3b437429ec4fabb430d2b8472b61c69",
            "status": "restricted"
        }
    ]
}