{
    "id": "p2/orbit/p2.eclipse.plugin/org.apache.batik.parser/1.17.0.v20230917-1000",
    "license": "Apache-2.0",
    "authority": "https://gitlab.eclipse.org/eclipsefdn/emo-team/iplab/-/issues/10538",
    "source": "https://repo.maven.apache.org/maven2/org/apache/xmlgraphics/batik-parser/1.17/batik-parser-1.17-sources.jar",
    "status": "approved",
    "scans": [
        {
            "date": "September 17, 2023 at 2:23:49 p.m. GMT",
            "authority": "https://gitlab.eclipse.org/eclipsefdn/emo-team/iplab/-/issues/10538",
            "scancode-version": "31.2.1",
            "licenses-discovered": [
                "Apache-2.0"
            ],
            "copyrights": [
            ],
            "file-count": 59,
            "sha256": "3920e25aadc5986d044cb5144bca44e05367394efae60da8bd4f4b02df06df34",
            "source": "https://repo.maven.apache.org/maven2/org/apache/xmlgraphics/batik-parser/1.17/batik-parser-1.17-sources.jar",
            "status": "approved"
        }
    ]
}