{
    "id": "git/github/cncf/xds/cb28da3451f1",
    "license": "Apache-2.0",
    "authority": "https://gitlab.eclipse.org/eclipsefdn/emo-team/iplab/-/issues/5156",
    "source": "https://github.com/cncf/xds/archive/cb28da3451f1.zip",
    "status": "approved",
    "scans": [
        {
            "date": "November 24, 2022 at 9:02:19 p.m. GMT",
            "authority": "https://gitlab.eclipse.org/eclipsefdn/emo-team/iplab/-/issues/5156",
            "scancode-version": "31.2.1",
            "licenses-discovered": [
                "Apache-2.0"
            ],
            "copyrights": [
            ],
            "file-count": 113,
            "sha256": "4bff4be4a6da9c2b0a84be318c88e323310649176d0f4710f8ab5fba62b55be6",
            "source": "https://github.com/cncf/xds/archive/cb28da3451f1.zip",
            "status": "approved"
        }
    ]
}