{
    "id": "npm/npmjs/-/webpack-merge/5.10.0",
    "license": "MIT",
    "authority": "https://gitlab.eclipse.org/eclipsefdn/emo-team/iplab/-/issues/12055",
    "source": "https://github.com/survivejs/webpack-merge/archive/refs/tags/v5.10.0.zip",
    "status": "approved",
    "scans": [
        {
            "date": "December 14, 2023 at 9:00:27 a.m. GMT",
            "authority": "https://gitlab.eclipse.org/eclipsefdn/emo-team/iplab/-/issues/12055",
            "scancode-version": "31.2.1",
            "licenses-discovered": [
                "MIT"
            ],
            "copyrights": [
                "Copyright (c) 2015 Juho Vepsalainen"
            ],
            "file-count": 28,
            "sha256": "b14b72b0cb5f4e744e68a4698850c8db4d0218e0336357cd9c69763b347e7486",
            "source": "https://github.com/survivejs/webpack-merge/archive/refs/tags/v5.10.0.zip",
            "status": "approved"
        }
    ]
}