{
    "id": "maven/mavencentral/com.google.api/gax-httpjson/2.54.1",
    "license": "BSD-3-Clause",
    "authority": "https://gitlab.eclipse.org/eclipsefdn/emo-team/iplab/-/issues/16715",
    "source": "https://repo1.maven.org/maven2/com/google/api/gax-httpjson/2.54.1/gax-httpjson-2.54.1-sources.jar",
    "status": "approved",
    "scans": [
        {
            "date": "October 15, 2024, 5:38:02 p.m. GMT",
            "authority": "https://gitlab.eclipse.org/eclipsefdn/emo-team/iplab/-/issues/16715",
            "scancode-version": "31.2.1",
            "licenses-discovered": [
                "BSD-3-Clause"
            ],
            "copyrights": [
                "Copyright 2017 Google LLC",
                "Copyright 2018 Google LLC",
                "Copyright 2020 Google LLC",
                "Copyright 2021 Google LLC",
                "Copyright 2022 Google LLC",
                "Copyright 2023 Google LLC"
            ],
            "file-count": 64,
            "sha256": "53446742f24d4810cd67d7b00913f5fd80d5d7581780fafb3a353a7b7ccc975b",
            "source": "https://repo1.maven.org/maven2/com/google/api/gax-httpjson/2.54.1/gax-httpjson-2.54.1-sources.jar",
            "status": "approved"
        }
    ]
}