{
    "id": "maven/mavencentral/io.fabric8/kubernetes-model-events/6.7.0",
    "license": "Apache-2.0",
    "authority": "https://gitlab.eclipse.org/eclipsefdn/emo-team/iplab/-/issues/8664",
    "source": "https://repo.maven.apache.org/maven2/io/fabric8/kubernetes-model-events/6.7.0/kubernetes-model-events-6.7.0-sources.jar",
    "status": "approved",
    "scans": [
        {
            "date": "June 5, 2023 at 11:28:31 a.m. GMT",
            "authority": "https://gitlab.eclipse.org/eclipsefdn/emo-team/iplab/-/issues/8664",
            "scancode-version": "31.2.1",
            "licenses-discovered": [
                "Apache-2.0"
            ],
            "copyrights": [
                "Copyright (c) 2015 Red Hat, Inc."
            ],
            "file-count": 33,
            "sha256": "40e74f7261ef3b682dcf54868631fcc27540ad29eb6704ce559b932852a0a895",
            "source": "https://repo.maven.apache.org/maven2/io/fabric8/kubernetes-model-events/6.7.0/kubernetes-model-events-6.7.0-sources.jar",
            "status": "approved"
        }
    ]
}