{
    "id": "maven/mavencentral/org.apache.xmlgraphics/xmlgraphics-commons/2.10",
    "license": "Apache-2.0",
    "authority": "https://gitlab.eclipse.org/eclipsefdn/emo-team/iplab/-/issues/16598",
    "source": "https://repo1.maven.org/maven2/org/apache/xmlgraphics/xmlgraphics-commons/2.10/xmlgraphics-commons-2.10-sources.jar",
    "status": "approved",
    "scans": [
        {
            "date": "October 9, 2024, 3:09:06 p.m. GMT",
            "authority": "https://gitlab.eclipse.org/eclipsefdn/emo-team/iplab/-/issues/16598",
            "scancode-version": "31.2.1",
            "licenses-discovered": [
                "Apache-2.0"
            ],
            "copyrights": [
                "Copyright 2001-2003,2010 + The Apache Software Foundation",
                "Copyright 2002-2003 + The Apache Software Foundation",
                "Copyright Creator"
            ],
            "file-count": 319,
            "sha256": "e49d6f2c6e617dafd30d7e9471a0f0863797e3346eab21f221d1eaad40a2f7cd",
            "source": "https://repo1.maven.org/maven2/org/apache/xmlgraphics/xmlgraphics-commons/2.10/xmlgraphics-commons-2.10-sources.jar",
            "status": "approved"
        }
    ]
}