{
    "id": "npm/npmjs/-/parse-conflict-json/3.0.1",
    "license": "ISC",
    "authority": "https://gitlab.eclipse.org/eclipsefdn/emo-team/iplab/-/issues/7596",
    "source": "https://github.com/npm/parse-conflict-json/archive/v3.0.1.zip",
    "status": "approved",
    "scans": [
        {
            "date": "March 27, 2023 at 4:44:52 p.m. GMT",
            "authority": "https://gitlab.eclipse.org/eclipsefdn/emo-team/iplab/-/issues/7596",
            "scancode-version": "31.2.1",
            "licenses-discovered": [
                "ISC"
            ],
            "copyrights": [
                "Copyright npm, Inc."
            ],
            "file-count": 29,
            "sha256": "747e461c302f466e37d221ca9249d90a2d11d11a3e5422ba7ef45ea78f174a08",
            "source": "https://github.com/npm/parse-conflict-json/archive/v3.0.1.zip",
            "status": "approved"
        }
    ]
}