{
    "id": "maven/mavencentral/org.seleniumhq.selenium/selenium-json/4.6.0",
    "license": "Apache-2.0",
    "authority": "https://gitlab.eclipse.org/eclipsefdn/emo-team/iplab/-/issues/13526",
    "source": "https://repo1.maven.org/maven2/org/seleniumhq/selenium/selenium-json/4.6.0/selenium-json-4.6.0-sources.jar",
    "status": "approved",
    "scans": [
        {
            "date": "March 5, 2024 at 6:40:03 p.m. GMT",
            "authority": "https://gitlab.eclipse.org/eclipsefdn/emo-team/iplab/-/issues/13526",
            "scancode-version": "31.2.1",
            "licenses-discovered": [
                "Apache-2.0",
                "Apache-2.0 AND LicenseRef-scancode-proprietary-license"
            ],
            "copyrights": [
            ],
            "file-count": 27,
            "sha256": "779db467b880ec65b2bd285e6085ede153df9910156a36f87bb0fb1b1e726a25",
            "source": "https://repo1.maven.org/maven2/org/seleniumhq/selenium/selenium-json/4.6.0/selenium-json-4.6.0-sources.jar",
            "status": "restricted"
        }
    ]
}
