{
    "id": "maven/mavencentral/org.apache.camel.springboot/camel-scheduler-starter/3.22.2",
    "license": "Apache-2.0",
    "authority": "https://gitlab.eclipse.org/eclipsefdn/emo-team/iplab/-/issues/14911",
    "source": "https://repo1.maven.org/maven2/org/apache/camel/springboot/camel-scheduler-starter/3.22.2/camel-scheduler-starter-3.22.2-sources.jar",
    "status": "approved",
    "scans": [
        {
            "date": "May 29, 2024 at 9:40:58 a.m. GMT",
            "authority": "https://gitlab.eclipse.org/eclipsefdn/emo-team/iplab/-/issues/14911",
            "scancode-version": "31.2.1",
            "licenses-discovered": [
                "Apache-2.0"
            ],
            "copyrights": [
            ],
            "file-count": 8,
            "sha256": "f35bcb82baeda8e43028c2200454d1da13b8a42186fe5c067cae489452b21363",
            "source": "https://repo1.maven.org/maven2/org/apache/camel/springboot/camel-scheduler-starter/3.22.2/camel-scheduler-starter-3.22.2-sources.jar",
            "status": "approved"
        }
    ]
}