{
    "id": "maven/mavencentral/software.amazon.awssdk/endpoints-spi/2.20.77",
    "license": "Apache-2.0",
    "authority": "https://gitlab.eclipse.org/eclipsefdn/emo-team/iplab/-/issues/8604",
    "source": "https://repo.maven.apache.org/maven2/software/amazon/awssdk/endpoints-spi/2.20.0/endpoints-spi-2.20.0-sources.jar",
    "status": "approved",
    "scans": [
        {
            "date": "June 2, 2023 at 6:20:59 p.m. GMT",
            "authority": "https://gitlab.eclipse.org/eclipsefdn/emo-team/iplab/-/issues/8604",
            "scancode-version": "31.2.1",
            "licenses-discovered": [
                "Apache-2.0"
            ],
            "copyrights": [
                "Copyright Amazon.com, Inc. or its affiliates"
            ],
            "file-count": 7,
            "sha256": "b7aa95f0a1040973463ef094225b8f02a935fa1b4e552cf321f1c0ec32f77823",
            "source": "https://repo.maven.apache.org/maven2/software/amazon/awssdk/endpoints-spi/2.20.0/endpoints-spi-2.20.0-sources.jar",
            "status": "approved"
        }
    ]
}