{
    "id": "maven/mavencentral/org.apache.accumulo/accumulo-hadoop-mapreduce/2.1.0",
    "license": "Apache-2.0",
    "authority": "https://gitlab.eclipse.org/eclipsefdn/emo-team/iplab/-/issues/6479",
    "source": "https://search.maven.org/remotecontent?filepath=org/apache/accumulo/accumulo-hadoop-mapreduce/2.1.0/accumulo-hadoop-mapreduce-2.1.0-sources.jar",
    "status": "approved",
    "scans": [
        {
            "date": "January 24, 2023 at 1:54:18 a.m. GMT",
            "authority": "https://gitlab.eclipse.org/eclipsefdn/emo-team/iplab/-/issues/6479",
            "scancode-version": "31.2.1",
            "licenses-discovered": [
                "Apache-2.0"
            ],
            "copyrights": [
            ],
            "file-count": 34,
            "sha256": "b3e9cdd8a708f96681267653967c5225f3ded7f0677dc9304f3ee3dc4262f185",
            "source": "https://search.maven.org/remotecontent?filepath=org/apache/accumulo/accumulo-hadoop-mapreduce/2.1.0/accumulo-hadoop-mapreduce-2.1.0-sources.jar",
            "status": "approved"
        }
    ]
}