{
    "id": "maven/mavencentral/org.apache.spark/spark-mllib_2.12/3.3.0",
    "license": "Apache-2.0",
    "authority": "https://gitlab.eclipse.org/eclipsefdn/emo-team/iplab/-/issues/6817",
    "source": "https://search.maven.org/remotecontent?filepath=org/apache/spark/spark-mllib_2.12/3.3.0/spark-mllib_2.12-3.3.0-sources.jar",
    "status": "approved",
    "scans": [
        {
            "date": "January 27, 2023 at 9:29:18 p.m. GMT",
            "authority": "https://gitlab.eclipse.org/eclipsefdn/emo-team/iplab/-/issues/6817",
            "scancode-version": "31.2.1",
            "licenses-discovered": [
                "Apache-2.0"
            ],
            "copyrights": [
            ],
            "file-count": 353,
            "sha256": "4ef3db3102af4f28ea7091ca205de31c2d853b683743b54172cf9001992c5870",
            "source": "https://search.maven.org/remotecontent?filepath=org/apache/spark/spark-mllib_2.12/3.3.0/spark-mllib_2.12-3.3.0-sources.jar",
            "status": "approved"
        }
    ]
}