{
    "license": "LGPL-2.1-only AND LGPL-2.1-or-later AND LicenseRef-scancode-unknown-license-reference",
    "file-count": 275,
    "authority": "https://gitlab.eclipse.org/eclipsefdn/emo-team/iplab/-/issues/1892",
    "scancode-version": "30.1.0",
    "licenses-discovered": [
        "LGPL-2.1-or-later",
        "LicenseRef-scancode-unknown-license-reference",
        "LGPL-2.1-only"
    ],
    "id": "maven/mavencentral/org.hibernate/hibernate-entitymanager/4.3.5.Final",
    "source": "https://search.maven.org/remotecontent?filepath=org/hibernate/hibernate-entitymanager/4.3.5.Final/hibernate-entitymanager-4.3.5.Final-sources.jar",
    "status": "restricted",
    "board_exception" : [
        {
            "rule" : "all"
        }
    ]
}
