{
    "id": "go/golang/golang.org%2Fx/text/v0.3.4",
    "license": "BSD-3-Clause AND CC-BY-SA-1.0 AND CC-BY-SA-2.0 AND CC-BY-SA-2.5 AND CC-BY-SA-3.0",
    "authority": "https://gitlab.eclipse.org/eclipsefdn/emo-team/iplab/-/issues/6125",
    "source": "https://proxy.golang.org/golang.org%2Fx/text/@v/v0.3.4.zip",
    "status": "approved",
    "scans": [
        {
            "date": "January 5, 2023 at 6:40:59 p.m. GMT",
            "authority": "https://gitlab.eclipse.org/eclipsefdn/emo-team/iplab/-/issues/6125",
            "scancode-version": "31.2.1",
            "licenses-discovered": [
                "BSD-3-Clause",
                "BSD-3-Clause AND CC-BY-SA-1.0 AND CC-BY-SA-2.5 AND CC-BY-SA-3.0",
                "BSD-3-Clause AND CC-BY-SA-1.0 AND CC-BY-SA-2.0 AND CC-BY-SA-2.5 AND CC-BY-SA-3.0"
            ],
            "copyrights": [
                "(c) (c) A",
                "(c) (c) AAEE",
                "(c) AeHa (c)",
                "(c) Bv",
                "(c) EAiE (c)",
                "(c) EeAoq (c)",
                "(c) EmeEBu (c)",
                "(c) aA\"AE (c) 1AE",
                "(c) lEEe (c) AE",
                "(c) oav!A (c) AY I",
                "(c) uSSg1/2a+-N (c) OY",
                "Copyright (c) 2009 The Go Authors",
                "Copyright 2009 The Go Authors",
                "Copyright 2011 The Go Authors",
                "Copyright 2012 The Go Authors",
                "Copyright 2013 The Go Authors",
                "Copyright 2014 The Go Authors",
                "Copyright 2015 The Go Authors",
                "Copyright 2016 The Go Authors",
                "Copyright 2017 The Go Authors",
                "Copyright 2018 The Go Authors",
                "Copyright 2019 The Go Authors"
            ],
            "file-count": 527,
            "sha256": "816f18045e9e146c86f44bebffe2d51c70110d68a5d41a3573f0cab6cc1e93c5",
            "source": "https://proxy.golang.org/golang.org%2Fx/text/@v/v0.3.4.zip",
            "status": "restricted"
        }
    ]
}
