{
    "id": "npm/npmjs/-/highlight.js/11.6.0",
    "license": "MIT AND BSD-3-Clause AND CC-BY-SA-4.0",
    "licenses-discovered": [
        "MIT",
        "BSD-3-Clause",
        "CC-BY-SA-4.0"
    ],
    "copyrights": [
        "(c) Felipe Contreras <felipe.contreras@gmail.com> Website https://github.com/felipec/vim-felipec",
        "(c) Gustavo Costa <gusbemacbe@gmail.com>",
        "(c) Henri Vandersleyen <hvandersleyen@gmail.com>",
        "(c) Ivan Sagalaev <maniac@softwaremaniacs.org>",
        "(c) Jim Mason <jmason@ibinx.com>",
        "(c) Taufik Nurrohman <hi@taufik-nurrohman.com>",
        "Copyright (c) Ivan Sagalaev"
    ],
    "file-count": 1287,
    "scancode-version": "30.1.0",
    "authority": "https://gitlab.eclipse.org/eclipsefdn/emo-team/iplab/-/issues/3079",
    "source": "https://registry.npmjs.org/highlight.js/-/highlight.js-11.6.0.tgz",
    "status": "approved"
}