{
    "id": "maven/mavencentral/androidx.compose.runtime/runtime-saveable/1.5.0",
    "license": "Apache-2.0",
    "authority": "https://gitlab.eclipse.org/eclipsefdn/emo-team/iplab/-/issues/10474",
    "source": "https://dl.google.com/android/maven2/androidx/compose/runtime/runtime-saveable/1.5.0/runtime-saveable-1.5.0-sources.jar",
    "status": "approved",
    "scans": [
        {
            "date": "September 12, 2023 at 8:31:11 a.m. GMT",
            "authority": "https://gitlab.eclipse.org/eclipsefdn/emo-team/iplab/-/issues/10474",
            "scancode-version": "31.2.1",
            "licenses-discovered": [
                "Apache-2.0"
            ],
            "copyrights": [
                "Copyright 2020 The Android Open Source Project",
                "Copyright 2021 The Android Open Source Project"
            ],
            "file-count": 7,
            "sha256": "d8472468b4b710ce2be678dbf55a771abdd8aeec207ed630b9e54e0125872466",
            "source": "https://dl.google.com/android/maven2/androidx/compose/runtime/runtime-saveable/1.5.0/runtime-saveable-1.5.0-sources.jar",
            "status": "approved"
        }
    ]
}