{
    "id": "maven/mavencentral/jakarta.json/jakarta.json-api/2.1.1",
    "license": "EPL-2.0 OR GPL-2.0-only WITH Classpath-exception-2.0",
    "authority": "https://gitlab.eclipse.org/eclipsefdn/emo-team/iplab/-/issues/7907",
    "source": "https://search.maven.org/remotecontent?filepath=jakarta/json/jakarta.json-api/2.1.1/jakarta.json-api-2.1.1-sources.jar",
    "status": "approved",
    "scans": [
        {
            "date": "April 18, 2023 at 2:20:19 p.m. GMT",
            "authority": "https://gitlab.eclipse.org/eclipsefdn/emo-team/iplab/-/issues/7907",
            "scancode-version": "31.2.1",
            "licenses-discovered": [
                "EPL-2.0 AND (GPL-2.0-only WITH Classpath-exception-2.0)",
                "EPL-2.0 OR GPL-2.0-only WITH Classpath-exception-2.0"
            ],
            "copyrights": [
                "Copyright (c) 1989, 1991 Free Software Foundation, Inc.",
                "Copyright (c) 2011, 2021 Oracle and/or its affiliates",
                "Copyright (c) 2011, 2022 Oracle and/or its affiliates",
                "Copyright (c) 2012, 2021 Oracle and/or its affiliates",
                "Copyright (c) 2012, 2022 Oracle and/or its affiliates",
                "Copyright (c) 2013, 2021 Oracle and/or its affiliates",
                "Copyright (c) 2015, 2021 Oracle and/or its affiliates",
                "Copyright (c) 2016, 2021 Oracle and/or its affiliates",
                "Copyright (c) 2016, 2022 Oracle and/or its affiliates",
                "Copyright (c) 2017, 2022 Oracle and/or its affiliates",
                "Copyright (c) 2018, 2020 Oracle and/or its affiliates",
                "Copyright (c) 2019, current.year Eclipse Foundation",
                "Copyright (c) 2021 Oracle and/or its affiliates",
                "copyrighted by the Free Software Foundation"
            ],
            "file-count": 41,
            "sha256": "440c8d8f90e1d552bfe13cec9e37d08b5be529f8484c15eaec7decb4270dbd1f",
            "source": "https://search.maven.org/remotecontent?filepath=jakarta/json/jakarta.json-api/2.1.1/jakarta.json-api-2.1.1-sources.jar",
            "status": "restricted"
        }
    ]
}
