{
    "id": "maven/mavencentral/io.openmanufacturing/sds-aspect-meta-model/2.0.0",
    "license": "MPL-2.0",
    "authority": "https://gitlab.eclipse.org/eclipsefdn/emo-team/iplab/-/issues/7285",
    "source": "https://search.maven.org/remotecontent?filepath=io/openmanufacturing/sds-aspect-meta-model/2.0.0/sds-aspect-meta-model-2.0.0-sources.jar",
    "status": "approved",
    "scans": [
        {
            "date": "March 1, 2023 at 2:16:03 p.m. GMT",
            "authority": "https://gitlab.eclipse.org/eclipsefdn/emo-team/iplab/-/issues/7285",
            "scancode-version": "31.2.1",
            "licenses-discovered": [
                "MPL-2.0"
            ],
            "copyrights": [
                "Copyright (c) 2021 Robert Bosch Manufacturing Solutions GmbH",
                "Copyright (c) 2022 Robert Bosch Manufacturing Solutions GmbH"
            ],
            "file-count": 27,
            "sha256": "4d27d9bf19c9bbb473aa69b65973e4a1f3201774e619cb30b5329c44cf6b36ea",
            "source": "https://search.maven.org/remotecontent?filepath=io/openmanufacturing/sds-aspect-meta-model/2.0.0/sds-aspect-meta-model-2.0.0-sources.jar",
            "status": "approved"
        }
    ]
}