{
    "id": "maven/mavencentral/org.apache.lucene/lucene-analysis-common/9.12.0",
    "license": "Apache-2.0 AND (Apache-2.0 AND BSD-3-Clause) AND BSD-2-Clause AND BSD-3-Clause AND NAIST-2003",
    "authority": "https://gitlab.eclipse.org/eclipsefdn/emo-team/iplab/-/issues/16380",
    "source": "https://repo1.maven.org/maven2/org/apache/lucene/lucene-analysis-common/9.12.0/lucene-analysis-common-9.12.0-sources.jar",
    "status": "approved",
    "scans": [
        {
            "date": "September 29, 2024, 7:43:08 a.m. GMT",
            "authority": "https://gitlab.eclipse.org/eclipsefdn/emo-team/iplab/-/issues/16380",
            "scancode-version": "31.2.1",
            "licenses-discovered": [
                "Apache-2.0",
                "Apache-2.0 AND BSD-3-Clause",
                "Apache-2.0 AND LPPL-1.3c",
                "BSD-3-Clause"
            ],
            "copyrights": [
                "Copyright (c) 2001, Dr Martin Porter",
                "Copyright (c) 2003, Center for Intelligent Information Retrieval, University of Massachusetts, Amherst",
                "Copyright (c) 2004,2005, Richard Boulton",
                "Copyright (c) 2005, Jacques Savoy",
                "Copyright (c) 2006,2007,2009,2010,2011,2014-2019, Olly Betts",
                "Copyright (c) 2013, Yoshiki Shibukawa",
                "Copyright 2003, CIIR University of Massachusetts Amherst (http://ciir.cs.umass.edu)",
                "Copyright 2008, Luicid Imagination, Inc."
            ],
            "file-count": 553,
            "sha256": "eb2e790a9259f1d066011462e969c682f8109eb161054a73b8cf4cfe569e88e8",
            "source": "https://repo1.maven.org/maven2/org/apache/lucene/lucene-analysis-common/9.12.0/lucene-analysis-common-9.12.0-sources.jar",
            "status": "restricted"
        }
    ]
}