{
    "id": "npm/npmjs/-/uncontrollable/7.2.1",
    "license": "MIT AND BSD-3-Clause",
    "licenses-discovered": [
        "MIT",
        "BSD-3-Clause AND LicenseRef-scancode-facebook-patent-rights-2"
    ],
    "copyrights": [
        "Copyright (c) Facebook, Inc.",
        "Copyright (c) Jason Quense"
    ],
    "file-count": 31,
    "scancode-version": "30.1.0",
    "authority": "https://gitlab.eclipse.org/eclipsefdn/emo-team/iplab/-/issues/3025",
    "source": "https://registry.npmjs.org/uncontrollable/-/uncontrollable-7.2.1.tgz",
    "status": "approved"
}
