{
    "id": "p2/orbit/p2.eclipse-plugin/org.osgi.util.promise/1.2.0.202109301733",
    "license": "Apache-2.0",
    "licenses-discovered": [
        "Apache-2.0"
    ],
    "file-count": 14,
    "scancode-version": "30.1.0",
    "authority": "https://gitlab.eclipse.org/eclipsefdn/emo-team/iplab/-/issues/2701",
    "source": "https://search.maven.org/remotecontent?filepath=org/osgi/org.osgi.util.promise/1.2.0/org.osgi.util.promise-1.2.0-sources.jar",
    "status": "approved"
}