{
    "id": "maven/mavencentral/biz.aQute.bnd/biz.aQute.tester.junit-platform/6.4.0",
    "license": "EPL-2.0",
    "authority": "https://gitlab.eclipse.org/eclipsefdn/emo-team/iplab/-/issues/6360",
    "source": "https://search.maven.org/remotecontent?filepath=biz/aQute/bnd/biz.aQute.tester.junit-platform/6.4.0/biz.aQute.tester.junit-platform-6.4.0-sources.jar",
    "status": "approved",
    "scans": [
        {
            "date": "January 14, 2023 at 1:00:39 p.m. GMT",
            "authority": "https://gitlab.eclipse.org/eclipsefdn/emo-team/iplab/-/issues/6360",
            "scancode-version": "31.2.1",
            "licenses-discovered": [
                "EPL-2.0"
            ],
            "copyrights": [
                "Copyright 2015-2019 the original author or authors"
            ],
            "file-count": 21,
            "sha256": "35247f5cad9b394fa5282fb2df3edb67a64bcb9c9c0f603bc826df07e0d6f7db",
            "source": "https://search.maven.org/remotecontent?filepath=biz/aQute/bnd/biz.aQute.tester.junit-platform/6.4.0/biz.aQute.tester.junit-platform-6.4.0-sources.jar",
            "status": "approved"
        }
    ]
}