{
    "id": "maven/mavencentral/org.apache.derby/derbyclient/10.16.1.1",
    "license": "Apache-2.0",
    "authority": "https://gitlab.eclipse.org/eclipsefdn/emo-team/iplab/-/issues/19337",
    "source": "https://gitlab.eclipse.org/-/project/46/uploads/3c4c89b2499ee0d8cece60280894b998/db-derby-10.16.1.1-src.zip",
    "status": "approved",
    "scans": [
        {
            "date": "February 7, 2025 at 8:52:48 p.m. GMT",
            "authority": "https://gitlab.eclipse.org/eclipsefdn/emo-team/iplab/-/issues/19337",
            "scancode-version": "31.2.1",
            "licenses-discovered": [
                "Apache-2.0"
            ],
            "copyrights": [
            ],
            "file-count": 191,
            "sha256": "955242b65b506fbf5aed40670534e331b2dbd8637034a29c3e84f4860d69ed15",
            "source": "https://gitlab.eclipse.org/-/project/46/uploads/3c4c89b2499ee0d8cece60280894b998/db-derby-10.16.1.1-src.zip",
            "status": "approved"
        }
    ]
}