{
    "id": "git/github/eclipse-ecal/ecal/56ad696756b9fbd7e32d48e8cf0b853629523aaa",
    "license": "Apache-2.0",
    "authority": "https://gitlab.eclipse.org/eclipsefdn/emo-team/iplab/-/issues/13566",
    "source": "https://github.com/eclipse-ecal/ecal/commit/56ad696756b9fbd7e32d48e8cf0b853629523aaa",
    "status": "approved",
    "scans": [
        {
            "date": "March 7, 2024 at 10:35:18 a.m. GMT",
            "authority": "https://gitlab.eclipse.org/eclipsefdn/emo-team/iplab/-/issues/13566",
            "scancode-version": "31.2.1",
            "licenses-discovered": [
                "Apache-2.0"
            ],
            "copyrights": [
                "(c) 2024 GitHub,&nbsp Inc."
            ],
            "file-count": 1,
            "sha256": "314175c43a8ea6d2a6c85450bf7455f5b5c1ff2bd48a2ae86df75f16a4dd2a9d",
            "source": "https://github.com/eclipse-ecal/ecal/commit/56ad696756b9fbd7e32d48e8cf0b853629523aaa",
            "status": "approved"
        }
    ]
}