{
    "id": "maven/mavencentral/org.activiti/activiti-api-process-runtime-impl/8.4.0",
    "license": "Apache-2.0",
    "authority": "https://gitlab.eclipse.org/eclipsefdn/emo-team/iplab/-/issues/14526",
    "source": "https://maven.alfresco.com/nexus/service/local/repositories/activiti-releases/content//org/activiti/activiti-api-process-runtime-impl/8.4.0/activiti-api-process-runtime-impl-8.4.0-sources.jar",
    "status": "approved",
    "scans": [
        {
            "date": "April 24, 2024 at 4:19:33 a.m. GMT",
            "authority": "https://gitlab.eclipse.org/eclipsefdn/emo-team/iplab/-/issues/14526",
            "scancode-version": "31.2.1",
            "licenses-discovered": [
                "Apache-2.0"
            ],
            "copyrights": [
                "Copyright 2010-2020 Alfresco Software, Ltd."
            ],
            "file-count": 105,
            "sha256": "c745acbfb69d7196a39f065cd625dbe919a50a7d304dd6334bf4f81184a14363",
            "source": "https://maven.alfresco.com/nexus/service/local/repositories/activiti-releases/content//org/activiti/activiti-api-process-runtime-impl/8.4.0/activiti-api-process-runtime-impl-8.4.0-sources.jar",
            "status": "approved"
        }
    ]
}