{
    "id": "p2/orbit/p2.eclipse.plugin/org.apache.batik.xml/1.17.0.v20230917-1000",
    "license": "Apache-2.0",
    "authority": "https://gitlab.eclipse.org/eclipsefdn/emo-team/iplab/-/issues/10543",
    "source": "https://repo.maven.apache.org/maven2/org/apache/xmlgraphics/batik-xml/1.17/batik-xml-1.17-sources.jar",
    "status": "approved",
    "scans": [
        {
            "date": "September 17, 2023 at 3:23:15 p.m. GMT",
            "authority": "https://gitlab.eclipse.org/eclipsefdn/emo-team/iplab/-/issues/10543",
            "scancode-version": "31.2.1",
            "licenses-discovered": [
                "Apache-2.0"
            ],
            "copyrights": [
            ],
            "file-count": 10,
            "sha256": "27d973dbbc10519cfdfc0c751f5fd9647b98cf75fe53cbef122a4a3966be8938",
            "source": "https://repo.maven.apache.org/maven2/org/apache/xmlgraphics/batik-xml/1.17/batik-xml-1.17-sources.jar",
            "status": "approved"
        }
    ]
}