{
    "id": "maven/mavencentral/org.activiti/activiti-spring-security/8.0.0",
    "license": "Apache-2.0",
    "authority": "https://gitlab.eclipse.org/eclipsefdn/emo-team/iplab/-/issues/12498",
    "source": "https://maven.alfresco.com/nexus/service/local/repositories/activiti-releases/content//org/activiti/activiti-spring-security/8.0.0/activiti-spring-security-8.0.0-sources.jar",
    "status": "approved",
    "scans": [
        {
            "date": "December 26, 2023 at 8:06:18 p.m. GMT",
            "authority": "https://gitlab.eclipse.org/eclipsefdn/emo-team/iplab/-/issues/12498",
            "scancode-version": "31.2.1",
            "licenses-discovered": [
                "Apache-2.0"
            ],
            "copyrights": [
                "Copyright 2010-2020 Alfresco Software, Ltd."
            ],
            "file-count": 17,
            "sha256": "cfda7a9f05db1958260a40a87d36abec2770e3390e7eced012049aef6402b86d",
            "source": "https://maven.alfresco.com/nexus/service/local/repositories/activiti-releases/content//org/activiti/activiti-spring-security/8.0.0/activiti-spring-security-8.0.0-sources.jar",
            "status": "approved"
        }
    ]
}