{
    "id": "npm/npmjs/@typescript-eslint/eslint-plugin/6.10.0",
    "license": "BSD-2-Clause AND (BSD-2-Clause AND ISC AND MIT) AND MIT",
    "authority": "https://gitlab.eclipse.org/eclipsefdn/emo-team/iplab/-/issues/14420",
    "source": "https://github.com/typescript-eslint/typescript-eslint/archive/refs/tags/v6.10.0.zip",
    "status": "approved",
    "scans": [
        {
            "date": "April 17, 2024 at 9:24:10 p.m. GMT",
            "authority": "https://gitlab.eclipse.org/eclipsefdn/emo-team/iplab/-/issues/14420",
            "scancode-version": "31.2.1",
            "licenses-discovered": [
                "BSD-2-Clause",
                "BSD-2-Clause AND ISC AND MIT",
                "MIT"
            ],
            "copyrights": [
                "Copyright (c) 2016 unional",
                "Copyright (c) 2019 typescript-eslint and other contributors",
                "Copyright (c) 2021 typescript-eslint and other contributors",
                "Copyright (c) 2023 typescript-eslint and other contributors",
                "Copyright JS Foundation and other contributors, https://js.foundation",
                "Copyright Joyent, Inc. and other Node contributors"
            ],
            "file-count": 7601,
            "sha256": "e72ebb4bf92afaa17c4bcbce02fb5dbc4627a2776d558e050e118dd69af9f4d1",
            "source": "https://github.com/typescript-eslint/typescript-eslint/archive/refs/tags/v6.10.0.zip",
            "status": "approved"
        }
    ]
}