{
    "id": "maven/mavencentral/jakarta.activation/jakarta.activation-api/1.2.1",
    "license": "BSD-3-Clause",
    "authority": "https://gitlab.eclipse.org/eclipsefdn/emo-team/iplab/-/issues/8017",
    "source": "https://search.maven.org/remotecontent?filepath=jakarta/activation/jakarta.activation-api/1.2.1/jakarta.activation-api-1.2.1-sources.jar",
    "status": "approved",
    "scans": [
        {
            "date": "April 28, 2023 at 10:36:06 a.m. GMT",
            "authority": "https://gitlab.eclipse.org/eclipsefdn/emo-team/iplab/-/issues/8017",
            "scancode-version": "31.2.1",
            "licenses-discovered": [
                "BSD-3-Clause"
            ],
            "copyrights": [
                "Copyright (c) 1997, 2018 Oracle and/or its affiliates",
                "Copyright (c) 2018 Oracle and/or its affiliates"
            ],
            "file-count": 23,
            "sha256": "e9638b764202c0def1b4d54bd37a984c681b2ed46a548ae94ef3f7e4a4b58a31",
            "source": "https://search.maven.org/remotecontent?filepath=jakarta/activation/jakarta.activation-api/1.2.1/jakarta.activation-api-1.2.1-sources.jar",
            "status": "approved"
        }
    ]
}