{
    "id": "project/technology.tradista/eclipse-tradista/tradista/a08cda7cb06853c503019ea637786404414bae58",
    "license": "Apache-2.0 AND BSD-2-Clause AND MIT",
    "authority": "https://gitlab.eclipse.org/eclipsefdn/emo-team/iplab/-/issues/17089",
    "source": "https://github.com/eclipse-tradista/tradista/archive/a08cda7cb06853c503019ea637786404414bae58.zip",
    "status": "approved",
    "scans": [
        {
            "date": "November 5, 2024, 9:46:49 p.m. GMT",
            "authority": "https://gitlab.eclipse.org/eclipsefdn/emo-team/iplab/-/issues/17089",
            "scancode-version": "31.2.1",
            "licenses-discovered": [
                "Apache-2.0",
                "BSD-2-Clause",
                "LGPL-3.0-only",
                "LGPL-2.1-only",
                "LicenseRef-scancode-bloomberg-blpapi",
                "GPL-2.0-only WITH Classpath-exception-2.0 AND LicenseRef-scancode-other-permissive",
                "MIT",
                "LicenseRef-scancode-free-unknown AND MIT"
            ],
            "copyrights": [
                "(c) 2002-2022 The Apache Software Foundation",
                "Copyright (c) 1989, 1991 Free Software Foundation, Inc.",
                "Copyright (c) 1991, 1999 Free Software Foundation, Inc.",
                "Copyright (c) 1992-2004 by P.J. Plauger",
                "Copyright (c) 2002-2015 Pivotal, Inc. Spring",
                "Copyright (c) 2002-2022, The Apache Software Foundation. Apache POI, POI, Apache, the Apache",
                "Copyright (c) 2004-2020 Apache, Apache DB, Apache Derby, Apache Torque, Apache JDO, Apache DDLUtils, the Derby",
                "Copyright (c) 2007 Free Software Foundation, Inc. <https://fsf.org/>",
                "Copyright (c) 2009-2021 PrimeTek",
                "Copyright (c) 2009-2021 PrimeTek PrimeFacees",
                "Copyright (c) 2009-2021 PrimeTek PrimeFaces Poseidon Theme",
                "Copyright (c) 2013, Harald Beck",
                "Copyright (c) 2014 Jim Moores. Quandl4J",
                "Copyright (c) 2014 Olivier Asuncion",
                "Copyright (c) 2015 Olivier Asuncion",
                "Copyright (c) 2016 Olivier Asuncion",
                "Copyright (c) 2017 Olivier Asuncion",
                "Copyright (c) 2018 Olivier Asuncion",
                "Copyright (c) 2019 Olivier Asuncion",
                "Copyright (c) 2020 Olivier Asuncion",
                "Copyright (c) 2021 Olivier Asuncion",
                "Copyright (c) 2021 The Apache Software Foundation",
                "Copyright (c) 2022 Olivier Asuncion",
                "Copyright (c) 2023 Olivier Asuncion",
                "Copyright (c) 2024 Olivier Asuncion",
                "Copyright (c) Terracotta, Inc. Quartz Scheduler",
                "Copyright 2006, 2014 Klaus Hartl",
                "Copyright 2012. Bloomberg Finance L.P.",
                "Copyright 2012. Bloomberg Finance L.P. Bloomberg API",
                "Copyright 2014-2022 Olivier Asuncion https://www.tradista.finance https://github.com/oasuncion/tradista",
                "Copyright 2015 Olivier Asuncion",
                "Copyright 2016 Olivier Asuncion",
                "Copyright 2021 Olivier Asuncion",
                "author hbeck Jun 1, 2013",
                "author hbeck Jun 8, 2013",
                "author hbeck Jun 9, 2013",
                "copyright 2010-2011, Google Corporation.Open",
                "copyright 2010-2011, Google Corporation.Open SansBold1.10 1ASC OpenSans-BoldOpen Sans BoldVersion",
                "copyright 2010-2011, Google Corporation.Open SansRegular1.10 1ASC OpenSans-RegularOpen Sans RegularVersion",
                "copyright 2011, Google Corporation.Open",
                "copyrighted by the Free Software Foundation"
            ],
            "file-count": 2977,
            "sha256": "0e0ebdc16c3a29b45431348133798d0e965f52ec421c110260759f27cc3298aa",
            "source": "https://github.com/eclipse-tradista/tradista/archive/a08cda7cb06853c503019ea637786404414bae58.zip",
            "status": "restricted"
        }
    ]
}