{
    "id": "crate/cratesio/-/windows_x86_64_gnullvm/0.52.3",
    "license": "Apache-2.0 AND MIT AND Apache-2.0 AND MIT",
    "authority": "https://gitlab.eclipse.org/eclipsefdn/emo-team/iplab/-/issues/13485",
    "source": "https://crates.io/api/v1/crates/windows_x86_64_gnullvm/0.52.3/download",
    "status": "approved",
    "scans": [
        {
            "date": "February 29, 2024 at 8:01:59 a.m. GMT",
            "authority": "https://gitlab.eclipse.org/eclipsefdn/emo-team/iplab/-/issues/13485",
            "scancode-version": "31.2.1",
            "licenses-discovered": [
                "Apache-2.0 AND MIT",
                "Apache-2.0",
                "MIT"
            ],
            "copyrights": [
                "Copyright (c) Microsoft Corporation"
            ],
            "file-count": 21543,
            "sha256": "42079295511643151e98d61c38c0acc444e52dd42ab456f7ccfd5152e8ecf21c",
            "source": "https://crates.io/api/v1/crates/windows_x86_64_gnullvm/0.52.3/download",
            "status": "approved"
        }
    ]
}