{
    "id": "npm/npmjs/@typescript-eslint/utils/7.6.0",
    "license": "BSD-2-Clause AND MIT AND (BSD-2-Clause AND ISC AND MIT)",
    "authority": "https://gitlab.eclipse.org/eclipsefdn/emo-team/iplab/-/issues/14255",
    "source": "https://github.com/typescript-eslint/typescript-eslint/archive/refs/tags/v7.6.0.zip",
    "status": "approved",
    "scans": [
        {
            "date": "April 10, 2024 at 9:17:23 a.m. GMT",
            "authority": "https://gitlab.eclipse.org/eclipsefdn/emo-team/iplab/-/issues/14255",
            "scancode-version": "31.2.1",
            "licenses-discovered": [
                "BSD-2-Clause",
                "MIT",
                "BSD-2-Clause AND ISC AND MIT"
            ],
            "copyrights": [
                "Copyright (c) 2016 unional",
                "Copyright (c) 2019 typescript-eslint and other contributors",
                "Copyright (c) 2021 typescript-eslint and other contributors",
                "Copyright (c) 2023 typescript-eslint and other contributors",
                "Copyright JS Foundation and other contributors, https://js.foundation",
                "Copyright Joyent, Inc. and other Node contributors",
                "Pp (c) Ac",
                "Tv (c) Gn"
            ],
            "file-count": 7088,
            "sha256": "ef0a4fd6f7baaf475baca0b060ec872d95b8c3c8202060b67c6a55b5952d4c35",
            "source": "https://github.com/typescript-eslint/typescript-eslint/archive/refs/tags/v7.6.0.zip",
            "status": "approved"
        }
    ]
}