{
    "id": "project/automotive.tractusx/-/sldt-bpn-discovery/0.0",
    "license": "Apache-2.0",
    "authority": "https://gitlab.eclipse.org/eclipsefdn/emo-team/iplab/-/issues/7741",
    "source": "https://github.com/bci-oss/sldt-bpn-discovery/archive/refs/heads/feature/initialContribution-sldt-bpn-discovery.zip",
    "status": "approved",
    "scans": [
        {
            "date": "April 4, 2023 at 1:14:27 p.m. GMT",
            "authority": "https://gitlab.eclipse.org/eclipsefdn/emo-team/iplab/-/issues/7741",
            "scancode-version": "31.2.1",
            "licenses-discovered": [
            ],
            "copyrights": [
                "(c) 2023 GitHub, Inc."
            ],
            "file-count": 1,
            "sha256": "4fe749ffc6900ef091d9246380b49d0a7c922f98ec2f588e91d52b83ab89a757",
            "source": "https://github.com/bci-oss/sldt-bpn-discovery/tree/feature/initialContribution-sldt-bpn-discovery",
            "status": "restricted"
        },
        {
            "date": "April 4, 2023 at 2:00:27 p.m. GMT",
            "authority": "https://gitlab.eclipse.org/eclipsefdn/emo-team/iplab/-/issues/7741",
            "scancode-version": "31.2.1",
            "licenses-discovered": [
                "Apache-2.0"
            ],
            "copyrights": [
                "Copyright (c) 2021-2022 Contributors",
                "Copyright (c) 2021-2022 Robert Bosch Manufacturing Solutions GmbH",
                "Copyright (c) 2023 Contributors",
                "Copyright (c) 2023 Robert Bosch Manufacturing Solutions GmbH",
                "Copyright (c) 2023 T-Systems International GmbH"
            ],
            "file-count": 57,
            "sha256": "b4af5ec283bba4cf49d0dd972c7671d89141870e3afe047a77ffc291fdb9d3e5",
            "source": "https://github.com/bci-oss/sldt-bpn-discovery/archive/refs/heads/feature/initialContribution-sldt-bpn-discovery.zip",
            "status": "restricted"
        }
    ]
}
