{
    "id": "git/github/nats-io/nuid/v1.0.1",
    "license": "Apache-2.0",
    "licenses-discovered": [
        "Apache-2.0"
    ],
    "copyrights": [
        "Copyright The NATS Authors"
    ],
    "file-count": 8,
    "scancode-version": "30.1.0",
    "authority": "https://gitlab.eclipse.org/eclipsefdn/emo-team/iplab/-/issues/3640",
    "source": "https://github.com/nats-io/nuid/archive/refs/tags/v1.0.1.zip",
    "status": "approved"
}