{
    "id": "maven/mavencentral/org.apache.hadoop/hadoop-yarn-server-common/3.3.6",
    "license": "Apache-2.0 AND BSD-2-Clause AND BSD-3-Clause AND BSL-1.0 AND MIT AND Apache-2.0",
    "authority": "https://gitlab.eclipse.org/eclipsefdn/emo-team/iplab/-/issues/18187",
    "source": "https://repo1.maven.org/maven2/org/apache/hadoop/hadoop-yarn-server-common/3.3.6/hadoop-yarn-server-common-3.3.6-sources.jar",
    "status": "approved",
    "scans": [
        {
            "date": "January 2, 2025 at 4:39:21 p.m. GMT",
            "authority": "https://gitlab.eclipse.org/eclipsefdn/emo-team/iplab/-/issues/18187",
            "scancode-version": "31.2.1",
            "licenses-discovered": [
                "Apache-2.0 AND BSD-2-Clause AND BSD-3-Clause AND BSL-1.0 AND MIT",
                "Apache-2.0"
            ],
            "copyrights": [
            ],
            "file-count": 289,
            "sha256": "08b0d30658bf3d3c54ea370587940c873fdd97de4ea480dd277146b36a2ad8a8",
            "source": "https://repo1.maven.org/maven2/org/apache/hadoop/hadoop-yarn-server-common/3.3.6/hadoop-yarn-server-common-3.3.6-sources.jar",
            "status": "approved"
        }
    ]
}