{
    "id": "npm/npmjs/-/lerna/6.5.1",
    "license": "MIT AND ISC",
    "authority": "https://gitlab.eclipse.org/eclipsefdn/emo-team/iplab/-/issues/7136",
    "source": "https://registry.yarnpkg.com/lerna/-/lerna-6.5.1.tgz",
    "status": "approved",
    "scans": [
        {
            "date": "February 14, 2023 at 3:13:11 p.m. GMT",
            "authority": "https://gitlab.eclipse.org/eclipsefdn/emo-team/iplab/-/issues/7136",
            "scancode-version": "31.2.1",
            "licenses-discovered": [
                "MIT",
                "ISC"
            ],
            "copyrights": [
                "Copyright (c) 2015-present Lerna"
            ],
            "file-count": 67,
            "sha256": "05288dbf9c3fa5523d68ad04e80f69ba88c8e4f00b68c03bb990202d4341ea20",
            "source": "https://registry.yarnpkg.com/lerna/-/lerna-6.5.1.tgz",
            "status": "approved"
        }
    ]
}