{
    "id": "npm/npmjs/@nx/nx-linux-x64-musl/20.4.0",
    "license": "MIT",
    "authority": "https://gitlab.eclipse.org/eclipsefdn/emo-team/iplab/-/issues/19230",
    "source": "https://github.com/nrwl/nx/archive/refs/tags/20.4.0.zip",
    "status": "approved",
    "scans": [
        {
            "date": "January 30, 2025 at 2:29:08 a.m. GMT",
            "authority": "https://gitlab.eclipse.org/eclipsefdn/emo-team/iplab/-/issues/19230",
            "scancode-version": "31.2.1",
            "licenses-discovered": [
                "MIT",
                "TMate",
                "ISC",
                "LicenseRef-scancode-commercial-license AND MIT",
                "LicenseRef-scancode-commercial-license",
                "Apache-2.0",
                "Apache-2.0 AND GPL-3.0-only AND ISC AND JSON AND MIT",
                "GPL-3.0-only AND JSON AND MIT",
                "JSON AND MIT",
                "LicenseRef-scancode-commercial-license AND LicenseRef-scancode-proprietary-license",
                "MIT AND Unlicense",
                "JSON"
            ],
            "copyrights": [
                "(c) 2025 made with",
                "Copyright (c) 2014 The Android Open Source Project",
                "Copyright (c) 2015-2021 the original",
                "Copyright (c) 2017-2025 Narwhal Technologies Inc.",
                "Copyright (c) 2022 Mohammad Ataei",
                "Copyright 2015 the original author or authors",
                "Copyright Apple Inc., 2024",
                "Copyright Google Inc."
            ],
            "file-count": 8538,
            "sha256": "ba87d493d802c0d352cc64f1e63c1757d4fec99e2631a487fae2f2200bab45a8",
            "source": "https://github.com/nrwl/nx/archive/refs/tags/20.4.0.zip",
            "status": "restricted"
        }
    ]
}