{
    "id": "maven/mavencentral/org.wildfly.security/wildfly-elytron-sasl-external/2.2.1.Final",
    "license": "Apache-2.0",
    "authority": "https://gitlab.eclipse.org/eclipsefdn/emo-team/iplab/-/issues/9412",
    "source": "https://repo.maven.apache.org/maven2/org/wildfly/security/wildfly-elytron-sasl-external/2.2.1.Final/wildfly-elytron-sasl-external-2.2.1.Final-sources.jar",
    "status": "approved",
    "scans": [
        {
            "date": "July 14, 2023 at 2:04:42 p.m. GMT",
            "authority": "https://gitlab.eclipse.org/eclipsefdn/emo-team/iplab/-/issues/9412",
            "scancode-version": "31.2.1",
            "licenses-discovered": [
                "Apache-2.0"
            ],
            "copyrights": [
                "Copyright 2014 Red Hat, Inc., and individual contributors",
                "Copyright 2018 Red Hat, Inc., and individual contributors"
            ],
            "file-count": 9,
            "sha256": "f83f80d03d222f26b04680c7642556d163c41549be7ebc77c9f74c151687bdae",
            "source": "https://repo.maven.apache.org/maven2/org/wildfly/security/wildfly-elytron-sasl-external/2.2.1.Final/wildfly-elytron-sasl-external-2.2.1.Final-sources.jar",
            "status": "approved"
        }
    ]
}