{
    "id": "maven/mavencentral/org.apache.activemq/artemis-service-extensions/2.31.0",
    "license": "Apache-2.0",
    "authority": "https://gitlab.eclipse.org/eclipsefdn/emo-team/iplab/-/issues/10610",
    "source": "https://repo.maven.apache.org/maven2/org/apache/activemq/artemis-service-extensions/2.31.0/artemis-service-extensions-2.31.0-sources.jar",
    "status": "approved",
    "scans": [
        {
            "date": "September 22, 2023 at 9:24:45 a.m. GMT",
            "authority": "https://gitlab.eclipse.org/eclipsefdn/emo-team/iplab/-/issues/10610",
            "scancode-version": "31.2.1",
            "licenses-discovered": [
                "Apache-2.0"
            ],
            "copyrights": [
            ],
            "file-count": 19,
            "sha256": "6a54dab44b8c1cb787ef5f73bf1473c4cd3925ea51e5ca2102c42b2bf6e54191",
            "source": "https://repo.maven.apache.org/maven2/org/apache/activemq/artemis-service-extensions/2.31.0/artemis-service-extensions-2.31.0-sources.jar",
            "status": "approved"
        }
    ]
}