{
    "license": "Apache-2.0",
    "file-count": 179,
    "authority": "https://gitlab.eclipse.org/eclipsefdn/emo-team/iplab/-/issues/1564",
    "scancode-version": "30.1.0",
    "licenses-discovered": [
        "Apache-2.0",
        "LicenseRef-scancode-public-domain"
    ],
    "id": "maven/mavencentral/joda-time/joda-time/2.1",
    "source": "https://search.maven.org/remotecontent?filepath=joda-time/joda-time/2.1/joda-time-2.1-sources.jar",
    "status": "approved"
}
