{
    "license": "MIT",
    "file-count": 4,
    "authority": "https://gitlab.eclipse.org/eclipsefdn/emo-team/iplab/-/issues/1261",
    "scancode-version": "21.3.31",
    "licenses-discovered": [
        "MIT"
    ],
    "id": "npm/npmjs/types/file-saver/2.0.1",
    "source": "https://registry.yarnpkg.com/@types/file-saver/-/file-saver-2.0.1.tgz",
    "status": "approved"
}