{
    "id": "nuget/nuget/-/HotChocolate/13.9.6",
    "license": "MIT",
    "authority": "https://gitlab.eclipse.org/eclipsefdn/emo-team/iplab/-/issues/15662",
    "source": "https://gitlab.eclipse.org/eclipsefdn/emo-team/iplab/uploads/a02797c6dd91ce92f34f4a6ef04bac50/HotChocolate.zip",
    "status": "approved",
    "scans": [
        {
            "date": "July 9, 2024 at 11:03:01 p.m. GMT",
            "authority": "https://gitlab.eclipse.org/eclipsefdn/emo-team/iplab/-/issues/15662",
            "scancode-version": "31.2.1",
            "licenses-discovered": [
                "GPL-3.0-only AND LicenseRef-scancode-proprietary-license",
                "GPL-3.0-only",
                "MIT",
                "Apache-2.0"
            ],
            "copyrights": [
                "Copyright (c) 2015-present, Facebook, Inc.",
                "Copyright (c) 2021 ChilliCream (Michael Rafael Staib) LICENSE https://chillicream.com"
            ],
            "file-count": 11275,
            "sha256": "4252778227d1620f20d2dff11944880cfd5b8b743ef3f4c8ba2399b11bd36584",
            "source": "https://gitlab.eclipse.org/eclipsefdn/emo-team/iplab/uploads/a02797c6dd91ce92f34f4a6ef04bac50/HotChocolate.zip",
            "status": "restricted"
        }
    ]
}