{
    "id": "npm/npmjs/@nrwl/devkit/19.8.0",
    "license": "MIT AND Apache-2.0",
    "authority": "https://gitlab.eclipse.org/eclipsefdn/emo-team/iplab/-/issues/16302",
    "source": "https://github.com/nrwl/nx/archive/refs/tags/19.8.0.zip",
    "status": "approved",
    "scans": [
        {
            "date": "September 25, 2024, 10:34:30 p.m. GMT",
            "authority": "https://gitlab.eclipse.org/eclipsefdn/emo-team/iplab/-/issues/16302",
            "scancode-version": "31.2.1",
            "licenses-discovered": [
                "MIT",
                "TMate",
                "Apache-2.0",
                "GPL-3.0-only AND JSON AND MIT",
                "JSON AND MIT",
                "MIT AND Unlicense",
                "ISC",
                "JSON",
                "Apache-2.0 AND BSD-3-Clause AND CDDL-1.0 AND CDDL-1.1 AND EPL-1.0 AND EPL-2.0 AND (GPL-2.0-only WITH Classpath-exception-2.0) AND MIT"
            ],
            "copyrights": [
                "(c) 2024 made with",
                "Copyright (c) 2014 The Android Open Source Project",
                "Copyright (c) 2015-2021 the original",
                "Copyright (c) 2017-2024 Narwhal Technologies Inc.",
                "Copyright (c) 2022 Mohammad Ataei",
                "Copyright 2015 the original author or authors",
                "Copyright Google Inc."
            ],
            "file-count": 7809,
            "sha256": "aa497f92e8e0a0728e55d56101c25f9bf3000efa6655fb64f3d44f7146872859",
            "source": "https://github.com/nrwl/nx/archive/refs/tags/19.8.0.zip",
            "status": "restricted"
        }
    ]
}