{
    "id": "crate/cratesio/-/rdkafka-sys/4.5.0",
    "license": "MIT",
    "authority": "https://gitlab.eclipse.org/eclipsefdn/emo-team/iplab/-/issues/9766",
    "source": "https://github.com/fede1024/rust-rdkafka/archive/97688d78c1f2d100b3ead7e1acfd8e600cad4c9e.zip",
    "status": "approved",
    "scans": [
        {
            "date": "July 28, 2023 at 8:59:45 p.m. GMT",
            "authority": "https://gitlab.eclipse.org/eclipsefdn/emo-team/iplab/-/issues/9766",
            "scancode-version": "31.2.1",
            "licenses-discovered": [
                "MIT"
            ],
            "copyrights": [
                "Copyright (c) 2016 Federico Giraud"
            ],
            "file-count": 67,
            "sha256": "b3bd695bb8e85976ad5c135d067ac1ef43ad098a68d650b4608c55e61014cd50",
            "source": "https://github.com/fede1024/rust-rdkafka/archive/97688d78c1f2d100b3ead7e1acfd8e600cad4c9e.zip",
            "status": "approved"
        }
    ]
}