{
    "id": "maven/mavencentral/com.google.api.grpc/proto-google-cloud-bigquerystorage-v1beta1/0.182.2",
    "license": "Apache-2.0",
    "authority": "https://gitlab.eclipse.org/eclipsefdn/emo-team/iplab/-/issues/17188",
    "source": "https://repo1.maven.org/maven2/com/google/api/grpc/proto-google-cloud-bigquerystorage-v1beta1/0.182.2/proto-google-cloud-bigquerystorage-v1beta1-0.182.2-sources.jar",
    "status": "approved",
    "scans": [
        {
            "date": "November 14, 2024, 3:28:07 a.m. GMT",
            "authority": "https://gitlab.eclipse.org/eclipsefdn/emo-team/iplab/-/issues/17188",
            "scancode-version": "31.2.1",
            "licenses-discovered": [
                "Apache-2.0"
            ],
            "copyrights": [
                "Copyright 2024 Google LLC"
            ],
            "file-count": 14,
            "sha256": "f5e4884e1cfc447224622586ef143f8e7fbbc5aa937c8bfff8808a42b9c61345",
            "source": "https://repo1.maven.org/maven2/com/google/api/grpc/proto-google-cloud-bigquerystorage-v1beta1/0.182.2/proto-google-cloud-bigquerystorage-v1beta1-0.182.2-sources.jar",
            "status": "approved"
        }
    ]
}