{
    "id": "go/golang/github.com%2Fgolang/mock/v1.6.0",
    "license": "Apache-2.0",
    "authority": "https://gitlab.eclipse.org/eclipsefdn/emo-team/iplab/-/issues/12207",
    "source": "https://proxy.golang.org/github.com%2Fgolang/mock/@v/v1.6.0.zip",
    "status": "approved",
    "scans": [
        {
            "date": "December 20, 2023 at 1:31:52 p.m. GMT",
            "authority": "https://gitlab.eclipse.org/eclipsefdn/emo-team/iplab/-/issues/12207",
            "scancode-version": "31.2.1",
            "licenses-discovered": [
                "Apache-2.0"
            ],
            "copyrights": [
                "Copyright 2010 Google Inc.",
                "Copyright 2010 Google LLC.",
                "Copyright 2011 Google Inc.",
                "Copyright 2012 Google Inc.",
                "Copyright 2019 Google LLC",
                "Copyright 2020 Google Inc.",
                "Copyright 2020 Google LLC"
            ],
            "file-count": 125,
            "sha256": "fa25916b546f90da49418f436e3a61e4c5dae898cf3c82b0007b5a6fab74261b",
            "source": "https://proxy.golang.org/github.com%2Fgolang/mock/@v/v1.6.0.zip",
            "status": "approved"
        }
    ]
}