{
    "id": "project/iot.threadx/eclipse-threadx/threadx-learn-samples/25b9e2df83d721fae67db2db32432b8f552eb8be",
    "license": "MIT",
    "authority": "https://gitlab.eclipse.org/eclipsefdn/emo-team/iplab/-/issues/12869",
    "source": "https://github.com/eclipse-threadx/threadx-learn-samples/archive/25b9e2df83d721fae67db2db32432b8f552eb8be.zip",
    "status": "approved",
    "scans": [
        {
            "date": "January 23, 2024 at 5:14:25 p.m. GMT",
            "authority": "https://gitlab.eclipse.org/eclipsefdn/emo-team/iplab/-/issues/12869",
            "scancode-version": "31.2.1",
            "licenses-discovered": [
                "MIT"
            ],
            "copyrights": [
                "Copyright (c) Microsoft Corporation"
            ],
            "file-count": 42,
            "sha256": "d7ba0e6aa572ccf23f8416ae614cdbb99bbed3bac8e141a1c0238130f63e6cbf",
            "source": "https://github.com/eclipse-threadx/threadx-learn-samples/archive/25b9e2df83d721fae67db2db32432b8f552eb8be.zip",
            "status": "restricted"
        }
    ]
}
