{
    "id": "pypi/pypi/-/jwcrypto/1.5.6",
    "license": "LGPL-3.0-only AND LGPL-3.0-or-later",
    "authority": "https://gitlab.eclipse.org/eclipsefdn/emo-team/iplab/-/issues/15152",
    "source": "https://files.pythonhosted.org/packages/e1/db/870e5d5fb311b0bcf049630b5ba3abca2d339fd5e13ba175b4c13b456d08/jwcrypto-1.5.6.tar.gz",
    "status": "approved",
    "scans": [
        {
            "date": "June 11, 2024 at 10:42:09 a.m. GMT",
            "authority": "https://gitlab.eclipse.org/eclipsefdn/emo-team/iplab/-/issues/15152",
            "scancode-version": "31.2.1",
            "licenses-discovered": [
                "LGPL-3.0-only",
                "LGPL-3.0-or-later"
            ],
            "copyrights": [
                "Copyright (c) 2007 Free Software Foundation, Inc. <http://fsf.org/>",
                "Copyright (c) 2015 JWCrypto Project",
                "Copyright (c) 2015 JWCrypto Project Contributors",
                "Copyright (c) 2016 JWCrypto Project"
            ],
            "file-count": 22,
            "sha256": "771a87762a0c081ae6166958a954f80848820b2ab066937dc8b8379d65b1b039",
            "source": "https://files.pythonhosted.org/packages/e1/db/870e5d5fb311b0bcf049630b5ba3abca2d339fd5e13ba175b4c13b456d08/jwcrypto-1.5.6.tar.gz",
            "status": "approved"
        }
    ]
}