{
    "id": "npm/npmjs/@emotion/styled/11.13.5",
    "license": "MIT AND (BSD-2-Clause AND MIT)",
    "authority": "https://gitlab.eclipse.org/eclipsefdn/emo-team/iplab/-/issues/17693",
    "source": "https://github.com/emotion-js/emotion/archive/refs/tags/@emotion/css@11.13.5.zip",
    "status": "approved",
    "scans": [
        {
            "date": "December 4, 2024 at 4:46:52 p.m. GMT",
            "authority": "https://gitlab.eclipse.org/eclipsefdn/emo-team/iplab/-/issues/17693",
            "scancode-version": "31.2.1",
            "licenses-discovered": [
                "MIT",
                "BSD-2-Clause AND MIT"
            ],
            "copyrights": [
                "Copyright (c) 2014-present, Jon Schlinkert",
                "Copyright (c) 2015-present, Jon Schlinkert",
                "Copyright (c) 2017 Paul Armstrong https://github.com/paularmstrong/react-component-benchmark",
                "Copyright (c) Emotion team and other contributors",
                "Copyright 2011-2021 The Bootstrap Authors",
                "Copyright 2011-2021 Twitter, Inc.",
                "Copyright 2022 Fonticons, Inc."
            ],
            "file-count": 810,
            "sha256": "f233d41a9fba328484e648728e687f9cab33e0fe6351a7558d3321ad5dedc53b",
            "source": "https://github.com/emotion-js/emotion/archive/refs/tags/@emotion/css@11.13.5.zip",
            "status": "approved"
        }
    ]
}