{
    "id": "maven/mavencentral/io.fabric8/mockwebserver/6.11.0",
    "license": "Apache-2.0",
    "authority": "https://gitlab.eclipse.org/eclipsefdn/emo-team/iplab/-/issues/14081",
    "source": "https://repo1.maven.org/maven2/io/fabric8/mockwebserver/6.11.0/mockwebserver-6.11.0-sources.jar",
    "status": "approved",
    "scans": [
        {
            "date": "March 26, 2024 at 9:55:11 a.m. GMT",
            "authority": "https://gitlab.eclipse.org/eclipsefdn/emo-team/iplab/-/issues/14081",
            "scancode-version": "31.2.1",
            "licenses-discovered": [
                "Apache-2.0"
            ],
            "copyrights": [
                "Copyright (c) 2015 Red Hat, Inc."
            ],
            "file-count": 62,
            "sha256": "1c6c1c8a35bd3fba39b03e51795162a4a68e9cc9e1550abd50c763fff34cf866",
            "source": "https://repo1.maven.org/maven2/io/fabric8/mockwebserver/6.11.0/mockwebserver-6.11.0-sources.jar",
            "status": "approved"
        }
    ]
}