{
    "id": "project/automotive.tractusx/-/demand-capacity-mgmt/0.0",
    "license": "Apache-2.0",
    "authority": "https://gitlab.eclipse.org/eclipsefdn/emo-team/iplab/-/issues/14873",
    "source": "https://github.com/eclipse-tractusx/demand-capacity-mgmt/pull/80.patch",
    "status": "approved",
    "scans": [
        {
            "date": "August 8, 2023 at 12:13:08 p.m. GMT",
            "authority": "https://gitlab.eclipse.org/eclipsefdn/emo-team/iplab/-/issues/9868",
            "scancode-version": "31.2.1",
            "licenses-discovered": [
            ],
            "copyrights": [
                "Copyright (c) 2021,2023 Contributors",
                "Copyright (c) 2022,2023 BMW Group AG",
                "Copyright (c) 2022,2023 Contributors",
                "Copyright (c) 2023 BMW AG",
                "Copyright (c) 2023 BMW AG - ~",
                "Copyright (c) 2023 Contributors",
                "Copyright 2022 Catena-X"
            ],
            "file-count": 1,
            "sha256": "25ad65c7843146550aba7ed10d7bf2ee84d5ae51b48642bb4328fde3af3f07d4",
            "source": "https://github.com/eclipse-tractusx/demand-capacity-mgmt/pull/6.patch",
            "status": "restricted"
        },
        {
            "date": "August 23, 2023 at 7:21:47 a.m. GMT",
            "authority": "https://gitlab.eclipse.org/eclipsefdn/emo-team/iplab/-/issues/10164",
            "scancode-version": "31.2.1",
            "licenses-discovered": [
                "Apache-2.0"
            ],
            "copyrights": [
                "Copyright (c) 2021,2023 Contributors",
                "Copyright (c) 2022,2023 BMW Group AG",
                "Copyright (c) 2022,2023 Contributors",
                "Copyright (c) 2023 BMW AG",
                "Copyright (c) 2023 BMW AG - ~",
                "Copyright (c) 2023 Contributors",
                "Copyright 2022 Catena-X"
            ],
            "file-count": 1,
            "sha256": "17a579214d99678c2671722834525e88680a739bb8f18325ef38e96044df2e77",
            "source": "https://github.com/eclipse-tractusx/demand-capacity-mgmt/pull/8.patch",
            "status": "restricted"
        },
        {
            "date": "October 5, 2023 at 9:05:47 a.m. GMT",
            "authority": "https://gitlab.eclipse.org/eclipsefdn/emo-team/iplab/-/issues/10908",
            "scancode-version": "31.2.1",
            "licenses-discovered": [
                "Apache-2.0"
            ],
            "copyrights": [
                "Copyright (c) 2023 BMW AG",
                "Copyright (c) 2023 Contributors"
            ],
            "file-count": 1,
            "sha256": "18008c6689f478fe06e72bc6c2800614474b419604e7ba54766417a4913e08a9",
            "source": "https://github.com/eclipse-tractusx/demand-capacity-mgmt/pull/28.patch",
            "status": "restricted"
        },
        {
            "date": "May 15, 2024 at 8:42:33 a.m. GMT",
            "authority": "https://gitlab.eclipse.org/eclipsefdn/emo-team/iplab/-/issues/14720",
            "scancode-version": "31.2.1",
            "licenses-discovered": [
                "Apache-2.0"
            ],
            "copyrights": [
                "Copyright (c) 2024 Contributors",
                "Copyright (c) 2024-25 Smart Sense Consulting Solutions Pvt. Ltd."
            ],
            "file-count": 1,
            "sha256": "2d351889a6d87b3a2e4e4c966730b9d9dde261f6676913d2d7cd334962f25ee0",
            "source": "https://github.com/eclipse-tractusx/demand-capacity-mgmt/pull/72.patch",
            "status": "restricted"
        },
        {
            "date": "May 22, 2024 at 2:48:34 p.m. GMT",
            "authority": "https://gitlab.eclipse.org/eclipsefdn/emo-team/iplab/-/issues/14873",
            "scancode-version": "31.2.1",
            "licenses-discovered": [
                "Apache-2.0"
            ],
            "copyrights": [
                "Copyright (c) 2024 Contributors"
            ],
            "file-count": 1,
            "sha256": "ee4ac50ce586a0809d25b94e06d0c008c0d1d631b02d60dce82e1f24e81ed91f",
            "source": "https://github.com/eclipse-tractusx/demand-capacity-mgmt/pull/80.patch",
            "status": "restricted"
        }
    ]
}