{
    "id": "npm/npmjs/-/allure-commandline/2.20.0",
    "license": "Apache-2.0",
    "licenses-discovered": [
        "Apache-2.0",
        "BSD-3-Clause AND MIT",
        "MIT AND OFL-1.1",
        "MPL-2.0",
        "BSD-3-Clause",
        "CDDL-1.1 AND (GPL-2.0-only WITH Classpath-exception-2.0)",
        "Apache-2.0 AND CDDL-1.1 AND (GPL-2.0-only WITH Classpath-exception-2.0)",
        "CDDL-1.0 AND (GPL-2.0-only WITH Classpath-exception-2.0)",
        "CDDL-1.0 AND CDDL-1.1 AND (GPL-2.0-only WITH Classpath-exception-2.0)",
        "Apache-1.1 AND Apache-2.0 AND EPL-1.0 AND LicenseRef-scancode-other-permissive",
        "Apache-2.0 AND EPL-1.0 AND EPL-2.0",
        "Apache-2.0 AND BSD-2-Clause AND BSD-2-Clause-Views AND BSD-3-Clause",
        "BSD-2-Clause",
        "Apache-2.0 AND LicenseRef-scancode-bsd-simplified-darwin AND LicenseRef-scancode-iptc-2006",
        "MIT"
    ],
    "copyrights": [
        "Copyright (c) 1989, 1991 Free Software Foundation, Inc.",
        "Copyright (c) 1997, 2019 Oracle and/or its affiliates",
        "Copyright (c) 1997-2010 Oracle and/or its affiliates",
        "Copyright (c) 1997-2013 Oracle and/or its affiliates",
        "Copyright (c) 1997-2017 Oracle and/or its affiliates",
        "Copyright (c) 1999-2010, QOS.ch",
        "Copyright (c) 1999-2012, QOS.ch",
        "Copyright (c) 1999-2013, http://www.oracle.com' Oracle and/or its affiliates",
        "Copyright (c) 2001-2013 Oracle and/or its affiliates",
        "Copyright (c) 2003, 2018 Oracle and/or its affiliates",
        "Copyright (c) 2003-2017 Oracle and/or its affiliates",
        "Copyright (c) 2004-2017 Oracle",
        "Copyright (c) 2008-2010 Oracle and/or its affiliates",
        "Copyright (c) 2008-2022 Mort Bay Consulting Pty Ltd",
        "Copyright (c) 2009-2010 Oracle and/or its affiliates",
        "Copyright (c) 2013 Oracle and/or its affiliates",
        "Copyright (c) 2015-2021 the original",
        "Copyright (c) 2017, 2018 Oracle and/or its affiliates",
        "Copyright (c) 2017-2018 Oracle and/or its affiliates",
        "Copyright (c) 2018 Oracle and/or its affiliates",
        "Copyright (c) 2018, 2019 Oracle and/or its affiliates",
        "Copyright (c) 2018, 2020 Oracle and/or its affiliates",
        "Copyright (c) 2019, 2020 Eclipse Foundation",
        "Copyright (c) Ian F. Darwin 1986, 1987, 1989, 1990, 1991, 1992, 1994, 1995",
        "Copyright 1996 Aki Yoshida",
        "Copyright 2004 The Apache Software Foundation",
        "Copyright 2010 International Press Telecommunications Council",
        "Copyright 2015 the original author or authors",
        "Copyright 2017 Andrew Rucker Jones",
        "Copyright 2018 Andre Levandovski Rosot",
        "Copyright 2021 Qameta Software",
        "Copyright JS Foundation and other contributors",
        "Copyright OpenJS Foundation and other contributors",
        "Portions Copyright (c) 1999-2002 The Apache Software Foundation",
        "copyright 2018 Jason Mulligan <jason.mulligan@avoidwork.com>",
        "copyrighted by the Free Software Foundation"
    ],
    "file-count": 12677,
    "scancode-version": "31.2.1",
    "authority": "https://gitlab.eclipse.org/eclipsefdn/emo-team/iplab/-/issues/4642",
    "source": "https://registry.npmjs.org/allure-commandline/-/allure-commandline-2.20.0.tgz",
    "status": "approved"
}
