{
    "id": "git/github/golang/net/8a410e7b638d",
    "license": "BSD-3-Clause AND (BSD-2-Clause AND BSD-3-Clause)",
    "authority": "https://gitlab.eclipse.org/eclipsefdn/emo-team/iplab/-/issues/5563",
    "source": "https://github.com/golang/net/archive/8a410e7b638d.zip",
    "status": "approved",
    "scans": [
        {
            "date": "December 9, 2022 at 11:06:14 a.m. GMT",
            "authority": "https://gitlab.eclipse.org/eclipsefdn/emo-team/iplab/-/issues/5563",
            "scancode-version": "31.2.1",
            "licenses-discovered": [
                "BSD-3-Clause",
                "BSD-2-Clause AND BSD-3-Clause"
            ],
            "copyrights": [
                "(c) cc.fr",
                "(c) if err p.JoinGroup en0, &net.UDPAddr IP group",
                "Copyright (c) 2009 Apple Inc.",
                "Copyright (c) 2009 The Go Authors",
                "Copyright 2009 The Go Authors",
                "Copyright 2010 The Go Authors",
                "Copyright 2011 The Go Authors",
                "Copyright 2012 The Go Authors",
                "Copyright 2013 The Go Authors",
                "Copyright 2014 The Go Authors",
                "Copyright 2015 The Go Authors",
                "Copyright 2016 The Go Authors",
                "Copyright 2017 The Go Authors",
                "Copyright 2018 The Go Authors"
            ],
            "file-count": 627,
            "sha256": "b7969a3a958bd3d5158820a0dd3835a01b05a94b1f82eb49fe1e4af530d7bb3c",
            "source": "https://github.com/golang/net/archive/8a410e7b638d.zip",
            "status": "approved"
        }
    ]
}