{
    "id": "maven/mavencentral/org.geotools/gt-grid/22.1",
    "license": "LGPL-2.1-only",
    "authority": "https://gitlab.eclipse.org/eclipsefdn/emo-team/iplab/-/issues/4950",
    "source": "https://repo.osgeo.org/repository/geotools-releases/org/geotools/gt-grid/22.1/gt-grid-22.1-sources.jar",
    "status": "approved",
    "scans": [
        {
            "date": "November 15, 2022 at 11:21:43 p.m. GMT",
            "authority": "https://gitlab.eclipse.org/eclipsefdn/emo-team/iplab/-/issues/4950",
            "scancode-version": "31.2.1",
            "licenses-discovered": [
                "LGPL-2.1-only"
            ],
            "copyrights": [
                "(c) 2010, Open Source Geospatial Foundation",
                "(c) 2011, Open Source Geospatial Foundation",
                "(c) 2019, Open Source Geospatial Foundation"
            ],
            "file-count": 27,
            "sha256": "0f90370eeeee592b815739c1307e2dc40cfcf934cc599c24de96e1a4e39690af",
            "source": "https://repo.osgeo.org/repository/geotools-releases/org/geotools/gt-grid/22.1/gt-grid-22.1-sources.jar",
            "status": "restricted"
        },
        {
            "date": "November 16, 2022 at 12:55:49 a.m. GMT",
            "authority": "https://gitlab.eclipse.org/eclipsefdn/emo-team/iplab/-/issues/4950",
            "scancode-version": "31.2.1",
            "licenses-discovered": [
                "LGPL-2.1-only"
            ],
            "copyrights": [
                "(c) 2010, Open Source Geospatial Foundation",
                "(c) 2011, Open Source Geospatial Foundation",
                "(c) 2019, Open Source Geospatial Foundation"
            ],
            "file-count": 27,
            "sha256": "0f90370eeeee592b815739c1307e2dc40cfcf934cc599c24de96e1a4e39690af",
            "source": "https://repo.osgeo.org/repository/geotools-releases/org/geotools/gt-grid/22.1/gt-grid-22.1-sources.jar",
            "status": "approved"
        }
    ]
}