{
    "id": "npm/npmjs/@deck.gl/mapbox/8.8.22",
    "license": "MIT AND ISC AND BSD-3-Clause AND Apache-2.0 AND CC-BY-4.0",
    "authority": "https://gitlab.eclipse.org/eclipsefdn/emo-team/iplab/-/issues/7078",
    "source": "https://github.com/visgl/deck.gl/archive/v8.8.22.zip",
    "status": "approved",
    "scans": [
        {
            "date": "February 9, 2023 at 5:27:56 p.m. GMT",
            "authority": "https://gitlab.eclipse.org/eclipsefdn/emo-team/iplab/-/issues/7078",
            "scancode-version": "31.2.1",
            "licenses-discovered": [
                "MIT",
                "Apache-2.0",
                "CC-BY-SA-3.0",
                "CC-BY-4.0 AND CC-BY-NC-SA-4.0 AND CC-BY-SA-4.0",
                "BSD-3-Clause",
                "LicenseRef-scancode-proprietary-license",
                "ODbL-1.0",
                "CC-BY-4.0",
                "ISC"
            ],
            "copyrights": [
                "(c) Land Transport",
                "(c) copyright Blender Foundation durian.blender.org'> durian.blender.org",
                "(c) https://www.openstreetmap.org/copyright",
                "(c) https://www.openstreetmap.org/copyright'>",
                "(c) or escaped code point https://developer.mozilla.org/en-US/docs/Web/JavaScript/Reference/Lexical_grammar",
                "Copyright (c) 2012-2016, Jon Atkins <github@jonatkins.com>",
                "Copyright (c) 2015 - 2017 Uber Technologies, Inc.",
                "Copyright (c) 2015 - 2018 Uber Technologies, Inc.",
                "Copyright (c) 2015 - 2019 Uber Technologies, Inc.",
                "Copyright (c) 2015 Uber Technologies, Inc.",
                "Copyright (c) 2015-2017 Uber Technologies, Inc.",
                "Copyright (c) 2016 Uber Technologies, Inc.",
                "Copyright (c) 2016, AJ ONeal <aj@daplie.com>",
                "Copyright (c) 2017 Tarek Sherif",
                "Copyright (c) 2017 Uber Technologies, Inc.",
                "Copyright (c) 2017, Mapbox",
                "Copyright (c) 2017, Mapbox import Evented, Event",
                "Copyright (c) 2017-2019 HERE Europe B.V.",
                "Copyright (c) 2019 Tarek Sherif",
                "Copyright (c) 2019 Uber Technologies, Inc.",
                "Copyright (c) 2020 Urban Computing Foundation",
                "Copyright (c) 2022, CARTO",
                "Copyright (c) Jupyter Development Team",
                "Copyright (c) Jupyter Labs Team",
                "Copyright (c) Uber Technologies, Inc.",
                "Copyright 2020 vis.gl, a Series of LF Projects, LLC",
                "copyright 2021, vis.gl, a Series of LF Projects, LLC"
            ],
            "file-count": 2122,
            "sha256": "43d7f8736e5bebe69cab0b835e9aaadb52aedcacc94ac76ad7621e197301cc6e",
            "source": "https://github.com/visgl/deck.gl/archive/v8.8.22.zip",
            "status": "restricted"
        }
    ]
}
