{
    "id": "npm/npmjs/-/webpack/5.76.2",
    "license": "MIT",
    "authority": "https://gitlab.eclipse.org/eclipsefdn/emo-team/iplab/-/issues/7409",
    "source": "https://github.com/webpack/webpack/archive/v5.76.2.zip",
    "status": "approved",
    "scans": [
        {
            "date": "March 16, 2023 at 12:56:45 p.m. GMT",
            "authority": "https://gitlab.eclipse.org/eclipsefdn/emo-team/iplab/-/issues/7409",
            "scancode-version": "31.2.1",
            "licenses-discovered": [
                "MIT"
            ],
            "copyrights": [
                "(c) 1990 RSA Data Security, Inc.",
                "Copyright (c) 2016 Stephan Brumme",
                "Copyright JS Foundation and other contributors"
            ],
            "file-count": 7138,
            "sha256": "bab53d2cb849e5350cf1d8499b7fb2dd2a2b1ee274f73606810a555f0a4ae0ea",
            "source": "https://github.com/webpack/webpack/archive/v5.76.2.zip",
            "status": "approved"
        }
    ]
}