{
    "id": "maven/mavencentral/org.wildfly.security/wildfly-elytron-provider-util/2.2.1.Final",
    "license": "Apache-2.0",
    "authority": "https://gitlab.eclipse.org/eclipsefdn/emo-team/iplab/-/issues/9405",
    "source": "https://repo.maven.apache.org/maven2/org/wildfly/security/wildfly-elytron-provider-util/2.2.1.Final/wildfly-elytron-provider-util-2.2.1.Final-sources.jar",
    "status": "approved",
    "scans": [
        {
            "date": "July 14, 2023 at 1:24:14 p.m. GMT",
            "authority": "https://gitlab.eclipse.org/eclipsefdn/emo-team/iplab/-/issues/9405",
            "scancode-version": "31.2.1",
            "licenses-discovered": [
                "Apache-2.0"
            ],
            "copyrights": [
                "Copyright 2014 Red Hat, Inc., and individual contributors",
                "Copyright 2015 Red Hat, Inc., and individual contributors",
                "Copyright 2018 Red Hat, Inc., and individual contributors",
                "Copyright 2019 Red Hat, Inc., and individual contributors"
            ],
            "file-count": 10,
            "sha256": "d34f1c5662dbcb04cfc975c69398af0b6409196392060c3fc2be1766bc6f70d7",
            "source": "https://repo.maven.apache.org/maven2/org/wildfly/security/wildfly-elytron-provider-util/2.2.1.Final/wildfly-elytron-provider-util-2.2.1.Final-sources.jar",
            "status": "approved"
        }
    ]
}