{
    "id": "maven/mavencentral/org.geotools/gt-coverage/31.0",
    "license": "LGPL-2.1-only AND (LGPL-2.1-only AND MIT)",
    "authority": "https://gitlab.eclipse.org/eclipsefdn/emo-team/iplab/-/issues/13886",
    "source": "https://repo.osgeo.org/repository/geotools-releases/org/geotools/gt-coverage/31.0/gt-coverage-31.0-sources.jar",
    "status": "approved",
    "scans": [
        {
            "date": "March 19, 2024 at 9:20:50 p.m. GMT",
            "authority": "https://gitlab.eclipse.org/eclipsefdn/emo-team/iplab/-/issues/13886",
            "scancode-version": "31.2.1",
            "licenses-discovered": [
                "LGPL-2.1-only",
                "LGPL-2.1-only AND LicenseRef-scancode-us-govt-public-domain",
                "LGPL-2.1-only AND MIT"
            ],
            "copyrights": [
                "(c) 2001 - 2016, Open Source Geospatial Foundation",
                "(c) 2001-2008, Open Source Geospatial Foundation",
                "(c) 2001-2011, Open Source Geospatial Foundation",
                "(c) 2001-2015, Open Source Geospatial Foundation",
                "(c) 2001-2016, Open Source Geospatial Foundation",
                "(c) 2002-2008, Open Source Geospatial Foundation",
                "(c) 2002-2011, Open Source Geospatial Foundation",
                "(c) 2002-2015, Open Source Geospatial Foundation",
                "(c) 2002-2016, Open Source Geospatial Foundation",
                "(c) 2003 - 2016, Open Source Geospatial Foundation",
                "(c) 2003-2008, Open Source Geospatial Foundation",
                "(c) 2003-2015, Open Source Geospatial Foundation",
                "(c) 2004 Mike Nidel",
                "(c) 2004-2008, Open Source Geospatial Foundation",
                "(c) 2004-2016, Open Source Geospatial Foundation",
                "(c) 2005 - 2016, Open Source Geospatial Foundation",
                "(c) 2005-2008, Open Source Geospatial Foundation",
                "(c) 2005-2013, Open Source Geospatial Foundation",
                "(c) 2005-2015, Open Source Geospatial Foundation",
                "(c) 2005-2016, Open Source Geospatial Foundation",
                "(c) 2006 - 2016, Open Source Geospatial Foundation",
                "(c) 2006-2008, Open Source Geospatial Foundation",
                "(c) 2006-2015, Open Source Geospatial Foundation",
                "(c) 2006-2016, Open Source Geospatial Foundation",
                "(c) 2006-2021, Open Source Geospatial Foundation",
                "(c) 2007 - 2016, Open Source Geospatial Foundation",
                "(c) 2007-2008, Open Source Geospatial Foundation",
                "(c) 2008, Open Source Geospatial Foundation",
                "(c) 2008-2015, Open Source Geospatial Foundation",
                "(c) 2008-2016, Open Source Geospatial Foundation",
                "(c) 2011-2016, Open Source Geospatial Foundation",
                "(c) 2012, Open Source Geospatial Foundation",
                "(c) 2013 - 2016, Open Source Geospatial Foundation",
                "(c) 2013, Open Source Geospatial Foundation",
                "(c) 2013-2015, Open Source Geospatial Foundation",
                "(c) 2014 TOPP - www.openplans.org",
                "(c) 2014, Open Source Geospatial Foundation",
                "(c) 2014-2015, Open Source Geospatial Foundation",
                "(c) 2015 - 2016, Open Source Geospatial Foundation",
                "(c) 2015, Open Source Geospatial Foundation",
                "(c) 2016, Open Source Geospatial Foundation",
                "(c) 2017, Open Source Geospatial Foundation",
                "(c) 2018, Open Source Geospatial Foundation",
                "(c) 2019, Open Source Geospatial Foundation",
                "(c) 2021, Open Source Geospatial Foundation",
                "(c) 2023, Open Source Geospatial Foundation",
                "Copyright (c) 2004 by Mike Nidel"
            ],
            "file-count": 191,
            "sha256": "d400e16fdce166832df67e223cb3febc22e905da44c73d5d5a3b476cc03893a5",
            "source": "https://repo.osgeo.org/repository/geotools-releases/org/geotools/gt-coverage/31.0/gt-coverage-31.0-sources.jar",
            "status": "restricted"
        }
    ]
}
