{
    "id": "git/github/eclipse/paho.mqtt.c/v1.3.9",
    "license": "(EPL-2.0 OR EDL-1.0) AND GPL-2.0 AND MIT",
    "authority": "https://gitlab.eclipse.org/eclipsefdn/emo-team/iplab/-/issues/8710",
    "source": "https://github.com/eclipse/paho.mqtt.c/archive/refs/tags/v1.3.9.zip",
    "status": "approved",
    "scans": [
        {
            "date": "June 6, 2023 at 8:54:24 a.m. GMT",
            "authority": "https://gitlab.eclipse.org/eclipsefdn/emo-team/iplab/-/issues/8710",
            "scancode-version": "31.2.1",
            "licenses-discovered": [
                "BSD-3-Clause AND EPL-1.0 AND EPL-2.0",
                "BSD-3-Clause AND EPL-2.0",
                "BSD-3-Clause",
                "EPL-2.0",
                "Apache-2.0 AND CPL-1.0 AND LicenseRef-scancode-eclipse-sua-2011 AND MPL-1.1",
                "GPL-2.0-or-later",
                "BSD-3-Clause AND EPL-2.0 AND GPL-2.0-or-later",
                "GPL-2.0-only AND MIT",
                "GPL-2.0-only"
            ],
            "copyrights": [
                "(c) Copyright 2009, 2021 IBM Corp., Ian Craggs and others",
                "(c) JS Foundation and other contributors",
                "C. (c) Copyright 2009, 2021 IBM Corp., Ian Craggs and others An MQTT",
                "Copyright (c) 1997-2017 by Dimitri van Heesch",
                "Copyright (c) 1997-2019 by Dimitri van Heesch",
                "Copyright (c) 2007 Ariel Flesler",
                "Copyright (c) 2007, Eclipse Foundation, Inc.",
                "Copyright (c) 2009, 2013 IBM Corp.",
                "Copyright (c) 2009, 2014 IBM Corp.",
                "Copyright (c) 2009, 2018 IBM Corp.",
                "Copyright (c) 2009, 2020 IBM Corp.",
                "Copyright (c) 2009, 2020 IBM Corp. and others",
                "Copyright (c) 2009, 2021 IBM Corp. and Ian Craggs",
                "Copyright (c) 2009, 2021 IBM Corp., Ian Craggs and others",
                "Copyright (c) 2011, 2020 IBM Corp. and others",
                "Copyright (c) 2012, 2017 IBM Corp.",
                "Copyright (c) 2012, 2018 IBM Corp.",
                "Copyright (c) 2012, 2020 IBM Corp.",
                "Copyright (c) 2012, 2020 IBM Corp. and others",
                "Copyright (c) 2012, 2020 IBM Corp., and others",
                "Copyright (c) 2013, 2014 IBM Corp.",
                "Copyright (c) 2013, 2018 IBM Corp.",
                "Copyright (c) 2013, 2020 IBM Corp.",
                "Copyright (c) 2015 logi.cals GmbH",
                "Copyright (c) 2015, 2020 logi.cals GmbH and others",
                "Copyright (c) 2016, 2017 logi.cals GmbH",
                "Copyright (c) 2017, 2018 IBM Corp.",
                "Copyright (c) 2017, 2020 IBM Corp. and others",
                "Copyright (c) 2018 IBM Corp.",
                "Copyright (c) 2018 Steven Benner (http://stevenbenner.com/)",
                "Copyright (c) 2018 Wind River Systems, Inc.",
                "Copyright (c) 2018, 2019 Wind River Systems, Inc.",
                "Copyright (c) 2018, 2020 Wind River Systems, Inc. and others",
                "Copyright (c) 2018, 2021 Wind River Systems, Inc., Ian Craggs and others",
                "Copyright (c) 2020 IBM Corp.",
                "Copyright (c) 2020, 2020 Andreas Walter",
                "Copyright (c) 2020, 2021 IBM Corp. and Ian Craggs",
                "Copyright 2011-2014, Dave Furfero",
                "Copyright Vasil Dinkov, Vadikom Web Ltd. http://vadikom.com",
                "Copyright jQuery Foundation and other contributors"
            ],
            "file-count": 1612,
            "sha256": "78aeb3e114d3550c5285d7c4c805135e4aaef0e43b278a4797e590fa58d10d06",
            "source": "https://github.com/eclipse/paho.mqtt.c/archive/refs/tags/v1.3.9.zip",
            "status": "restricted"
        }
    ]
}
