{
    "id": "npm/npmjs/@csstools/css-tokenizer/2.1.1",
    "license": "MIT",
    "authority": "https://gitlab.eclipse.org/eclipsefdn/emo-team/iplab/-/issues/8033",
    "source": "https://registry.npmjs.org/@csstools/css-tokenizer/-/css-tokenizer-2.1.1.tgz",
    "status": "approved",
    "scans": [
        {
            "date": "April 28, 2023 at 6:59:49 p.m. GMT",
            "authority": "https://gitlab.eclipse.org/eclipsefdn/emo-team/iplab/-/issues/8033",
            "scancode-version": "31.2.1",
            "licenses-discovered": [
                "MIT"
            ],
            "copyrights": [
                "Copyright 2022 Romain Menke, Antonio Laguna <antonio@laguna.es>"
            ],
            "file-count": 35,
            "sha256": "810f5251ba18ec0afa1152ab6605239c5bf22bff9bca756f5e839132cae91859",
            "source": "https://registry.npmjs.org/@csstools/css-tokenizer/-/css-tokenizer-2.1.1.tgz",
            "status": "approved"
        }
    ]
}