{
    "id": "maven/mavencentral/org.apache.logging.log4j/log4j-core/2.21.1",
    "license": "Apache-2.0 AND (Apache-2.0 AND LGPL-2.0-or-later)",
    "authority": "https://gitlab.eclipse.org/eclipsefdn/emo-team/iplab/-/issues/12592",
    "source": "https://repo1.maven.org/maven2/org/apache/logging/log4j/log4j-core/2.21.1/log4j-core-2.21.1-sources.jar",
    "status": "approved",
    "scans": [
        {
            "date": "January 2, 2024 at 2:24:25 p.m. GMT",
            "authority": "https://gitlab.eclipse.org/eclipsefdn/emo-team/iplab/-/issues/12592",
            "scancode-version": "31.2.1",
            "licenses-discovered": [
                "Apache-2.0",
                "Apache-2.0 AND LGPL-2.0-or-later"
            ],
            "copyrights": [
                "Copyright (c) 2017 public",
                "Copyright 1999-2005 The Apache Software Foundation",
                "Copyright Terracotta, Inc."
            ],
            "file-count": 723,
            "sha256": "31cf3b86d90f214940d1a53ecfd927251c808f6a613dfd68d3ba4d46ba37a699",
            "source": "https://repo1.maven.org/maven2/org/apache/logging/log4j/log4j-core/2.21.1/log4j-core-2.21.1-sources.jar",
            "status": "approved"
        }
    ]
}