{
    "id": "maven/mavencentral/androidx.lifecycle/lifecycle-livedata-core-ktx/2.7.0",
    "license": "Apache-2.0",
    "authority": "https://gitlab.eclipse.org/eclipsefdn/emo-team/iplab/-/issues/12881",
    "source": "https://dl.google.com/android/maven2/androidx/lifecycle/lifecycle-livedata-core-ktx/2.7.0/lifecycle-livedata-core-ktx-2.7.0-sources.jar",
    "status": "approved",
    "scans": [
        {
            "date": "January 24, 2024 at 1:57:36 p.m. GMT",
            "authority": "https://gitlab.eclipse.org/eclipsefdn/emo-team/iplab/-/issues/12881",
            "scancode-version": "31.2.1",
            "licenses-discovered": [
                "Apache-2.0"
            ],
            "copyrights": [
                "Copyright 2018 The Android Open Source Project"
            ],
            "file-count": 2,
            "sha256": "52aebe57b7619530d5d762671262a6be54972c7ab64e41a330d81ab21adfcba9",
            "source": "https://dl.google.com/android/maven2/androidx/lifecycle/lifecycle-livedata-core-ktx/2.7.0/lifecycle-livedata-core-ktx-2.7.0-sources.jar",
            "status": "approved"
        }
    ]
}