{
    "id": "maven/mavencentral/org.apache.felix/org.apache.felix.http.servlet-api/2.1.0",
    "license": "Apache-2.0",
    "authority": "https://gitlab.eclipse.org/eclipsefdn/emo-team/iplab/-/issues/5258",
    "source": "https://search.maven.org/remotecontent?filepath=org/apache/felix/org.apache.felix.http.servlet-api/2.1.0/org.apache.felix.http.servlet-api-2.1.0-sources.jar",
    "status": "approved",
    "scans": [
        {
            "date": "November 29, 2022 at 2:52:32 p.m. GMT",
            "authority": "https://gitlab.eclipse.org/eclipsefdn/emo-team/iplab/-/issues/5258",
            "scancode-version": "31.2.1",
            "licenses-discovered": [
                "Apache-2.0"
            ],
            "copyrights": [
            ],
            "file-count": 4,
            "sha256": "0441f69956d3e95e5f13b1987ba0ad83fd24d442575f6a20057baaf4caae887d",
            "source": "https://search.maven.org/remotecontent?filepath=org/apache/felix/org.apache.felix.http.servlet-api/2.1.0/org.apache.felix.http.servlet-api-2.1.0-sources.jar",
            "status": "approved"
        }
    ]
}