{
    "id": "maven/mavencentral/com.google.api.grpc/proto-google-iam-admin-v1/3.31.0",
    "license": "Apache-2.0",
    "authority": "https://gitlab.eclipse.org/eclipsefdn/emo-team/iplab/-/issues/13440",
    "source": "https://repo1.maven.org/maven2/com/google/api/grpc/proto-google-iam-admin-v1/3.31.0/proto-google-iam-admin-v1-3.31.0-sources.jar",
    "status": "approved",
    "scans": [
        {
            "date": "February 26, 2024 at 7:14:34 a.m. GMT",
            "authority": "https://gitlab.eclipse.org/eclipsefdn/emo-team/iplab/-/issues/13440",
            "scancode-version": "31.2.1",
            "licenses-discovered": [
                "Apache-2.0"
            ],
            "copyrights": [
                "Copyright 2022 Google LLC",
                "Copyright 2024 Google LLC"
            ],
            "file-count": 101,
            "sha256": "27843e2eb72311e9604e495a5ac679483c480917d761823bcfcfcadbb405840d",
            "source": "https://repo1.maven.org/maven2/com/google/api/grpc/proto-google-iam-admin-v1/3.31.0/proto-google-iam-admin-v1-3.31.0-sources.jar",
            "status": "approved"
        }
    ]
}