{
    "id": "maven/mavencentral/org.apache.camel/camel-xml-jaxb-dsl/3.22.2",
    "license": "Apache-2.0",
    "authority": "https://gitlab.eclipse.org/eclipsefdn/emo-team/iplab/-/issues/14970",
    "source": "https://repo1.maven.org/maven2/org/apache/camel/camel-xml-jaxb-dsl/3.22.2/camel-xml-jaxb-dsl-3.22.2-sources.jar",
    "status": "approved",
    "scans": [
        {
            "date": "May 29, 2024 at 11:48:16 a.m. GMT",
            "authority": "https://gitlab.eclipse.org/eclipsefdn/emo-team/iplab/-/issues/14970",
            "scancode-version": "31.2.1",
            "licenses-discovered": [
                "Apache-2.0"
            ],
            "copyrights": [
            ],
            "file-count": 11,
            "sha256": "5a6ffd5ffb045904a110a61f7a31962168a01eafb05134f93ea3cfe7ecfb28ef",
            "source": "https://repo1.maven.org/maven2/org/apache/camel/camel-xml-jaxb-dsl/3.22.2/camel-xml-jaxb-dsl-3.22.2-sources.jar",
            "status": "approved"
        }
    ]
}