{
    "id": "git/github/nanopb/nanopb/0.4.9",
    "license": "Zlib AND MIT AND BSD-3-Clause AND Apache-2.0",
    "authority": "https://gitlab.eclipse.org/eclipsefdn/emo-team/iplab/-/issues/17182",
    "source": "https://github.com/nanopb/nanopb/archive/refs/tags/nanopb-0.4.9.zip",
    "status": "approved",
    "scans": [
        {
            "date": "November 13, 2024, 4:34:02 p.m. GMT",
            "authority": "https://gitlab.eclipse.org/eclipsefdn/emo-team/iplab/-/issues/17182",
            "scancode-version": "31.2.1",
            "licenses-discovered": [
                "Zlib",
                "MIT",
                "BSD-3-Clause",
                "Apache-2.0"
            ],
            "copyrights": [
                "Copyright (c) 2011 Petteri Aimonen",
                "Copyright 2008 Esben Mose Hansen, Ange Optimization ApS",
                "Copyright 2008 Google Inc.",
                "Copyright 2009 Kitware, Inc.",
                "Copyright 2009-2011 Philip Lowman <philip@yhbt.com>",
                "copyright Markus Kuhn <http://www.cl.cam.ac.uk/~mgk25/>"
            ],
            "file-count": 4293,
            "sha256": "67f4465dda5bf581224d97997a277840410de36b2a2d339bb656c4a4983e1784",
            "source": "https://github.com/nanopb/nanopb/archive/refs/tags/nanopb-0.4.9.zip",
            "status": "approved"
        }
    ]
}