{
    "id": "maven/mavencentral/org.springframework.data/spring-data-commons/2.6.3",
    "license": "Apache-2.0",
    "licenses-discovered": [
        "Apache-2.0 AND LicenseRef-scancode-unknown-license-reference",
        "Apache-2.0"
    ],
    "file-count": 524,
    "scancode-version": "30.1.0",
    "authority": "https://gitlab.eclipse.org/eclipsefdn/emo-team/iplab/-/issues/2447",
    "source": "https://search.maven.org/remotecontent?filepath=org/springframework/data/spring-data-commons/2.6.3/spring-data-commons-2.6.3-sources.jar",
    "status": "approved"
}
