{
    "id": "maven/mavencentral/androidx.datastore/datastore/1.0.0",
    "license": "Apache-2.0",
    "authority": "https://gitlab.eclipse.org/eclipsefdn/emo-team/iplab/-/issues/10440",
    "source": "https://dl.google.com/android/maven2/androidx/datastore/datastore/1.0.0/datastore-1.0.0-sources.jar",
    "status": "approved",
    "scans": [
        {
            "date": "September 11, 2023 at 8:31:22 p.m. GMT",
            "authority": "https://gitlab.eclipse.org/eclipsefdn/emo-team/iplab/-/issues/10440",
            "scancode-version": "31.2.1",
            "licenses-discovered": [
                "Apache-2.0"
            ],
            "copyrights": [
                "Copyright 2020 The Android Open Source Project",
                "Copyright 2021 The Android Open Source Project"
            ],
            "file-count": 4,
            "sha256": "ae96990d5a45d1e2efc2b69868c6257162c1ff29ea93e17ae9e72ea900ea8d83",
            "source": "https://dl.google.com/android/maven2/androidx/datastore/datastore/1.0.0/datastore-1.0.0-sources.jar",
            "status": "approved"
        }
    ]
}