{
    "license": "JSON",
    "file-count": 5,
    "authority": "https://gitlab.eclipse.org/eclipsefdn/emo-team/iplab/-/issues/987",
    "scancode-version": "21.3.31",
    "licenses-discovered": [
        "JSON"
    ],
    "id": "npm/npmjs/-/jsmin/1.0.1",
    "source": "https://registry.npmjs.org/jsmin/-/jsmin-1.0.1.tgz",
    "status": "restricted",
    "workswith": [
        "ecd.theia"
    ]
}
