{
    "id": "npm/npmjs/-/lilconfig/2.1.0",
    "license": "MIT",
    "authority": "https://gitlab.eclipse.org/eclipsefdn/emo-team/iplab/-/issues/7313",
    "source": "https://github.com/antonk52/lilconfig/archive/v2.1.0.zip",
    "status": "approved",
    "scans": [
        {
            "date": "March 2, 2023 at 9:48:18 p.m. GMT",
            "authority": "https://gitlab.eclipse.org/eclipsefdn/emo-team/iplab/-/issues/7313",
            "scancode-version": "31.2.1",
            "licenses-discovered": [
                "MIT"
            ],
            "copyrights": [
                "Copyright (c) 2022 Anton Kastritskiy"
            ],
            "file-count": 28,
            "sha256": "1a3f568ec8f7db547b58a5f325f9b429c565ceb1537c53ecddb85497ed32797c",
            "source": "https://github.com/antonk52/lilconfig/archive/v2.1.0.zip",
            "status": "approved"
        }
    ]
}