{
    "id": "npm/npmjs/-/inversify/6.2.0",
    "license": "MIT AND ISC",
    "authority": "https://gitlab.eclipse.org/eclipsefdn/emo-team/iplab/-/issues/17898",
    "source": "https://github.com/inversify/InversifyJS/archive/refs/tags/v6.2.0.zip",
    "status": "approved",
    "scans": [
        {
            "date": "December 13, 2024 at 1:42:44 p.m. GMT",
            "authority": "https://gitlab.eclipse.org/eclipsefdn/emo-team/iplab/-/issues/17898",
            "scancode-version": "31.2.1",
            "licenses-discovered": [
                "MIT",
                "ISC"
            ],
            "copyrights": [
                "Copyright (c) 2015-2017 Remo H. Jansen",
                "Copyright (c) 2015-2017 Remo H. Jansen (http://www.remojansen.com)"
            ],
            "file-count": 184,
            "sha256": "415cbd03d48e407f75fd8d13e048668871d71312d82e0884181904656686d547",
            "source": "https://github.com/inversify/InversifyJS/archive/refs/tags/v6.2.0.zip",
            "status": "approved"
        }
    ]
}