{
    "id": "p2/orbit/p2.eclipse-plugin/org.apache.cxf.cxf-core/3.3.1",
    "license": "Apache-2.0 AND W3C-19980720 AND W3C and LicenseRef-scancode-ws-addressing-spec",
    "licenses-discovered": [
        "Apache-2.0",
        "LicenseRef-scancode-ws-addressing-spec",
        "LicenseRef-scancode-ms-ws-routing-spec",
        "W3C-19980720",
        "W3C",
        "LicenseRef-scancode-ws-trust-specification"
    ],
    "file-count": 675,
    "scancode-version": "30.1.0",
    "authority": "https://gitlab.eclipse.org/eclipsefdn/emo-team/iplab/-/issues/2369",
    "source": "https://search.maven.org/remotecontent?filepath=org/apache/cxf/cxf-core/3.3.1/cxf-core-3.3.1-sources.jar",
    "status": "approved"
}
