{
    "id": "npm/npmjs/-/clone/2.1.2",
    "license": "MIT",
    "authority": "https://gitlab.eclipse.org/eclipsefdn/emo-team/iplab/-/issues/7971",
    "source": "https://github.com/pvorb/node-clone/archive/v2.1.2.zip",
    "status": "approved",
    "scans": [
        {
            "date": "April 26, 2023 at 6:13:59 p.m. GMT",
            "authority": "https://gitlab.eclipse.org/eclipsefdn/emo-team/iplab/-/issues/7971",
            "scancode-version": "31.2.1",
            "licenses-discovered": [
                "MIT",
                "LicenseRef-scancode-proprietary-license"
            ],
            "copyrights": [
                "Copyright (c) 2011-2015 Paul Vorbach <paul@vorba.ch>",
                "Copyright (c) 2011-2016 Paul Vorbach (https://paul.vorba.ch/) and contributors (https://github.com/pvorb/clone/graphs/contributors)"
            ],
            "file-count": 9,
            "sha256": "8ab88a063adba5f5df94118f67b9f3454e79a2edc97d1d437f21c710921a7c6c",
            "source": "https://github.com/pvorb/node-clone/archive/v2.1.2.zip",
            "status": "restricted"
        }
    ]
}
