{
    "id": "npm/npmjs/@mui/icons-material/5.10.3",
    "license": "MIT",
    "licenses-discovered": [
        "LicenseRef-scancode-commercial-license AND MIT",
        "MIT"
    ],
    "copyrights": [
        "Copyright (c) Call-Em-All"
    ],
    "file-count": 31671,
    "scancode-version": "30.1.0",
    "authority": "https://gitlab.eclipse.org/eclipsefdn/emo-team/iplab/-/issues/3245",
    "source": "https://registry.npmjs.org/@mui/icons-material/-/icons-material-5.10.3.tgz",
    "status": "approved"
}
