{
    "id": "maven/mavencentral/org.apache.lucene/lucene-core/9.5.0",
    "license": "Apache-2.0 AND BSD-3-Clause AND BSD-2-Clause AND MIT AND ISC AND Unicode-TOU AND (LGPL-2.1-or-later OR CC-BY-4.0)",
    "authority": "https://gitlab.eclipse.org/eclipsefdn/emo-team/iplab/-/issues/7915",
    "source": "https://search.maven.org/remotecontent?filepath=org/apache/lucene/lucene-core/9.5.0/lucene-core-9.5.0-sources.jar",
    "status": "approved",
    "scans": [
        {
            "date": "April 20, 2023 at 9:05:22 a.m. GMT",
            "authority": "https://gitlab.eclipse.org/eclipsefdn/emo-team/iplab/-/issues/7915",
            "scancode-version": "31.2.1",
            "licenses-discovered": [
                "Apache-2.0",
                "Apache-2.0 AND BSD-3-Clause AND NCSA",
                "Apache-2.0 AND ISC",
                "Apache-2.0 AND LicenseRef-scancode-sunpro",
                "Apache-2.0 AND ICU AND LicenseRef-scancode-unicode-mappings",
                "BSD-3-Clause",
                "Apache-2.0 AND MIT",
                "BSD-2-Clause"
            ],
            "copyrights": [
                "Copyright (c) 1970-2003, Wm. Randolph Franklin",
                "Copyright (c) 1993 by Sun Microsystems, Inc.",
                "Copyright (c) 1999-2010, International Business Machines Corporation and others",
                "Copyright (c) 2001-2009 Anders Moeller",
                "Copyright (c) 2011-2016, Yann Collet",
                "Copyright (c) 2016, Mapbox",
                "Copyright 2001-2004 Unicode, Inc."
            ],
            "file-count": 1008,
            "sha256": "a963a8ab1caef2f63662ad07f8b078f3af31472dc350e07277633bce1d4b0576",
            "source": "https://search.maven.org/remotecontent?filepath=org/apache/lucene/lucene-core/9.5.0/lucene-core-9.5.0-sources.jar",
            "status": "restricted"
        }
    ]
}
