{
    "id": "maven/mavencentral/org.testcontainers/mongodb/1.20.2",
    "license": "MIT",
    "authority": "https://gitlab.eclipse.org/eclipsefdn/emo-team/iplab/-/issues/16553",
    "source": "https://repo1.maven.org/maven2/org/testcontainers/mongodb/1.20.2/mongodb-1.20.2-sources.jar",
    "status": "approved",
    "scans": [
        {
            "date": "October 9, 2024, 8:53:30 a.m. GMT",
            "authority": "https://gitlab.eclipse.org/eclipsefdn/emo-team/iplab/-/issues/16553",
            "scancode-version": "31.2.1",
            "licenses-discovered": [
            ],
            "copyrights": [
            ],
            "file-count": 3,
            "sha256": "6e7eebe1b637c60ef75b27483cac49417947d7d3917895bebbe22e7978f89e28",
            "source": "https://repo1.maven.org/maven2/org/testcontainers/mongodb/1.20.2/mongodb-1.20.2-sources.jar",
            "status": "restricted"
        }
    ]
}