{
    "id": "npm/npmjs/-/diff/4.0.2",
    "license": "BSD-3-Clause",
    "licenses-discovered": [
        "BSD-3-Clause"
    ],
    "file-count": 56,
    "scancode-version": "30.1.0",
    "authority": "https://gitlab.eclipse.org/eclipsefdn/emo-team/iplab/-/issues/2728",
    "source": "https://github.com/kpdecker/jsdiff/archive/v4.0.2.zip",
    "status": "approved"
}