{
    "id": "npm/npmjs/-/phone/3.1.40",
    "license": "MIT",
    "authority": "https://gitlab.eclipse.org/eclipsefdn/emo-team/iplab/-/issues/10500",
    "source": "https://github.com/AfterShip/phone/archive/refs/tags/3.1.40.zip",
    "status": "approved",
    "scans": [
        {
            "date": "September 12, 2023 at 9:16:53 a.m. GMT",
            "authority": "https://gitlab.eclipse.org/eclipsefdn/emo-team/iplab/-/issues/10500",
            "scancode-version": "31.2.1",
            "licenses-discovered": [
                "MIT"
            ],
            "copyrights": [
                "Copyright (c) 2013-2020 AfterShip"
            ],
            "file-count": 29,
            "sha256": "67830f04cb3994263f05c18aefed98a50d168ae8c9644b62e11a8beaa7545df3",
            "source": "https://github.com/AfterShip/phone/archive/refs/tags/3.1.40.zip",
            "status": "approved"
        }
    ]
}