{
    "id": "npm/npmjs/-/firefox-debugadapter/2.10.0",
    "license": "MIT",
    "authority": "https://gitlab.eclipse.org/eclipsefdn/emo-team/iplab/-/issues/17825",
    "source": "https://github.com/firefox-devtools/vscode-firefox-debug/archive/refs/tags/2.10.0.zip",
    "status": "approved",
    "scans": [
        {
            "date": "December 11, 2024 at 3:31:33 p.m. GMT",
            "authority": "https://gitlab.eclipse.org/eclipsefdn/emo-team/iplab/-/issues/17825",
            "scancode-version": "31.2.1",
            "licenses-discovered": [
                "MIT"
            ],
            "copyrights": [
                "Copyright (c) 2015-2017 Holger Benl <hbenl@evandor.de>"
            ],
            "file-count": 142,
            "sha256": "fb1e6280f896ab3748f8ba18d38f996216b691a5cebf2eec91b7a1b1c2ebd7e4",
            "source": "https://github.com/firefox-devtools/vscode-firefox-debug/archive/refs/tags/2.10.0.zip",
            "status": "approved"
        }
    ]
}