{
    "id": "npm/npmjs/@types/express-serve-static-core/5.0.2",
    "license": "MIT",
    "authority": "https://gitlab.eclipse.org/eclipsefdn/emo-team/iplab/-/issues/17738",
    "source": "https://registry.npmjs.org/@types/express-serve-static-core/-/express-serve-static-core-5.0.2.tgz",
    "status": "approved",
    "scans": [
        {
            "date": "December 5, 2024 at 6:23:28 a.m. GMT",
            "authority": "https://gitlab.eclipse.org/eclipsefdn/emo-team/iplab/-/issues/17738",
            "scancode-version": "31.2.1",
            "licenses-discovered": [
                "MIT"
            ],
            "copyrights": [
                "Copyright (c) Microsoft Corporation"
            ],
            "file-count": 4,
            "sha256": "927ccdae87ecc985f502bffadaf5df82a4d82c677848efa6388c79ea4445ff29",
            "source": "https://registry.npmjs.org/@types/express-serve-static-core/-/express-serve-static-core-5.0.2.tgz",
            "status": "approved"
        }
    ]
}