{
    "id": "go/golang/github.com%2Fform3tech-oss/jwt-go/v3.2.2",
    "license": "MIT",
    "authority": "https://gitlab.eclipse.org/eclipsefdn/emo-team/iplab/-/issues/6043",
    "source": "https://github.com/form3tech-oss/jwt-go/archive/refs/tags/v3.2.2.zip",
    "status": "approved",
    "scans": [
        {
            "date": "January 6, 2023 at 8:06:32 p.m. GMT",
            "authority": "https://gitlab.eclipse.org/eclipsefdn/emo-team/iplab/-/issues/6043",
            "scancode-version": "31.2.1",
            "licenses-discovered": [
                "MIT"
            ],
            "copyrights": [
                "Copyright (c) 2012 Dave Grijalva"
            ],
            "file-count": 51,
            "sha256": "7c4b7368a3d06ac20444c4b2a84f0394a12f1649d0e27758efc6cb53819eb5cf",
            "source": "https://github.com/form3tech-oss/jwt-go/archive/refs/tags/v3.2.2.zip",
            "status": "approved"
        }
    ]
}