{
    "id": "npm/npmjs/-/sass/1.57.1",
    "license": "Apache-2.0 AND BSD-2-Clause AND BSD-3-Clause AND MIT AND MIT",
    "authority": "https://gitlab.eclipse.org/eclipsefdn/emo-team/iplab/-/issues/5906",
    "source": "https://registry.yarnpkg.com/sass/-/sass-1.57.1.tgz",
    "status": "approved",
    "scans": [
        {
            "date": "December 20, 2022 at 12:37:32 a.m. GMT",
            "authority": "https://gitlab.eclipse.org/eclipsefdn/emo-team/iplab/-/issues/5906",
            "scancode-version": "31.2.1",
            "licenses-discovered": [
                "Apache-2.0 AND BSD-2-Clause AND BSD-3-Clause AND MIT",
                "MIT"
            ],
            "copyrights": [
                "Copyright (c) 2000 - 2019 The Legion of the Bouncy Castle Inc. (https://www.bouncycastle.org)",
                "Copyright (c) 2006, Kirill Simonov",
                "Copyright (c) 2006-2012 The Authors",
                "Copyright (c) 2006-2022 Lukas Renggli",
                "Copyright (c) 2013-2021 Brendan Duncan",
                "Copyright (c) 2014, the Dart project",
                "Copyright (c) 2014, the tuple project authors",
                "Copyright (c) 2015 Michael Bullington",
                "Copyright (c) 2015, Anders Holmgren",
                "Copyright (c) 2016, Google Inc.",
                "Copyright (c) 2017, Anatoly Pulyaevskiy",
                "Copyright (c) 2018, Jennifer Thakar",
                "Copyright (c) 2020 Leo Farias",
                "Copyright 2012, the Dart project",
                "Copyright 2012, the Dart project authors",
                "Copyright 2013, Google Inc.",
                "Copyright 2013, the Dart project",
                "Copyright 2013, the Dart project authors",
                "Copyright 2014, the Dart project",
                "Copyright 2014, the Dart project authors",
                "Copyright 2015, the Dart project",
                "Copyright 2016, the Dart project",
                "Copyright 2017, the Dart project",
                "Copyright 2017, the Dart project authors",
                "Copyright 2018, the Dart project",
                "Copyright 2019, the Dart project",
                "Copyright 2019, the Dart project authors",
                "Copyright 2020, the Dart project",
                "Copyright 2021, the Dart project"
            ],
            "file-count": 30,
            "sha256": "7010f87f7fee870dd210680bce92c2068a26a0690c509cc7a439d761575fdc13",
            "source": "https://registry.yarnpkg.com/sass/-/sass-1.57.1.tgz",
            "status": "approved"
        }
    ]
}