{
    "id": "npm/npmjs/-/langium-cli/2.1.0",
    "license": "MIT",
    "authority": "https://gitlab.eclipse.org/eclipsefdn/emo-team/iplab/-/issues/11694",
    "source": "https://github.com/eclipse-langium/langium/archive/refs/tags/v2.1.0.zip",
    "status": "approved",
    "scans": [
        {
            "date": "November 24, 2023 at 8:58:45 a.m. GMT",
            "authority": "https://gitlab.eclipse.org/eclipsefdn/emo-team/iplab/-/issues/11694",
            "scancode-version": "31.2.1",
            "licenses-discovered": [
                "MIT"
            ],
            "copyrights": [
                "Copyright 2021 TypeFox GmbH",
                "Copyright 2021-2022 TypeFox GmbH",
                "Copyright 2022 TypeFox GmbH",
                "Copyright 2023 TypeFox GmbH"
            ],
            "file-count": 439,
            "sha256": "638781b250f00210c43ee30fad4406ac51f6b6d14f5508098f78f0f09d05113e",
            "source": "https://github.com/eclipse-langium/langium/archive/refs/tags/v2.1.0.zip",
            "status": "approved"
        }
    ]
}