{
    "id": "npm/npmjs/@volar/source-map/2.3.0",
    "license": "MIT",
    "authority": "https://gitlab.eclipse.org/eclipsefdn/emo-team/iplab/-/issues/15142",
    "source": "https://github.com/volarjs/volar.js/archive/refs/tags/v2.3.0.zip",
    "status": "approved",
    "scans": [
        {
            "date": "June 9, 2024 at 8:28:59 p.m. GMT",
            "authority": "https://gitlab.eclipse.org/eclipsefdn/emo-team/iplab/-/issues/15142",
            "scancode-version": "31.2.1",
            "licenses-discovered": [
                "MIT"
            ],
            "copyrights": [
                "Copyright (c) 2021-present Johnson Chu",
                "Copyright (c) 2023-present Johnson Chu"
            ],
            "file-count": 195,
            "sha256": "0d7923f83e06cd4dca5fc42284402eb43787df3a0705027813bc9bc6721fd9c5",
            "source": "https://github.com/volarjs/volar.js/archive/refs/tags/v2.3.0.zip",
            "status": "approved"
        }
    ]
}