{
    "id": "npm/npmjs/@octokit/plugin-rest-endpoint-methods/10.2.0",
    "license": "MIT",
    "authority": "https://gitlab.eclipse.org/eclipsefdn/emo-team/iplab/-/issues/11940",
    "source": "https://github.com/octokit/plugin-rest-endpoint-methods.js/archive/refs/tags/v10.2.0.zip",
    "status": "approved",
    "scans": [
        {
            "date": "December 13, 2023 at 10:38:18 p.m. GMT",
            "authority": "https://gitlab.eclipse.org/eclipsefdn/emo-team/iplab/-/issues/11940",
            "scancode-version": "31.2.1",
            "licenses-discovered": [
                "MIT",
                "AGPL-3.0-only AND Apache-2.0 AND CC0-1.0 AND GPL-3.0-only AND LGPL-3.0-only AND LicenseRef-scancode-proprietary-license AND MIT AND MPL-2.0 AND Unlicense"
            ],
            "copyrights": [
                "Copyright (c) 2019 Octokit"
            ],
            "file-count": 937,
            "sha256": "9362a0cc97ba3ec1ab4c71b08a0350400590c187a68801089fa233ef5321505a",
            "source": "https://github.com/octokit/plugin-rest-endpoint-methods.js/archive/refs/tags/v10.2.0.zip",
            "status": "restricted"
        }
    ]
}
