{
    "id": "maven/mavencentral/org.jboss.byteman/byteman/4.0.20",
    "license": "LGPL-2.1-or-later AND (BSD-3-Clause AND LGPL-2.1-or-later)",
    "authority": "https://gitlab.eclipse.org/eclipsefdn/emo-team/iplab/-/issues/5972",
    "source": "https://search.maven.org/remotecontent?filepath=org/jboss/byteman/byteman/4.0.20/byteman-4.0.20-sources.jar",
    "status": "approved",
    "scans": [
        {
            "date": "December 22, 2022 at 5:11:32 p.m. GMT",
            "authority": "https://gitlab.eclipse.org/eclipsefdn/emo-team/iplab/-/issues/5972",
            "scancode-version": "31.2.1",
            "licenses-discovered": [
                "LGPL-2.1-or-later",
                "BSD-3-Clause AND LGPL-2.1-or-later"
            ],
            "copyrights": [
                "(c) 2009-10",
                "(c) 2010",
                "Copyright (c) 2000-2005 INRIA, France Telecom",
                "Copyright 2008-10 Red Hat and individual contributors by the authors",
                "Copyright 2008-10, Red Hat and individual contributors by the authors",
                "Copyright 2008-2018 Red Hat and individual contributors by the authors",
                "Copyright 2009-10 Red Hat and individual contributors by the authors",
                "Copyright 2009-10, Red Hat and individual contributors by the authors",
                "Copyright 2010 Red Hat",
                "Copyright 2010 Red Hat and individual contributors by the authors",
                "Copyright 2011, Red Hat and individual contributors by the authors",
                "Copyright 2011, Red Hat, Inc., and individual contributors",
                "Copyright 2013, Red Hat and individual contributors by the authors",
                "Copyright 2015, Red Hat and individual contributors by the authors",
                "Copyright 2016, Red Hat and individual contributors by the authors",
                "Copyright 2017, Red Hat and individual contributors by the authors",
                "Copyright 2018, Red Hat and individual contributors by the authors",
                "Copyright 2019, Red Hat and individual contributors by the authors"
            ],
            "file-count": 157,
            "sha256": "01b22fc668c3ba10e7a75fbfef5df01ba760dc5e799cab22c470372cb71f85b0",
            "source": "https://search.maven.org/remotecontent?filepath=org/jboss/byteman/byteman/4.0.20/byteman-4.0.20-sources.jar",
            "status": "approved"
        }
    ]
}