{
    "id": "npm/npmjs/@types/node/18.15.5",
    "license": "MIT",
    "authority": "https://gitlab.eclipse.org/eclipsefdn/emo-team/iplab/-/issues/7483",
    "source": "https://registry.npmjs.org/@types/node/-/node-18.15.5.tgz",
    "status": "approved",
    "scans": [
        {
            "date": "March 22, 2023 at 3:19:16 a.m. GMT",
            "authority": "https://gitlab.eclipse.org/eclipsefdn/emo-team/iplab/-/issues/7483",
            "scancode-version": "31.2.1",
            "licenses-discovered": [
                "MIT"
            ],
            "copyrights": [
                "Copyright (c) Microsoft Corporation",
                "Copyright Node.js contributors"
            ],
            "file-count": 111,
            "sha256": "4538ac1c51d3cd76b9f2b4fb39177c8a100b69a3fb5723eb506ea6be7bdb0e4b",
            "source": "https://registry.npmjs.org/@types/node/-/node-18.15.5.tgz",
            "status": "approved"
        }
    ]
}