{
    "id": "go/golang/google.golang.org/grpc/v1.36.1",
    "license": "Apache-2.0",
    "authority": "https://gitlab.eclipse.org/eclipsefdn/emo-team/iplab/-/issues/6087",
    "source": "https://proxy.golang.org/google.golang.org/grpc/@v/v1.36.1.zip",
    "status": "approved",
    "scans": [
        {
            "date": "January 6, 2023 at 7:34:35 a.m. GMT",
            "authority": "https://gitlab.eclipse.org/eclipsefdn/emo-team/iplab/-/issues/6087",
            "scancode-version": "31.2.1",
            "licenses-discovered": [
                "Apache-2.0"
            ],
            "copyrights": [
                "Copyright 2014 gRPC",
                "Copyright 2015 The gRPC",
                "Copyright 2015 gRPC",
                "Copyright 2015-2016 gRPC",
                "Copyright 2016 The gRPC",
                "Copyright 2016 gRPC",
                "Copyright 2017 gRPC",
                "Copyright 2018 The gRPC",
                "Copyright 2018 gRPC",
                "Copyright 2019 Istio Authors",
                "Copyright 2019 gRPC",
                "Copyright 2020 The gRPC",
                "Copyright 2020 gRPC"
            ],
            "file-count": 583,
            "sha256": "1d23b0e633cc114966ab1e8eec18c5ac38cc55594a4215c4f801c914e84c5da5",
            "source": "https://proxy.golang.org/google.golang.org/grpc/@v/v1.36.1.zip",
            "status": "approved"
        }
    ]
}