{
    "license": "BSD-3-Clause AND CC-BY-SA-4.0 AND MIT",
    "file-count": 398,
    "authority": "https://gitlab.eclipse.org/eclipsefdn/emo-team/iplab/-/issues/931",
    "scancode-version": "21.3.31",
    "licenses-discovered": [
        "BSD-3-Clause",
        "LicenseRef-scancode-unknown-license-reference",
        "MIT",
        "CC-BY-SA-4.0"
    ],
    "id": "npm/npmjs/-/highlight.js/10.7.3",
    "source": "https://registry.npmjs.org/highlight.js/-/highlight.js-10.7.3.tgz",
    "status": "approved"
}
