{
    "id": "maven/mavencentral/io.grpc/grpc-inprocess/1.67.1",
    "license": "Apache-2.0",
    "authority": "https://gitlab.eclipse.org/eclipsefdn/emo-team/iplab/-/issues/16774",
    "source": "https://repo1.maven.org/maven2/io/grpc/grpc-inprocess/1.67.1/grpc-inprocess-1.67.1-sources.jar",
    "status": "approved",
    "scans": [
        {
            "date": "October 17, 2024, 4:07:46 a.m. GMT",
            "authority": "https://gitlab.eclipse.org/eclipsefdn/emo-team/iplab/-/issues/16774",
            "scancode-version": "31.2.1",
            "licenses-discovered": [
                "Apache-2.0"
            ],
            "copyrights": [
                "Copyright 2015 The gRPC",
                "Copyright 2016 The gRPC",
                "Copyright 2020 The gRPC",
                "Copyright 2021 The gRPC"
            ],
            "file-count": 11,
            "sha256": "cbc419dea9cc692e46c148eafefbeb3027f6c70ecd0f452df2adff4c0deb3d8e",
            "source": "https://repo1.maven.org/maven2/io/grpc/grpc-inprocess/1.67.1/grpc-inprocess-1.67.1-sources.jar",
            "status": "approved"
        }
    ]
}