{
    "id": "project/iot.kapua/-/refactoring-static-fields-removal/0.0",
    "license": "EPL-2.0",
    "authority": "https://gitlab.eclipse.org/eclipsefdn/emo-team/iplab/-/issues/12906",
    "source": "https://github.com/eclipse/kapua/pull/3837.patch",
    "status": "approved",
    "scans": [
        {
            "date": "January 25, 2024 at 7:29:37 p.m. GMT",
            "authority": "https://gitlab.eclipse.org/eclipsefdn/emo-team/iplab/-/issues/12906",
            "scancode-version": "31.2.1",
            "licenses-discovered": [
                "EPL-2.0"
            ],
            "copyrights": [
                "Copyright (c) 2016, 2022 Eurotech and/or its affiliates and others",
                "Copyright (c) 2017, 2022 Eurotech and/or its affiliates and others",
                "Copyright (c) 2017, 2022 Red Hat Inc and others",
                "Copyright (c) 2018, 2022 Eurotech and/or its affiliates and others",
                "Copyright (c) 2019, 2022 Eurotech and/or its affiliates and others",
                "Copyright (c) 2020, 2022 Eurotech and/or its affiliates and others",
                "Copyright (c) 2021, 2022 Eurotech and/or its affiliates and others",
                "Copyright (c) 2022 Eurotech and/or its affiliates and others",
                "Copyright (c) 2023, 2022 Eurotech and/or its affiliates and others"
            ],
            "file-count": 1,
            "sha256": "be57d5e8bb77b171c160705905b10e1cdc4df8bcf8dec9cf19ab7513ef82ba71",
            "source": "https://github.com/eclipse/kapua/pull/3837.patch",
            "status": "restricted"
        }
    ]
}
