{
    "id": "npm/npmjs/-/playwright/1.50.1",
    "license": "Apache-2.0 AND MIT",
    "authority": "https://gitlab.eclipse.org/eclipsefdn/emo-team/iplab/-/issues/19320",
    "source": "https://github.com/microsoft/playwright/archive/refs/tags/v1.50.1.zip",
    "status": "approved",
    "scans": [
        {
            "date": "February 5, 2025 at 10:17:42 p.m. GMT",
            "authority": "https://gitlab.eclipse.org/eclipsefdn/emo-team/iplab/-/issues/19320",
            "scancode-version": "31.2.1",
            "licenses-discovered": [
                "Apache-2.0",
                "MPL-2.0",
                "BSD-2-Clause AND MPL-2.0",
                "BSD-2-Clause",
                "BSD-2-Clause AND LGPL-2.0-or-later AND LGPL-3.0-only AND LGPL-3.0-or-later",
                "Apache-2.0 AND MIT",
                "ISC",
                "MIT",
                "Apache-2.0 AND CC-BY-4.0 AND ISC AND MIT",
                "BSD-2-Clause AND BSD-3-Clause AND ISC AND LicenseRef-scancode-mit-addition AND MIT",
                "BSD-3-Clause",
                "CC0-1.0",
                "OFL-1.1",
                "GPL-2.0-only AND MIT",
                "Apache-2.0 AND BSD-3-Clause AND MIT",
                "BSD-3-Clause AND MIT"
            ],
            "copyrights": [
                "(c) 2014-2021 Evan",
                "(c) Ja (c)",
                "(c) Jb (c)",
                "(c) Sindre Sorhus",
                "(c) http://www.w3.org/1999/xhtml",
                "(c) web-platform-tests contributors",
                "Copyright (c) 2003-2005 Tom Wu",
                "Copyright (c) 2006 Apple Inc.",
                "Copyright (c) 2006, 2008, 2013-2015 Apple Inc.",
                "Copyright (c) 2007, 2008 Apple Inc.",
                "Copyright (c) 2007-20 Apple Inc.",
                "Copyright (c) 2007-present, Alexandru Marasteanu <hello@alexei.ro>",
                "Copyright (c) 2008, 2009 Anthony Ricaud <rik@webkit.org>",
                "Copyright (c) 2009, 2010, 2011 Appcelerator, Inc.",
                "Copyright (c) 2009, 2011 Brent Fulgham",
                "Copyright (c) 2009, Martin Robinson",
                "Copyright (c) 2009-2011, Mozilla Foundation and contributors",
                "Copyright (c) 2009-2015, Kevin Decker <kpdecker@gmail.com>",
                "Copyright (c) 2010 Apple Inc.",
                "Copyright (c) 2010 Benjamin Thomas, Robert Kieffer",
                "Copyright (c) 2010, 2013 Apple Inc.",
                "Copyright (c) 2010, The WebM Project authors",
                "Copyright (c) 2010,2017 Igalia S.L.",
                "Copyright (c) 2010-2014, Christian Johansen, christian@cjohansen.no",
                "Copyright (c) 2010-2016 Apple Inc.",
                "Copyright (c) 2010-2017 Apple Inc.",
                "Copyright (c) 2011 Einar Otto Stangvik <einaros@gmail.com>",
                "Copyright (c) 2011 Google Inc.",
                "Copyright (c) 2011 Igalia S.L.",
                "Copyright (c) 2011 TJ Holowaychuk <tj@vision-media.ca>",
                "Copyright (c) 2011 Tim Koschutzki (tim@debuggable.com) Felix Geisendorfer (felix@debuggable.com)",
                "Copyright (c) 2011 by Beau Gunderson",
                "Copyright (c) 2011, Edgar Tolentino and Pablo Impallari (www.impallari.com impallari@gmail.com)",
                "Copyright (c) 2011, Edgar Tolentino, Pablo Impallari, Igino Marini",
                "Copyright (c) 2011, Igino Marini. (www.ikern.com mail@iginomarini.com)",
                "Copyright (c) 2011-2016 Heather Arthur <fayearthur@gmail.com>",
                "Copyright (c) 2011-2022 Isaac Z. Schlueter, Ben Noordhuis, and Contributors",
                "Copyright (c) 2012 Kuba Niegowski",
                "Copyright (c) 2012-2013 TJ Holowaychuk",
                "Copyright (c) 2012-2014 by various contributors",
                "Copyright (c) 2012-2018 Aseem Kishore, and others",
                "Copyright (c) 2012-2019 Paul Miller (https://paulmillr.com), Elan Shanker",
                "Copyright (c) 2012-2019 Thorsten Lorenz, Paul Miller (https://paulmillr.com)",
                "Copyright (c) 2013 Alex Christensen",
                "Copyright (c) 2013 Arnout Kazemier and contributors",
                "Copyright (c) 2013 Brian J. Brennan",
                "Copyright (c) 2013 Josh Glazebrook",
                "Copyright (c) 2013 Julian Gruber <julian@juliangruber.com>",
                "Copyright (c) 2013 Nathan Rajlich <nathan@tootallnate.net>",
                "Copyright (c) 2013 The Chromium Authors",
                "Copyright (c) 2013-2017 Josh Glazebrook",
                "Copyright (c) 2013-present, Facebook, Inc.",
                "Copyright (c) 2014 Andrew Kelley",
                "Copyright (c) 2014 Evan Wallace",
                "Copyright (c) 2014 Guille Paz",
                "Copyright (c) 2014 Josh Wolfe",
                "Copyright (c) 2014 Mathias Buus",
                "Copyright (c) 2014 Max Ogden and other contributors",
                "Copyright (c) 2014 Petka Antonov 2015 Sindre Sorhus",
                "Copyright (c) 2014 The WebM project authors",
                "Copyright (c) 2014 pazguille (http://twitter.com/pazguille)",
                "Copyright (c) 2014, 2015, 2016, 2017, 2018 Simon Lydell",
                "Copyright (c) 2014, Eugene Ware",
                "Copyright (c) 2014-2016, Jon Schlinkert",
                "Copyright (c) 2014-2017 TJ Holowaychuk <tj@vision-media.ca>",
                "Copyright (c) 2014-2017, Jon Schlinkert",
                "Copyright (c) 2014-2018, Jon Schlinkert",
                "Copyright (c) 2014-present Matt Zabriskie",
                "Copyright (c) 2014-present Sebastian McKenzie and other contributors",
                "Copyright (c) 2014-present, Facebook, Inc.",
                "Copyright (c) 2014-present, Jon Schlinkert",
                "Copyright (c) 2015 - present Microsoft Corporation",
                "Copyright (c) 2015 Andreas Lubbe",
                "Copyright (c) 2015 Dmitry Ivanov",
                "Copyright (c) 2015 Igalia S.L.",
                "Copyright (c) 2015 Luke Page & Original Contributors",
                "Copyright (c) 2015 Rich Harris",
                "Copyright (c) 2015 Tiancheng Timothy Gu",
                "Copyright (c) 2015, 2019 Elan Shanker",
                "Copyright (c) 2015, Contributors",
                "Copyright (c) 2015, Scott Motte",
                "Copyright (c) 2015-2021 the original",
                "Copyright (c) 2015-present, Brian Woodward",
                "Copyright (c) 2015-present, Facebook, Inc.",
                "Copyright (c) 2015-present, Jon Schlinkert",
                "Copyright (c) 2016 Jonas Kello",
                "Copyright (c) 2016 Luigi Pinca and contributors",
                "Copyright (c) 2016 Thomas Watson Steen",
                "Copyright (c) 2016 Zeit, Inc.",
                "Copyright (c) 2016, 2018 Linus Unneback",
                "Copyright (c) 2016-2018 Ari Porad",
                "Copyright (c) 2016-2018 Rob Wu <rob@robwu.nl>",
                "Copyright (c) 2016-2022 Isaac Z. Schlueter <i@izs.me> , James Talmage <james@talmage.io> (github.com/jamestalmage), and Contributors",
                "Copyright (c) 2016-present, Facebook, Inc.",
                "Copyright (c) 2016-present, Jon Schlinkert",
                "Copyright (c) 2017 Hunter Loftis <hunter@hunterloftis.com>",
                "Copyright (c) 2017 Sergey Rubanov (https://github.com/chicoxyzzy)",
                "Copyright (c) 2017 TJ Holowaychuk <tj@vision-media.ca>",
                "Copyright (c) 2017 by Marijn Haverbeke <marijn@haverbeke.berlin> and others",
                "Copyright (c) 2017-2023 Haydn Paterson",
                "Copyright (c) 2017-present, Jon Schlinkert",
                "Copyright (c) 2018 Made With MOXY Lda",
                "Copyright (c) 2018 Sony Interactive Entertainment Inc.",
                "Copyright (c) 2018-2021 Josh Junon",
                "Copyright (c) 2019 Apple Inc.",
                "Copyright (c) 2019 Elan Shanker, Paul Miller (https://paulmillr.com)",
                "Copyright (c) 2019 Igalia S.L.",
                "Copyright (c) 2019 Microsoft Corporation",
                "Copyright (c) 2019 Sindre Sorhus <sindresorhus@gmail.com> (https://sindresorhus.com), Paul Miller (https://paulmillr.com)",
                "Copyright (c) 2019, Mapbox",
                "Copyright (c) 2020 Apple Inc.",
                "Copyright (c) 2020 Julien Waechter",
                "Copyright (c) 2020 Microsoft Corporation",
                "Copyright (c) 2021 Alexey Raspopov, Kostiantyn Denysov, Anton Verinov",
                "Copyright (c) 2021 GitHub Inc.",
                "Copyright (c) 2021 Igalia S.L.",
                "Copyright (c) 2021-2024 Oleksii Raspopov, Kostiantyn Denysov, Anton Verinov",
                "Copyright (c) 2022 by original authors fontello.com",
                "Copyright (c) 2023 Microsoft Corporation",
                "Copyright (c) 2024 Igalia, S.L.",
                "Copyright (c) 2024 Microsoft",
                "Copyright (c) Facebook, Inc. and its affiliates",
                "Copyright (c) Faruk Ates Paul Irish",
                "Copyright (c) Isaac Z. Schlueter <i@izs.me> , James Talmage <james@talmage.io> (github.com/jamestalmage), and Contributors",
                "Copyright (c) Isaac Z. Schlueter and Contributors",
                "Copyright (c) Luke Edwards <luke.edwards05@gmail.com> (lukeed.com)",
                "Copyright (c) Marak Squires",
                "Copyright (c) Matteo Collina and Undici contributors",
                "Copyright (c) Meta Platforms, Inc. and affiliates",
                "Copyright (c) Microsoft",
                "Copyright (c) Microsoft Corporation",
                "Copyright (c) Sindre Sorhus <sindresorhus@gmail.com> (https://sindresorhus.com)",
                "Copyright (c) Sindre Sorhus <sindresorhus@gmail.com> (sindresorhus.com)",
                "Copyright 2013 Thorsten Lorenz",
                "Copyright 2013-present, Facebook, Inc.",
                "Copyright 2014 Andrey Sitnik <andrey@sitnik.ru> and other contributors",
                "Copyright 2014 The Chromium Authors",
                "Copyright 2014-2015, Facebook, Inc.",
                "Copyright 2015 the original author or authors",
                "Copyright 2017 Google Inc.",
                "Copyright 2018 Bernhard R. Fischer",
                "Copyright 2018 Google Inc.",
                "Copyright 2018 Kilian Valkhof",
                "Copyright 2018 Logan Smyth <loganfsmyth@gmail.com>",
                "Copyright 2019 Google Inc.",
                "Copyright 2019 Justin Ridgewell <jridgewell@google.com>",
                "Copyright 2019 Microsoft Corporation",
                "Copyright 2020 Microsoft Corporation",
                "Copyright 2022 Andrey Sitnik <andrey@sitnik.ru> and other contributors",
                "Copyright 2022 Justin Ridgewell <jridgewell@google.com>",
                "Copyright 2022 Justin Ridgewell <justin@ridgewell.name>",
                "Copyright 2023 Google Inc.",
                "Copyright 2024 Adobe Inc.",
                "Copyright 2024 Google Inc.",
                "Copyright Eemeli Aro <eemeli@gmail.com>",
                "Copyright Joyent, Inc. and other Node contributors",
                "Copyright Mathias Bynens <https://mathiasbynens.be/>",
                "Copyright Microsoft Corporation",
                "Portions Copyright (c) Microsoft Corporation",
                "Portions Copyright 2017 Google Inc.",
                "copyright (c) Microsoft Corporation",
                "copyright (c) by Microsoft Corporation"
            ],
            "file-count": 2786,
            "sha256": "ffe7cab1b3e25b17713598567aac9e7e7cf46588fef69ea6957631d0ee752a5a",
            "source": "https://github.com/microsoft/playwright/archive/refs/tags/v1.50.1.zip",
            "status": "restricted"
        }
    ]
}