{
    "id": "git/github/cloudykit/fastprinter/33d98a066a53",
    "license": "BSD-3-Clause AND MIT",
    "licenses-discovered": [
        "BSD-3-Clause",
        "MIT"
    ],
    "copyrights": [
        "Copyright (c) CloudyKit",
        "Copyright (c) Jose Santos <henrique_1609@me.com>",
        "Copyright The Go Authors"
    ],
    "file-count": 8,
    "scancode-version": "30.1.0",
    "authority": "https://gitlab.eclipse.org/eclipsefdn/emo-team/iplab/-/issues/3747",
    "source": "https://github.com/cloudykit/fastprinter/archive/33d98a066a53.zip",
    "status": "approved"
}