{
    "id": "npm/npmjs/-/source-map/0.8.0-beta.0",
    "license": "BSD-3-Clause",
    "licenses-discovered": [
        "BSD-3-Clause"
    ],
    "copyrights": [
        "Copyright (c) Mozilla Foundation and contributors",
        "Copyright The Closure Compiler"
    ],
    "file-count": 21,
    "scancode-version": "30.1.0",
    "authority": "https://gitlab.eclipse.org/eclipsefdn/emo-team/iplab/-/issues/2984",
    "source": "https://registry.npmjs.org/source-map/-/source-map-0.8.0-beta.0.tgz",
    "status": "approved"
}