{
    "license": "Apache-2.0 AND MIT",
    "file-count": 17,
    "authority": "https://gitlab.eclipse.org/eclipsefdn/emo-team/iplab/-/issues/1840",
    "scancode-version": "30.1.0",
    "licenses-discovered": [
        "Apache-2.0",
        "MIT"
    ],
    "id": "maven/mavencentral/org.apache.shiro/shiro-config-ogdl/1.8.0",
    "source": "https://search.maven.org/remotecontent?filepath=org/apache/shiro/shiro-config-ogdl/1.8.0/shiro-config-ogdl-1.8.0-sources.jar",
    "status": "approved"
}