{
    "id": "npm/npmjs/@vue/runtime-core/3.2.47",
    "license": "MIT",
    "authority": "https://gitlab.eclipse.org/eclipsefdn/emo-team/iplab/-/issues/7086",
    "source": "https://github.com/vuejs/core/archive/v3.2.47.zip",
    "status": "approved",
    "scans": [
        {
            "date": "February 13, 2023 at 9:25:23 a.m. GMT",
            "authority": "https://gitlab.eclipse.org/eclipsefdn/emo-team/iplab/-/issues/7086",
            "scancode-version": "31.2.1",
            "licenses-discovered": [
                "MIT"
            ],
            "copyrights": [
                "Copyright (c) 2013-present, Yuxi",
                "Copyright (c) 2018-present, Yuxi"
            ],
            "file-count": 604,
            "sha256": "c16313b622c697aea616e36ed1a8d253c454e8bab1e804758328d434304bb583",
            "source": "https://github.com/vuejs/core/archive/v3.2.47.zip",
            "status": "approved"
        }
    ]
}