{
    "id": "npm/npmjs/@turf/polygon-to-line/7.0.0",
    "license": "MIT AND BSD-2-Clause",
    "authority": "https://gitlab.eclipse.org/eclipsefdn/emo-team/iplab/-/issues/15254",
    "source": "https://github.com/Turfjs/turf/archive/refs/tags/v7.0.0.zip",
    "status": "approved",
    "scans": [
        {
            "date": "June 14, 2024 at 3:52:30 p.m. GMT",
            "authority": "https://gitlab.eclipse.org/eclipsefdn/emo-team/iplab/-/issues/15254",
            "scancode-version": "31.2.1",
            "licenses-discovered": [
                "MIT",
                "BSD-2-Clause"
            ],
            "copyrights": [
                "(c) 2013, Vladimir Agafonkin",
                "Copyright (c) 2013 Leszek Rybicki",
                "Copyright (c) 2017 TurfJS",
                "Copyright (c) 2017, Vladimir Agafonkin",
                "Copyright (c) 2019 Morgan Herlocker",
                "Copyright (c) 2019, Dane Springmeyer",
                "Copyright (c) Microsoft Corporation"
            ],
            "file-count": 2450,
            "sha256": "d80c46c25d38880646d121226ffe221fc85cf1714214a37b4f4ea09c51ed5c49",
            "source": "https://github.com/Turfjs/turf/archive/refs/tags/v7.0.0.zip",
            "status": "approved"
        }
    ]
}