{
    "id": "maven/mavencentral/org.apache.lucene/lucene-memory/9.2.0",
    "license": "Apache-2.0",
    "authority": "https://gitlab.eclipse.org/eclipsefdn/emo-team/iplab/-/issues/5928",
    "source": "https://search.maven.org/remotecontent?filepath=org/apache/lucene/lucene-memory/9.2.0/lucene-memory-9.2.0-sources.jar",
    "status": "approved",
    "scans": [
        {
            "date": "December 21, 2022 at 7:16:32 p.m. GMT",
            "authority": "https://gitlab.eclipse.org/eclipsefdn/emo-team/iplab/-/issues/5928",
            "scancode-version": "31.2.1",
            "licenses-discovered": [
                "Apache-2.0"
            ],
            "copyrights": [
            ],
            "file-count": 4,
            "sha256": "a5f7619554ed701dfd9c0002083529af22c262f7f7a30cf1b1245923e6048127",
            "source": "https://search.maven.org/remotecontent?filepath=org/apache/lucene/lucene-memory/9.2.0/lucene-memory-9.2.0-sources.jar",
            "status": "approved"
        }
    ]
}