{
    "id": "maven/mavencentral/io.swagger.core.v3/swagger-models-jakarta/2.2.7",
    "license": "Apache-2.0",
    "authority": "https://gitlab.eclipse.org/eclipsefdn/emo-team/iplab/-/issues/5919",
    "source": "https://search.maven.org/remotecontent?filepath=io/swagger/core/v3/swagger-models-jakarta/2.2.7/swagger-models-jakarta-2.2.7-sources.jar",
    "status": "approved",
    "scans": [
        {
            "date": "December 21, 2022 at 7:27:44 p.m. GMT",
            "authority": "https://gitlab.eclipse.org/eclipsefdn/emo-team/iplab/-/issues/5919",
            "scancode-version": "31.2.1",
            "licenses-discovered": [
                "Apache-2.0"
            ],
            "copyrights": [
                "Copyright (c) 2015. SmartBear Software Inc."
            ],
            "file-count": 5,
            "sha256": "a55080b49c763568552f51f3701badbb16b625a7cc9987c3f994b624b4e9969a",
            "source": "https://search.maven.org/remotecontent?filepath=io/swagger/core/v3/swagger-models-jakarta/2.2.7/swagger-models-jakarta-2.2.7-sources.jar",
            "status": "approved"
        }
    ]
}