{
    "id": "maven/mavencentral/com.azure.resourcemanager/azure-resourcemanager-cosmos/2.44.0",
    "license": "MIT",
    "authority": "https://gitlab.eclipse.org/eclipsefdn/emo-team/iplab/-/issues/16940",
    "source": "https://repo1.maven.org/maven2/com/azure/resourcemanager/azure-resourcemanager-cosmos/2.44.0/azure-resourcemanager-cosmos-2.44.0-sources.jar",
    "status": "approved",
    "scans": [
        {
            "date": "October 29, 2024, 4:57:24 a.m. GMT",
            "authority": "https://gitlab.eclipse.org/eclipsefdn/emo-team/iplab/-/issues/16940",
            "scancode-version": "31.2.1",
            "licenses-discovered": [
                "MIT"
            ],
            "copyrights": [
                "Copyright (c) Microsoft Corporation"
            ],
            "file-count": 465,
            "sha256": "6c9be8c2b99b9c884cefbd35237886b609e43f49dae0e6da327e3853d3c736a2",
            "source": "https://repo1.maven.org/maven2/com/azure/resourcemanager/azure-resourcemanager-cosmos/2.44.0/azure-resourcemanager-cosmos-2.44.0-sources.jar",
            "status": "approved"
        }
    ]
}