{
    "id": "maven/mavencentral/com.azure.resourcemanager/azure-resourcemanager-eventhubs/2.39.0",
    "license": "MIT",
    "authority": "https://gitlab.eclipse.org/eclipsefdn/emo-team/iplab/-/issues/15083",
    "source": "https://repo1.maven.org/maven2/com/azure/resourcemanager/azure-resourcemanager-eventhubs/2.39.0/azure-resourcemanager-eventhubs-2.39.0-sources.jar",
    "status": "approved",
    "scans": [
        {
            "date": "June 6, 2024 at 10:06:51 a.m. GMT",
            "authority": "https://gitlab.eclipse.org/eclipsefdn/emo-team/iplab/-/issues/15083",
            "scancode-version": "31.2.1",
            "licenses-discovered": [
                "MIT"
            ],
            "copyrights": [
                "(c) 2008 VeriSign, Inc.",
                "Copyright (c) Microsoft Corporation"
            ],
            "file-count": 151,
            "sha256": "bd4f96991fc159fd8037728763c21a4f8f0a0ebeb617196cc2a9ac9b26209f8d",
            "source": "https://repo1.maven.org/maven2/com/azure/resourcemanager/azure-resourcemanager-eventhubs/2.39.0/azure-resourcemanager-eventhubs-2.39.0-sources.jar",
            "status": "approved"
        }
    ]
}