{
    "id": "nuget/nuget/-/NHamcrest/3.2.0",
    "license": "MIT",
    "authority": "https://gitlab.eclipse.org/eclipsefdn/emo-team/iplab/-/issues/9299",
    "source": "https://github.com/nhamcrest/NHamcrest/archive/refs/tags/3.2.0.zip",
    "status": "approved",
    "scans": [
        {
            "date": "July 7, 2023 at 7:59:46 a.m. GMT",
            "authority": "https://gitlab.eclipse.org/eclipsefdn/emo-team/iplab/-/issues/9299",
            "scancode-version": "31.2.1",
            "licenses-discovered": [
                "MIT"
            ],
            "copyrights": [
                "Copyright (c) 2010 Graham Hay",
                "Copyright (c) 2023 Condition"
            ],
            "file-count": 118,
            "sha256": "747374d2e21651c9906d971f839f21a01d1c76d9abe941d97a54d857aaf13664",
            "source": "https://github.com/nhamcrest/NHamcrest/archive/refs/tags/3.2.0.zip",
            "status": "approved"
        }
    ]
}