{
    "id": "maven/mavencentral/software.amazon.awssdk/annotations/2.29.1",
    "license": "Apache-2.0",
    "authority": "https://gitlab.eclipse.org/eclipsefdn/emo-team/iplab/-/issues/17015",
    "source": "https://repo1.maven.org/maven2/software/amazon/awssdk/annotations/2.29.1/annotations-2.29.1-sources.jar",
    "status": "approved",
    "scans": [
        {
            "date": "November 1, 2024, 3:51:24 a.m. GMT",
            "authority": "https://gitlab.eclipse.org/eclipsefdn/emo-team/iplab/-/issues/17015",
            "scancode-version": "31.2.1",
            "licenses-discovered": [
                "Apache-2.0"
            ],
            "copyrights": [
                "Copyright Amazon.com, Inc. or its affiliates"
            ],
            "file-count": 18,
            "sha256": "139da56d481c1990d9cb7975cc402ce9624f4acf86eb35a011f0b440e00e1487",
            "source": "https://repo1.maven.org/maven2/software/amazon/awssdk/annotations/2.29.1/annotations-2.29.1-sources.jar",
            "status": "approved"
        }
    ]
}