{
    "id": "maven/mavencentral/com.github.librepdf/openpdf/1.4.1",
    "license": "LicenseRef-Permission-Notice AND Apache-2.0 AND BSD-3-Clause AND BSD-3-Clause-No-Nuclear-Warranty AND (MPL-1.1 OR LGPL-2.0-or-later) AND CC-BY-2.5 AND CC-BY-SSA-3.0 AND MIT AND LGPL-2.1-or-later AND OFL-1.1 AND LicenseRef-Public-domain AND GPL-2.0-only WITH LicenseRef-GPL-exception",
    "authority": "https://gitlab.eclipse.org/eclipsefdn/emo-team/iplab/-/issues/13351",
    "source": "https://repo1.maven.org/maven2/com/github/librepdf/openpdf/1.4.1/openpdf-1.4.1-sources.jar",
    "status": "approved",
    "scans": [
        {
            "date": "February 21, 2024 at 8:52:44 a.m. GMT",
            "authority": "https://gitlab.eclipse.org/eclipsefdn/emo-team/iplab/-/issues/13351",
            "scancode-version": "31.2.1",
            "licenses-discovered": [
                "LGPL-2.0-or-later AND MPL-1.1",
                "Apache-2.0 AND LGPL-2.1-only",
                "BSD-3-Clause AND BSD-3-Clause-No-Nuclear-Warranty",
                "BSD-3-Clause AND LGPL-2.0-or-later AND MPL-1.1",
                "Apache-2.0",
                "LicenseRef-scancode-adobe-acrobat-reader-eula AND LicenseRef-scancode-adobe-postscript AND LicenseRef-scancode-paulo-soares",
                "BSD-3-Clause",
                "Apache-2.0 AND LGPL-2.0-or-later AND MPL-1.1",
                "OFL-1.1",
                "LGPL-2.1-only",
                "Apache-2.0 AND LGPL-2.1-only AND MPL-2.0",
                "MPL-2.0"
            ],
            "copyrights": [
                "Copyright (c) 1985, 1987, 1988, 1989, 1997 Adobe Systems Incorporated",
                "Copyright (c) 1985, 1987, 1989, 1990, 1993, 1997 Adobe Systems Incorporated",
                "Copyright (c) 1985, 1987, 1989, 1990, 1997 Adobe Systems Incorporated",
                "Copyright (c) 1989, 1990, 1991, 1992, 1993, 1997 Adobe Systems Incorporated",
                "Copyright (c) 1989, 1990, 1991, 1993, 1997 Adobe Systems Incorporated",
                "Copyright (c) 1991, 1999 Free Software Foundation, Inc.",
                "Copyright (c) 1999, 2000, 2001, 2002 Bruno Lowagie",
                "Copyright (c) 1999, 2000, 2001, 2002 by Bruno Lowagie",
                "Copyright (c) 1999-2005 by Bruno Lowagie",
                "Copyright (c) 1999-2007 by Bruno Lowagie",
                "Copyright (c) 1999-2008 by Bruno Lowagie",
                "Copyright (c) 1999-2009 by Bruno Lowagie",
                "Copyright (c) 2000, 2001, 2002 by Paulo Soares",
                "Copyright (c) 2000-2005 by Paulo Soares",
                "Copyright (c) 2000-2007 by Paulo Soares",
                "Copyright (c) 2000-2008 by Paulo Soares",
                "Copyright (c) 2000-2009 by Paulo Soares",
                "Copyright (c) 2001 Dr. Heinz M. Kabutz",
                "Copyright (c) 2001, 2002 Bruno Lowagie",
                "Copyright (c) 2002 Mark Thompson",
                "Copyright (c) 2002 by Mark Thompson",
                "Copyright (c) 2003-2006, www.pdfbox.org",
                "Copyright (c) 2005 Sun Microsystems, Inc.",
                "Copyright (c) 2005, www.fontbox.org",
                "Copyright (c) 2005-2006, www.fontbox.org",
                "Copyright (c) 2008 by Bruno Lowagie",
                "Copyright (c) 2008 by Paulo Soares",
                "Copyright (c) 2009 by Bruno Lowagie",
                "Copyright (c) 2009 by Martin Brunecky",
                "Copyright (c) 2009 by Paulo Soares",
                "Copyright (c) 2012 Red Hat, Inc. Digitized",
                "Copyright (c) 2012 Red Hat, Inc. Liberation Sans Liberation Sans",
                "Copyright (c) IBM Corp., 1991",
                "Copyright 1990-2000 Adobe Systems Incorporated",
                "Copyright 1991 Ken Borgendale",
                "Copyright 1999, 2000, 2001, 2002 Bruno Lowagie",
                "Copyright 1999, 2000, 2001, 2002 by Bruno Lowagie",
                "Copyright 1999, 2000, 2001, 2002 by Paulo Soares",
                "Copyright 1999-2004 The Apache Software Foundation",
                "Copyright 1999-2005 The Apache Software Foundation",
                "Copyright 1999-2006 Bruno Lowagie",
                "Copyright 2000 by Bruno Lowagie",
                "Copyright 2000, 2001, 2002 by Bruno Lowagie",
                "Copyright 2000, 2001, 2002 by Paulo Soares",
                "Copyright 2000-2006 by Paulo Soares",
                "Copyright 2001, 2002 Bruno Lowagie",
                "Copyright 2001, 2002 Paulo Soares",
                "Copyright 2001, 2002 by Bruno Lowagie",
                "Copyright 2001, 2002 by Paulo Soares",
                "Copyright 2001-2006 Paulo Soares",
                "Copyright 2002 Bruno Lowagie",
                "Copyright 2002 Mark Thompson",
                "Copyright 2002 Paulo Soares",
                "Copyright 2002 by Bruno Lowagie",
                "Copyright 2002 by Jeremy Bowman <bowmanjm@attbi.com>",
                "Copyright 2002 by Jim Moore <jim@scolamoore.com>",
                "Copyright 2002 by Josselin PUJO.",
                "Copyright 2002 by Paulo Soares",
                "Copyright 2002 by Phillip Pan",
                "Copyright 2002-2006 by Paulo Soares",
                "Copyright 2002-2008 by Paulo Soares",
                "Copyright 2003 Galo Gimenez",
                "Copyright 2003 Paulo Soares",
                "Copyright 2003 Sivan Toledo",
                "Copyright 2003 by Michael Niedermair",
                "Copyright 2003 by Michael Niedermair and 2007 Bruno Lowagie",
                "Copyright 2003 by Paulo Soares",
                "Copyright 2003, 2004 by Paulo Soares",
                "Copyright 2003-2005 by Paulo Soares",
                "Copyright 2003-2007 Paulo Soares and Bruno Lowagie",
                "Copyright 2004 Oren Manor and Ygal Blum",
                "Copyright 2004 Paulo Soares",
                "Copyright 2004 Paulo Soares and Alexandru Carstoiu",
                "Copyright 2004 Steve Appling",
                "Copyright 2004 by Leonard Rosenthol",
                "Copyright 2004 by Paulo Soares",
                "Copyright 2004 by Takenori",
                "Copyright 2004-2006 by Paulo Soares",
                "Copyright 2005 Bruno Lowagie",
                "Copyright 2005 Paulo Soares",
                "Copyright 2005 by Bruno Lowagie",
                "Copyright 2005 by David G. Durand",
                "Copyright 2005 by Michael Niedermair",
                "Copyright 2005 by Paulo Soares",
                "Copyright 2006 Bruno Lowagie",
                "Copyright 2006 Joakim Sandstroem",
                "Copyright 2006 Paulo Soares",
                "Copyright 2007 Bruno Lowagie and Wil",
                "Copyright 2007 Michael Neuweiler and Bruno Lowagie",
                "Copyright 2007 Paulo Soares",
                "Copyright 2007 by Armin Haberling",
                "Copyright 2007 by Bruno Lowagie",
                "Copyright 2007 by Paulo Soares",
                "Copyright 2008 Bruno Lowagie and Xavier Le Vourch",
                "Copyright 2008 by Bruno Lowagie",
                "Copyright 2008 by Kevin Day",
                "Copyright 2008 by Paulo Soares",
                "Copyright 2009 Bruno Lowagie",
                "Copyright 2009 Holger Plankermann",
                "Copyright 2009 Martin Brunecky",
                "Copyright 2009 Martin Brunecky, Aiken Sam",
                "Copyright 2009 Paulo Soares",
                "Copyright 2009 by Bruno Lowagie",
                "Copyright 2009 by Kevin Day",
                "Copyright 2009 by Nigel Kerr",
                "Copyright 2009 by Paulo Soares",
                "Copyright 2014 by Tizra Inc.",
                "Copyright 2018 Andreas Rosdal",
                "Copyright 2020-2022 Volker Kunert",
                "Copyright Adobe Systems Incorporated",
                "Copyright Copyright 1990-1998 Adobe Systems Incorporated",
                "Copyright Copyright 1990-1999 Adobe Systems Incorporated",
                "Copyright Copyright 1990-200 Adobe Systems Incorporated",
                "Copyright Copyright 1990-2000 Adobe Systems Incorporated",
                "Copyright Copyright 1990-2001 Adobe Systems Incorporated",
                "Copyright Copyright 1990-2002 Adobe Systems Incorporated",
                "Copyright Copyright 1990-2003 Adobe Systems Incorporated",
                "Copyright PostScript and Display PostScript",
                "Pending",
                "copyright (c) 2010 Google Corporation",
                "copyright 2014 Tizra Inc.",
                "copyrighted by the Free Software Foundation"
            ],
            "file-count": 562,
            "sha256": "bca1e89039a6325c0a856fe4677fdb24f88cd305ce922b6edd18551f3612971c",
            "source": "https://repo1.maven.org/maven2/com/github/librepdf/openpdf/1.4.1/openpdf-1.4.1-sources.jar",
            "status": "restricted"
        }
    ]
}
