{
    "id": "npm/npmjs/-/fastq/1.18.0",
    "license": "ISC",
    "authority": "https://gitlab.eclipse.org/eclipsefdn/emo-team/iplab/-/issues/18379",
    "source": "https://github.com/mcollina/fastq/archive/refs/tags/v1.18.0.zip",
    "status": "approved",
    "scans": [
        {
            "date": "January 8, 2025 at 1:07:08 p.m. GMT",
            "authority": "https://gitlab.eclipse.org/eclipsefdn/emo-team/iplab/-/issues/18379",
            "scancode-version": "31.2.1",
            "licenses-discovered": [
                "ISC"
            ],
            "copyrights": [
                "Copyright (c) 2015-2020, Matteo Collina <matteo.collina@gmail.com>"
            ],
            "file-count": 15,
            "sha256": "5384a331ed6de00dfc99458fe363676b527fadfdee10e60537c3bfbfb96edaaa",
            "source": "https://github.com/mcollina/fastq/archive/refs/tags/v1.18.0.zip",
            "status": "approved"
        }
    ]
}