{
    "id": "maven/mavencentral/software.amazon.awssdk/http-auth-aws/2.23.12",
    "license": "Apache-2.0",
    "authority": "https://gitlab.eclipse.org/eclipsefdn/emo-team/iplab/-/issues/13154",
    "source": "https://repo1.maven.org/maven2/software/amazon/awssdk/http-auth-aws/2.23.12/http-auth-aws-2.23.12-sources.jar",
    "status": "approved",
    "scans": [
        {
            "date": "February 4, 2024 at 11:05:41 a.m. GMT",
            "authority": "https://gitlab.eclipse.org/eclipsefdn/emo-team/iplab/-/issues/13154",
            "scancode-version": "31.2.1",
            "licenses-discovered": [
                "Apache-2.0"
            ],
            "copyrights": [
                "Copyright Amazon.com, Inc. or its affiliates"
            ],
            "file-count": 77,
            "sha256": "3e7b4615dfaacac3ba7ccfd987e0a873d23613bdd5ecc8bfa23b399d238ec5a0",
            "source": "https://repo1.maven.org/maven2/software/amazon/awssdk/http-auth-aws/2.23.12/http-auth-aws-2.23.12-sources.jar",
            "status": "approved"
        }
    ]
}