{
    "id": "pypi/pypi/-/defer/1.0.6",
    "license": "GPL-2.0-only AND GPL-1.0-or-later AND MIT",
    "authority": "https://gitlab.eclipse.org/eclipsefdn/emo-team/iplab/-/issues/6326",
    "source": "https://launchpad.net/python-defer/trunk/1.0.6/+download/defer-1.0.6.tar.gz",
    "status": "restricted",
    "scans": [
        {
            "date": "January 17, 2023 at 11:20:54 p.m. GMT",
            "authority": "https://gitlab.eclipse.org/eclipsefdn/emo-team/iplab/-/issues/6326",
            "scancode-version": "31.2.1",
            "licenses-discovered": [
                "GPL-2.0-only",
                "GPL-1.0-or-later",
                "MIT"
            ],
            "copyrights": [
                "Copyright (c) 1989, 1991 Free Software Foundation, Inc.",
                "Copyright (c) 2001-2010 Allen Short Andy Gayton",
                "Copyright (c) 2008-2010 Sebastian Heinlein <devel@glatzor.de>",
                "copyrighted by the Free Software Foundation"
            ],
            "file-count": 18,
            "sha256": "dbaaeab7ef9c1ece7f9df082ffe6bbcfb42e6b94b1d0219e9958f339b530325c",
            "source": "https://launchpad.net/python-defer/trunk/1.0.6/+download/defer-1.0.6.tar.gz",
            "status": "restricted"
        }
    ]
}