{
    "id": "maven/mavencentral/com.vladsch.flexmark/flexmark-util-misc/0.64.8",
    "license": "Apache-2.0 AND (Apache-2.0 AND BSD-2-Clause)",
    "authority": "https://gitlab.eclipse.org/eclipsefdn/emo-team/iplab/-/issues/11332",
    "source": "https://repo.maven.apache.org/maven2/com/vladsch/flexmark/flexmark-util-misc/0.64.8/flexmark-util-misc-0.64.8-sources.jar",
    "status": "approved",
    "scans": [
        {
            "date": "October 26, 2023 at 7:12:27 p.m. GMT",
            "authority": "https://gitlab.eclipse.org/eclipsefdn/emo-team/iplab/-/issues/11332",
            "scancode-version": "31.2.1",
            "licenses-discovered": [
                "Apache-2.0",
                "Apache-2.0 AND BSD-2-Clause"
            ],
            "copyrights": [
                "Copyright (c) 2015-2018 Vladimir Schneider <vladimir.schneider@gmail.com>",
                "Copyright (c) 2016-2018 Vladimir Schneider <vladimir.schneider@gmail.com>",
                "Copyright (c) 2017, Holger Brandl",
                "Copyright (c) 2017, Vladimir Schneider"
            ],
            "file-count": 23,
            "sha256": "93d87943c488545fa7e4ec5f6d7a1869febeb9ab781852afa51930c3d67628fb",
            "source": "https://repo.maven.apache.org/maven2/com/vladsch/flexmark/flexmark-util-misc/0.64.8/flexmark-util-misc-0.64.8-sources.jar",
            "status": "approved"
        }
    ]
}