{
    "id": "maven/mavencentral/org.geotools/gt-render/30.2",
    "license": "LGPL-2.1-only",
    "authority": "https://gitlab.eclipse.org/eclipsefdn/emo-team/iplab/-/issues/13117",
    "source": "https://repo.osgeo.org/repository/geotools-releases/org/geotools/gt-render/30.2/gt-render-30.2-sources.jar",
    "status": "approved",
    "scans": [
        {
            "date": "February 2, 2024 at 8:18:23 p.m. GMT",
            "authority": "https://gitlab.eclipse.org/eclipsefdn/emo-team/iplab/-/issues/13117",
            "scancode-version": "31.2.1",
            "licenses-discovered": [
                "LGPL-2.1-only"
            ],
            "copyrights": [
                "(c) 2001-2008, Open Source Geospatial Foundation",
                "(c) 2002-2008, Open Source Geospatial Foundation",
                "(c) 2002-2011, Open Source Geospatial Foundation",
                "(c) 2002-2015, Open Source Geospatial Foundation",
                "(c) 2002-2016, Open Source Geospatial Foundation",
                "(c) 2003-2008, Open Source Geospatial Foundation",
                "(c) 2003-2011, Open Source Geospatial Foundation",
                "(c) 2003-2015, Open Source Geospatial Foundation",
                "(c) 2003-2016, Open Source Geospatial Foundation",
                "(c) 2003-2018, Open Source Geospatial Foundation, OSGeo http://osgeo.org",
                "(c) 2004-2008, Open Source Geospatial Foundation",
                "(c) 2004-2015, Open Source Geospatial Foundation",
                "(c) 2004-2016, Open Source Geospatial Foundation",
                "(c) 2005-2008, Open Source Geospatial Foundation",
                "(c) 2005-2015, Open Source Geospatial Foundation",
                "(c) 2008, Open Source Geospatial Foundation",
                "(c) 2010-2011, Open Source Geospatial Foundation",
                "(c) 2011, Open Source Geospatial Foundation",
                "(c) 2013, Open Source Geospatial Foundation",
                "(c) 2013-2016, Open Source Geospatial Foundation",
                "(c) 2014 - 2015, Open Source Geospatial Foundation",
                "(c) 2014, Open Source Geospatial Foundation",
                "(c) 2014-2016, Open Source Geospatial Foundation",
                "(c) 2015, Open Source Geospatial Foundation",
                "(c) 2016, Open Source Geospatial Foundation",
                "(c) 2017, Open Source Geospatial Foundation",
                "(c) 2018, Open Source Geospatial Foundation",
                "(c) 2019, Open Source Geospatial Foundation",
                "(c) 2021, Open Source Geospatial Foundation",
                "(c) 2023, Open Source Geospatial Foundation"
            ],
            "file-count": 161,
            "sha256": "dada544847329ddf875636ba19180776166aa3778cdce971e6dd39dfac5a0ca0",
            "source": "https://repo.osgeo.org/repository/geotools-releases/org/geotools/gt-render/30.2/gt-render-30.2-sources.jar",
            "status": "approved"
        }
    ]
}