{
    "license": "Apache-2.0",
    "file-count": 123,
    "authority": "https://gitlab.eclipse.org/eclipsefdn/emo-team/iplab/-/issues/1898",
    "scancode-version": "30.1.0",
    "licenses-discovered": [
        "Apache-2.0",
        "BSD-3-Clause",
        "CDDL-1.0",
        "CDDL-1.1",
        "Classpath-exception-2.0",
        "GPL-2.0-only",
        "LicenseRef-scancode-free-unknown",
        "LicenseRef-scancode-unknown-license-reference",
        "MIT"
    ],
    "id": "maven/mavencentral/org.apache.wss4j/wss4j-ws-security-common/2.3.0",
    "source": "https://search.maven.org/remotecontent?filepath=org/apache/wss4j/wss4j-ws-security-common/2.3.0/wss4j-ws-security-common-2.3.0-sources.jar",
    "status": "approved"
}
