{
    "id": "maven/mavencentral/io.fabric8/openshift-model-miscellaneous/6.5.0",
    "license": "Apache-2.0",
    "authority": "https://gitlab.eclipse.org/eclipsefdn/emo-team/iplab/-/issues/7398",
    "source": "https://search.maven.org/remotecontent?filepath=io/fabric8/openshift-model-miscellaneous/6.5.0/openshift-model-miscellaneous-6.5.0-sources.jar",
    "status": "approved",
    "scans": [
        {
            "date": "March 14, 2023 at 9:19:27 a.m. GMT",
            "authority": "https://gitlab.eclipse.org/eclipsefdn/emo-team/iplab/-/issues/7398",
            "scancode-version": "31.2.1",
            "licenses-discovered": [
                "Apache-2.0"
            ],
            "copyrights": [
                "Copyright (c) 2015 Red Hat, Inc."
            ],
            "file-count": 296,
            "sha256": "f2311562b9feb06ffaa62d449488762ee6b15b922850c8162d5f9762185ec9dd",
            "source": "https://search.maven.org/remotecontent?filepath=io/fabric8/openshift-model-miscellaneous/6.5.0/openshift-model-miscellaneous-6.5.0-sources.jar",
            "status": "approved"
        }
    ]
}