{
    "id": "maven/mavencentral/software.amazon.awssdk/third-party-jackson-core/2.27.24",
    "license": "Apache-2.0",
    "authority": "https://gitlab.eclipse.org/eclipsefdn/emo-team/iplab/-/issues/17741",
    "source": "https://repo1.maven.org/maven2/software/amazon/awssdk/third-party-jackson-core/2.27.24/third-party-jackson-core-2.27.24-sources.jar",
    "status": "approved",
    "scans": [
        {
            "date": "December 5, 2024 at 7:01:04 a.m. GMT",
            "authority": "https://gitlab.eclipse.org/eclipsefdn/emo-team/iplab/-/issues/17741",
            "scancode-version": "31.2.1",
            "licenses-discovered": [
                "Apache-2.0"
            ],
            "copyrights": [
                "Copyright Amazon.com, Inc. or its affiliates"
            ],
            "file-count": 4,
            "sha256": "5146e489aa1d00cf5fe2fef21e9300875549fd6abf2499ed359d74ce54840f6c",
            "source": "https://repo1.maven.org/maven2/software/amazon/awssdk/third-party-jackson-core/2.27.24/third-party-jackson-core-2.27.24-sources.jar",
            "status": "approved"
        }
    ]
}