{
    "id": "maven/mavencentral/org.kie/kie-pmml-api/7.63.0-20211209.163911-14",
    "license": "Apache-2.0",
    "licenses-discovered": [
        "Apache-2.0"
    ],
    "copyrights": [
        "Copyright Red Hat, Inc. and/or its affiliates"
    ],
    "file-count": 55,
    "scancode-version": "30.1.0",
    "authority": "https://gitlab.eclipse.org/eclipsefdn/emo-team/iplab/-/issues/2796",
    "source": "https://search.maven.org/remotecontent?filepath=org/kie/kie-pmml-api/7.63.0.Final/kie-pmml-api-7.63.0.Final-sources.jar",
    "status": "approved"
}