{
    "id": "npm/npmjs/-/memorystream/0.3.1",
    "license": "MIT",
    "licenses-discovered": [
        "MIT"
    ],
    "copyrights": [
        "Copyright (c) 2011 Dmitry Nizovtsev"
    ],
    "file-count": 8,
    "scancode-version": "31.2.1",
    "authority": "https://gitlab.eclipse.org/eclipsefdn/emo-team/iplab/-/issues/4514",
    "source": "https://registry.npmjs.org/memorystream/-/memorystream-0.3.1.tgz",
    "status": "approved"
}