{
    "id": "p2/orbit/p2.eclipse-plugin/com.fasterxml.jackson.core.jackson-annotations/2.13.2",
    "license": "Apache-2.0",
    "licenses-discovered": [
        "Apache-2.0"
    ],
    "copyrights": [
    ],
    "file-count": 50,
    "scancode-version": "31.2.1",
    "authority": "https://gitlab.eclipse.org/eclipsefdn/emo-team/iplab/-/issues/3908",
    "source": "https://search.maven.org/remotecontent?filepath=com/fasterxml/jackson/core/jackson-annotations/2.13.2/jackson-annotations-2.13.2-sources.jar",
    "status": "approved"
}