{
    "id": "npm/npmjs/@vue/reactivity-transform/3.2.33",
    "license": "MIT",
    "licenses-discovered": [
        "MIT"
    ],
    "copyrights": [
        "Copyright (c) Yuxi"
    ],
    "file-count": 585,
    "scancode-version": "30.1.0",
    "authority": "https://gitlab.eclipse.org/eclipsefdn/emo-team/iplab/-/issues/3096",
    "source": "https://github.com/vuejs/core/archive/v3.2.33.zip",
    "status": "approved"
}