{
    "id": "go/golang/github.com/hashicorp%2Fterraform-registry-address/v0.2.3",
    "license": "MPL-2.0",
    "authority": "https://gitlab.eclipse.org/eclipsefdn/emo-team/iplab/-/issues/14443",
    "source": "https://proxy.golang.org/github.com/hashicorp%2Fterraform-registry-address/@v/v0.2.3.zip",
    "status": "approved",
    "scans": [
        {
            "date": "April 18, 2024 at 9:19:03 p.m. GMT",
            "authority": "https://gitlab.eclipse.org/eclipsefdn/emo-team/iplab/-/issues/14443",
            "scancode-version": "31.2.1",
            "licenses-discovered": [
                "MPL-2.0"
            ],
            "copyrights": [
                "Copyright (c) 2021 HashiCorp, Inc.",
                "Copyright (c) HashiCorp, Inc."
            ],
            "file-count": 14,
            "sha256": "3d77929cdf8acf459c3744134a2407204261f597a990e271102cd4e23032660d",
            "source": "https://proxy.golang.org/github.com/hashicorp%2Fterraform-registry-address/@v/v0.2.3.zip",
            "status": "approved"
        }
    ]
}