{
    "id": "npm/npmjs/-/autoprefixer/9.4.6",
    "license": "MIT",
    "licenses-discovered": [
        "MIT"
    ],
    "copyrights": [
        "Copyright Andrey Sitnik <andrey@sitnik.ru>"
    ],
    "file-count": 76,
    "scancode-version": "30.1.0",
    "authority": "https://gitlab.eclipse.org/eclipsefdn/emo-team/iplab/-/issues/2880",
    "source": "https://registry.npmjs.org/autoprefixer/-/autoprefixer-9.4.6.tgz",
    "status": "approved"
}