{
    "id": "npm/npmjs/-/docusaurus-plugin-redoc/2.0.0",
    "license": "MIT AND (BSD-2-Clause AND ISC AND MIT) AND Apache-2.0",
    "authority": "https://gitlab.eclipse.org/eclipsefdn/emo-team/iplab/-/issues/12053",
    "source": "https://github.com/rohit-gohri/redocusaurus/archive/refs/tags/v2.0.0.zip",
    "status": "approved",
    "scans": [
        {
            "date": "December 14, 2023 at 9:04:22 a.m. GMT",
            "authority": "https://gitlab.eclipse.org/eclipsefdn/emo-team/iplab/-/issues/12053",
            "scancode-version": "31.2.1",
            "licenses-discovered": [
                "MIT",
                "BSD-2-Clause AND ISC AND MIT",
                "Apache-2.0"
            ],
            "copyrights": [
                "(c) 2023 Rohit Gohri",
                "Copyright (c) 2023 Rohit Gohri"
            ],
            "file-count": 104,
            "sha256": "753cb5bb5afcbd0e04d1a8e7b0df11683c5173766f1fe968485495c7a4106dec",
            "source": "https://github.com/rohit-gohri/redocusaurus/archive/refs/tags/v2.0.0.zip",
            "status": "approved"
        }
    ]
}