{
    "id": "npm/npmjs/-/ajv/8.15.0",
    "license": "MIT AND (EPL-2.0 OR GPL-2.0 WITH Classpath-exception-2.0) AND OFL-1.1",
    "authority": "https://gitlab.eclipse.org/eclipsefdn/emo-team/iplab/-/issues/15071",
    "source": "https://github.com/ajv-validator/ajv/archive/refs/tags/v8.15.0.zip",
    "status": "approved",
    "scans": [
        {
            "date": "June 4, 2024 at 12:07:38 a.m. GMT",
            "authority": "https://gitlab.eclipse.org/eclipsefdn/emo-team/iplab/-/issues/15071",
            "scancode-version": "31.2.1",
            "licenses-discovered": [
                "MIT",
                "OFL-1.1",
                "EPL-2.0 AND (GPL-2.0-only WITH Classpath-exception-2.0)"
            ],
            "copyrights": [
                "(c) 2015-2021 (./license.md) Ajv JSON",
                "Copyright (c) 2008-2014, Andrey V. Panov (panov@canopus.iacp.dvo.ru)",
                "Copyright (c) 2015-2021 Evgeny Poberezkin",
                "Copyright (c) 2018 TypeFox and others",
                "Copyright (c) 2018-present, Yuxi",
                "Copyright (c) Microsoft Corporation",
                "Copyright 2010 The Raleway Project"
            ],
            "file-count": 483,
            "sha256": "e5d26eb3a2f89bd4a71d2cdd83e914ca6c315af103f6362449923b3fba30e058",
            "source": "https://github.com/ajv-validator/ajv/archive/refs/tags/v8.15.0.zip",
            "status": "restricted"
        }
    ]
}