{
    "id": "maven/mavencentral/org.jboss.resteasy/resteasy-json-p-provider/6.2.7.Final",
    "license": "Apache-2.0",
    "authority": "https://gitlab.eclipse.org/eclipsefdn/emo-team/iplab/-/issues/16087",
    "source": "https://repo1.maven.org/maven2/org/jboss/resteasy/resteasy-json-p-provider/6.2.7.Final/resteasy-json-p-provider-6.2.7.Final-sources.jar",
    "status": "approved",
    "scans": [
        {
            "date": "September 10, 2024, 2:47:16 p.m. GMT",
            "authority": "https://gitlab.eclipse.org/eclipsefdn/emo-team/iplab/-/issues/16087",
            "scancode-version": "31.2.1",
            "licenses-discovered": [
            ],
            "copyrights": [
            ],
            "file-count": 11,
            "sha256": "5a320fc1433ccdfe39ae8cdf18b2c0ddbcdee70043400adbf172a3ae77370b36",
            "source": "https://repo1.maven.org/maven2/org/jboss/resteasy/resteasy-json-p-provider/6.2.7.Final/resteasy-json-p-provider-6.2.7.Final-sources.jar",
            "status": "restricted"
        }
    ]
}