{
    "id": "go/golang/google.golang.org/api/v0.15.0",
    "license": "BSD-3-Clause AND CC-BY-3.0 AND CC-BY-4.0",
    "authority": "https://gitlab.eclipse.org/eclipsefdn/emo-team/iplab/-/issues/6397",
    "source": "https://proxy.golang.org/google.golang.org/api/@v/v0.15.0.zip",
    "status": "approved",
    "scans": [
        {
            "date": "January 20, 2023 at 2:22:01 p.m. GMT",
            "authority": "https://gitlab.eclipse.org/eclipsefdn/emo-team/iplab/-/issues/6397",
            "scancode-version": "31.2.1",
            "licenses-discovered": [
                "BSD-3-Clause",
                "LicenseRef-scancode-unknown",
                "BSD-3-Clause AND LicenseRef-scancode-unknown",
                "BSD-3-Clause AND JSON",
                "LicenseRef-scancode-other-copyleft AND LicenseRef-scancode-proprietary-license",
                "BSD-3-Clause AND LicenseRef-scancode-other-copyleft AND LicenseRef-scancode-proprietary-license",
                "CC-BY-3.0",
                "BSD-3-Clause AND CC-BY-3.0 AND CC-BY-4.0 AND JSON",
                "LicenseRef-scancode-proprietary-license",
                "BSD-3-Clause AND LicenseRef-scancode-proprietary-license"
            ],
            "copyrights": [
                "Copyright (c) 2011 Google Inc.",
                "Copyright (c) 2013 Joshua Tacoma",
                "Copyright 2011 Google LLC.",
                "Copyright 2012 Google LLC.",
                "Copyright 2013 Google LLC.",
                "Copyright 2013 Joshua Tacoma",
                "Copyright 2014 The Go Authors",
                "Copyright 2015 Google LLC",
                "Copyright 2015 Google LLC.",
                "Copyright 2015 The Go Authors",
                "Copyright 2016 Google LLC",
                "Copyright 2016 Google LLC.",
                "Copyright 2016 The Go Authors",
                "Copyright 2017 Google LLC.",
                "Copyright 2017 The Go Authors",
                "Copyright 2018 Google LLC",
                "Copyright 2018 Google LLC.",
                "Copyright 2019 Google LLC.",
                "Copyright Google LLC.",
                "Copyright YEAR Google LLC.",
                "Copyright d d d d (Google LLC The Go Authors)( .)"
            ],
            "file-count": 748,
            "sha256": "e6a7a980ad1161a3db060cbeff23ec339d6db40a8c8b619b1aa47cee6662b5da",
            "source": "https://proxy.golang.org/google.golang.org/api/@v/v0.15.0.zip",
            "status": "restricted"
        }
    ]
}
