{
    "id": "maven/mavencentral/com.fasterxml.jackson.module/jackson-module-parameter-names/2.16.1",
    "license": "Apache-2.0",
    "authority": "https://gitlab.eclipse.org/eclipsefdn/emo-team/iplab/-/issues/14670",
    "source": "https://repo1.maven.org/maven2/com/fasterxml/jackson/module/jackson-module-parameter-names/2.16.1/jackson-module-parameter-names-2.16.1-sources.jar",
    "status": "approved",
    "scans": [
        {
            "date": "May 9, 2024 at 11:13:38 a.m. GMT",
            "authority": "https://gitlab.eclipse.org/eclipsefdn/emo-team/iplab/-/issues/14670",
            "scancode-version": "31.2.1",
            "licenses-discovered": [
                "Apache-2.0"
            ],
            "copyrights": [
            ],
            "file-count": 10,
            "sha256": "a226e456732ddc2a91f4ae76de511a0d99cd7e37fa93a40c5ba07c17af59d82d",
            "source": "https://repo1.maven.org/maven2/com/fasterxml/jackson/module/jackson-module-parameter-names/2.16.1/jackson-module-parameter-names-2.16.1-sources.jar",
            "status": "approved"
        }
    ]
}