{
    "id": "npm/npmjs/@sinclair/typebox/0.24.41",
    "license": "MIT",
    "licenses-discovered": [
        "MIT",
        "JSON AND MIT"
    ],
    "copyrights": [
        "Copyright (c) Haydn Paterson"
    ],
    "file-count": 47,
    "scancode-version": "30.1.0",
    "authority": "https://gitlab.eclipse.org/eclipsefdn/emo-team/iplab/-/issues/3330",
    "source": "https://registry.npmjs.org/@sinclair/typebox/-/typebox-0.24.41.tgz",
    "status": "approved"
}
