{
    "id": "maven/mavencentral/software.amazon.awssdk/netty-nio-client/2.23.12",
    "license": "Apache-2.0",
    "authority": "https://gitlab.eclipse.org/eclipsefdn/emo-team/iplab/-/issues/13134",
    "source": "https://repo1.maven.org/maven2/software/amazon/awssdk/netty-nio-client/2.23.12/netty-nio-client-2.23.12-sources.jar",
    "status": "approved",
    "scans": [
        {
            "date": "February 4, 2024 at 11:42:59 a.m. GMT",
            "authority": "https://gitlab.eclipse.org/eclipsefdn/emo-team/iplab/-/issues/13134",
            "scancode-version": "31.2.1",
            "licenses-discovered": [
                "Apache-2.0"
            ],
            "copyrights": [
                "Copyright Amazon.com, Inc. or its affiliates"
            ],
            "file-count": 98,
            "sha256": "f24f6ff1acff5cd6170e7359345617ffaa9f7710c3524f0139961597680c9842",
            "source": "https://repo1.maven.org/maven2/software/amazon/awssdk/netty-nio-client/2.23.12/netty-nio-client-2.23.12-sources.jar",
            "status": "approved"
        }
    ]
}