{
    "id": "maven/mavencentral/org.apache.maven.surefire/surefire-booter/3.2.1",
    "license": "Apache-2.0",
    "authority": "https://gitlab.eclipse.org/eclipsefdn/emo-team/iplab/-/issues/11113",
    "source": "https://repo.maven.apache.org/maven2/org/apache/maven/surefire/surefire-booter/3.2.1/surefire-booter-3.2.1-sources.jar",
    "status": "approved",
    "scans": [
        {
            "date": "October 25, 2023 at 5:36:27 a.m. GMT",
            "authority": "https://gitlab.eclipse.org/eclipsefdn/emo-team/iplab/-/issues/11113",
            "scancode-version": "31.2.1",
            "licenses-discovered": [
                "Apache-2.0"
            ],
            "copyrights": [
            ],
            "file-count": 39,
            "sha256": "1531f2e151b33898594ed6139d7ae7f5711a946c69701deeab2635468efbba66",
            "source": "https://repo.maven.apache.org/maven2/org/apache/maven/surefire/surefire-booter/3.2.1/surefire-booter-3.2.1-sources.jar",
            "status": "approved"
        }
    ]
}