{
    "id": "pypi/pypi/-/pycairo/1.21.0",
    "license": "(LGPL-2.1-only OR MPL-1.1) AND MIT",
    "authority": "https://gitlab.eclipse.org/eclipsefdn/emo-team/iplab/-/issues/4737",
    "source": "https://files.pythonhosted.org/packages/92/a4/506564f574fa74c90b98690e8ecc8dbae1629f31fcfe0be69de45d9e1605/pycairo-1.21.0.tar.gz",
    "status": "approved",
    "scans": [
        {
            "date": "November 10, 2022 at 9:14:20 p.m. GMT",
            "authority": "https://gitlab.eclipse.org/eclipsefdn/emo-team/iplab/-/issues/4737",
            "scancode-version": "31.2.1",
            "licenses-discovered": [
                "LGPL-2.1-only OR MPL-1.1",
                "LGPL-2.1-only",
                "MPL-1.1",
                "LGPL-2.0-or-later AND LGPL-2.1-only",
                "LGPL-2.0-only AND LGPL-2.1-only AND MPL-1.1",
                "LGPL-2.0-only AND MPL-1.1",
                "LGPL-2.0-or-later",
                "LGPL-2.1-only AND MPL-1.1",
                "MIT"
            ],
            "copyrights": [
                "Copyright (c) 1991, 1999 Free Software Foundation, Inc.",
                "Copyright (c) 2003 James Henstridge",
                "Copyright (c) 2003 James Henstridge, Steven Chaplin",
                "Copyright (c) 2004-2006 Steve Chaplin",
                "Copyright (c) 2004-2011 Steven Chaplin",
                "Copyright (c) 2005 Steve Chaplin",
                "Copyright (c) 2005,2010 Steve Chaplin",
                "Copyright (c) 2006 Cairo Lover",
                "Copyright (c) 2017 Christoph Reiter",
                "Copyright 2017 Christoph Reiter",
                "copyrighted by the Free Software Foundation"
            ],
            "file-count": 131,
            "sha256": "251907f18a552df938aa3386657ff4b5a4937dde70e11aa042bc297957f4b74b",
            "source": "https://files.pythonhosted.org/packages/92/a4/506564f574fa74c90b98690e8ecc8dbae1629f31fcfe0be69de45d9e1605/pycairo-1.21.0.tar.gz",
            "status": "restricted"
        }
    ]
}
