{
    "id": "maven/mavencentral/org.geotools/gt-process-feature/22.1",
    "license": "LGPL-2.1-only",
    "authority": "https://gitlab.eclipse.org/eclipsefdn/emo-team/iplab/-/issues/4949",
    "source": "https://repo.osgeo.org/repository/geotools-releases/org/geotools/gt-process-feature/22.1/gt-process-feature-22.1-sources.jar",
    "status": "approved",
    "scans": [
        {
            "date": "November 15, 2022 at 11:22:17 p.m. GMT",
            "authority": "https://gitlab.eclipse.org/eclipsefdn/emo-team/iplab/-/issues/4949",
            "scancode-version": "31.2.1",
            "licenses-discovered": [
                "LGPL-2.1-only"
            ],
            "copyrights": [
                "(c) 2001-2007 TOPP - www.openplans.org",
                "(c) 2007-2011 Refractions Research",
                "(c) 2008, Open Source Geospatial Foundation",
                "(c) 2008-2011 TOPP - www.openplans.org",
                "(c) 2008-2011, Open Source Geospatial Foundation",
                "(c) 2011, Open Source Geospatial Foundation",
                "(c) 2011-2016, Open Source Geospatial Foundation",
                "(c) 2012, Open Source Geospatial Foundation",
                "(c) 2016, Open Source Geospatial Foundation",
                "(c) 2017, Open Source Geospatial Foundation",
                "(c) 2019, Open Source Geospatial Foundation"
            ],
            "file-count": 47,
            "sha256": "dfc05057a5d59e5e23af107dfed0aaba658e91d34e9f3ac151ab08388466a2d6",
            "source": "https://repo.osgeo.org/repository/geotools-releases/org/geotools/gt-process-feature/22.1/gt-process-feature-22.1-sources.jar",
            "status": "restricted"
        },
        {
            "date": "November 16, 2022 at 12:56:36 a.m. GMT",
            "authority": "https://gitlab.eclipse.org/eclipsefdn/emo-team/iplab/-/issues/4949",
            "scancode-version": "31.2.1",
            "licenses-discovered": [
                "LGPL-2.1-only"
            ],
            "copyrights": [
                "(c) 2001-2007 TOPP - www.openplans.org",
                "(c) 2007-2011 Refractions Research",
                "(c) 2008, Open Source Geospatial Foundation",
                "(c) 2008-2011 TOPP - www.openplans.org",
                "(c) 2008-2011, Open Source Geospatial Foundation",
                "(c) 2011, Open Source Geospatial Foundation",
                "(c) 2011-2016, Open Source Geospatial Foundation",
                "(c) 2012, Open Source Geospatial Foundation",
                "(c) 2016, Open Source Geospatial Foundation",
                "(c) 2017, Open Source Geospatial Foundation",
                "(c) 2019, Open Source Geospatial Foundation"
            ],
            "file-count": 47,
            "sha256": "dfc05057a5d59e5e23af107dfed0aaba658e91d34e9f3ac151ab08388466a2d6",
            "source": "https://repo.osgeo.org/repository/geotools-releases/org/geotools/gt-process-feature/22.1/gt-process-feature-22.1-sources.jar",
            "status": "approved"
        }
    ]
}