{
    "id": "p2/orbit/p2.eclipse.plugin/junit-platform-runner/1.10.1",
    "license": "EPL-2.0",
    "authority": "https://gitlab.eclipse.org/eclipsefdn/emo-team/iplab/-/issues/12837",
    "source": "https://download.eclipse.org/tools/orbit/simrel/orbit-aggregation/milestone/S202401021059/plugins/junit-platform-runner.source_1.10.1.jar",
    "status": "approved",
    "scans": [
        {
            "date": "January 19, 2024 at 5:41:14 p.m. GMT",
            "authority": "https://gitlab.eclipse.org/eclipsefdn/emo-team/iplab/-/issues/12837",
            "scancode-version": "31.2.1",
            "licenses-discovered": [
                "EPL-2.0"
            ],
            "copyrights": [
                "Copyright 2015-2021 the original author or authors",
                "Copyright 2015-2023 the original author or authors"
            ],
            "file-count": 8,
            "sha256": "a2a074493aafb392b7808e3cfa77e2049909ad5148020672f2810e76de48d7dd",
            "source": "https://download.eclipse.org/tools/orbit/simrel/orbit-aggregation/milestone/S202401021059/plugins/junit-platform-runner.source_1.10.1.jar",
            "status": "approved"
        }
    ]
}