{
    "id": "npm/npmjs/-/react-hook-form/7.47.0",
    "license": "MIT",
    "authority": "https://gitlab.eclipse.org/eclipsefdn/emo-team/iplab/-/issues/10982",
    "source": "https://github.com/react-hook-form/react-hook-form/archive/refs/tags/v7.47.0.zip",
    "status": "approved",
    "scans": [
        {
            "date": "October 9, 2023 at 2:44:37 p.m. GMT",
            "authority": "https://gitlab.eclipse.org/eclipsefdn/emo-team/iplab/-/issues/10982",
            "scancode-version": "31.2.1",
            "licenses-discovered": [
                "MIT"
            ],
            "copyrights": [
                "Copyright (c) 2019-present Beier(Bill) Luo"
            ],
            "file-count": 445,
            "sha256": "55cdd1965bdab7d0120e01da0612f441e1fa9278f86fb34dfccd2bb07dfc366c",
            "source": "https://github.com/react-hook-form/react-hook-form/archive/refs/tags/v7.47.0.zip",
            "status": "approved"
        }
    ]
}