{
    "id": "maven/mavencentral/io.github.resilience4j/resilience4j-annotations/2.1.0",
    "license": "Apache-2.0",
    "authority": "https://gitlab.eclipse.org/eclipsefdn/emo-team/iplab/-/issues/10171",
    "source": "https://repo.maven.apache.org/maven2/io/github/resilience4j/resilience4j-annotations/2.1.0/resilience4j-annotations-2.1.0-sources.jar",
    "status": "approved",
    "scans": [
        {
            "date": "August 23, 2023 at 8:39:05 a.m. GMT",
            "authority": "https://gitlab.eclipse.org/eclipsefdn/emo-team/iplab/-/issues/10171",
            "scancode-version": "31.2.1",
            "licenses-discovered": [
                "Apache-2.0"
            ],
            "copyrights": [
                "Copyright 2017 Bohdan Storozhuk",
                "Copyright 2017 Robert Winkler",
                "Copyright 2019 Mahmoud Romeh",
                "Copyright 2020 Ingyu Hwang"
            ],
            "file-count": 6,
            "sha256": "8f6b9e3e33c3bd5c9676e45215bf4e64feec88e65b730d4fe6ac451d7cd6bf45",
            "source": "https://repo.maven.apache.org/maven2/io/github/resilience4j/resilience4j-annotations/2.1.0/resilience4j-annotations-2.1.0-sources.jar",
            "status": "approved"
        }
    ]
}