{
    "id": "npm/npmjs/-/ol-mapbox-style/9.7.0",
    "license": "BSD-3-Clause AND BSD-2-Clause AND MIT",
    "authority": "https://gitlab.eclipse.org/eclipsefdn/emo-team/iplab/-/issues/7723",
    "source": "https://github.com/openlayers/ol-mapbox-style/archive/v9.7.0.zip",
    "status": "approved",
    "scans": [
        {
            "date": "March 31, 2023 at 12:53:30 p.m. GMT",
            "authority": "https://gitlab.eclipse.org/eclipsefdn/emo-team/iplab/-/issues/7723",
            "scancode-version": "31.2.1",
            "licenses-discovered": [
                "BSD-2-Clause",
                "BSD-2-Clause AND MIT",
                "BSD-3-Clause",
                "BSD-2-Clause AND BSD-3-Clause AND LicenseRef-scancode-softsurfer AND MIT",
                "ODbL-1.0"
            ],
            "copyrights": [
                "(c) Acme Inc.",
                "(c) Bacme Inc.",
                "(c) Dean McNamee <dean@gmail.com> , 2012",
                "(c) OpenStreetMap contributors",
                "(c) https://www.openstreetmap.org/copyright'>",
                "Copyright (c) 2008 Apple Inc.",
                "Copyright (c) 2012, Vladimir Agafonkin",
                "Copyright 2000 softSurfer, 2012 Dan",
                "Copyright 2016-present ol-mapbox-style contributors"
            ],
            "file-count": 205,
            "sha256": "16b6f9785d450d6256cfff0c2fc59e4b6c80cca99bcf319cf490b4f55612f152",
            "source": "https://github.com/openlayers/ol-mapbox-style/archive/v9.7.0.zip",
            "status": "restricted"
        }
    ]
}
