{
    "id": "maven/mavencentral/com.puppycrawl.tools/checkstyle/10.14.0",
    "license": "LGPL-2.1-or-later AND (Apache-2.0 AND LGPL-2.1-or-later) AND Apache-2.0",
    "authority": "https://gitlab.eclipse.org/eclipsefdn/emo-team/iplab/-/issues/13562",
    "source": "https://repo1.maven.org/maven2/com/puppycrawl/tools/checkstyle/10.14.0/checkstyle-10.14.0-sources.jar",
    "status": "approved",
    "scans": [
        {
            "date": "March 7, 2024 at 7:30:37 a.m. GMT",
            "authority": "https://gitlab.eclipse.org/eclipsefdn/emo-team/iplab/-/issues/13562",
            "scancode-version": "31.2.1",
            "licenses-discovered": [
                "LGPL-2.1-or-later",
                "Apache-2.0 AND LGPL-2.1-or-later",
                "Apache-2.0"
            ],
            "copyrights": [
                "Copyright (c) 2001-2024 the original author or authors",
                "Copyright (c) 2002 Oliver Burn",
                "Copyright 2006 The Apache Software Foundation"
            ],
            "file-count": 852,
            "sha256": "987b92bef6bee2ea97320016f4203072295a419cdaa9224e0f1335b5e1696a2f",
            "source": "https://repo1.maven.org/maven2/com/puppycrawl/tools/checkstyle/10.14.0/checkstyle-10.14.0-sources.jar",
            "status": "approved"
        }
    ]
}