{
    "id": "npm/npmjs/@napi-rs/canvas-linux-x64-musl/0.1.64",
    "license": "MIT AND CC-BY-3.0 AND (BSD-2-Clause AND ISC AND MIT) AND OFL-1.1",
    "authority": "https://gitlab.eclipse.org/eclipsefdn/emo-team/iplab/-/issues/17596",
    "source": "https://github.com/Brooooooklyn/canvas/archive/refs/tags/v0.1.64.zip",
    "status": "approved",
    "scans": [
        {
            "date": "December 2, 2024 at 2:56:41 p.m. GMT",
            "authority": "https://gitlab.eclipse.org/eclipsefdn/emo-team/iplab/-/issues/17596",
            "scancode-version": "31.2.1",
            "licenses-discovered": [
                "MIT",
                "CC-BY-3.0",
                "BSD-2-Clause AND ISC AND MIT",
                "OFL-1.1"
            ],
            "copyrights": [
                "(c) Copyright Beijing HANYI KEYIN Information Technology Co wWRegularHanyi HYXiXingKaiW Regular",
                "(c) Copyright Beijing HANYI KEYIN Information Technology Co. WRegularHanyi HYXiXingKaiW Regular v5.00 W RegularVersion",
                "(c) Copyright Beijing HANYI KEYIN Information Technology Co.HYXiXingKaiWRegularHanyi HYXiXingKaiW Regular v5.00HYXiXingKaiW RegularVersion",
                "Copyright (c) 2020 lynweklm@gmail.com",
                "Copyright 1999-2019 Jagex Ltd",
                "Copyright 2015-2021, Renzhi Li aka. Belleve Invis",
                "Copyright 2017 Adobe Systems Incorporated (http://www.adobe.com/)"
            ],
            "file-count": 271,
            "sha256": "f9acc304dc5d754e04909e758525eda226d1958722caa621e4cf727e0737e7f6",
            "source": "https://github.com/Brooooooklyn/canvas/archive/refs/tags/v0.1.64.zip",
            "status": "approved"
        }
    ]
}