{
    "id": "npm/npmjs/-/redoc/2.1.3",
    "license": "MIT AND (Apache-2.0 AND BSD-2-Clause AND BSD-3-Clause AND MIT) AND Apache-2.0",
    "authority": "https://gitlab.eclipse.org/eclipsefdn/emo-team/iplab/-/issues/12052",
    "source": "https://github.com/Redocly/redoc/archive/refs/tags/v2.1.3.zip",
    "status": "approved",
    "scans": [
        {
            "date": "December 14, 2023 at 9:06:44 a.m. GMT",
            "authority": "https://gitlab.eclipse.org/eclipsefdn/emo-team/iplab/-/issues/12052",
            "scancode-version": "31.2.1",
            "licenses-discovered": [
                "MIT",
                "Apache-2.0 AND BSD-2-Clause AND BSD-3-Clause AND MIT",
                "Apache-2.0"
            ],
            "copyrights": [
                "Copyright (c) 2015-present, Rebilly, Inc."
            ],
            "file-count": 314,
            "sha256": "4c060b258c9533a09ba11c529de1e7173694ec093a620e79bc017cdabc203c98",
            "source": "https://github.com/Redocly/redoc/archive/refs/tags/v2.1.3.zip",
            "status": "approved"
        }
    ]
}