{
    "id": "pypi/pypi/-/numpy/1.26.2",
    "license": "Apache-2.0 AND BSD-2-Clause AND BSD-3-Clause AND CC0-1.0 AND CC-BY-4.0 AND CC-BY-SA-3.0 AND (BSL-1.0 OR Zlib) AND (NCSA OR BSD-3-Clause) AND SunPro AND FSFAP AND MIT AND MIT-Modern-Variant AND LicenseRef-Public-domain AND Vim AND Zlib",
    "authority": "https://gitlab.eclipse.org/eclipsefdn/emo-team/iplab/-/issues/12087",
    "source": "https://files.pythonhosted.org/packages/dd/2b/205ddff2314d4eea852e31d53b8e55eb3f32b292efc3dd86bd827ab9019d/numpy-1.26.2.tar.gz",
    "status": "approved",
    "scans": [
        {
            "date": "December 15, 2023 at 12:04:27 p.m. GMT",
            "authority": "https://gitlab.eclipse.org/eclipsefdn/emo-team/iplab/-/issues/12087",
            "scancode-version": "31.2.1",
            "licenses-discovered": [
                "BSD-3-Clause",
                "Apache-2.0 AND BSD-3-Clause AND MIT AND Zlib",
                "MIT",
                "DOC",
                "CC-BY-SA-3.0",
                "GPL-3.0-only",
                "Apache-2.0 AND MIT",
                "Apache-2.0",
                "CC0-1.0 AND LicenseRef-scancode-free-unknown",
                "LicenseRef-scancode-proprietary-license",
                "CC-BY-4.0",
                "BSD-2-Clause",
                "Zlib",
                "LicenseRef-scancode-generic-exception AND MIT AND Zlib",
                "MIT AND Zlib",
                "LicenseRef-scancode-sunpro",
                "BSD-3-Clause AND LicenseRef-scancode-free-unknown",
                "BSD-3-Clause-Open-MPI",
                "BSD-3-Clause AND NCSA",
                "BSD-3-Clause AND MIT",
                "CC0-1.0",
                "BSD-3-Clause AND BSD-3-Clause-Attribution AND BSD-3-Clause-Open-MPI AND GCC-exception-3.1 AND GPL-3.0-only AND LGPL-2.1-only",
                "LicenseRef-scancode-zsh",
                "Vim",
                "Apache-2.0 AND CC-BY-SA-4.0 AND CC0-1.0",
                "LicenseRef-scancode-free-unknown",
                "Apache-2.0 AND GPL-2.0-only",
                "FSFAP",
                "BSD-3-Clause AND BSL-1.0 AND GPL-1.0-or-later AND MIT",
                "GPL-1.0-or-later",
                "Apache-2.0 AND BSD-3-Clause AND GPL-1.0-or-later AND MIT"
            ],
            "copyrights": [
                "(c) Convert Chebyshev",
                "(c) Jussi Pakkanen",
                "(c) Multiply a Chebyshev",
                "(c) Multiply a Hermite",
                "(c) Multiply a Laguerre",
                "(c) Multiply a Legendre",
                "(c), False, False, False, True",
                "(c), False, False, True, False",
                "(c), True, True, False, False",
                "Copyright (c) 1992-2013 The University of Tennessee and The University of Tennessee Research Foundation",
                "Copyright (c) 1993 by Sun Microsystems, Inc.",
                "Copyright (c) 1995, 1996, 1997 Jim Hugunin, hugunin@mit.edu",
                "Copyright (c) 1997 - 2002, Makoto Matsumoto and Takuji Nishimura",
                "Copyright (c) 2000-2013 The University of California Berkeley",
                "Copyright (c) 2002-2017 Free Software Foundation, Inc.",
                "Copyright (c) 2003-2005, Jean-Sebastien Roy (js@jeannot.org)",
                "Copyright (c) 2004, 2006 The Linux Foundation and its contributors",
                "Copyright (c) 2004-2018 Max-Planck-Society author Martin Reinecke",
                "Copyright (c) 2005-2015, NumPy Developers",
                "Copyright (c) 2005-2017, NumPy Developers",
                "Copyright (c) 2005-2018 NVIDIA Corporation Built",
                "Copyright (c) 2005-2021, NumPy Developers",
                "Copyright (c) 2005-2023, NumPy Developers",
                "Copyright (c) 2006, University of Georgia and Pierre G.F. Gerard-Marchant",
                "Copyright (c) 2006-2013 The University of Colorado Denver",
                "Copyright (c) 2007 Cybozu Labs, Inc.",
                "Copyright (c) 2007 Free Software Foundation, Inc. <http://fsf.org/>",
                "Copyright (c) 2007, 2011 David Schultz <das@FreeBSD.ORG>",
                "Copyright (c) 2008 Ian Bicking and Contributors",
                "Copyright (c) 2009 Free Software Foundation, Inc. <http://fsf.org/>",
                "Copyright (c) 2009-2017 The MathJax Consortium",
                "Copyright (c) 2009-2019 Jeff Bezanson, Stefan Karpinski, Viral B. Shah, and other contributors",
                "Copyright (c) 2010 - 2019",
                "Copyright (c) 2010 The Android Open Source Project",
                "Copyright (c) 2010 by Mark Wiebe (mwwiebe@gmail.com) The University of British Columbia",
                "Copyright (c) 2010-2011 by Mark Wiebe (mwwiebe@gmail.com) The University of British Columbia",
                "Copyright (c) 2010-2017 The MathJax Consortium",
                "Copyright (c) 2010-2019 Free Software Foundation, Inc.",
                "Copyright (c) 2011 Enthought, Inc",
                "Copyright (c) 2011 by Enthought, Inc.",
                "Copyright (c) 2011 by Mark Wiebe (mwwiebe@gmail.com) The University of British Columbia",
                "Copyright (c) 2011-2014, The OpenBLAS Project",
                "Copyright (c) 2011-2015 The MathJax Consortium",
                "Copyright (c) 2011-2017 The MathJax Consortium",
                "Copyright (c) 2012 Google Inc.",
                "Copyright (c) 2012 Stephen Montgomery-Smith <stephen@FreeBSD.ORG>",
                "Copyright (c) 2013 Gabriele Svelto <gabriele.svelto@gmail.com>",
                "Copyright (c) 2013 THE PACKAGE'S",
                "Copyright (c) 2013-2017 The MathJax Consortium",
                "Copyright (c) 2014 Mathjax Consortium",
                "Copyright (c) 2014 Ryan Juckett",
                "Copyright (c) 2014-2017 The MathJax Consortium",
                "Copyright (c) 2015 Melissa E. O'Neill",
                "Copyright (c) 2015 Pauli Virtanen",
                "Copyright (c) 2015-2017 Martin Hensel",
                "Copyright (c) 2015-2017 The MathJax Consortium",
                "Copyright (c) 2015-2021 Matthias Klumpp <matthias@tenstral.net>",
                "Copyright (c) 2016 - 2019 Kim Walisch, <kim.walisch@gmail.com>",
                "Copyright (c) 2016-2017 The MathJax Consortium",
                "Copyright (c) 2017",
                "Copyright (c) 2017 Arseny Maslennikov",
                "Copyright (c) 2017 Dylan Baker",
                "Copyright (c) 2017 Intel Corporation",
                "Copyright (c) 2017-2018 Intel Corporation",
                "Copyright (c) 2018 Intel Corporation",
                "Copyright (c) 2018 Melissa E. O'Neill",
                "Copyright (c) 2018, Meson",
                "Copyright (c) 2019 Kevin Sheppard",
                "Copyright (c) 2019 NumPy Developers",
                "Copyright (c) 2019 Takao Fujiwara <takao.fujiwara1@gmail.com>",
                "Copyright (c) 2020 Intel Corporation",
                "Copyright (c) 2020-2021 Intel Corporation",
                "Copyright (c) 2020-2023 Intel Corporation",
                "Copyright (c) 2021 2022, Scientific Python project",
                "Copyright (c) 2021 Intel Corporation",
                "Copyright (c) 2021 Intel Corporation project 'existing project",
                "Copyright (c) 2021 Microsoft Corporation",
                "Copyright (c) 2021 Quansight Labs and Filipe Lains",
                "Copyright (c) 2021 Serge Sans Paille SPDX-License-Identifier BSD-3-Clause Authors Raghuveer Devulapalli <raghuveer.devulapalli@intel.com> Serge Sans Paille <serge.guelton@telecom-bretagne.eu>",
                "Copyright (c) 2021 Serge Sans Paille SPDX-License-Identifier BSD-3-Clause Authors Raghuveer Devulapalli <raghuveer.devulapalli@intel.com> Serge Sans Paille <serge.guelton@telecom-bretagne.eu> Liu Zhuan <zhuan.liu@intel.com>",
                "Copyright (c) 2021 The Meson Developers",
                "Copyright (c) 2021-2022 Intel Corporation",
                "Copyright (c) 2022 Intel Corporation",
                "Copyright (c) 2022 Intel Corporation SPDX-License-Identifier BSD-3-Clause Authors Liu Zhuan <zhuan.liu@intel.com> Tang Xi <xi.tang@intel.com>",
                "Copyright (c) 2022 Intel Corporation SPDX-License-Identifier BSD-3-Clause Authors Raghuveer Devulapalli <raghuveer.devulapalli@intel.com>",
                "Copyright (c) 2022 the meson-python contributors",
                "Copyright (c) 2022, Intel",
                "Copyright (c) 2022-2023 Intel Corporation",
                "Copyright (c) 2023 Intel Corporation",
                "Copyright (c) 2023, NumPy Developers",
                "Copyright (c) Donald Stufft and individual contributors",
                "Copyright 1996-2023 Intel Corporation",
                "Copyright 1999 - 2011 Pearu Peterson",
                "Copyright 1999 2011 Pearu Peterson",
                "Copyright 1999, 2000, 2001 Regents of the University of California",
                "Copyright 1999,2000 Pearu Peterson",
                "Copyright 1999-2004 Pearu Peterson",
                "Copyright 2000 Pearu Peterson",
                "Copyright 2001-2005 Pearu Peterson",
                "Copyright 2002 Pearu Peterson",
                "Copyright 2007-2018 by the Sphinx team",
                "Copyright 2010-2012, D. E. Shaw Research",
                "Copyright 2011 by Enthought, Inc",
                "Copyright 2012-2016 The Meson development team",
                "Copyright 2012-2017 The Meson development team",
                "Copyright 2012-2019 The Meson development team",
                "Copyright 2012-2020 Meson development team",
                "Copyright 2012-2020 The Meson development team",
                "Copyright 2012-2021 The Meson development team",
                "Copyright 2012-2022 The Meson development team",
                "Copyright 2012-2023 The Meson development team",
                "Copyright 2013 The Meson development team",
                "Copyright 2013-2014 The Meson development team",
                "Copyright 2013-2016 The Meson development team",
                "Copyright 2013-2017 The Meson development team",
                "Copyright 2013-2018 The Meson development team",
                "Copyright 2013-2019 The Meson development team",
                "Copyright 2013-2020 The Meson development team",
                "Copyright 2013-2021 The Meson development team",
                "Copyright 2013-2023 The Meson development team",
                "Copyright 2014 Jussi Pakkanen",
                "Copyright 2014 Melissa O'Neill <oneill@pcg-random.org>",
                "Copyright 2014-2016 The Meson development team",
                "Copyright 2014-2017 The Meson development team",
                "Copyright 2014-2019 The Meson development team",
                "Copyright 2014-2021 The Meson development team",
                "Copyright 2015 Robert Kern <robert.kern@gmail.com>",
                "Copyright 2015 The Meson development team",
                "Copyright 2015-2016 The Meson development team",
                "Copyright 2015-2022 The Meson development team",
                "Copyright 2016 The Meson development team",
                "Copyright 2016-2017 The Meson development team",
                "Copyright 2016-2018 The Meson development team",
                "Copyright 2016-2021 Matthew Brett, Isuru Fernando, Matti Picus",
                "Copyright 2016-2021 The Meson development team",
                "Copyright 2016-2022 The Meson development team",
                "Copyright 2017 Niklas Claesson",
                "Copyright 2017 The Meson development team",
                "Copyright 2017, 2019 The Meson development team",
                "Copyright 2017-2021 The Meson development team",
                "Copyright 2018 The Meson development team",
                "Copyright 2019 Red Hat, Inc.",
                "Copyright 2019 The Meson development team",
                "Copyright 2019 The meson development team",
                "Copyright 2019-2022 The meson development team",
                "Copyright 2020 Intel Corporation",
                "Copyright 2020 The Meson development team",
                "Copyright 2021 Filipe Lains <lains@riseup.net>",
                "Copyright 2021 Quansight, LLC",
                "Copyright 2021 The Meson development team",
                "Copyright 2021 The Meson development team SPDX-license-identifier",
                "Copyright 2021 The Meson development team from",
                "Copyright 2021 The meson-python",
                "Copyright 2022 Intel Corporation",
                "Copyright 2022 Mark Bolhuis <mark@bolhuis.dev>",
                "Copyright 2022 The Meson development team",
                "Copyright 2022 The meson-python",
                "Copyright 2023 Lars Pastewka <lars.pastewka@imtek.uni-freiburg.de>",
                "Copyright 2023 The meson-python",
                "Copyright Absoft Corporation",
                "Copyright Absoft Corporation 1994-1998 mV2 Cray Research, Inc. 1994-1996 CF90",
                "Copyright Absoft Corporation 1994-2002 Absoft Pro FORTRAN",
                "copyright 2008-2022, NumPy Developers",
                "copyright 2017-2018, NumPy Developers",
                "copyright 2021, The meson-python"
            ],
            "file-count": 7287,
            "sha256": "f65738447676ab5777f11e6bbbdb8ce11b785e105f690bc45966574816b6d3ea",
            "source": "https://files.pythonhosted.org/packages/dd/2b/205ddff2314d4eea852e31d53b8e55eb3f32b292efc3dd86bd827ab9019d/numpy-1.26.2.tar.gz",
            "status": "restricted"
        }
    ]
}
