{
    "id": "nuget/nuget/-/Npgsql.EntityFrameworkCore.PostgreSQL/8.0.2",
    "license": "PostgreSQL AND MIT",
    "authority": "https://gitlab.eclipse.org/eclipsefdn/emo-team/iplab/-/issues/13972",
    "source": "https://github.com/npgsql/efcore.pg/archive/refs/tags/v8.0.2.zip",
    "status": "approved",
    "scans": [
        {
            "date": "March 21, 2024 at 5:33:50 p.m. GMT",
            "authority": "https://gitlab.eclipse.org/eclipsefdn/emo-team/iplab/-/issues/13972",
            "scancode-version": "31.2.1",
            "licenses-discovered": [
                "PostgreSQL",
                "MIT"
            ],
            "copyrights": [
                "Copyright (c) 2002-2021, Npgsql",
                "Copyright (c) 2016 JetBrains http://www.jetbrains.com",
                "Copyright 2023 (c) The Npgsql Development Team"
            ],
            "file-count": 574,
            "sha256": "6146547da3e16c0a806098ea19d71866d3611bcdcaa3b55cc5076b701c861b8b",
            "source": "https://github.com/npgsql/efcore.pg/archive/refs/tags/v8.0.2.zip",
            "status": "approved"
        }
    ]
}