{
    "id": "maven/mavencentral/com.google.code.findbugs/annotations/1.3.9",
    "license": "LGPL-2.1-or-later AND CC-BY-2.5",
    "authority": "https://gitlab.eclipse.org/eclipsefdn/emo-team/iplab/-/issues/13475",
    "source": "https://gitlab.eclipse.org/eclipsefdn/emo-team/iplab/uploads/1cd4e652762cc0c9fe535140870d6655/findbugs-1.3.9.zip",
    "status": "approved",
    "scans": [
        {
            "date": "March 13, 2024 at 2:32:48 a.m. GMT",
            "authority": "https://gitlab.eclipse.org/eclipsefdn/emo-team/iplab/-/issues/13475",
            "scancode-version": "31.2.1",
            "licenses-discovered": [
                "LGPL-2.1-or-later",
                "CC-BY-2.5"
            ],
            "copyrights": [
                "Copyright (c) 2003-2007 University of Maryland",
                "Copyright (c) 2005 Brian Goetz",
                "Copyright (c) 2005 University of Maryland",
                "Copyright (c) 2005, University of Maryland",
                "Copyright (c) 2005-2006 University of Maryland",
                "Copyright (c) 2005-2006, University of Maryland",
                "Copyright (c) 2008, University of Maryland"
            ],
            "file-count": 26,
            "sha256": "b29899cdd36ee67dfef96d17de2baeeace2b0c2f1364ffd895b29b091d8aa38b",
            "source": "https://gitlab.eclipse.org/eclipsefdn/emo-team/iplab/uploads/1cd4e652762cc0c9fe535140870d6655/findbugs-1.3.9.zip",
            "status": "approved"
        },
        {
            "date": "June 14, 2024 at 3:04:29 p.m. GMT",
            "authority": "https://gitlab.eclipse.org/eclipsefdn/emo-team/iplab/-/issues/15231",
            "scancode-version": "31.2.1",
            "licenses-discovered": [
                "LGPL-2.0-or-later",
                "LGPL-2.1-or-later",
                "LGPL-2.1-only",
                "EPL-1.0 AND LGPL-2.1-only",
                "EPL-1.0",
                "AML",
                "BSD-3-Clause",
                "Apache-2.0",
                "Plexus",
                "CC-BY-2.5",
                "GPL-2.0-only AND LicenseRef-scancode-oracle-openjdk-exception-2.0",
                "GPL-1.0-or-later",
                "CC-PDDC",
                "LicenseRef-scancode-proprietary-license",
                "Apache-1.1",
                "BSD-3-Clause AND CC-BY-NC-SA-1.0 AND GPL-1.0-or-later AND LGPL-2.0-or-later AND Plexus"
            ],
            "copyrights": [
                "(c) . Calling",
                "(c) 2001-2002. <http://bcel.sourceforge.net> <http://jakarta.apache.org/bcel>",
                "(c) 2006-2007, University of Maryland",
                "(c) 2006-2008, University of Maryland",
                "(c) A Double A Float",
                "(c) A Long A Integer A Short A Character A Byte I",
                "(c) AAvP VIS",
                "(c) AC3uAC/U* BU1/2Joshua Blocha http://googleresearch.blogspot.com/2006/06/extra-extra-read-all-about-it-nearly.html",
                "(c) AOIaIEI (c)",
                "(c) AURLIMapASet (c)",
                "(c) AdIIE (c)",
                "(c) C$? (c) E",
                "(c) Eaed (c)",
                "(c) Eaud (c)",
                "(c) EcIA (c)",
                "(c) OIaIEI (c)",
                "(c) XLbvuE (c)",
                "(c) aueU1nBUxAndu@EC/AIA http://bugs.sun.com/bugdatabase/view_bug.do?bug_id",
                "(c) |AuU$?e-a eU*BtB hdvolatileE*eAA+-Iaedd*eaoU*BUxIA http://www.cs.umd.edu/~pugh/java/memoryModel/",
                "Copyright &copy 2006 University of Maryland",
                "Copyright (c) 1989, 1991 Free Software Foundation, Inc.",
                "Copyright (c) 1991, 1999 Free Software Foundation, Inc.",
                "Copyright (c) 2000, 2007 IBM Corporation and others",
                "Copyright (c) 2000,2003,2004 University of Maryland",
                "Copyright (c) 2000,2003,2004,2007 University of Maryland",
                "Copyright (c) 2000,2003-2005 University of Maryland",
                "Copyright (c) 2000-2002 The Apache Software Foundation",
                "Copyright (c) 2000-2005 INRIA, France Telecom",
                "Copyright (c) 2000-2006, www.hamcrest.org",
                "Copyright (c) 2001 Clarkware Consulting, Inc.",
                "Copyright (c) 2003 - 2004, Peter Friese",
                "Copyright (c) 2003 - 2004, Peter Friese, 2008 Andrei Loskutov",
                "Copyright (c) 2003 William Pugh <pugh@cs.umd.edu> http://www.cs.umd.edu/~pugh",
                "Copyright (c) 2003, Institut for Software An Institut of the University of Applied Sciences Rapperswil",
                "Copyright (c) 2003, Mike Fagan <mfagan@tde.com>",
                "Copyright (c) 2003,2004 University of Maryland",
                "Copyright (c) 2003-2005 University of Maryland",
                "Copyright (c) 2003-2005 William Pugh",
                "Copyright (c) 2003-2005, Mike Fagan <mfagan@tde.com>",
                "Copyright (c) 2003-2005, University of Maryland",
                "Copyright (c) 2003-2006 Apple Computer, Inc.",
                "Copyright (c) 2003-2006 University of Maryland",
                "Copyright (c) 2003-2006 University of Maryland and others",
                "Copyright (c) 2003-2006, University of Maryland",
                "Copyright (c) 2003-2007 University of Maryland",
                "Copyright (c) 2003-2007 University of Maryland and others",
                "Copyright (c) 2003-2007, University of Maryland",
                "Copyright (c) 2003-2008 University of Maryland",
                "Copyright (c) 2003-2008 University of Maryland and others",
                "Copyright (c) 2003-2008, University of Maryland",
                "Copyright (c) 2004 Apple Computer, Inc.",
                "Copyright (c) 2004 Brian Goetz <briangoetz@users.sourceforge.net>",
                "Copyright (c) 2004 Dave Brosius <dbrosius@users.sourceforge.net>",
                "Copyright (c) 2004 University of Maryland",
                "Copyright (c) 2004, Garvin LeClaire <garvin.leclaire@insightbb.com>",
                "Copyright (c) 2004, University of Maryland",
                "Copyright (c) 2004,2005 Dave Brosius",
                "Copyright (c) 2004,2005 Dave Brosius <dbrosius@qis.net>",
                "Copyright (c) 2004,2005 Dave Brosius <dbrosius@users.sourceforge.net>",
                "Copyright (c) 2004,2005 Rohan Lloyd <findbugs@rohanl.com>",
                "Copyright (c) 2004,2005 University of Maryland",
                "Copyright (c) 2004,2008 University of Maryland",
                "Copyright (c) 2004-2005 Dave Brosius <dbrosius@users.sourceforge.net>",
                "Copyright (c) 2004-2005 University of Maryland",
                "Copyright (c) 2004-2005, University of Maryland",
                "Copyright (c) 2004-2006 University of Maryland",
                "Copyright (c) 2004-2006, University of Maryland",
                "Copyright (c) 2004-2007 University of Maryland",
                "Copyright (c) 2004-2008 University of Maryland",
                "Copyright (c) 2005 Brian Goetz",
                "Copyright (c) 2005 Dave Brosius",
                "Copyright (c) 2005 Dave Brosius <dbrosius@users.sourceforge.net>",
                "Copyright (c) 2005 Jay Dunning",
                "Copyright (c) 2005 University of Maryland",
                "Copyright (c) 2005 William Pugh",
                "Copyright (c) 2005, 2006 Etienne Giraudy, InStranet Inc",
                "Copyright (c) 2005, 2007 Etienne Giraudy",
                "Copyright (c) 2005, Chris Nappin",
                "Copyright (c) 2005, University of Maryland",
                "Copyright (c) 2005,2007 University of Maryland",
                "Copyright (c) 2005,2008 University of Maryland",
                "Copyright (c) 2005-2006 University of Maryland",
                "Copyright (c) 2005-2006, University of Maryland",
                "Copyright (c) 2005-2007 University of Maryland",
                "Copyright (c) 2005-2008 University of Maryland",
                "Copyright (c) 2006 University of Maryland",
                "Copyright (c) 2006, David Hovemeyer <daveho@users.sourceforge.net>",
                "Copyright (c) 2006, Institut for Software An Institut of the University of Applied Sciences Rapperswil",
                "Copyright (c) 2006, University of Maryland",
                "Copyright (c) 2006,2008 University of Maryland",
                "Copyright (c) 2006-2007 University of Maryland",
                "Copyright (c) 2006-2008 University of Maryland",
                "Copyright (c) 2007, Andrei Loskutov",
                "Copyright (c) 2007, Institut for Software An Institut of the University of Applied Sciences Rapperswil",
                "Copyright (c) 2007, University of Maryland",
                "Copyright (c) 2008 David H. Hovemeyer <david.hovemeyer@gmail.com>",
                "Copyright (c) 2008 Google",
                "Copyright (c) 2008 University of Maryland",
                "Copyright (c) 2008 peterfranza.com",
                "Copyright (c) 2008, Alessandro Nistico",
                "Copyright (c) 2008, Andrei Loskutov",
                "Copyright (c) 2008, Tomas Pollak, Andrei Loskutov",
                "Copyright (c) 2008, University of Maryland",
                "Copyright (c) 2009, Andrei Loskutov",
                "Copyright (c) 2009, Tom u00e1s Pollak",
                "Copyright (c) 2009, Tomas Pollak",
                "Copyright (c) 2009, University of Maryland",
                "Copyright 1992-2002 HaL Computer Systems, Inc., O'Reilly & Associates, Inc., ArborText, Inc., Fujitsu Software Corporation, Norman Walsh, Sun Microsystems, Inc.",
                "Copyright 2000-2004 The Apache Software Foundation",
                "Copyright 2001 (c) MetaStuff, Ltd.",
                "Copyright 2001-2005 (c) MetaStuff, Ltd.",
                "Copyright 2003 - 2007 by the University of Maryland",
                "Copyright 2003-2006 The Werken Company",
                "Copyright 2003-2007 Sun Microsystems, Inc.",
                "Copyright 2003-2008 MySQL AB, 2008 Sun Microsystems",
                "Copyright 2003-2008 by the University of Maryland",
                "EnullA eAa$?euI3/4c (c) EnullAI",
                "copyright (c) 2005 Brian Goetz",
                "copyrighted by the Free Software Foundation"
            ],
            "file-count": 5725,
            "sha256": "51c5161c71524bb0c61e9e7e586604627130f3c890b5f1a23543ef53da22ad9e",
            "source": "https://github.com/findbugsproject/findbugs/archive/refs/tags/1.3.9.zip",
            "status": "restricted"
        }
    ]
}