{
    "id": "maven/mavencentral/org.graalvm.regex/regex/21.3.5",
    "license": "UPL-1.0 AND Unicode-TOU",
    "authority": "https://gitlab.eclipse.org/eclipsefdn/emo-team/iplab/-/issues/6719",
    "source": "https://search.maven.org/remotecontent?filepath=org/graalvm/regex/regex/21.3.5/regex-21.3.5-sources.jar",
    "status": "approved",
    "scans": [
        {
            "date": "January 27, 2023 at 9:17:39 a.m. GMT",
            "authority": "https://gitlab.eclipse.org/eclipsefdn/emo-team/iplab/-/issues/6719",
            "scancode-version": "31.2.1",
            "licenses-discovered": [
                "UPL-1.0",
                "LicenseRef-scancode-unicode AND UPL-1.0"
            ],
            "copyrights": [
                "Copyright (c) 2018 Unicode, Inc.",
                "Copyright (c) 2018, 2019, Oracle and/or its affiliates",
                "Copyright (c) 2018, 2020, Oracle and/or its affiliates",
                "Copyright (c) 2018, 2021, Oracle and/or its affiliates",
                "Copyright (c) 2019, 2019, Oracle and/or its affiliates",
                "Copyright (c) 2019, 2020, Oracle and/or its affiliates",
                "Copyright (c) 2020, 2020, Oracle and/or its affiliates",
                "Copyright (c) 2020, 2021, Oracle and/or its affiliates",
                "Copyright (c) 2020, Oracle and/or its affiliates",
                "Copyright (c) 2021, 2021, Oracle and/or its affiliates"
            ],
            "file-count": 287,
            "sha256": "d370653a778393007a6333ee4eaba3330bd5f147a495d96fb2f8cc053899f73c",
            "source": "https://search.maven.org/remotecontent?filepath=org/graalvm/regex/regex/21.3.5/regex-21.3.5-sources.jar",
            "status": "restricted"
        }
    ]
}
