{
    "id": "maven/mavencentral/io.swagger.core.v3/swagger-annotations-jakarta/2.2.7",
    "license": "Apache-2.0",
    "authority": "https://gitlab.eclipse.org/eclipsefdn/emo-team/iplab/-/issues/5947",
    "source": "https://search.maven.org/remotecontent?filepath=io/swagger/core/v3/swagger-annotations-jakarta/2.2.7/swagger-annotations-jakarta-2.2.7-sources.jar",
    "status": "approved",
    "scans": [
        {
            "date": "December 21, 2022 at 2:14:35 p.m. GMT",
            "authority": "https://gitlab.eclipse.org/eclipsefdn/emo-team/iplab/-/issues/5947",
            "scancode-version": "31.2.1",
            "licenses-discovered": [
                "Apache-2.0"
            ],
            "copyrights": [
                "Copyright (c) 2015. SmartBear Software Inc."
            ],
            "file-count": 5,
            "sha256": "540628164e322cff4692216cc76e31ceefa76ceace47ff45404bca6147cfce29",
            "source": "https://search.maven.org/remotecontent?filepath=io/swagger/core/v3/swagger-annotations-jakarta/2.2.7/swagger-annotations-jakarta-2.2.7-sources.jar",
            "status": "approved"
        }
    ]
}