{
    "id": "project/technology.xfsc/eclipse-xfsc-por/claim-mapping-library/7aa6ac589a571203463acb8c227b7226107a1a3b",
    "license": "Apache-2.0",
    "authority": "https://gitlab.eclipse.org/eclipsefdn/emo-team/iplab/-/issues/9576",
    "source": "https://gitlab.eclipse.org/api/v4/projects/eclipse%2Fxfsc%2Fpor%2Fclaim-mapping-library/repository/archive.zip?sha=7aa6ac589a571203463acb8c227b7226107a1a3b",
    "status": "approved",
    "scans": [
        {
            "date": "July 18, 2023 at 4:19:46 a.m. GMT",
            "authority": "https://gitlab.eclipse.org/eclipsefdn/emo-team/iplab/-/issues/9576",
            "scancode-version": "31.2.1",
            "licenses-discovered": [
            ],
            "copyrights": [
            ],
            "file-count": 1,
            "sha256": "be835c34d8de774cef04f4de82529d37f73b4ba6f04ac638c91e4cc4d32bc9b4",
            "source": "https://gitlab.eclipse.org/api/v4/projects/eclipse%2Fxfsc%2Fpor%2Fclaim-mapping-library/repository/archive.zip?sha=7aa6ac589a571203463acb8c227b7226107a1a3b",
            "status": "restricted"
        }
    ]
}
