{
    "id": "maven/mavencentral/com.sun.woodstock.dependlibs/prototype/1.7.3",
    "license": "MIT",
    "licenses-discovered": [
        "MIT"
    ],
    "copyrights": [
        "(c) Sam Stephenson",
        "Copyright jQuery Foundation, Inc. and other contributors"
    ],
    "file-count": 2,
    "scancode-version": "30.1.0",
    "authority": "https://gitlab.eclipse.org/eclipsefdn/emo-team/iplab/-/issues/2740",
    "source": "https://repo1.maven.org/maven2/com/sun/woodstock/dependlibs/prototype/1.7.3/prototype-1.7.3.jar",
    "status": "approved"
}