{
    "id": "project/dt.aasportal/eclipse-aasportal/AASPortal/bbb1eb93c74e59825a27f6bfdc23161618dcc911",
    "license": "Apache-2.0 AND (CC-BY-SA-3.0 OR LGPL-2.1-only) AND ISC AND MIT AND CC-BY-ND-4.0",
    "authority": "https://gitlab.eclipse.org/eclipsefdn/emo-team/iplab/-/issues/19247",
    "source": "https://github.com/eclipse-aasportal/AASPortal/archive/bbb1eb93c74e59825a27f6bfdc23161618dcc911.zip",
    "status": "approved",
    "scans": [
        {
            "date": "January 31, 2025 at 5:32:48 p.m. GMT",
            "authority": "https://gitlab.eclipse.org/eclipsefdn/emo-team/iplab/-/issues/19247",
            "scancode-version": "31.2.1",
            "licenses-discovered": [
                "Apache-2.0",
                "MIT",
                "0BSD AND Apache-2.0 AND BSD-2-Clause AND BSD-3-Clause AND CC0-1.0 AND GPL-1.0-or-later AND GPL-3.0-only AND ISC AND LicenseRef-scancode-mit-taylor-variant AND LicenseRef-scancode-other-permissive AND LicenseRef-scancode-unknown AND MIT AND MIT-0 AND NGPL",
                "LicenseRef-scancode-proprietary-license",
                "CC-BY-ND-4.0",
                "Apache-2.0 AND MIT",
                "ISC"
            ],
            "copyrights": [
                "(c) 2019 Schneider Electric",
                "(c) 2019 UL LLC",
                "(c) 2020",
                "(c) 2020 alle",
                "(c) 2024 Fraunhofer IOSB-INA",
                "(c) 3S-Smart Software Solutions GmbH",
                "(c) ABB 2019 3KXT221001R4201",
                "(c) ABB 2019 3KXT221001R4203",
                "(c) Alle rechten bij Bosch Rexroth AG",
                "(c) Bosch Rexroth AG",
                "(c) Bosch Rexroth AG, 2017 Weitergabe sowie Vervielfaltigung",
                "(c) Gui Ding De Qing Ji Du Deng Ji",
                "(c) Siemens AG 2015 - 2018",
                "(c) by Bosch Rexroth AG",
                "Copyright (c) 2007 Free Software Foundation, Inc. <http://fsf.org/>",
                "Copyright (c) 2008-2019 Pivotal Labs",
                "Copyright (c) 2008-2023 The Jasmine developers",
                "Copyright (c) 2009-2014 TJ Holowaychuk <tj@vision-media.ca>",
                "Copyright (c) 2009-2015, Kevin Decker <kpdecker@gmail.com>",
                "Copyright (c) 2009-2016 Stuart Knightley, David Duponchel, Franz Buchinger, Antonio Afonso",
                "Copyright (c) 2010-2013 LearnBoost <dev@learnboost.com>",
                "Copyright (c) 2010-2024 Google LLC. https://angular.io/license",
                "Copyright (c) 2011-2013 Google, Inc.",
                "Copyright (c) 2011-2013 Vojta Jina and contributors",
                "Copyright (c) 2011-2015 by Vitaly Puzrin",
                "Copyright (c) 2011-2021 Google, Inc.",
                "Copyright (c) 2011-2023 Andris Reinman",
                "Copyright (c) 2011-2023 Isaac Z. Schlueter and Contributors",
                "Copyright (c) 2011-2024 The Bootstrap Authors",
                "Copyright (c) 2012 EditorConfig Team",
                "Copyright (c) 2012 Felix Geisendorfer (felix@debuggable.com) and contributors",
                "Copyright (c) 2012 Nevins Bartolomeo <nevins.bartolomeo@gmail.com>",
                "Copyright (c) 2012 Shane Girish <shaneGirish@gmail.com>",
                "Copyright (c) 2012 Yves-Marie K. Rinquin",
                "Copyright (c) 2012-2014 Raynos",
                "Copyright (c) 2012-2014 by Woong Jun and Tim Oxley",
                "Copyright (c) 2012-2014 by various contributors",
                "Copyright (c) 2012-2017 by Ingvar Stepanyan",
                "Copyright (c) 2012-2018 Aseem Kishore, and others",
                "Copyright (c) 2012-2022 by various contributors",
                "Copyright (c) 2013 Andrey Sitnik <andrey@sitnik.ru>",
                "Copyright (c) 2013 Dominic Tarr",
                "Copyright (c) 2013 James Halliday",
                "Copyright (c) 2013 Kael Zhang <i@kael.me> , contributors http://kael.me",
                "Copyright (c) 2013 Liucw",
                "Copyright (c) 2013 Mikola Lysenko",
                "Copyright (c) 2013 Troy Goode <troygoode@gmail.com>",
                "Copyright (c) 2013-2014 Roman Shtylman <shtylman+expressjs@gmail.com>",
                "Copyright (c) 2013-2021 Automattic",
                "Copyright (c) 2014 Alex Bell",
                "Copyright (c) 2014 Blake Embrey (hello@blakeembrey.com)",
                "Copyright (c) 2014 Daniel Wirtz <dcode@dcode.io>",
                "Copyright (c) 2014 Hage Yaapa < http://www.hacksparrow.com (http://www.hacksparrow.com)>",
                "Copyright (c) 2014 Jonathan Ong <me@jongleberry.com>",
                "Copyright (c) 2014 Stefan Thomas",
                "Copyright (c) 2014 TJ Holowaychuk <tj@vision-media.ca>",
                "Copyright (c) 2014 Yehuda Katz and contributors",
                "Copyright (c) 2014, 2015, 2016, 2017, 2018 Simon Lydell",
                "Copyright (c) 2014-2015 Douglas Christopher Wilson <doug@somethingdoug.com>",
                "Copyright (c) 2014-2016, Jon Schlinkert",
                "Copyright (c) 2014-2017 Douglas Christopher Wilson <doug@somethingdoug.com>",
                "Copyright (c) 2014-2017, Jon Schlinkert",
                "Copyright (c) 2014-2019 Pivotal Labs",
                "Copyright (c) 2014-2020 Teambition",
                "Copyright (c) 2014-2022 Etienne Rossignon",
                "Copyright (c) 2014-2023 The Jasmine developers",
                "Copyright (c) 2014-2024 Chart.js Contributors",
                "Copyright (c) 2014-present Sebastian McKenzie and other contributors",
                "Copyright (c) 2014-present, Jon Schlinkert",
                "Copyright (c) 2015 Auth0, Inc. <support@auth0.com> (http://auth0.com)",
                "Copyright (c) 2015 Brian Donovan",
                "Copyright (c) 2015 Matteo Collina",
                "Copyright (c) 2015 Tilde, Inc.",
                "Copyright (c) 2015 Titus Wormer",
                "Copyright (c) 2015 Titus Wormer <tituswormer@gmail.com>",
                "Copyright (c) 2015, 2019 Elan Shanker",
                "Copyright (c) 2015-2018 Angular ng-bootstrap team",
                "Copyright (c) 2015-2018 Google, Inc., Netflix, Inc., Microsoft Corp. and contributors",
                "Copyright (c) 2015-2020, Matteo Collina <matteo.collina@gmail.com>",
                "Copyright (c) 2015-present, Jon Schlinkert",
                "Copyright (c) 2016 Andrey Sidorov (sidorares@yandex.ru) and contributors",
                "Copyright (c) 2016 Denys Kniazevych <webschik@gmail.com>",
                "Copyright (c) 2016 Joshua Holbrook",
                "Copyright (c) 2016 Luke Autry",
                "Copyright (c) 2016 Pat Sissons <patricksissons@gmail.com>",
                "Copyright (c) 2016 Sven Reglitzki",
                "Copyright (c) 2016 Thomas Watson Steen",
                "Copyright (c) 2016 Titus Wormer <tituswormer@gmail.com>",
                "Copyright (c) 2016, Mark Wubben",
                "Copyright (c) 2016, Rebecca Turner <me@re-becca.org>",
                "Copyright (c) 2016-2018 Permission",
                "Copyright (c) 2017 Andres Suarez and Teddy Katz",
                "Copyright (c) 2017 Andrew Powell <andrew@shellscape.org>",
                "Copyright (c) 2017 Contributors",
                "Copyright (c) 2017 Evgeny Poberezkin",
                "Copyright (c) 2017 Google, Inc.",
                "Copyright (c) 2017 Martin Munoz and contributors",
                "Copyright (c) 2017 Permission",
                "Copyright (c) 2017 Pierre-Denis Vanduynslager",
                "Copyright (c) 2017 Titus Wormer <tituswormer@gmail.com>",
                "Copyright (c) 2017, 2018, 2019, 2020, 2021, 2022, 2023 Simon Lydell and contributors",
                "Copyright (c) 2017-2020 Alan Agius",
                "Copyright (c) 2017-present, Jon Schlinkert",
                "Copyright (c) 2018 Oliver Moran",
                "Copyright (c) 2018 Olivier Combe",
                "Copyright (c) 2018 Scott IT London",
                "Copyright (c) 2018-2020, Andrea Giammarchi",
                "Copyright (c) 2019",
                "Copyright (c) 2019 Federico Zivolo",
                "Copyright (c) 2019 and later, KFlash and others",
                "Copyright (c) 2019 typescript-eslint and other contributors",
                "Copyright (c) 2019-2023 Fraunhofer IOSB-INA",
                "Copyright (c) 2019-2023 Fraunhofer IOSB-INA Lemgo",
                "Copyright (c) 2019-2024 Fraunhofer IOSB-INA",
                "Copyright (c) 2019-2024 Fraunhofer IOSB-INA Lemgo",
                "Copyright (c) 2019-2024 The Bootstrap Authors",
                "Copyright (c) 2020 Evan Wallace",
                "Copyright (c) 2020 James Henry",
                "Copyright (c) 2020 Titus Wormer <tituswormer@gmail.com>",
                "Copyright (c) 2021 Alexey Raspopov, Kostiantyn Denysov, Anton Verinov",
                "Copyright (c) 2021 Titus Wormer",
                "Copyright (c) 2021 typicode Permission",
                "Copyright (c) 2022-2024 Sterfive SAS",
                "Copyright (c) 2023 Olivier Combe",
                "Copyright (c) 2023, Fraunhofer IOSB-INA Lemgo",
                "Copyright (c) Andrew Powell <andrew@shellscape.org>",
                "Copyright (c) Ben Briggs <beneb.info@gmail.com> (http://beneb.info)",
                "Copyright (c) Bosch Rexroth AG, 2017",
                "Copyright (c) Denis Malinochkin",
                "Copyright (c) Feross Aboukhadijeh",
                "Copyright (c) GraphQL Contributors",
                "Copyright (c) Ika <ikatyang@gmail.com> (https://github.com/ikatyang)",
                "Copyright (c) Isaac Z. Schlueter",
                "Copyright (c) Isaac Z. Schlueter and Contributors",
                "Copyright (c) James Long and contributors",
                "Copyright (c) James Talmage <james@talmage.io> (https://github.com/jamestalmage)",
                "Copyright (c) Meta Platforms, Inc. and affiliates",
                "Copyright (c) Microsoft Corporation",
                "Copyright (c) Open JS Foundation",
                "Copyright (c) Petka Antonov Benjamin Gruenbaum",
                "Copyright (c) Roy Riojas & Jared Wray",
                "Copyright (c) Roy Riojas and Jared Wray",
                "Copyright (c) Siemens AG 2011 - 2018",
                "Copyright (c) Sindre Sorhus <sindresorhus@gmail.com> (https://sindresorhus.com)",
                "Copyright (c) Sindre Sorhus <sindresorhus@gmail.com> (sindresorhus.com)",
                "Copyright 2012 - 2017 jindw <jindw@xidea.org> and other contributors",
                "Copyright 2013 Andrey Sitnik <andrey@sitnik.ru>",
                "Copyright 2015, Balluff GmbH",
                "Copyright 2017 Andrey Sitnik <andrey@sitnik.ru>",
                "Copyright 2018 Eemeli Aro <eemeli@gmail.com>",
                "Copyright 2019 - present Christopher J. Brody and other contributors",
                "Copyright 2019 by WITTENSTEIN SE",
                "Copyright JS Foundation and other contributors, https://js.foundation",
                "Copyright Joyent, Inc. and other Node contributors",
                "Copyright Mathias Bynens <https://mathiasbynens.be/>",
                "Copyright Node.js contributors",
                "Copyright OpenJS Foundation and other contributors <https://openjsf.org/>",
                "Copyright OpenJS Foundation and other contributors, <www.openjsf.org>",
                "Copyright Pepperl+Fuchs www.pepperl-fuchs.com",
                "copyright 2023, Fraunhofer IOSB-INA Lemgo",
                "copyright Jeremy Ashkenas, DocumentCloud and Investigative Reporters & Editors <http://underscorejs.org/>",
                "copyright law"
            ],
            "file-count": 1786,
            "sha256": "9e9c61726e3dfcb5d73add05ab8ea74e4f3ecd66549e62d1c738558064b0d809",
            "source": "https://github.com/eclipse-aasportal/AASPortal/archive/bbb1eb93c74e59825a27f6bfdc23161618dcc911.zip",
            "status": "restricted"
        }
    ]
}