{
    "id": "maven/mavencentral/com.github.pureconfig/pureconfig-core_2.12/0.17.2",
    "license": "MPL-2.0",
    "authority": "https://gitlab.eclipse.org/eclipsefdn/emo-team/iplab/-/issues/6507",
    "source": "https://search.maven.org/remotecontent?filepath=com/github/pureconfig/pureconfig-core_2.12/0.17.2/pureconfig-core_2.12-0.17.2-sources.jar",
    "status": "approved",
    "scans": [
        {
            "date": "January 24, 2023 at 12:57:18 a.m. GMT",
            "authority": "https://gitlab.eclipse.org/eclipsefdn/emo-team/iplab/-/issues/6507",
            "scancode-version": "31.2.1",
            "licenses-discovered": [
                "MPL-2.0"
            ],
            "copyrights": [
            ],
            "file-count": 34,
            "sha256": "e080880fddaa3cd62ab64a709ed6f5d0fe0330a8edbbf0aaad73d7aa655165bd",
            "source": "https://search.maven.org/remotecontent?filepath=com/github/pureconfig/pureconfig-core_2.12/0.17.2/pureconfig-core_2.12-0.17.2-sources.jar",
            "status": "approved"
        }
    ]
}