{
    "id": "npm/npmjs/@jridgewell/trace-mapping/0.3.19",
    "license": "MIT",
    "authority": "https://gitlab.eclipse.org/eclipsefdn/emo-team/iplab/-/issues/9904",
    "source": "https://github.com/jridgewell/trace-mapping/archive/refs/tags/v0.3.19.zip",
    "status": "approved",
    "scans": [
        {
            "date": "August 11, 2023 at 5:35:57 a.m. GMT",
            "authority": "https://gitlab.eclipse.org/eclipsefdn/emo-team/iplab/-/issues/9904",
            "scancode-version": "31.2.1",
            "licenses-discovered": [
                "MIT"
            ],
            "copyrights": [
                "Copyright 2022 Justin Ridgewell <justin@ridgewell.name>"
            ],
            "file-count": 32,
            "sha256": "a02332197fe98faebfd2a934b264a09dbb4057fe374555b478091c7bafefdefb",
            "source": "https://github.com/jridgewell/trace-mapping/archive/refs/tags/v0.3.19.zip",
            "status": "approved"
        }
    ]
}