{
    "id": "maven/mavencentral/org.apache.curator/curator-recipes/5.5.0",
    "license": "Apache-2.0",
    "authority": "https://gitlab.eclipse.org/eclipsefdn/emo-team/iplab/-/issues/10608",
    "source": "https://repo.maven.apache.org/maven2/org/apache/curator/curator-recipes/5.5.0/curator-recipes-5.5.0-sources.jar",
    "status": "approved",
    "scans": [
        {
            "date": "September 22, 2023 at 9:27:48 a.m. GMT",
            "authority": "https://gitlab.eclipse.org/eclipsefdn/emo-team/iplab/-/issues/10608",
            "scancode-version": "31.2.1",
            "licenses-discovered": [
                "Apache-2.0"
            ],
            "copyrights": [
            ],
            "file-count": 109,
            "sha256": "2c6b243b7ab9dcfd47a305d1d1ed1c03cf927a60914d45601a63a24748ef9912",
            "source": "https://repo.maven.apache.org/maven2/org/apache/curator/curator-recipes/5.5.0/curator-recipes-5.5.0-sources.jar",
            "status": "approved"
        }
    ]
}