{
    "id": "crate/cratesio/-/base64/0.13.1",
    "license": "Apache-2.0 AND MIT AND Apache-2.0 AND MIT",
    "authority": "https://gitlab.eclipse.org/eclipsefdn/emo-team/iplab/-/issues/6655",
    "source": "https://crates.io/api/v1/crates/base64/0.13.1/download",
    "status": "approved",
    "scans": [
        {
            "date": "January 25, 2023 at 8:29:38 p.m. GMT",
            "authority": "https://gitlab.eclipse.org/eclipsefdn/emo-team/iplab/-/issues/6655",
            "scancode-version": "31.2.1",
            "licenses-discovered": [
                "Apache-2.0 AND MIT",
                "Apache-2.0",
                "MIT"
            ],
            "copyrights": [
                "Copyright (c) 2015 Alice Maz"
            ],
            "file-count": 31,
            "sha256": "9e1b586273c5702936fe7b7d6896644d8be71e6314cfe09d3167c95f712589e8",
            "source": "https://crates.io/api/v1/crates/base64/0.13.1/download",
            "status": "approved"
        }
    ]
}