{
    "id": "p2/orbit/p2.eclipse.plugin/org.eclipse.pde.api.tools.annotations/1.1.400.v20190929-1236",
    "license": "EPL-1.0 AND EPL-2.0 AND EPL-2.0",
    "licenses-discovered": [
        "EPL-1.0 AND EPL-2.0",
        "EPL-2.0"
    ],
    "copyrights": [
        "(c) 2008 VeriSign, Inc.",
        "Copyright (c) 2013 IBM Corporation and others"
    ],
    "file-count": 11,
    "scancode-version": "31.2.1",
    "authority": "https://gitlab.eclipse.org/eclipsefdn/emo-team/iplab/-/issues/4072",
    "source": "https://search.maven.org/remotecontent?filepath=org/eclipse/pde/org.eclipse.pde.api.tools.annotations/1.1.400/org.eclipse.pde.api.tools.annotations-1.1.400-sources.jar",
    "status": "approved"
}