{
    "id": "maven/mavencentral/org.flywaydb/flyway-core/9.20.0",
    "license": "Apache-2.0",
    "authority": "https://gitlab.eclipse.org/eclipsefdn/emo-team/iplab/-/issues/9244",
    "source": "https://repo.maven.apache.org/maven2/org/flywaydb/flyway-core/9.20.0/flyway-core-9.20.0-sources.jar",
    "status": "approved",
    "scans": [
        {
            "date": "July 4, 2023 at 9:25:02 a.m. GMT",
            "authority": "https://gitlab.eclipse.org/eclipsefdn/emo-team/iplab/-/issues/9244",
            "scancode-version": "31.2.1",
            "licenses-discovered": [
                "Apache-2.0"
            ],
            "copyrights": [
                "Copyright (c) Red Gate Software Ltd 2010-2023"
            ],
            "file-count": 474,
            "sha256": "541dd652d376a8cff3eca1f849c65e9d4be9fa15db1b81066cda8f71022f50d1",
            "source": "https://repo.maven.apache.org/maven2/org/flywaydb/flyway-core/9.20.0/flyway-core-9.20.0-sources.jar",
            "status": "approved"
        }
    ]
}