{
    "id": "nuget/nuget/-/Swashbuckle.AspNetCore/6.6.2",
    "license": "MIT AND Apache-2.0",
    "authority": "https://gitlab.eclipse.org/eclipsefdn/emo-team/iplab/-/issues/15646",
    "source": "https://github.com/domaindrivendev/Swashbuckle.AspNetCore/archive/refs/tags/v6.6.2.zip",
    "status": "approved",
    "scans": [
        {
            "date": "July 9, 2024 at 9:55:39 p.m. GMT",
            "authority": "https://gitlab.eclipse.org/eclipsefdn/emo-team/iplab/-/issues/15646",
            "scancode-version": "31.2.1",
            "licenses-discovered": [
                "MIT",
                "Apache-2.0"
            ],
            "copyrights": [
                "Copyright (c) 2016 Richard Morris",
                "Copyright (c) 2016-$( System.DateTime ::Now.ToString(yyyy)) Richard Morris"
            ],
            "file-count": 447,
            "sha256": "29a5f4e23db97f18459732f7af40d3dbee085e42c8a3bfe957ae9e73bec1412a",
            "source": "https://github.com/domaindrivendev/Swashbuckle.AspNetCore/archive/refs/tags/v6.6.2.zip",
            "status": "approved"
        }
    ]
}