{
    "id": "pypi/pypi/-/urllib3/2.0.6",
    "license": "MIT AND Python-2.0",
    "authority": "https://gitlab.eclipse.org/eclipsefdn/emo-team/iplab/-/issues/19827",
    "source": "https://files.pythonhosted.org/packages/8b/00/db794bb94bf09cadb4ecd031c4295dd4e3536db4da958e20331d95f1edb7/urllib3-2.0.6.tar.gz",
    "status": "restricted",
    "scans": [
        {
            "date": "March 1, 2025 at 7:31:41 a.m. GMT",
            "authority": "https://gitlab.eclipse.org/eclipsefdn/emo-team/iplab/-/issues/19827",
            "scancode-version": "31.2.1",
            "licenses-discovered": [
                "MIT",
                "Python-2.0"
            ],
            "copyrights": [
                "Copyright (c) 2008-2020 Andrey Petrov and contributors",
                "Copyright (c) 2012 Senko Rasic <senko.rasic@dobarkod.hr>",
                "Copyright (c) 2015-2016 Will Bond <will@wbond.net>"
            ],
            "file-count": 118,
            "sha256": "b19e1a85d206b56d7df1d5e683df4a7725252a964e3993648dd0fb5a1c157564",
            "source": "https://files.pythonhosted.org/packages/8b/00/db794bb94bf09cadb4ecd031c4295dd4e3536db4da958e20331d95f1edb7/urllib3-2.0.6.tar.gz",
            "status": "restricted"
        }
    ]
}