{
    "id": "maven/mavencentral/software.amazon.awssdk/third-party-jackson-core/2.30.33",
    "license": "Apache-2.0",
    "authority": "https://gitlab.eclipse.org/eclipsefdn/emo-team/iplab/-/issues/19920",
    "source": "https://repo1.maven.org/maven2/software/amazon/awssdk/third-party-jackson-core/2.30.33/third-party-jackson-core-2.30.33-sources.jar",
    "status": "approved",
    "scans": [
        {
            "date": "March 6, 2025 at 8:21:47 a.m. GMT",
            "authority": "https://gitlab.eclipse.org/eclipsefdn/emo-team/iplab/-/issues/19920",
            "scancode-version": "31.2.1",
            "licenses-discovered": [
                "Apache-2.0"
            ],
            "copyrights": [
                "Copyright Amazon.com, Inc. or its affiliates"
            ],
            "file-count": 4,
            "sha256": "7e460a49a140cf5e8f6c551e7e9c20110b98877744be83c5fdc3dd92e6426792",
            "source": "https://repo1.maven.org/maven2/software/amazon/awssdk/third-party-jackson-core/2.30.33/third-party-jackson-core-2.30.33-sources.jar",
            "status": "approved"
        }
    ]
}