{
    "id": "npm/npmjs/-/vue-eslint-parser/9.3.2",
    "license": "MIT",
    "authority": "https://gitlab.eclipse.org/eclipsefdn/emo-team/iplab/-/issues/11439",
    "source": "https://github.com/vuejs/vue-eslint-parser/archive/refs/tags/v9.3.2.zip",
    "status": "approved",
    "scans": [
        {
            "date": "November 6, 2023 at 9:29:06 a.m. GMT",
            "authority": "https://gitlab.eclipse.org/eclipsefdn/emo-team/iplab/-/issues/11439",
            "scancode-version": "31.2.1",
            "licenses-discovered": [
                "MIT"
            ],
            "copyrights": [
                "Copyright (c) 2016 Toru Nagashima",
                "copyright 2016 Toru Nagashima",
                "copyright 2017 Toru Nagashima"
            ],
            "file-count": 1263,
            "sha256": "6515c8e2d8a35cad09de8ff563bc6cdadffa3c5c7254304ff9aad25019898025",
            "source": "https://github.com/vuejs/vue-eslint-parser/archive/refs/tags/v9.3.2.zip",
            "status": "approved"
        }
    ]
}