{
    "id": "maven/mavencentral/org.codehaus.plexus/plexus-sec-dispatcher/2.0",
    "license": "Apache-2.0",
    "authority": "https://gitlab.eclipse.org/eclipsefdn/emo-team/iplab/-/issues/17647",
    "source": "https://repo1.maven.org/maven2/org/codehaus/plexus/plexus-sec-dispatcher/2.0/plexus-sec-dispatcher-2.0-sources.jar",
    "status": "approved",
    "scans": [
        {
            "date": "December 4, 2024 at 11:48:30 a.m. GMT",
            "authority": "https://gitlab.eclipse.org/eclipsefdn/emo-team/iplab/-/issues/17647",
            "scancode-version": "31.2.1",
            "licenses-discovered": [
                "Apache-2.0"
            ],
            "copyrights": [
                "Copyright (c) 2008 Sonatype, Inc."
            ],
            "file-count": 13,
            "sha256": "ba4508f478d47717c8aeb41cf0ad9bc67e3c6bc7bf8f8bded2ca77b5885435a2",
            "source": "https://repo1.maven.org/maven2/org/codehaus/plexus/plexus-sec-dispatcher/2.0/plexus-sec-dispatcher-2.0-sources.jar",
            "status": "approved"
        }
    ]
}