{
    "id": "go/golang/github.com%2Fgolang/mock/v1.1.1",
    "license": "Apache-2.0",
    "authority": "https://gitlab.eclipse.org/eclipsefdn/emo-team/iplab/-/issues/5656",
    "source": "https://proxy.golang.org/github.com%2Fgolang/mock/@v/v1.1.1.zip",
    "status": "approved",
    "scans": [
        {
            "date": "December 12, 2022 at 2:27:32 a.m. GMT",
            "authority": "https://gitlab.eclipse.org/eclipsefdn/emo-team/iplab/-/issues/5656",
            "scancode-version": "31.2.1",
            "licenses-discovered": [
                "Apache-2.0"
            ],
            "copyrights": [
                "Copyright 2010 Google Inc.",
                "Copyright 2011 Google Inc.",
                "Copyright 2012 Google Inc."
            ],
            "file-count": 70,
            "sha256": "636fd21575ebdfbebd53045802a40c780fdab33c6130cea9279346898286f1ca",
            "source": "https://proxy.golang.org/github.com%2Fgolang/mock/@v/v1.1.1.zip",
            "status": "approved"
        }
    ]
}