{
    "id": "maven/mavencentral/com.vaadin/vaadin-messages-flow/24.2.2",
    "license": "Apache-2.0",
    "authority": "https://gitlab.eclipse.org/eclipsefdn/emo-team/iplab/-/issues/12118",
    "source": "https://repo1.maven.org/maven2/com/vaadin/vaadin-messages-flow/24.2.2/vaadin-messages-flow-24.2.2-sources.jar",
    "status": "approved",
    "scans": [
        {
            "date": "December 18, 2023 at 8:50:17 a.m. GMT",
            "authority": "https://gitlab.eclipse.org/eclipsefdn/emo-team/iplab/-/issues/12118",
            "scancode-version": "31.2.1",
            "licenses-discovered": [
                "Apache-2.0"
            ],
            "copyrights": [
                "Copyright 2000-2023 Vaadin Ltd."
            ],
            "file-count": 8,
            "sha256": "6fe542f186b950fd62c83038fcfdb178b38b3505171ecf308f5860e4766021ca",
            "source": "https://repo1.maven.org/maven2/com/vaadin/vaadin-messages-flow/24.2.2/vaadin-messages-flow-24.2.2-sources.jar",
            "status": "approved"
        }
    ]
}