{
    "id": "maven/mavencentral/org.scala-sbt/util-control_2.13/1.6.1",
    "license": "Apache-2.0",
    "authority": "https://gitlab.eclipse.org/eclipsefdn/emo-team/iplab/-/issues/9643",
    "source": "https://repo.maven.apache.org/maven2/org/scala-sbt/util-control_2.13/1.6.1/util-control_2.13-1.6.1-sources.jar",
    "status": "approved",
    "scans": [
        {
            "date": "July 19, 2023 at 12:20:05 p.m. GMT",
            "authority": "https://gitlab.eclipse.org/eclipsefdn/emo-team/iplab/-/issues/9643",
            "scancode-version": "31.2.1",
            "licenses-discovered": [
                "Apache-2.0"
            ],
            "copyrights": [
                "Copyright (c) 2008 - 2010, Mark Harrah",
                "Copyright (c) 2011 - 2018, Lightbend, Inc.",
                "Copyright 2008 - 2010, Mark Harrah",
                "Copyright 2011 - 2018, Lightbend, Inc."
            ],
            "file-count": 6,
            "sha256": "b8315450fb59eb212f04e19db44c70b6ffb5d7e7b50da3c656c6060f02bdb60d",
            "source": "https://repo.maven.apache.org/maven2/org/scala-sbt/util-control_2.13/1.6.1/util-control_2.13-1.6.1-sources.jar",
            "status": "approved"
        }
    ]
}