{
    "id": "maven/mavencentral/org.webjars/swagger-ui/3.52.5",
    "license": "Apache-2.0",
    "authority": "https://gitlab.eclipse.org/eclipsefdn/emo-team/iplab/-/issues/7084",
    "source": "http://github.com/webjars/swagger-ui/archive/refs/tags/release/org.webjars:swagger-ui:3.52.5.zip",
    "status": "approved",
    "scans": [
        {
            "date": "February 10, 2023 at 1:25:27 p.m. GMT",
            "authority": "https://gitlab.eclipse.org/eclipsefdn/emo-team/iplab/-/issues/7084",
            "scancode-version": "31.2.1",
            "licenses-discovered": [
            ],
            "copyrights": [
            ],
            "file-count": 1,
            "sha256": "d5558cd419c8d46bdc958064cb97f963d1ea793866414c025906ec15033512ed",
            "source": "http://github.com/webjars/swagger-ui/archive/refs/tags/release/org.webjars:swagger-ui:3.52.5.zip",
            "status": "restricted"
        }
    ]
}
