{
    "id": "maven/mavencentral/org.codehaus.mojo.versions/versions-api/2.18.0",
    "license": "Apache-2.0",
    "authority": "https://gitlab.eclipse.org/eclipsefdn/emo-team/iplab/-/issues/17215",
    "source": "https://repo1.maven.org/maven2/org/codehaus/mojo/versions/versions-api/2.18.0/versions-api-2.18.0-sources.jar",
    "status": "approved",
    "scans": [
        {
            "date": "November 14, 2024, 6:47:10 a.m. GMT",
            "authority": "https://gitlab.eclipse.org/eclipsefdn/emo-team/iplab/-/issues/17215",
            "scancode-version": "31.2.1",
            "licenses-discovered": [
                "Apache-2.0"
            ],
            "copyrights": [
                "Copyright MojoHaus and Contributors"
            ],
            "file-count": 10,
            "sha256": "4a8c63b1fa0ad32b2e210c0eb627b6904cbb6de7890f298cbc736f2d3d343d51",
            "source": "https://repo1.maven.org/maven2/org/codehaus/mojo/versions/versions-api/2.18.0/versions-api-2.18.0-sources.jar",
            "status": "approved"
        }
    ]
}