{
    "id": "maven/mavencentral/org.apache.maven.resolver/maven-resolver-connector-basic/1.9.4",
    "license": "Apache-2.0",
    "authority": "https://gitlab.eclipse.org/eclipsefdn/emo-team/iplab/-/issues/7026",
    "source": "https://search.maven.org/remotecontent?filepath=org/apache/maven/resolver/maven-resolver-connector-basic/1.9.4/maven-resolver-connector-basic-1.9.4-sources.jar",
    "status": "approved",
    "scans": [
        {
            "date": "February 7, 2023 at 5:48:30 a.m. GMT",
            "authority": "https://gitlab.eclipse.org/eclipsefdn/emo-team/iplab/-/issues/7026",
            "scancode-version": "31.2.1",
            "licenses-discovered": [
                "Apache-2.0"
            ],
            "copyrights": [
            ],
            "file-count": 12,
            "sha256": "af32536dcb88322334d7c0a6c86dbd4fcf74564619487cf3e33a507c5d9f241d",
            "source": "https://search.maven.org/remotecontent?filepath=org/apache/maven/resolver/maven-resolver-connector-basic/1.9.4/maven-resolver-connector-basic-1.9.4-sources.jar",
            "status": "approved"
        }
    ]
}