{
    "id": "maven/mavencentral/org.activiti/activiti-api-process-model/8.6.0",
    "license": "Apache-2.0",
    "authority": "https://gitlab.eclipse.org/eclipsefdn/emo-team/iplab/-/issues/15919",
    "source": "https://maven.alfresco.com/nexus/service/local/repositories/activiti-releases/content//org/activiti/activiti-api-process-model/8.6.0/activiti-api-process-model-8.6.0-sources.jar",
    "status": "approved",
    "scans": [
        {
            "date": "August 14, 2024 at 5:28:26 p.m. GMT",
            "authority": "https://gitlab.eclipse.org/eclipsefdn/emo-team/iplab/-/issues/15919",
            "scancode-version": "31.2.1",
            "licenses-discovered": [
                "Apache-2.0"
            ],
            "copyrights": [
                "Copyright 2010-2020 Alfresco Software, Ltd."
            ],
            "file-count": 101,
            "sha256": "a27084a6b3a5d23189b09710458f6354fa08713cfef8930f972c57bec8f674a8",
            "source": "https://maven.alfresco.com/nexus/service/local/repositories/activiti-releases/content//org/activiti/activiti-api-process-model/8.6.0/activiti-api-process-model-8.6.0-sources.jar",
            "status": "approved"
        }
    ]
}