{
    "id": "nuget/nuget/-/Serilog.Extensions.Hosting/9.0.0",
    "license": "Apache-2.0",
    "authority": "https://gitlab.eclipse.org/eclipsefdn/emo-team/iplab/-/issues/19186",
    "source": "https://github.com/serilog/serilog-extensions-hosting/archive/refs/tags/v9.0.0.zip",
    "status": "approved",
    "scans": [
        {
            "date": "January 24, 2025 at 8:15:51 a.m. GMT",
            "authority": "https://gitlab.eclipse.org/eclipsefdn/emo-team/iplab/-/issues/19186",
            "scancode-version": "31.2.1",
            "licenses-discovered": [
                "Apache-2.0"
            ],
            "copyrights": [
                "Copyright (c) .NET Foundation",
                "Copyright 2019 Serilog",
                "Copyright 2020 Serilog"
            ],
            "file-count": 48,
            "sha256": "5159c61cabb8229824c115f86ce51ba2f9aecb9a100be154fd08f7aef39ac9bd",
            "source": "https://github.com/serilog/serilog-extensions-hosting/archive/refs/tags/v9.0.0.zip",
            "status": "approved"
        }
    ]
}