{
    "id": "npm/npmjs/-/lz-string/1.5.0",
    "license": "MIT AND WTFPL",
    "authority": "https://gitlab.eclipse.org/eclipsefdn/emo-team/iplab/-/issues/8398",
    "source": "https://registry.yarnpkg.com/lz-string/-/lz-string-1.5.0.tgz",
    "status": "approved",
    "scans": [
        {
            "date": "May 10, 2023 at 4:12:59 a.m. GMT",
            "authority": "https://gitlab.eclipse.org/eclipsefdn/emo-team/iplab/-/issues/8398",
            "scancode-version": "31.2.1",
            "licenses-discovered": [
                "MIT",
                "WTFPL"
            ],
            "copyrights": [
                "Copyright (c) 2008-2011 Pivotal Labs",
                "Copyright (c) 2013 Pieroxy <pieroxy@pieroxy.net>",
                "Copyright (c) 2013 pieroxy"
            ],
            "file-count": 16,
            "sha256": "ad640cf79fc54bc8035a66edd33974f1334db9ba079c8b845f13e5d54c5e011b",
            "source": "https://registry.yarnpkg.com/lz-string/-/lz-string-1.5.0.tgz",
            "status": "approved"
        }
    ]
}