{
    "id": "npm/npmjs/@commitlint/lint/17.2.0",
    "license": "MIT",
    "authority": "https://gitlab.eclipse.org/eclipsefdn/emo-team/iplab/-/issues/4854",
    "source": "https://registry.npmjs.org/@commitlint/lint/-/lint-17.2.0.tgz",
    "status": "approved",
    "scans": [
        {
            "date": "November 15, 2022 at 7:55:36 a.m. GMT",
            "authority": "https://gitlab.eclipse.org/eclipsefdn/emo-team/iplab/-/issues/4854",
            "scancode-version": "31.2.1",
            "licenses-discovered": [
                "MIT"
            ],
            "copyrights": [
                "Copyright (c) 2016 - present Mario Nebl"
            ],
            "file-count": 11,
            "sha256": "9db136d43a5a6fc119133cf769f3a6d0cfc65256d1be4aa8dce8926817809fe0",
            "source": "https://registry.npmjs.org/@commitlint/lint/-/lint-17.2.0.tgz",
            "status": "approved"
        }
    ]
}