{
    "id": "git/github/EndBug/add-and-commit/v9",
    "license": "MIT",
    "authority": "https://gitlab.eclipse.org/eclipsefdn/emo-team/iplab/-/issues/9203",
    "source": "https://github.com/EndBug/add-and-commit/archive/refs/tags/v9.zip",
    "status": "approved",
    "scans": [
        {
            "date": "June 29, 2023 at 2:44:05 p.m. GMT",
            "authority": "https://gitlab.eclipse.org/eclipsefdn/emo-team/iplab/-/issues/9203",
            "scancode-version": "31.2.1",
            "licenses-discovered": [
                "MIT"
            ],
            "copyrights": [
                "Copyright (c) 2014-2017, Jon Schlinkert",
                "Copyright (c) 2019 Federico Grandi"
            ],
            "file-count": 30,
            "sha256": "be2686516c8453471284f5b187098d3c9d50afc1499d898d2f9f6168b52c4c30",
            "source": "https://github.com/EndBug/add-and-commit/archive/refs/tags/v9.zip",
            "status": "approved"
        }
    ]
}