{
    "id": "maven/mavencentral/org.springframework.boot/spring-boot-starter-oauth2-client/3.4.0",
    "license": "Apache-2.0",
    "authority": "https://gitlab.eclipse.org/eclipsefdn/emo-team/iplab/-/issues/17563",
    "source": "https://repo1.maven.org/maven2/org/springframework/boot/spring-boot-starter-oauth2-client/3.4.0/spring-boot-starter-oauth2-client-3.4.0-sources.jar",
    "status": "approved",
    "scans": [
        {
            "date": "November 29, 2024 at 5:51:12 a.m. GMT",
            "authority": "https://gitlab.eclipse.org/eclipsefdn/emo-team/iplab/-/issues/17563",
            "scancode-version": "31.2.1",
            "licenses-discovered": [
                "Apache-2.0"
            ],
            "copyrights": [
            ],
            "file-count": 2,
            "sha256": "c525c64dfbd5f7fd8908ced9b97a0117d091c60cb3c53fb445fbf3b69150a368",
            "source": "https://repo1.maven.org/maven2/org/springframework/boot/spring-boot-starter-oauth2-client/3.4.0/spring-boot-starter-oauth2-client-3.4.0-sources.jar",
            "status": "approved"
        }
    ]
}