{
    "id": "maven/mavencentral/androidx.compose.foundation/foundation-layout/1.5.0",
    "license": "Apache-2.0",
    "authority": "https://gitlab.eclipse.org/eclipsefdn/emo-team/iplab/-/issues/10458",
    "source": "https://dl.google.com/android/maven2/androidx/compose/foundation/foundation-layout/1.5.0/foundation-layout-1.5.0-sources.jar",
    "status": "approved",
    "scans": [
        {
            "date": "September 11, 2023 at 7:33:50 p.m. GMT",
            "authority": "https://gitlab.eclipse.org/eclipsefdn/emo-team/iplab/-/issues/10458",
            "scancode-version": "31.2.1",
            "licenses-discovered": [
                "Apache-2.0"
            ],
            "copyrights": [
                "Copyright 2019 The Android Open Source Project",
                "Copyright 2020 The Android Open Source Project",
                "Copyright 2021 The Android Open Source Project",
                "Copyright 2022 The Android Open Source Project"
            ],
            "file-count": 22,
            "sha256": "1f5b59e1d7b6983ac64149925ed35f414f30fead1996718a8703f06f6fa65507",
            "source": "https://dl.google.com/android/maven2/androidx/compose/foundation/foundation-layout/1.5.0/foundation-layout-1.5.0-sources.jar",
            "status": "approved"
        }
    ]
}