{
    "id": "go/golang/cloud.google.com/go/v0.93.3",
    "license": "Apache-2.0 AND (Apache-2.0 AND BSD-3-Clause) AND BSD-2-Clause AND BSD-3-Clause",
    "authority": "https://gitlab.eclipse.org/eclipsefdn/emo-team/iplab/-/issues/12423",
    "source": "https://proxy.golang.org/cloud.google.com/go/@v/v0.93.3.zip",
    "status": "approved",
    "scans": [
        {
            "date": "December 21, 2023 at 10:36:07 a.m. GMT",
            "authority": "https://gitlab.eclipse.org/eclipsefdn/emo-team/iplab/-/issues/12423",
            "scancode-version": "31.2.1",
            "licenses-discovered": [
                "Apache-2.0",
                "Apache-2.0 AND BSD-3-Clause",
                "BSD-2-Clause",
                "BSD-3-Clause"
            ],
            "copyrights": [
                "Copyright (c) 1996-1998 John D. Polstra",
                "Copyright (c) 2001 David E. O'Brien",
                "Copyright (c) 2020 The Go Authors",
                "Copyright 2009 The Go Authors",
                "Copyright 2011 The Go Authors",
                "Copyright 2012 Google, Inc.",
                "Copyright 2012 The Go Authors",
                "Copyright 2013 The Go Authors",
                "Copyright 2014 Google LLC",
                "Copyright 2016 Google LLC",
                "Copyright 2017 Google LLC",
                "Copyright 2017 The Go Authors",
                "Copyright 2018 Google Inc.",
                "Copyright 2018 Google LLC",
                "Copyright 2019 Google LLC",
                "Copyright 2020 Google LLC",
                "Copyright 2020 The Go Authors",
                "Copyright 2020, Google LLC",
                "Copyright 2021 Google LLC",
                "Portions Copyright 2018 Google LLC."
            ],
            "file-count": 392,
            "sha256": "93fca6541e54b4e7e1dfcadf57f09f1f818b53af44d10f967afba060c988674a",
            "source": "https://proxy.golang.org/cloud.google.com/go/@v/v0.93.3.zip",
            "status": "approved"
        }
    ]
}