{
    "id": "maven/mavencentral/org.apache.kerby/kerby-pkix/1.0.1",
    "license": "Apache-2.0",
    "authority": "https://gitlab.eclipse.org/eclipsefdn/emo-team/iplab/-/issues/15518",
    "source": "https://repo1.maven.org/maven2/org/apache/kerby/kerby-pkix/1.0.1/kerby-pkix-1.0.1-sources.jar",
    "status": "approved",
    "scans": [
        {
            "date": "July 2, 2024 at 1:03:06 p.m. GMT",
            "authority": "https://gitlab.eclipse.org/eclipsefdn/emo-team/iplab/-/issues/15518",
            "scancode-version": "31.2.1",
            "licenses-discovered": [
                "Apache-2.0"
            ],
            "copyrights": [
            ],
            "file-count": 142,
            "sha256": "ddf20ba78d2b57323a6ed8f926455819ff6a32820cad73bea5a65c010ae03e49",
            "source": "https://repo1.maven.org/maven2/org/apache/kerby/kerby-pkix/1.0.1/kerby-pkix-1.0.1-sources.jar",
            "status": "approved"
        }
    ]
}