{
    "id": "npm/npmjs/-/vsce/2.7.0",
    "license": "MIT AND (ISC AND MIT) AND ISC",
    "authority": "https://gitlab.eclipse.org/eclipsefdn/emo-team/iplab/-/issues/6437",
    "source": "https://github.com/Microsoft/vsce/archive/v2.7.0.zip",
    "status": "approved",
    "scans": [
        {
            "date": "January 20, 2023 at 6:14:09 p.m. GMT",
            "authority": "https://gitlab.eclipse.org/eclipsefdn/emo-team/iplab/-/issues/6437",
            "scancode-version": "31.2.1",
            "licenses-discovered": [
                "MIT",
                "ISC AND MIT",
                "ISC"
            ],
            "copyrights": [
                "Copyright (c) 2010 Benjamin Thomas, Robert Kieffer",
                "Copyright (c) 2011 TJ Holowaychuk <tj@vision-media.ca>",
                "Copyright (c) 2014 Josh Wolfe",
                "Copyright (c) 2014 KARASZI Istvan",
                "Copyright (c) 2015 Microsoft",
                "Copyright (c) Isaac Z. Schlueter and Contributors",
                "Copyright (c) Microsoft Corporation",
                "Copyright 2012-2015 The Dojo Foundation <http://dojofoundation.org/>",
                "copyright 2009-2015 Jeremy Ashkenas, DocumentCloud and Investigative Reporters & Editors <http://underscorejs.org/>"
            ],
            "file-count": 101,
            "sha256": "660be047b702a793dd0abd8b70642081267fae852f243c06ef2b28d955b3a502",
            "source": "https://github.com/Microsoft/vsce/archive/v2.7.0.zip",
            "status": "approved"
        }
    ]
}