{
    "id": "maven/mavencentral/org.bouncycastle/bcpkix-jdk18on/1.80",
    "license": "MIT",
    "authority": "https://gitlab.eclipse.org/eclipsefdn/emo-team/iplab/-/issues/18697",
    "source": "https://repo1.maven.org/maven2/org/bouncycastle/bcpkix-jdk18on/1.80/bcpkix-jdk18on-1.80-sources.jar",
    "status": "approved",
    "scans": [
        {
            "date": "January 15, 2025 at 7:27:07 a.m. GMT",
            "authority": "https://gitlab.eclipse.org/eclipsefdn/emo-team/iplab/-/issues/18697",
            "scancode-version": "31.2.1",
            "licenses-discovered": [
            ],
            "copyrights": [
            ],
            "file-count": 713,
            "sha256": "601ec2beb4749f0be65e296811b6e63de567f90d124f26887875bb722fd87e71",
            "source": "https://repo1.maven.org/maven2/org/bouncycastle/bcpkix-jdk18on/1.80/bcpkix-jdk18on-1.80-sources.jar",
            "status": "restricted"
        }
    ]
}