{
    "id": "maven/mavencentral/org.opensaml/opensaml-security-api/4.3.2",
    "license": "Apache-2.0",
    "authority": "https://gitlab.eclipse.org/eclipsefdn/emo-team/iplab/-/issues/17465",
    "source": "https://build.shibboleth.net/maven/releases/org/opensaml/opensaml-security-api/4.3.2/opensaml-security-api-4.3.2-sources.jar",
    "status": "approved",
    "scans": [
        {
            "date": "November 27, 2024 at 2:57:34 a.m. GMT",
            "authority": "https://gitlab.eclipse.org/eclipsefdn/emo-team/iplab/-/issues/17465",
            "scancode-version": "31.2.1",
            "licenses-discovered": [
                "Apache-2.0"
            ],
            "copyrights": [
            ],
            "file-count": 129,
            "sha256": "65ba0ebd18c110f2889c3475bccba23d335712f6af0dc21f5096c8055b424500",
            "source": "https://build.shibboleth.net/maven/releases/org/opensaml/opensaml-security-api/4.3.2/opensaml-security-api-4.3.2-sources.jar",
            "status": "approved"
        }
    ]
}