{
    "id": "pypi/pypi/-/pyasn1/0.4.2",
    "license": "BSD-2-Clause AND BSD-3-Clause AND (BSD-2-Clause AND MIT)",
    "authority": "https://gitlab.eclipse.org/eclipsefdn/emo-team/iplab/-/issues/6313",
    "source": "https://files.pythonhosted.org/packages/eb/3d/b7d0fdf4a882e26674c68c20f40682491377c4db1439870f5b6f862f76ed/pyasn1-0.4.2.tar.gz",
    "status": "approved",
    "scans": [
        {
            "date": "January 12, 2023 at 8:07:35 p.m. GMT",
            "authority": "https://gitlab.eclipse.org/eclipsefdn/emo-team/iplab/-/issues/6313",
            "scancode-version": "31.2.1",
            "licenses-discovered": [
                "BSD-2-Clause",
                "BSD-3-Clause",
                "BSD-2-Clause AND MIT"
            ],
            "copyrights": [
                "Copyright (c) 2005-2017, Ilya Etingof (mailto:etingof@gmail.com)",
                "Copyright (c) 2005-2017, Ilya Etingof <etingof@gmail.com>",
                "copyright u'2005-2017, Ilya Etingof <etingof@gmail.com>"
            ],
            "file-count": 154,
            "sha256": "d258b0a71994f7770599835249cece1caef3c70def868c4915e6e5ca49b67d15",
            "source": "https://files.pythonhosted.org/packages/eb/3d/b7d0fdf4a882e26674c68c20f40682491377c4db1439870f5b6f862f76ed/pyasn1-0.4.2.tar.gz",
            "status": "approved"
        }
    ]
}