{
    "id": "maven/mavencentral/org.burningwave/core/12.64.3",
    "license": "MIT",
    "authority": "https://gitlab.eclipse.org/eclipsefdn/emo-team/iplab/-/issues/11872",
    "source": "https://repo1.maven.org/maven2/org/burningwave/core/12.64.3/core-12.64.3-sources.jar",
    "status": "approved",
    "scans": [
        {
            "date": "December 11, 2023 at 7:12:24 p.m. GMT",
            "authority": "https://gitlab.eclipse.org/eclipsefdn/emo-team/iplab/-/issues/11872",
            "scancode-version": "31.2.1",
            "licenses-discovered": [
                "MIT"
            ],
            "copyrights": [
                "Copyright (c) 2019-2023 Roberto Gentili"
            ],
            "file-count": 133,
            "sha256": "3d79a21d56ddc61f2d07026f3bfd45febcd424b2343e8faf4a4efe40a4b7ab20",
            "source": "https://repo1.maven.org/maven2/org/burningwave/core/12.64.3/core-12.64.3-sources.jar",
            "status": "approved"
        }
    ]
}