{
    "id": "npm/npmjs/@babel/code-frame/7.22.5",
    "license": "MIT",
    "authority": "https://gitlab.eclipse.org/eclipsefdn/emo-team/iplab/-/issues/8946",
    "source": "https://registry.npmjs.org/@babel/code-frame/-/code-frame-7.22.5.tgz",
    "status": "approved",
    "scans": [
        {
            "date": "June 15, 2023 at 3:10:38 p.m. GMT",
            "authority": "https://gitlab.eclipse.org/eclipsefdn/emo-team/iplab/-/issues/8946",
            "scancode-version": "31.2.1",
            "licenses-discovered": [
                "MIT"
            ],
            "copyrights": [
                "Copyright (c) 2014-present Sebastian McKenzie and other contributors"
            ],
            "file-count": 5,
            "sha256": "8d862d807568b366406bbb041a0df0462e4041a812f00db3dc6cac490184984d",
            "source": "https://registry.npmjs.org/@babel/code-frame/-/code-frame-7.22.5.tgz",
            "status": "approved"
        }
    ]
}