{
    "id": "maven/mavencentral/com.apicatalog/iron-ed25519-cryptosuite-2020/0.8.1",
    "license": "Apache-2.0",
    "authority": "https://gitlab.eclipse.org/eclipsefdn/emo-team/iplab/-/issues/11157",
    "source": "https://repo.maven.apache.org/maven2/com/apicatalog/iron-ed25519-cryptosuite-2020/0.8.1/iron-ed25519-cryptosuite-2020-0.8.1-sources.jar",
    "status": "approved",
    "scans": [
        {
            "date": "October 25, 2023 at 8:42:59 a.m. GMT",
            "authority": "https://gitlab.eclipse.org/eclipsefdn/emo-team/iplab/-/issues/11157",
            "scancode-version": "31.2.1",
            "licenses-discovered": [
                "Apache-2.0"
            ],
            "copyrights": [
            ],
            "file-count": 8,
            "sha256": "98b806c3044abdbc81c9637dc93dba2cc495b63863966180567b961d3e6f1230",
            "source": "https://repo.maven.apache.org/maven2/com/apicatalog/iron-ed25519-cryptosuite-2020/0.8.1/iron-ed25519-cryptosuite-2020-0.8.1-sources.jar",
            "status": "approved"
        }
    ]
}