{
    "id": "p2/orbit/p2.eclipse.plugin/org.eclipse.emf.databinding.source/1.6.0.v20220517-0824",
    "license": "EPL-1.0 AND EPL-2.0 AND EPL-2.0 AND (CPL-1.0 AND EPL-1.0)",
    "licenses-discovered": [
        "EPL-1.0 AND EPL-2.0",
        "EPL-2.0",
        "CPL-1.0 AND EPL-1.0"
    ],
    "copyrights": [
        "(c) 2008 VeriSign, Inc.",
        "Copyright (c) 2005 IBM Corporation and others",
        "Copyright (c) 2006 IBM Corporation and others",
        "Copyright (c) 2007 Brad Reynolds and others",
        "Copyright (c) 2007 IBM Corporation and others",
        "Copyright (c) 2008 Matthew Hall and others",
        "Copyright (c) 2008 Tom Schindl and others",
        "Copyright (c) 2008, 2009 Matthew Hall and others",
        "Copyright (c) 2009 BestSolution.at and others",
        "Copyright (c) 2009 Tom Schindl",
        "Copyright (c) 2009 Tom Schindl and others",
        "Copyright (c) 2011 BestSolution.at and others"
    ],
    "file-count": 41,
    "scancode-version": "31.2.1",
    "authority": "https://gitlab.eclipse.org/eclipsefdn/emo-team/iplab/-/issues/4003",
    "source": "https://search.maven.org/remotecontent?filepath=org/eclipse/emf/org.eclipse.emf.databinding/1.6.0/org.eclipse.emf.databinding-1.6.0-sources.jar",
    "status": "approved"
}