{
    "id": "maven/mavencentral/ch.qos.logback/logback-core/1.5.6",
    "license": "EPL-1.0 AND LGPL-2.1-only",
    "authority": "https://gitlab.eclipse.org/eclipsefdn/emo-team/iplab/-/issues/15210",
    "source": "https://repo1.maven.org/maven2/ch/qos/logback/logback-core/1.5.6/logback-core-1.5.6-sources.jar",
    "status": "approved",
    "scans": [
        {
            "date": "June 14, 2024 at 10:23:46 a.m. GMT",
            "authority": "https://gitlab.eclipse.org/eclipsefdn/emo-team/iplab/-/issues/15210",
            "scancode-version": "31.2.1",
            "licenses-discovered": [
                "EPL-1.0 AND LGPL-2.1-only"
            ],
            "copyrights": [
                "Copyright (c) 1999-2002, QOS.ch",
                "Copyright (c) 1999-2015, QOS.ch",
                "Copyright (c) 1999-2021, QOS.ch",
                "Copyright (c) 1999-2022, QOS.ch",
                "Copyright (c) 1999-2023, QOS.ch",
                "Copyright (c) 1999-2024, QOS.ch"
            ],
            "file-count": 434,
            "sha256": "5e06c4e3cfd283ea10b4f73c199a8acb913eb7201d95b609c601e50b2bff7b61",
            "source": "https://repo1.maven.org/maven2/ch/qos/logback/logback-core/1.5.6/logback-core-1.5.6-sources.jar",
            "status": "approved"
        }
    ]
}