{
    "id": "maven/mavencentral/org.springframework.security/spring-security-config/4.0.4.RELEASE",
    "license": "Apache-2.0",
    "licenses-discovered": [
        "Apache-2.0"
    ],
    "file-count": 119,
    "scancode-version": "30.1.0",
    "authority": "https://gitlab.eclipse.org/eclipsefdn/emo-team/iplab/-/issues/2245",
    "source": "https://search.maven.org/remotecontent?filepath=org/springframework/security/spring-security-config/4.0.4.RELEASE/spring-security-config-4.0.4.RELEASE-sources.jar",
    "status": "approved"
}