{
    "id": "maven/mavencentral/org.openrewrite/rewrite-maven/8.5.0",
    "license": "Apache-2.0",
    "authority": "https://gitlab.eclipse.org/eclipsefdn/emo-team/iplab/-/issues/11226",
    "source": "https://repo.maven.apache.org/maven2/org/openrewrite/rewrite-maven/8.5.0/rewrite-maven-8.5.0-sources.jar",
    "status": "approved",
    "scans": [
        {
            "date": "October 25, 2023 at 9:16:28 p.m. GMT",
            "authority": "https://gitlab.eclipse.org/eclipsefdn/emo-team/iplab/-/issues/11226",
            "scancode-version": "31.2.1",
            "licenses-discovered": [
                "Apache-2.0",
                "Apache-2.0 AND GPL-1.0-or-later AND LGPL-2.0-or-later AND MIT",
                "Apache-2.0 AND LGPL-2.0-or-later"
            ],
            "copyrights": [
                "Copyright 2020 the original author or authors",
                "Copyright 2021 the original author or authors",
                "Copyright 2022 the original author or authors",
                "Copyright 2023 the original author or authors"
            ],
            "file-count": 136,
            "sha256": "16ed06846f8eae5df98b10a8f87f5957b251b5683e9e0aab7c5d63a12b8a7b63",
            "source": "https://repo.maven.apache.org/maven2/org/openrewrite/rewrite-maven/8.5.0/rewrite-maven-8.5.0-sources.jar",
            "status": "restricted"
        }
    ]
}
