{
    "id": "npm/npmjs/@nx/nx-darwin-x64/16.10.0",
    "license": "MIT",
    "authority": "https://gitlab.eclipse.org/eclipsefdn/emo-team/iplab/-/issues/11014",
    "source": "https://github.com/nrwl/nx/archive/refs/tags/16.10.0.zip",
    "status": "approved",
    "scans": [
        {
            "date": "October 10, 2023 at 2:37:34 p.m. GMT",
            "authority": "https://gitlab.eclipse.org/eclipsefdn/emo-team/iplab/-/issues/11014",
            "scancode-version": "31.2.1",
            "licenses-discovered": [
                "MIT",
                "TMate",
                "MIT AND Unlicense",
                "ISC",
                "Apache-2.0",
                "Apache-2.0 AND BSD-3-Clause AND CDDL-1.0 AND CDDL-1.1 AND EPL-1.0 AND EPL-2.0 AND (GPL-2.0-only WITH Classpath-exception-2.0) AND MIT"
            ],
            "copyrights": [
                "(c) 2023 made with",
                "Copyright (c) 2014 The Android Open Source Project",
                "Copyright (c) 2015-2021 the original",
                "Copyright (c) 2017-2023 Narwhal Technologies Inc.",
                "Copyright (c) 2022 Mohammad Ataei",
                "Copyright (c) Meta Platforms, Inc. and affiliates",
                "Copyright 2015 the original author or authors",
                "Copyright Google Inc."
            ],
            "file-count": 6221,
            "sha256": "25e38dd4eeaa83aef1f2c1be18b4284fce6783ad2cbab47d10053ab0a77be01a",
            "source": "https://github.com/nrwl/nx/archive/refs/tags/16.10.0.zip",
            "status": "restricted"
        }
    ]
}
