{
    "id": "maven/mavencentral/org.eclipse.dataspaceconnector/core-base/0.0.1-20220922.4-20230220.143048-2",
    "license": "Apache-2.0",
    "authority": "https://gitlab.eclipse.org/eclipsefdn/emo-team/iplab/-/issues/7637",
    "source": "https://search.maven.org/remotecontent?filepath=org/eclipse/dataspaceconnector/core-base/0.0.1-milestone-6/core-base-0.0.1-milestone-6-sources.jar",
    "status": "approved",
    "scans": [
        {
            "date": "March 28, 2023 at 9:50:17 p.m. GMT",
            "authority": "https://gitlab.eclipse.org/eclipsefdn/emo-team/iplab/-/issues/7637",
            "scancode-version": "31.2.1",
            "licenses-discovered": [
                "Apache-2.0"
            ],
            "copyrights": [
                "Copyright (c) 2020 - 2022 Microsoft Corporation",
                "Copyright (c) 2020, 2021 Microsoft Corporation",
                "Copyright (c) 2021 Microsoft Corporation",
                "Copyright (c) 2022 Amadeus",
                "Copyright (c) 2022 Bayerische Motoren Werke Aktiengesellschaft",
                "Copyright (c) 2022 Microsoft Corporation"
            ],
            "file-count": 17,
            "sha256": "cecee92e6f1b7998ad67c6d7a69c0d67a6393ccb650bbd2aed99446d663ab592",
            "source": "https://search.maven.org/remotecontent?filepath=org/eclipse/dataspaceconnector/core-base/0.0.1-milestone-6/core-base-0.0.1-milestone-6-sources.jar",
            "status": "approved"
        }
    ]
}