{
    "id": "maven/mavencentral/io.github.resilience4j/resilience4j-spring6/2.1.0",
    "license": "Apache-2.0",
    "authority": "https://gitlab.eclipse.org/eclipsefdn/emo-team/iplab/-/issues/10915",
    "source": "https://repo.maven.apache.org/maven2/io/github/resilience4j/resilience4j-spring6/2.1.0/resilience4j-spring6-2.1.0-sources.jar",
    "status": "approved",
    "scans": [
        {
            "date": "October 5, 2023 at 3:15:06 p.m. GMT",
            "authority": "https://gitlab.eclipse.org/eclipsefdn/emo-team/iplab/-/issues/10915",
            "scancode-version": "31.2.1",
            "licenses-discovered": [
                "Apache-2.0"
            ],
            "copyrights": [
                "Copyright 2017 Bohdan Storozhuk",
                "Copyright 2017 Bohdan Storozhuk, Mahmoud Romeh",
                "Copyright 2017 Robert Winkler",
                "Copyright 2017 Robert Winkler,Mahmoud Romeh",
                "Copyright 2018 Clint Checketts",
                "Copyright 2019 Kyuhyen Hwang",
                "Copyright 2019 Kyuhyen Hwang, Mahmoud Romeh",
                "Copyright 2019 Mahmoud Romeh",
                "Copyright 2019 Robert Winkler",
                "Copyright 2019 lespinsideg",
                "Copyright 2019 lespinsideg, Mahmoud Romeh",
                "Copyright 2020 Ingyu Hwang",
                "Copyright 2020 Kyuhyen Hwang",
                "Copyright 2021 Aaron Asch"
            ],
            "file-count": 58,
            "sha256": "92dc10e86a66a42ee06bef13c917f2f295be5fe9569590497b044790c65416e4",
            "source": "https://repo.maven.apache.org/maven2/io/github/resilience4j/resilience4j-spring6/2.1.0/resilience4j-spring6-2.1.0-sources.jar",
            "status": "approved"
        }
    ]
}