{
    "id": "maven/mavencentral/org.bouncycastle/bcutil-jdk18on/1.74",
    "license": "MIT",
    "authority": "https://gitlab.eclipse.org/eclipsefdn/emo-team/iplab/-/issues/9094",
    "source": "https://repo.maven.apache.org/maven2/org/bouncycastle/bcutil-jdk18on/1.74/bcutil-jdk18on-1.74-sources.jar",
    "status": "approved",
    "scans": [
        {
            "date": "June 18, 2023 at 1:43:11 p.m. GMT",
            "authority": "https://gitlab.eclipse.org/eclipsefdn/emo-team/iplab/-/issues/9094",
            "scancode-version": "31.2.1",
            "licenses-discovered": [
            ],
            "copyrights": [
            ],
            "file-count": 488,
            "sha256": "0e8510b2b0bff7bb8430cb504a89728edccb0001034f81b6f1810fec63f845c2",
            "source": "https://repo.maven.apache.org/maven2/org/bouncycastle/bcutil-jdk18on/1.74/bcutil-jdk18on-1.74-sources.jar",
            "status": "restricted"
        }
    ]
}
