{
    "id": "nuget/nuget/-/BlazorInputFile/0.2.0",
    "license": "Apache-2.0 AND MIT",
    "authority": "https://gitlab.eclipse.org/eclipsefdn/emo-team/iplab/-/issues/15989",
    "source": "https://github.com/SteveSandersonMS/BlazorInputFile/archive/db10236b049ea05de28de9b7806447a3c84c8465.zip",
    "status": "approved",
    "scans": [
        {
            "date": "September 11, 2024, 3:16:22 a.m. GMT",
            "authority": "https://gitlab.eclipse.org/eclipsefdn/emo-team/iplab/-/issues/15989",
            "scancode-version": "31.2.1",
            "licenses-discovered": [
                "Apache-2.0",
                "MIT"
            ],
            "copyrights": [
            ],
            "file-count": 37,
            "sha256": "5e39a38097f3086424d7bd0739618b00cbf21823fe634029305ab9011227e84d",
            "source": "https://github.com/SteveSandersonMS/BlazorInputFile/archive/db10236b049ea05de28de9b7806447a3c84c8465.zip",
            "status": "approved"
        }
    ]
}