{
    "id": "maven/mavencentral/software.amazon.awssdk/checksums/2.25.1",
    "license": "Apache-2.0",
    "authority": "https://gitlab.eclipse.org/eclipsefdn/emo-team/iplab/-/issues/13677",
    "source": "https://repo1.maven.org/maven2/software/amazon/awssdk/checksums/2.25.1/checksums-2.25.1-sources.jar",
    "status": "approved",
    "scans": [
        {
            "date": "March 14, 2024 at 1:06:15 p.m. GMT",
            "authority": "https://gitlab.eclipse.org/eclipsefdn/emo-team/iplab/-/issues/13677",
            "scancode-version": "31.2.1",
            "licenses-discovered": [
                "Apache-2.0"
            ],
            "copyrights": [
                "Copyright Amazon.com, Inc. or its affiliates"
            ],
            "file-count": 5,
            "sha256": "1fa1262e2b03ec62f481702fb91b69a62d37eb1443c3bcb55608cdf0066c47d9",
            "source": "https://repo1.maven.org/maven2/software/amazon/awssdk/checksums/2.25.1/checksums-2.25.1-sources.jar",
            "status": "approved"
        }
    ]
}