{
    "id": "maven/mavencentral/software.amazon.awssdk/crt-core/2.23.12",
    "license": "Apache-2.0",
    "authority": "https://gitlab.eclipse.org/eclipsefdn/emo-team/iplab/-/issues/13136",
    "source": "https://repo1.maven.org/maven2/software/amazon/awssdk/crt-core/2.23.12/crt-core-2.23.12-sources.jar",
    "status": "approved",
    "scans": [
        {
            "date": "February 4, 2024 at 11:40:10 a.m. GMT",
            "authority": "https://gitlab.eclipse.org/eclipsefdn/emo-team/iplab/-/issues/13136",
            "scancode-version": "31.2.1",
            "licenses-discovered": [
                "Apache-2.0"
            ],
            "copyrights": [
                "Copyright Amazon.com, Inc. or its affiliates"
            ],
            "file-count": 7,
            "sha256": "9edecef0ad78eedd05a047a36255b28f533c5467fc92224bf5a48b684ca9b3c3",
            "source": "https://repo1.maven.org/maven2/software/amazon/awssdk/crt-core/2.23.12/crt-core-2.23.12-sources.jar",
            "status": "approved"
        }
    ]
}