{
    "id": "maven/mavencentral/org.apache.xmlgraphics/batik-gvt/1.17",
    "license": "Apache-2.0",
    "authority": "https://gitlab.eclipse.org/eclipsefdn/emo-team/iplab/-/issues/10157",
    "source": "https://repo.maven.apache.org/maven2/org/apache/xmlgraphics/batik-gvt/1.17/batik-gvt-1.17-sources.jar",
    "status": "approved",
    "scans": [
        {
            "date": "August 22, 2023 at 10:51:54 a.m. GMT",
            "authority": "https://gitlab.eclipse.org/eclipsefdn/emo-team/iplab/-/issues/10157",
            "scancode-version": "31.2.1",
            "licenses-discovered": [
                "Apache-2.0"
            ],
            "copyrights": [
            ],
            "file-count": 98,
            "sha256": "52e5aa341a33b45c88a9f9bd270718a3584bcfd22f44e38533b266b11f45af94",
            "source": "https://repo.maven.apache.org/maven2/org/apache/xmlgraphics/batik-gvt/1.17/batik-gvt-1.17-sources.jar",
            "status": "approved"
        }
    ]
}