{
    "id": "maven/mavencentral/io.fabric8/kubernetes-server-mock/6.4.0",
    "license": "Apache-2.0",
    "authority": "https://gitlab.eclipse.org/eclipsefdn/emo-team/iplab/-/issues/6608",
    "source": "https://search.maven.org/remotecontent?filepath=io/fabric8/kubernetes-server-mock/6.4.0/kubernetes-server-mock-6.4.0-sources.jar",
    "status": "approved",
    "scans": [
        {
            "date": "January 24, 2023 at 8:37:11 a.m. GMT",
            "authority": "https://gitlab.eclipse.org/eclipsefdn/emo-team/iplab/-/issues/6608",
            "scancode-version": "31.2.1",
            "licenses-discovered": [
                "Apache-2.0"
            ],
            "copyrights": [
                "Copyright (c) 2015 Red Hat, Inc."
            ],
            "file-count": 22,
            "sha256": "725ac92a27c49081176e6d7c5c45420bf2fe5f2dfbdca3d771ff57af9d19fd13",
            "source": "https://search.maven.org/remotecontent?filepath=io/fabric8/kubernetes-server-mock/6.4.0/kubernetes-server-mock-6.4.0-sources.jar",
            "status": "approved"
        }
    ]
}