{
    "id": "maven/mavencentral/com.vladsch.flexmark/flexmark-ext-enumerated-reference/0.64.8",
    "license": "BSD-2-Clause AND CC-BY-SA-4.0",
    "authority": "https://gitlab.eclipse.org/eclipsefdn/emo-team/iplab/-/issues/11320",
    "source": "https://repo.maven.apache.org/maven2/com/vladsch/flexmark/flexmark-ext-enumerated-reference/0.64.8/flexmark-ext-enumerated-reference-0.64.8-sources.jar",
    "status": "approved",
    "scans": [
        {
            "date": "October 26, 2023 at 7:24:17 p.m. GMT",
            "authority": "https://gitlab.eclipse.org/eclipsefdn/emo-team/iplab/-/issues/11320",
            "scancode-version": "31.2.1",
            "licenses-discovered": [
            ],
            "copyrights": [
            ],
            "file-count": 26,
            "sha256": "6349efd94245f6b07d059925e02866fa1fe835801172bd5e4084cadb835cb5bd",
            "source": "https://repo.maven.apache.org/maven2/com/vladsch/flexmark/flexmark-ext-enumerated-reference/0.64.8/flexmark-ext-enumerated-reference-0.64.8-sources.jar",
            "status": "restricted"
        }
    ]
}
