{
    "id": "maven/mavencentral/org.springframework.security/spring-security-crypto/5.7.4",
    "license": "Apache-2.0 AND ISC",
    "licenses-discovered": [
        "Apache-2.0",
        "ISC"
    ],
    "copyrights": [
        "Copyright (c) 2006 Damien Miller <djm@mindrot.org>",
        "Copyright 2002-2011 the original author or authors",
        "Copyright 2002-2016 the original author or authors",
        "Copyright 2002-2017 the original author or authors",
        "Copyright 2002-2018 the original author or authors",
        "Copyright 2002-2019 the original author or authors",
        "Copyright 2002-2020 the original author or authors",
        "Copyright 2002-2022 the original author or authors",
        "Copyright 2011-2016 the original author or authors",
        "Copyright 2011-2018 the original author or authors",
        "Copyright 2011-2020 the original author or authors"
    ],
    "file-count": 40,
    "scancode-version": "31.2.1",
    "authority": "https://gitlab.eclipse.org/eclipsefdn/emo-team/iplab/-/issues/4268",
    "source": "https://search.maven.org/remotecontent?filepath=org/springframework/security/spring-security-crypto/5.7.4/spring-security-crypto-5.7.4-sources.jar",
    "status": "approved"
}