{
    "id": "git/github/eclipse-tractusx/traceability-foss/1385",
    "license": "Apache-2.0",
    "authority": "https://gitlab.eclipse.org/eclipsefdn/emo-team/iplab/-/issues/19308",
    "source": "https://patch-diff.githubusercontent.com/raw/eclipse-tractusx/traceability-foss/pull/1385.patch",
    "status": "approved",
    "scans": [
        {
            "date": "February 5, 2025 at 2:23:53 p.m. GMT",
            "authority": "https://gitlab.eclipse.org/eclipsefdn/emo-team/iplab/-/issues/19308",
            "scancode-version": "31.2.1",
            "licenses-discovered": [
            ],
            "copyrights": [
                "(c) 2022, 2023 Bayerische Motoren Werke Aktiengesellschaft",
                "(c) 2022, 2023 Contributors",
                "(c) 2022, 2023 ZF Friedrichshafen AG",
                "(c) 2023 Contributors",
                "(c) 2024 Contributors",
                "(c) If1RNZ2jJI4Qis8Je 8 ShEbVH",
                "Copyright (c) 2022 Contributors",
                "Copyright (c) 2022, 2023 Bayerische Motoren Werke Aktiengesellschaft",
                "Copyright (c) 2022, 2023 Contributors",
                "Copyright (c) 2022, 2023 ZF Friedrichshafen AG",
                "Copyright (c) 2022, 2023, 2024 Contributors",
                "Copyright (c) 2023 Contributors",
                "Copyright (c) 2023, 2024 Contributors",
                "Copyright (c) 2024 Contributors"
            ],
            "file-count": 1,
            "sha256": "2c25a40a69e755ee2c58c88f569b0efcbc743c0ec8cacadadda1f0ea4fb42238",
            "source": "https://patch-diff.githubusercontent.com/raw/eclipse-tractusx/traceability-foss/pull/1385.patch",
            "status": "restricted"
        }
    ]
}