{
    "id": "npm/npmjs/-/rc-pagination/4.0.3",
    "license": "MIT",
    "authority": "https://gitlab.eclipse.org/eclipsefdn/emo-team/iplab/-/issues/11963",
    "source": "https://registry.yarnpkg.com/rc-pagination/-/rc-pagination-4.0.3.tgz",
    "status": "approved",
    "scans": [
        {
            "date": "December 13, 2023 at 7:37:42 p.m. GMT",
            "authority": "https://gitlab.eclipse.org/eclipsefdn/emo-team/iplab/-/issues/11963",
            "scancode-version": "31.2.1",
            "licenses-discovered": [
                "MIT"
            ],
            "copyrights": [
                "Copyright (c) 2014-present yiminghe"
            ],
            "file-count": 307,
            "sha256": "53adae82cecc040ad14b9ee607266ef802e329c364ab2212ff77e5f9a6417e68",
            "source": "https://registry.yarnpkg.com/rc-pagination/-/rc-pagination-4.0.3.tgz",
            "status": "approved"
        }
    ]
}