{
    "id": "npm/npmjs/@vue/language-core/1.8.3",
    "license": "MIT",
    "authority": "https://gitlab.eclipse.org/eclipsefdn/emo-team/iplab/-/issues/9195",
    "source": "https://registry.npmjs.org/@vue/language-core/-/language-core-1.8.3.tgz",
    "status": "approved",
    "scans": [
        {
            "date": "June 28, 2023 at 1:06:45 p.m. GMT",
            "authority": "https://gitlab.eclipse.org/eclipsefdn/emo-team/iplab/-/issues/9195",
            "scancode-version": "31.2.1",
            "licenses-discovered": [
                "MIT"
            ],
            "copyrights": [
                "Copyright (c) 2021-present Johnson Chu"
            ],
            "file-count": 54,
            "sha256": "75c0f2ee314cb3683bf2b4f5ab5e9e89cbe260292b3283dd1ca4561766737029",
            "source": "https://registry.npmjs.org/@vue/language-core/-/language-core-1.8.3.tgz",
            "status": "approved"
        }
    ]
}