{
    "id": "npm/npmjs/-/regjsparser/0.12.0",
    "license": "BSD-2-Clause AND (BSD-2-Clause AND BSD-3-Clause)",
    "authority": "https://gitlab.eclipse.org/eclipsefdn/emo-team/iplab/-/issues/17699",
    "source": "https://registry.npmjs.org/regjsparser/-/regjsparser-0.12.0.tgz",
    "status": "approved",
    "scans": [
        {
            "date": "December 4, 2024 at 5:45:10 p.m. GMT",
            "authority": "https://gitlab.eclipse.org/eclipsefdn/emo-team/iplab/-/issues/17699",
            "scancode-version": "31.2.1",
            "licenses-discovered": [
                "BSD-2-Clause",
                "BSD-2-Clause AND BSD-3-Clause"
            ],
            "copyrights": [
                "Copyright (c) Julian Viereck and Contributors"
            ],
            "file-count": 6,
            "sha256": "c8bf709acadc4876adeaceda72b8cf141cf2fcf6bf951c080e090a0d0a88c9e7",
            "source": "https://registry.npmjs.org/regjsparser/-/regjsparser-0.12.0.tgz",
            "status": "approved"
        }
    ]
}