{
    "id": "maven/mavencentral/org.geotools/gt-grid/23.3",
    "license": "LGPL-2.1-only",
    "authority": "https://gitlab.eclipse.org/eclipsefdn/emo-team/iplab/-/issues/5115",
    "source": "https://repo.osgeo.org/repository/geotools-releases/org/geotools/gt-grid/23.3/gt-grid-23.3-sources.jar",
    "status": "approved",
    "scans": [
        {
            "date": "November 24, 2022 at 4:54:38 p.m. GMT",
            "authority": "https://gitlab.eclipse.org/eclipsefdn/emo-team/iplab/-/issues/5115",
            "scancode-version": "31.2.1",
            "licenses-discovered": [
                "LGPL-2.1-only"
            ],
            "copyrights": [
                "(c) 2010, Open Source Geospatial Foundation",
                "(c) 2011, Open Source Geospatial Foundation",
                "(c) 2019, Open Source Geospatial Foundation"
            ],
            "file-count": 31,
            "sha256": "9b7f2cd5b4f7ec37dfbde7c9c52031e35e96c363300e1e991e0c269b2f20378b",
            "source": "https://repo.osgeo.org/repository/geotools-releases/org/geotools/gt-grid/23.3/gt-grid-23.3-sources.jar",
            "status": "approved"
        }
    ]
}