{
    "id": "maven/mavencentral/org.openjdk.jmh/jmh-core/1.35",
    "license": "GPL-2.0-only WITH Classpath-exception-2.0",
    "licenses-discovered": [
        "GPL-2.0-only WITH Classpath-exception-2.0",
        "GPL-2.0-only AND LicenseRef-scancode-oracle-openjdk-classpath-exception-2.0",
        "Apache-2.0 AND BSD-3-Clause AND MIT"
    ],
    "copyrights": [
        "Copyright (c) Free Software Foundation, Inc.",
        "Copyright (c) INRIA, France Telecom",
        "Copyright (c) Oracle and/or its affiliates",
        "Copyright (c) Paul R. Holser, Jr",
        "Copyright (c) Red Hat Inc.",
        "copyrighted by the Free Software Foundation"
    ],
    "file-count": 211,
    "scancode-version": "30.1.0",
    "authority": "https://gitlab.eclipse.org/eclipsefdn/emo-team/iplab/-/issues/3052",
    "source": "https://search.maven.org/remotecontent?filepath=org/openjdk/jmh/jmh-core/1.35/jmh-core-1.35-sources.jar",
    "status": "approved"
}
