{
    "id": "pypi/pypi/-/numpy/2.2.3",
    "license": "BSD-3-Clause AND (Apache-2.0 AND BSD-3-Clause AND MIT AND Zlib) AND MIT AND DOC AND CC-BY-SA-3.0 AND CC0-1.0 AND GPL-3.0-only AND (Apache-2.0 AND BSD-3-Clause) AND (Apache-2.0 AND MIT) AND Apache-2.0 AND (CC0-1.0 AND LicenseRef-scancode-free-unknown) AND LicenseRef-scancode-proprietary-license AND CC-BY-4.0 AND Zlib AND BSD-2-Clause AND 0BSD AND (LicenseRef-scancode-generic-exception AND MIT AND Zlib) AND (MIT AND Zlib) AND LicenseRef-scancode-sunpro AND BSD-3-Clause-Open-MPI AND (BSD-3-Clause AND NCSA) AND (BSD-3-Clause AND MIT) AND (BSD-3-Clause AND BSD-3-Clause-Attribution AND BSD-3-Clause-Open-MPI AND GCC-exception-3.1 AND GPL-3.0-only AND LGPL-2.1-only) AND (BSD-3-Clause AND BSD-3-Clause-Attribution AND BSD-3-Clause-Open-MPI AND GCC-exception-3.1 AND GPL-3.0-only) AND LicenseRef-scancode-zsh AND Vim AND (Apache-2.0 AND CC-BY-SA-4.0 AND CC0-1.0) AND LicenseRef-scancode-free-unknown AND (Apache-2.0 AND GPL-2.0-only) AND FSFAP AND (BSD-3-Clause AND BSL-1.0 AND GPL-1.0-or-later AND MIT) AND GPL-1.0-or-later",
    "authority": "https://gitlab.eclipse.org/eclipsefdn/emo-team/iplab/-/issues/19888",
    "source": "https://files.pythonhosted.org/packages/fb/90/8956572f5c4ae52201fdec7ba2044b2c882832dcec7d5d0922c9e9acf2de/numpy-2.2.3.tar.gz",
    "status": "restricted",
    "scans": [
        {
            "date": "March 4, 2025 at 11:16:39 a.m. GMT",
            "authority": "https://gitlab.eclipse.org/eclipsefdn/emo-team/iplab/-/issues/19888",
            "scancode-version": "31.2.1",
            "licenses-discovered": [
                "BSD-3-Clause",
                "Apache-2.0 AND BSD-3-Clause AND MIT AND Zlib",
                "MIT",
                "DOC",
                "CC-BY-SA-3.0",
                "CC0-1.0",
                "GPL-3.0-only",
                "Apache-2.0 AND BSD-3-Clause",
                "Apache-2.0 AND MIT",
                "Apache-2.0",
                "CC0-1.0 AND LicenseRef-scancode-free-unknown",
                "LicenseRef-scancode-proprietary-license",
                "CC-BY-4.0",
                "Zlib",
                "BSD-2-Clause",
                "0BSD",
                "LicenseRef-scancode-generic-exception AND MIT AND Zlib",
                "MIT AND Zlib",
                "LicenseRef-scancode-sunpro",
                "BSD-3-Clause-Open-MPI",
                "BSD-3-Clause AND NCSA",
                "BSD-3-Clause AND MIT",
                "BSD-3-Clause AND BSD-3-Clause-Attribution AND BSD-3-Clause-Open-MPI AND GCC-exception-3.1 AND GPL-3.0-only AND LGPL-2.1-only",
                "BSD-3-Clause AND BSD-3-Clause-Attribution AND BSD-3-Clause-Open-MPI AND GCC-exception-3.1 AND GPL-3.0-only",
                "LicenseRef-scancode-zsh",
                "Vim",
                "Apache-2.0 AND CC-BY-SA-4.0 AND CC0-1.0",
                "LicenseRef-scancode-free-unknown",
                "Apache-2.0 AND GPL-2.0-only",
                "FSFAP",
                "BSD-3-Clause AND BSL-1.0 AND GPL-1.0-or-later AND MIT",
                "GPL-1.0-or-later"
            ],
            "copyrights": [
                "(c) Convert Chebyshev",
                "(c) Jussi Pakkanen",
                "(c) Multiply a Chebyshev",
                "(c) Multiply a Hermite",
                "(c) Multiply a Laguerre",
                "(c) Multiply a Legendre",
                "(c), False, False, False, True",
                "(c), False, False, True, False",
                "(c), True, True, False, False",
                "Copyright (c) 1992-2013 The University of Tennessee and The University of Tennessee Research Foundation",
                "Copyright (c) 1993 by Sun Microsystems, Inc.",
                "Copyright (c) 1995, 1996, 1997 Jim Hugunin, hugunin@mit.edu",
                "Copyright (c) 1997 - 2002, Makoto Matsumoto and Takuji Nishimura",
                "Copyright (c) 2000-2013 The University of California Berkeley",
                "Copyright (c) 2002-2017 Free Software Foundation, Inc.",
                "Copyright (c) 2003, 2007-14 Massachusetts Institute of Technology",
                "Copyright (c) 2003, 2007-14 Matteo Frigo",
                "Copyright (c) 2003-2005, Jean-Sebastien Roy (js@jeannot.org)",
                "Copyright (c) 2004, 2006 The Linux Foundation and its contributors",
                "Copyright (c) 2004-2018 Max-Planck-Society author Martin Reinecke",
                "Copyright (c) 2005-2015, NumPy Developers",
                "Copyright (c) 2005-2017, NumPy Developers",
                "Copyright (c) 2005-2018 NVIDIA Corporation Built",
                "Copyright (c) 2005-2021, NumPy Developers",
                "Copyright (c) 2005-2024, NumPy Developers",
                "Copyright (c) 2006, University of Georgia and Pierre G.F. Gerard-Marchant",
                "Copyright (c) 2006-2013 The University of Colorado Denver",
                "Copyright (c) 2007 Cybozu Labs, Inc.",
                "Copyright (c) 2007 Free Software Foundation, Inc. <http://fsf.org/>",
                "Copyright (c) 2007, 2011 David Schultz <das@FreeBSD.ORG>",
                "Copyright (c) 2008 Ian Bicking and Contributors",
                "Copyright (c) 2008-2009 Bjoern Hoehrmann <bjoern@hoehrmann.de>",
                "Copyright (c) 2009 Free Software Foundation, Inc. <http://fsf.org/>",
                "Copyright (c) 2009-2017 The MathJax Consortium",
                "Copyright (c) 2009-2019 Jeff Bezanson, Stefan Karpinski, Viral B. Shah, and other contributors",
                "Copyright (c) 2010 - 2019",
                "Copyright (c) 2010 The Android Open Source Project",
                "Copyright (c) 2010 by Mark Wiebe (mwwiebe@gmail.com) The University of British Columbia",
                "Copyright (c) 2010-2011 by Mark Wiebe (mwwiebe@gmail.com) The University of British Columbia",
                "Copyright (c) 2010-2017 The MathJax Consortium",
                "Copyright (c) 2010-2018 Max-Planck-Society",
                "Copyright (c) 2010-2019 Free Software Foundation, Inc.",
                "Copyright (c) 2010-2022 Max-Planck-Society",
                "Copyright (c) 2011 Enthought, Inc",
                "Copyright (c) 2011 by Enthought, Inc.",
                "Copyright (c) 2011 by Mark Wiebe (mwwiebe@gmail.com) The University of British Columbia",
                "Copyright (c) 2011-2014, The OpenBLAS Project",
                "Copyright (c) 2011-2015 The MathJax Consortium",
                "Copyright (c) 2011-2017 The MathJax Consortium",
                "Copyright (c) 2012 Google Inc.",
                "Copyright (c) 2012 Stephen Montgomery-Smith <stephen@FreeBSD.ORG>",
                "Copyright (c) 2013 Gabriele Svelto <gabriele.svelto@gmail.com>",
                "Copyright (c) 2013 THE PACKAGE'S",
                "Copyright (c) 2013-2017 The MathJax Consortium",
                "Copyright (c) 2014 Mathjax Consortium",
                "Copyright (c) 2014 Ryan Juckett",
                "Copyright (c) 2014-2017 The MathJax Consortium",
                "Copyright (c) 2015 Melissa E. O'Neill",
                "Copyright (c) 2015 Pauli Virtanen",
                "Copyright (c) 2015-2017 Martin Hensel",
                "Copyright (c) 2015-2017 The MathJax Consortium",
                "Copyright (c) 2015-2021 Matthias Klumpp <matthias@tenstral.net>",
                "Copyright (c) 2016 - 2019 Kim Walisch, <kim.walisch@gmail.com>",
                "Copyright (c) 2016-2017 The MathJax Consortium",
                "Copyright (c) 2017",
                "Copyright (c) 2017 Arseny Maslennikov",
                "Copyright (c) 2017 Dylan Baker",
                "Copyright (c) 2017 Intel Corporation",
                "Copyright (c) 2017-2018 Intel Corporation",
                "Copyright (c) 2017-2023 Intel Corporation",
                "Copyright (c) 2018 Intel Corporation",
                "Copyright (c) 2018 Melissa E. O'Neill",
                "Copyright (c) 2018, Meson",
                "Copyright (c) 2019 Kevin Sheppard",
                "Copyright (c) 2019 NumPy Developers",
                "Copyright (c) 2019 Takao Fujiwara <takao.fujiwara1@gmail.com>",
                "Copyright (c) 2019-2020 Peter Bell",
                "Copyright (c) 2020-2023 Intel Corporation",
                "Copyright (c) 2020-2024 Intel Corporation",
                "Copyright (c) 2021 2022, Scientific Python project",
                "Copyright (c) 2021 Intel Corporation",
                "Copyright (c) 2021 Intel Corporation project 'existing project",
                "Copyright (c) 2021 Microsoft Corporation",
                "Copyright (c) 2021 Serge Sans Paille SPDX-License-Identifier BSD-3-Clause Authors Raghuveer Devulapalli <raghuveer.devulapalli@intel.com> Serge Sans Paille <serge.guelton@telecom-bretagne.eu>",
                "Copyright (c) 2021 Serge Sans Paille SPDX-License-Identifier BSD-3-Clause Authors Raghuveer Devulapalli <raghuveer.devulapalli@intel.com> Serge Sans Paille <serge.guelton@telecom-bretagne.eu> Liu Zhuan <zhuan.liu@intel.com>",
                "Copyright (c) 2021 The Meson Developers",
                "Copyright (c) 2021-2023 Intel Corporation",
                "Copyright (c) 2021-2024 Intel Corporation",
                "Copyright (c) 2022 Intel Corporation",
                "Copyright (c) 2022 Intel Corporation SPDX-License-Identifier BSD-3-Clause Authors Liu Zhuan <zhuan.liu@intel.com> Tang Xi <xi.tang@intel.com>",
                "Copyright (c) 2022 Intel Corporation SPDX-License-Identifier BSD-3-Clause Authors Raghuveer Devulapalli <raghuveer.devulapalli@intel.com>",
                "Copyright (c) 2022 Intel Corporation SPDX-License-Identifier BSD-3-Clause Authors Raghuveer Devulapalli <raghuveer.devulapalli@intel.com> Matthew Sterrett <matthew.sterrett@intel.com>",
                "Copyright (c) 2022, Intel",
                "Copyright (c) 2022-2023 Intel Corporation",
                "Copyright (c) 2022-2024 Intel Corporation",
                "Copyright (c) 2023 Intel Corporation",
                "Copyright (c) 2023 Red Hat, Inc",
                "Copyright (c) 2023, NumPy Developers",
                "Copyright (c) 2023-2024 Intel Corporation",
                "Copyright (c) 2024 Intel Corporation",
                "Copyright (c) 2024 Tan Ping Liang, Peter Bell",
                "Copyright (c) Donald Stufft and individual contributors",
                "Copyright (c) The Highway Project Authors",
                "Copyright (c) the JPEG XL Project",
                "Copyright (c) the JPEG XL Project Authors",
                "Copyright 1996-2023 Intel Corporation",
                "Copyright 1999 2011 Pearu Peterson",
                "Copyright 1999, 2000, 2001 Regents of the University of California",
                "Copyright 2002 Pearu Peterson",
                "Copyright 2007-2018 by the Sphinx team",
                "Copyright 2010-2012, D. E. Shaw Research",
                "Copyright 2011 by Enthought, Inc",
                "Copyright 2011 present NumPy Developers",
                "Copyright 2011 present NumPy Developers. https://numpy.org/doc/stable/f2py/index.html",
                "Copyright 2012-2016 The Meson development team",
                "Copyright 2012-2017 The Meson development team",
                "Copyright 2012-2019 The Meson development team",
                "Copyright 2012-2020 Meson development team",
                "Copyright 2012-2020 The Meson development team",
                "Copyright 2012-2021 The Meson development team",
                "Copyright 2012-2022 The Meson development team",
                "Copyright 2012-2023 The Meson development team",
                "Copyright 2013 The Meson development team",
                "Copyright 2013-2014 The Meson development team",
                "Copyright 2013-2016 The Meson development team",
                "Copyright 2013-2017 The Meson development team",
                "Copyright 2013-2018 The Meson development team",
                "Copyright 2013-2019 The Meson development team",
                "Copyright 2013-2020 The Meson development team",
                "Copyright 2013-2021 The Meson development team",
                "Copyright 2013-2024 Contributors",
                "Copyright 2013-2024 The Meson development team",
                "Copyright 2014 Jussi Pakkanen",
                "Copyright 2014 Melissa O'Neill <oneill@pcg-random.org>",
                "Copyright 2014-2016 The Meson development team",
                "Copyright 2014-2017 The Meson development team",
                "Copyright 2014-2019 The Meson development team",
                "Copyright 2014-2021 The Meson development team",
                "Copyright 2015 Robert Kern <robert.kern@gmail.com>",
                "Copyright 2015 The Meson development team",
                "Copyright 2015-2016 The Meson development team",
                "Copyright 2015-2022 The Meson development team",
                "Copyright 2016 The Meson development team",
                "Copyright 2016-2017 The Meson development team",
                "Copyright 2016-2018 The Meson development team",
                "Copyright 2016-2021 Matthew Brett, Isuru Fernando, Matti Picus",
                "Copyright 2016-2021 The Meson development team",
                "Copyright 2016-2022 The Meson development team",
                "Copyright 2017 Google Inc.",
                "Copyright 2017 Niklas Claesson",
                "Copyright 2017 The Meson development team",
                "Copyright 2017, 2019 The Meson development team",
                "Copyright 2017-2021 The Meson development team",
                "Copyright 2018 The Meson development team",
                "Copyright 2019 Google LLC",
                "Copyright 2019 Red Hat, Inc.",
                "Copyright 2019 The Meson development team",
                "Copyright 2019 The meson development team",
                "Copyright 2019-2022 The meson development team",
                "Copyright 2020 Google LLC",
                "Copyright 2020 Intel Corporation",
                "Copyright 2020 The Meson development team",
                "Copyright 2021 Google LLC",
                "Copyright 2021 The Meson development team",
                "Copyright 2021 The Meson development team SPDX-license-identifier",
                "Copyright 2021 The Meson development team from",
                "Copyright 2022 Google LLC",
                "Copyright 2022 Intel Corporation",
                "Copyright 2022 Mark Bolhuis <mark@bolhuis.dev>",
                "Copyright 2022 The Meson development team",
                "Copyright 2023 Arm Limited and/or its affiliates <open-source-office@arm.com>",
                "Copyright 2023 Google LLC",
                "Copyright 2023 Matthew Kolbe",
                "Copyright 2023 The Meson development team from",
                "Copyright 2023,2024 Arm Limited and/or its affiliates <open-source-office@arm.com>",
                "Copyright 2024 Arm Limited and/or its affiliates <open-source-office@arm.com>",
                "Copyright 2024 Google LLC",
                "Copyright 2024 The Meson development team",
                "Copyright 2025 Arm Limited and/or its affiliates <open-source-office@arm.com>",
                "Copyright Absoft Corporation",
                "Copyright Absoft Corporation 1994-1998 mV2 Cray Research, Inc. 1994-1996 CF90",
                "Copyright Absoft Corporation 1994-2002 Absoft Pro FORTRAN",
                "Copyright Google LLC 2021 Matthew Kolbe",
                "Copyright Stone Tickle <lattis@mochiro.moe>",
                "copyright 2022, Victor Stinner",
                "copyright f'2008- year, NumPy Developers",
                "copyright f'2017- year, NumPy Developers"
            ],
            "file-count": 7787,
            "sha256": "dbdc15f0c81611925f382dfa97b3bd0bc2c1ce19d4fe50482cb0ddc12ba30020",
            "source": "https://files.pythonhosted.org/packages/fb/90/8956572f5c4ae52201fdec7ba2044b2c882832dcec7d5d0922c9e9acf2de/numpy-2.2.3.tar.gz",
            "status": "restricted"
        }
    ]
}