{
    "id": "go/golang/google.golang.org/grpc/v1.37.0",
    "license": "Apache-2.0",
    "authority": "https://gitlab.eclipse.org/eclipsefdn/emo-team/iplab/-/issues/12572",
    "source": "https://proxy.golang.org/google.golang.org/grpc/@v/v1.37.0.zip",
    "status": "approved",
    "scans": [
        {
            "date": "December 26, 2023 at 10:06:08 a.m. GMT",
            "authority": "https://gitlab.eclipse.org/eclipsefdn/emo-team/iplab/-/issues/12572",
            "scancode-version": "31.2.1",
            "licenses-discovered": [
                "Apache-2.0"
            ],
            "copyrights": [
                "Copyright 2014 gRPC",
                "Copyright 2015 The gRPC",
                "Copyright 2015 gRPC",
                "Copyright 2015-2016 gRPC",
                "Copyright 2016 The gRPC",
                "Copyright 2016 gRPC",
                "Copyright 2017 gRPC",
                "Copyright 2018 The gRPC",
                "Copyright 2018 gRPC",
                "Copyright 2019 Istio Authors",
                "Copyright 2019 gRPC",
                "Copyright 2020 The gRPC",
                "Copyright 2020 gRPC",
                "Copyright 2021 gRPC"
            ],
            "file-count": 623,
            "sha256": "650d12186b2c0c84c9d55da615f01fe37f518872b86572bfb4d6bb1108238a8f",
            "source": "https://proxy.golang.org/google.golang.org/grpc/@v/v1.37.0.zip",
            "status": "approved"
        }
    ]
}