{
    "id": "npm/npmjs/-/css-to-react-native/3.1.0",
    "license": "MIT",
    "authority": "https://gitlab.eclipse.org/eclipsefdn/emo-team/iplab/-/issues/7033",
    "source": "https://registry.yarnpkg.com/css-to-react-native/-/css-to-react-native-3.1.0.tgz",
    "status": "approved",
    "scans": [
        {
            "date": "February 7, 2023 at 7:28:45 p.m. GMT",
            "authority": "https://gitlab.eclipse.org/eclipsefdn/emo-team/iplab/-/issues/7033",
            "scancode-version": "31.2.1",
            "licenses-discovered": [
                "MIT"
            ],
            "copyrights": [
                "Copyright (c) 2016 Jacob Parker and Maximilian Stoiber",
                "Copyright (c) 2019 Krister Kari, Jacob Parker, and Maximilian Stoiber"
            ],
            "file-count": 41,
            "sha256": "41febbf77df92aee0e21fbf3fc9ebd71af6857f035944129a7f92078a60acfd7",
            "source": "https://registry.yarnpkg.com/css-to-react-native/-/css-to-react-native-3.1.0.tgz",
            "status": "approved"
        }
    ]
}