{
    "id": "maven/mavencentral/org.springframework/spring-webmvc/6.0.2",
    "license": "Apache-2.0",
    "authority": "https://gitlab.eclipse.org/eclipsefdn/emo-team/iplab/-/issues/5944",
    "source": "https://search.maven.org/remotecontent?filepath=org/springframework/spring-webmvc/6.0.2/spring-webmvc-6.0.2-sources.jar",
    "status": "approved",
    "scans": [
        {
            "date": "December 21, 2022 at 4:21:04 p.m. GMT",
            "authority": "https://gitlab.eclipse.org/eclipsefdn/emo-team/iplab/-/issues/5944",
            "scancode-version": "31.2.1",
            "licenses-discovered": [
                "Apache-2.0"
            ],
            "copyrights": [
                "Copyright 2002-2010 the original author or authors",
                "Copyright 2002-2012 the original author or authors",
                "Copyright 2002-2013 the original author or authors",
                "Copyright 2002-2014 the original author or authors",
                "Copyright 2002-2015 the original author or authors",
                "Copyright 2002-2016 the original author or authors",
                "Copyright 2002-2017 the original author or authors",
                "Copyright 2002-2018 the original author or authors",
                "Copyright 2002-2019 the original author or authors",
                "Copyright 2002-2020 the original author or authors",
                "Copyright 2002-2021 the original author or authors",
                "Copyright 2002-2022 the original author or authors"
            ],
            "file-count": 367,
            "sha256": "c26502fd026122610c45688b27a66a9d5e2b83a757ba05236e3982db7870436b",
            "source": "https://search.maven.org/remotecontent?filepath=org/springframework/spring-webmvc/6.0.2/spring-webmvc-6.0.2-sources.jar",
            "status": "approved"
        }
    ]
}