{
    "id": "npm/npmjs/@mui/utils/5.15.14",
    "license": "MIT AND OFL-1.1 AND CC-BY-3.0",
    "authority": "https://gitlab.eclipse.org/eclipsefdn/emo-team/iplab/-/issues/13927",
    "source": "https://github.com/mui/material-ui/archive/refs/tags/v5.15.14.zip",
    "status": "approved",
    "scans": [
        {
            "date": "March 21, 2024 at 9:22:44 p.m. GMT",
            "authority": "https://gitlab.eclipse.org/eclipsefdn/emo-team/iplab/-/issues/13927",
            "scancode-version": "31.2.1",
            "licenses-discovered": [
                "MIT",
                "LicenseRef-scancode-free-unknown",
                "LGPL-2.0-or-later AND MIT",
                "LicenseRef-scancode-commercial-license",
                "OFL-1.1",
                "CC-BY-3.0",
                "JSON AND MIT"
            ],
            "copyrights": [
                "(c) Your company",
                "Copyright (c) 2014 Call-Em-All",
                "Copyright (c) color inherit https://mui.com/",
                "Copyright 2017-2021 Indian Type Foundry",
                "Copyright 2018 IBM Corp.",
                "Copyright 2020"
            ],
            "file-count": 42972,
            "sha256": "79cc83a9a991d29205a2aaebc0241e6f44bd495b34526a0b8403ec8cda14847f",
            "source": "https://github.com/mui/material-ui/archive/refs/tags/v5.15.14.zip",
            "status": "restricted"
        }
    ]
}
