{
    "id": "maven/mavencentral/org.glassfish.hk2/class-model/2.5.0",
    "license": "EPL-2.0 OR GPL-2.0 WITH Classpath-exception-2.0",
    "licenses-discovered": [
        "EPL-2.0 AND (GPL-2.0-only WITH Classpath-exception-2.0)"
    ],
    "file-count": 45,
    "scancode-version": "30.1.0",
    "authority": "https://gitlab.eclipse.org/eclipsefdn/emo-team/iplab/-/issues/2577",
    "source": "https://search.maven.org/remotecontent?filepath=org/glassfish/hk2/class-model/2.5.0/class-model-2.5.0-sources.jar",
    "status": "approved"
}
