{
    "id": "git/github/spf13/viper/v1.7.0",
    "license": "MIT",
    "licenses-discovered": [
        "MIT"
    ],
    "file-count": 18,
    "scancode-version": "30.1.0",
    "authority": "https://gitlab.eclipse.org/eclipsefdn/emo-team/iplab/-/issues/2604",
    "source": "https://github.com/spf13/viper/archive/refs/tags/v1.7.0.zip",
    "status": "approved"
}