{
    "id": "npm/npmjs/@octokit/openapi-types/20.0.0",
    "license": "MIT",
    "authority": "https://gitlab.eclipse.org/eclipsefdn/emo-team/iplab/-/issues/14564",
    "source": "https://github.com/octokit/openapi-types.ts/archive/refs/tags/v20.0.0.zip",
    "status": "approved",
    "scans": [
        {
            "date": "April 24, 2024 at 6:13:22 a.m. GMT",
            "authority": "https://gitlab.eclipse.org/eclipsefdn/emo-team/iplab/-/issues/14564",
            "scancode-version": "31.2.1",
            "licenses-discovered": [
                "MIT",
                "AGPL-3.0-only AND Apache-2.0 AND CC0-1.0 AND GPL-3.0-only AND LGPL-3.0-only AND LicenseRef-scancode-proprietary-license AND MIT AND MPL-2.0 AND Unlicense",
                "AGPL-3.0-only AND Apache-2.0 AND GPL-3.0-only AND LGPL-3.0-only AND LicenseRef-scancode-proprietary-license AND MIT AND MPL-2.0 AND Unlicense",
                "CC0-1.0 AND LicenseRef-scancode-proprietary-license AND MIT",
                "LicenseRef-scancode-proprietary-license AND MIT"
            ],
            "copyrights": [
                "Copyright 2020 Gregor Martynus"
            ],
            "file-count": 62,
            "sha256": "4d4f24e1c72747d736bdeb840a16ddc11af60db79e0ce259d2e6520a525a092c",
            "source": "https://github.com/octokit/openapi-types.ts/archive/refs/tags/v20.0.0.zip",
            "status": "restricted"
        }
    ]
}
