{
    "id": "nuget/nuget/-/JetBrains.Annotations/2024.2.0",
    "license": "MIT",
    "authority": "https://gitlab.eclipse.org/eclipsefdn/emo-team/iplab/-/issues/15665",
    "source": "https://github.com/JetBrains/JetBrains.Annotations/archive/refs/tags/2024.2.zip",
    "status": "approved",
    "scans": [
        {
            "date": "July 11, 2024 at 8:54:02 p.m. GMT",
            "authority": "https://gitlab.eclipse.org/eclipsefdn/emo-team/iplab/-/issues/15665",
            "scancode-version": "31.2.1",
            "licenses-discovered": [
                "MIT"
            ],
            "copyrights": [
                "Copyright (c) 2016 JetBrains http://www.jetbrains.com",
                "Copyright (c) 2016-2024 JetBrains s.r.o."
            ],
            "file-count": 8,
            "sha256": "4ae8f5d97d47fe8b0260962ff8c7b680b78fd54793eae29599f2600421c36eea",
            "source": "https://github.com/JetBrains/JetBrains.Annotations/archive/refs/tags/2024.2.zip",
            "status": "approved"
        }
    ]
}