{
    "id": "npm/npmjs/@emnapi/core/1.2.0",
    "license": "MIT AND CC0-1.0 AND (MIT OR NCSA) AND ISC",
    "authority": "https://gitlab.eclipse.org/eclipsefdn/emo-team/iplab/-/issues/16288",
    "source": "https://github.com/toyobayashi/emnapi/archive/refs/tags/v1.2.0.zip",
    "status": "approved",
    "scans": [
        {
            "date": "September 25, 2024, 4:51:17 p.m. GMT",
            "authority": "https://gitlab.eclipse.org/eclipsefdn/emo-team/iplab/-/issues/16288",
            "scancode-version": "31.2.1",
            "licenses-discovered": [
                "MIT",
                "CC0-1.0",
                "MIT AND NCSA",
                "ISC"
            ],
            "copyrights": [
                "Copyright (c) 2013, Ben Noordhuis <info@bnoordhuis.nl>",
                "Copyright (c) 2021-present Toyobayashi",
                "Copyright 2018 The Emscripten Authors",
                "Copyright Joyent, Inc. and other Node contributors"
            ],
            "file-count": 448,
            "sha256": "bfdde1dc6ac1928f7fac56557c742b93858c9fdf9410e907295f907e8e3e7ae0",
            "source": "https://github.com/toyobayashi/emnapi/archive/refs/tags/v1.2.0.zip",
            "status": "restricted"
        }
    ]
}