{
    "id": "maven/mavencentral/org.apache.maven.wagon/wagon-http/3.5.3",
    "license": "Apache-2.0",
    "authority": "https://gitlab.eclipse.org/eclipsefdn/emo-team/iplab/-/issues/6005",
    "source": "https://search.maven.org/remotecontent?filepath=org/apache/maven/wagon/wagon-http/3.5.3/wagon-http-3.5.3-sources.jar",
    "status": "approved",
    "scans": [
        {
            "date": "December 23, 2022 at 6:52:04 p.m. GMT",
            "authority": "https://gitlab.eclipse.org/eclipsefdn/emo-team/iplab/-/issues/6005",
            "scancode-version": "31.2.1",
            "licenses-discovered": [
                "Apache-2.0"
            ],
            "copyrights": [
            ],
            "file-count": 6,
            "sha256": "b816d1cc79685a65dba62c783be5d7abd9208041e4b67d59c47f64dca005e815",
            "source": "https://search.maven.org/remotecontent?filepath=org/apache/maven/wagon/wagon-http/3.5.3/wagon-http-3.5.3-sources.jar",
            "status": "approved"
        }
    ]
}