{
    "id": "maven/mavencentral/software.amazon.awssdk/metrics-spi/2.24.1",
    "license": "Apache-2.0",
    "authority": "https://gitlab.eclipse.org/eclipsefdn/emo-team/iplab/-/issues/13239",
    "source": "https://repo1.maven.org/maven2/software/amazon/awssdk/metrics-spi/2.24.1/metrics-spi-2.24.1-sources.jar",
    "status": "approved",
    "scans": [
        {
            "date": "February 14, 2024 at 3:10:25 p.m. GMT",
            "authority": "https://gitlab.eclipse.org/eclipsefdn/emo-team/iplab/-/issues/13239",
            "scancode-version": "31.2.1",
            "licenses-discovered": [
                "Apache-2.0"
            ],
            "copyrights": [
                "Copyright Amazon.com, Inc. or its affiliates"
            ],
            "file-count": 18,
            "sha256": "842e53ee820f97a38741df3804390aa69dc99eed3e43bcc43ec89e127d1a9814",
            "source": "https://repo1.maven.org/maven2/software/amazon/awssdk/metrics-spi/2.24.1/metrics-spi-2.24.1-sources.jar",
            "status": "approved"
        }
    ]
}