{
    "id": "maven/mavencentral/org.webjars/swagger-ui/5.2.0",
    "license": "Apache-2.0",
    "authority": "https://gitlab.eclipse.org/eclipsefdn/emo-team/iplab/-/issues/10221",
    "source": "https://github.com/webjars/swagger-ui/archive/refs/tags/swagger-ui-5.2.0.zip",
    "status": "approved",
    "scans": [
        {
            "date": "August 24, 2023 at 12:30:37 p.m. GMT",
            "authority": "https://gitlab.eclipse.org/eclipsefdn/emo-team/iplab/-/issues/10221",
            "scancode-version": "31.2.1",
            "licenses-discovered": [
                "Apache-2.0"
            ],
            "copyrights": [
            ],
            "file-count": 2,
            "sha256": "1a5d20b0511e0a4f1fc5e377f26b39c38e8e03654570f1226693fb77ac3d1e4f",
            "source": "https://github.com/webjars/swagger-ui/archive/refs/tags/swagger-ui-5.2.0.zip",
            "status": "approved"
        }
    ]
}