{
    "id": "pypi/pypi/-/protobuf/4.25.1",
    "license": "BSD-3-Clause",
    "authority": "https://gitlab.eclipse.org/eclipsefdn/emo-team/iplab/-/issues/12089",
    "source": "https://files.pythonhosted.org/packages/59/5f/b2d00e6a08d97656a27832d4d146e03ffc46ae74b4699740674bea13a905/protobuf-4.25.1.tar.gz",
    "status": "approved",
    "scans": [
        {
            "date": "December 15, 2023 at 11:14:55 a.m. GMT",
            "authority": "https://gitlab.eclipse.org/eclipsefdn/emo-team/iplab/-/issues/12089",
            "scancode-version": "31.2.1",
            "licenses-discovered": [
                "BSD-3-Clause"
            ],
            "copyrights": [
                "Copyright 2007 Google Inc.",
                "Copyright 2008 Google Inc.",
                "Copyright 2023 Google LLC."
            ],
            "file-count": 248,
            "sha256": "57d65074b4f5baa4ab5da1605c02be90ac20c8b40fb137d6a8df9f416b0d0ce2",
            "source": "https://files.pythonhosted.org/packages/59/5f/b2d00e6a08d97656a27832d4d146e03ffc46ae74b4699740674bea13a905/protobuf-4.25.1.tar.gz",
            "status": "approved"
        }
    ]
}