{
    "id": "npm/npmjs/-/tsp-typescript-client/0.5.0",
    "license": "MIT",
    "authority": "https://gitlab.eclipse.org/eclipsefdn/emo-team/iplab/-/issues/17102",
    "source": "https://github.com/eclipse-cdt-cloud/tsp-typescript-client/archive/refs/tags/v0.5.0.zip",
    "status": "approved",
    "scans": [
        {
            "date": "November 6, 2024, 8:33:41 p.m. GMT",
            "authority": "https://gitlab.eclipse.org/eclipsefdn/emo-team/iplab/-/issues/17102",
            "scancode-version": "31.2.1",
            "licenses-discovered": [
                "MIT",
                "JSON AND MIT"
            ],
            "copyrights": [
                "Copyright (c) 2019, 2021 Ericsson and others"
            ],
            "file-count": 79,
            "sha256": "e68bbe46c2cec597eaa6d17e2b37b07cef90999c8b9f4685f43239c08a4efe99",
            "source": "https://github.com/eclipse-cdt-cloud/tsp-typescript-client/archive/refs/tags/v0.5.0.zip",
            "status": "restricted"
        }
    ]
}