{
    "id": "npm/npmjs/-/node-abi/3.40.0",
    "license": "MIT",
    "authority": "https://gitlab.eclipse.org/eclipsefdn/emo-team/iplab/-/issues/8210",
    "source": "https://github.com/electron/node-abi/archive/v3.40.0.zip",
    "status": "approved",
    "scans": [
        {
            "date": "May 5, 2023 at 7:57:51 a.m. GMT",
            "authority": "https://gitlab.eclipse.org/eclipsefdn/emo-team/iplab/-/issues/8210",
            "scancode-version": "31.2.1",
            "licenses-discovered": [
                "MIT"
            ],
            "copyrights": [
                "Copyright (c) 2016 Lukas Geiger"
            ],
            "file-count": 14,
            "sha256": "2b441ae99a11fd582818e553cc28354be1f40e6b0f7e823d809fd7c4f1e521f9",
            "source": "https://github.com/electron/node-abi/archive/v3.40.0.zip",
            "status": "approved"
        }
    ]
}