{
    "id": "maven/mavencentral/software.amazon.awssdk/auth/2.24.1",
    "license": "Apache-2.0",
    "authority": "https://gitlab.eclipse.org/eclipsefdn/emo-team/iplab/-/issues/13256",
    "source": "https://repo1.maven.org/maven2/software/amazon/awssdk/auth/2.24.1/auth-2.24.1-sources.jar",
    "status": "approved",
    "scans": [
        {
            "date": "February 14, 2024 at 2:34:02 p.m. GMT",
            "authority": "https://gitlab.eclipse.org/eclipsefdn/emo-team/iplab/-/issues/13256",
            "scancode-version": "31.2.1",
            "licenses-discovered": [
                "Apache-2.0"
            ],
            "copyrights": [
                "Copyright Amazon.com, Inc. or its affiliates"
            ],
            "file-count": 83,
            "sha256": "a49ae7c826deea1dcefc5df6a9ce1a7e14a3a391b51bc64d69d5d17f91ef47bf",
            "source": "https://repo1.maven.org/maven2/software/amazon/awssdk/auth/2.24.1/auth-2.24.1-sources.jar",
            "status": "approved"
        }
    ]
}