{
    "id": "maven/mavencentral/org.geckoprojects.emf/org.gecko.emf.osgi.component/4.5.0",
    "license": "EPL-2.0",
    "authority": "https://gitlab.eclipse.org/eclipsefdn/emo-team/iplab/-/issues/6876",
    "source": "https://search.maven.org/remotecontent?filepath=org/geckoprojects/emf/org.gecko.emf.osgi.component/4.5.0/org.gecko.emf.osgi.component-4.5.0-sources.jar",
    "status": "approved",
    "scans": [
        {
            "date": "January 30, 2023 at 10:28:49 p.m. GMT",
            "authority": "https://gitlab.eclipse.org/eclipsefdn/emo-team/iplab/-/issues/6876",
            "scancode-version": "31.2.1",
            "licenses-discovered": [
                "EPL-2.0"
            ],
            "copyrights": [
                "Copyright (c) 2012 - 2022 Data In Motion and others"
            ],
            "file-count": 22,
            "sha256": "ac71f7ecf09a613e9392933dea6cc757f461252987f5ef3eb87b53fca3c595fd",
            "source": "https://search.maven.org/remotecontent?filepath=org/geckoprojects/emf/org.gecko.emf.osgi.component/4.5.0/org.gecko.emf.osgi.component-4.5.0-sources.jar",
            "status": "approved"
        }
    ]
}