{
    "license": "MIT",
    "file-count": 21,
    "authority": "https://gitlab.eclipse.org/eclipsefdn/emo-team/iplab/-/issues/894",
    "scancode-version": "21.3.31",
    "licenses-discovered": [
        "MIT"
    ],
    "id": "npm/npmjs/-/shx/0.3.2",
    "source": "https://github.com/shelljs/shx/archive/v0.3.2.zip",
    "status": "approved"
}