{
    "id": "git/github/JetBrains/intellij-community%2fjava-decompiler/231.9011.34",
    "license": "Apache-2.0",
    "authority": "https://gitlab.eclipse.org/eclipsefdn/emo-team/iplab/-/issues/9099",
    "source": "https://www.jetbrains.com/intellij-repository/releases/com/jetbrains/intellij/java/java-decompiler-engine/231.9011.34/java-decompiler-engine-231.9011.34-sources.jar",
    "status": "approved",
    "scans": [
        {
            "date": "June 21, 2023 at 1:29:03 p.m. GMT",
            "authority": "https://gitlab.eclipse.org/eclipsefdn/emo-team/iplab/-/issues/9099",
            "scancode-version": "31.2.1",
            "licenses-discovered": [
                "Apache-2.0"
            ],
            "copyrights": [
                "Copyright 2000-2017 JetBrains s.r.o.",
                "Copyright 2000-2018 JetBrains s.r.o.",
                "Copyright 2000-2020 JetBrains s.r.o.",
                "Copyright 2000-2021 JetBrains s.r.o.",
                "Copyright 2000-2021 JetBrains s.r.o. and contributors",
                "Copyright 2000-2022 JetBrains s.r.o. and contributors",
                "Copyright 2000-2023 JetBrains s.r.o. and contributors"
            ],
            "file-count": 183,
            "sha256": "8467cdd963ebbc011d8ed68ae43d5f6b59435cac876684c74f75ea915e8172af",
            "source": "https://www.jetbrains.com/intellij-repository/releases/com/jetbrains/intellij/java/java-decompiler-engine/231.9011.34/java-decompiler-engine-231.9011.34-sources.jar",
            "status": "approved"
        }
    ]
}