{
    "id": "maven/mavencentral/com.vaadin/vaadin-custom-field-flow/24.3.7",
    "license": "Apache-2.0",
    "authority": "https://gitlab.eclipse.org/eclipsefdn/emo-team/iplab/-/issues/13787",
    "source": "https://repo1.maven.org/maven2/com/vaadin/vaadin-custom-field-flow/24.3.7/vaadin-custom-field-flow-24.3.7-sources.jar",
    "status": "approved",
    "scans": [
        {
            "date": "March 15, 2024 at 12:50:21 p.m. GMT",
            "authority": "https://gitlab.eclipse.org/eclipsefdn/emo-team/iplab/-/issues/13787",
            "scancode-version": "31.2.1",
            "licenses-discovered": [
                "Apache-2.0"
            ],
            "copyrights": [
                "Copyright 2000-2023 Vaadin Ltd."
            ],
            "file-count": 6,
            "sha256": "487442aa381ba3f6d0447372288699fa02e28dc6bd7e6105c6cccc64054237d6",
            "source": "https://repo1.maven.org/maven2/com/vaadin/vaadin-custom-field-flow/24.3.7/vaadin-custom-field-flow-24.3.7-sources.jar",
            "status": "approved"
        }
    ]
}