{
    "id": "maven/mavencentral/software.amazon.awssdk/aws-query-protocol/2.21.5",
    "license": "Apache-2.0",
    "authority": "https://gitlab.eclipse.org/eclipsefdn/emo-team/iplab/-/issues/11123",
    "source": "https://repo.maven.apache.org/maven2/software/amazon/awssdk/aws-query-protocol/2.21.5/aws-query-protocol-2.21.5-sources.jar",
    "status": "approved",
    "scans": [
        {
            "date": "October 24, 2023 at 11:17:19 a.m. GMT",
            "authority": "https://gitlab.eclipse.org/eclipsefdn/emo-team/iplab/-/issues/11123",
            "scancode-version": "31.2.1",
            "licenses-discovered": [
                "Apache-2.0"
            ],
            "copyrights": [
                "Copyright Amazon.com, Inc. or its affiliates"
            ],
            "file-count": 27,
            "sha256": "912d0fcfe463e7debb5e85299691ead01892ac0cf8531b52335014c6e5bc9d75",
            "source": "https://repo.maven.apache.org/maven2/software/amazon/awssdk/aws-query-protocol/2.21.5/aws-query-protocol-2.21.5-sources.jar",
            "status": "approved"
        }
    ]
}