{
    "id": "npm/npmjs/@axa-fr/oidc-client/7.24.1",
    "license": "MIT",
    "authority": "https://gitlab.eclipse.org/eclipsefdn/emo-team/iplab/-/issues/18940",
    "source": "https://github.com/AxaFrance/oidc-client/archive/refs/tags/v7.24.1.zip",
    "status": "approved",
    "scans": [
        {
            "date": "January 19, 2025 at 11:45:07 a.m. GMT",
            "authority": "https://gitlab.eclipse.org/eclipsefdn/emo-team/iplab/-/issues/18940",
            "scancode-version": "31.2.1",
            "licenses-discovered": [
                "MIT"
            ],
            "copyrights": [
                "Copyright (c) 2018 Axa France IARD / Axa France VIE"
            ],
            "file-count": 199,
            "sha256": "3ab90126cd2c77d89cdefc833c952a8161984683980bce6669abab07062ed097",
            "source": "https://github.com/AxaFrance/oidc-client/archive/refs/tags/v7.24.1.zip",
            "status": "approved"
        }
    ]
}