{
    "id": "npm/npmjs/-/are-docs-informative/0.0.2",
    "license": "MIT",
    "authority": "https://gitlab.eclipse.org/eclipsefdn/emo-team/iplab/-/issues/8056",
    "source": "https://registry.yarnpkg.com/are-docs-informative/-/are-docs-informative-0.0.2.tgz",
    "status": "approved",
    "scans": [
        {
            "date": "April 28, 2023 at 3:39:11 p.m. GMT",
            "authority": "https://gitlab.eclipse.org/eclipsefdn/emo-team/iplab/-/issues/8056",
            "scancode-version": "31.2.1",
            "licenses-discovered": [
                "MIT",
                "JSON AND MIT"
            ],
            "copyrights": [
            ],
            "file-count": 7,
            "sha256": "0cf06df6aa821c0f96b57e64094208e3f6f1f17b0003b737eef6d63ef6d1f87a",
            "source": "https://registry.yarnpkg.com/are-docs-informative/-/are-docs-informative-0.0.2.tgz",
            "status": "restricted"
        }
    ]
}
