{
    "id": "maven/mavencentral/org.keycloak/keycloak-crypto-default/19.0.3",
    "license": "Apache-2.0",
    "licenses-discovered": [
        "Apache-2.0"
    ],
    "copyrights": [
        "Copyright 2016 Red Hat, Inc. and/or its affiliates and other contributors",
        "Copyright 2017 Red Hat, Inc. and/or its affiliates and other contributors",
        "Copyright 2022 Red Hat, Inc. and/or its affiliates and other contributors",
        "Copyright 2022 Red Hat, Inc. and/or its affiliates ~ and other contributors"
    ],
    "file-count": 9,
    "scancode-version": "31.2.1",
    "authority": "https://gitlab.eclipse.org/eclipsefdn/emo-team/iplab/-/issues/4094",
    "source": "https://search.maven.org/remotecontent?filepath=org/keycloak/keycloak-crypto-default/19.0.3/keycloak-crypto-default-19.0.3-sources.jar",
    "status": "approved"
}