{
    "id": "maven/mavencentral/org.jobrunr/jobrunr-spring-boot-3-starter/6.2.0",
    "license": "LGPL-3.0-or-later OR LicenseRef-Commercial",
    "authority": "https://gitlab.eclipse.org/eclipsefdn/emo-team/iplab/-/issues/9633",
    "source": "https://repo.maven.apache.org/maven2/org/jobrunr/jobrunr-spring-boot-3-starter/6.2.0/jobrunr-spring-boot-3-starter-6.2.0-sources.jar",
    "status": "approved",
    "scans": [
        {
            "date": "July 19, 2023 at 1:00:11 p.m. GMT",
            "authority": "https://gitlab.eclipse.org/eclipsefdn/emo-team/iplab/-/issues/9633",
            "scancode-version": "31.2.1",
            "licenses-discovered": [
            ],
            "copyrights": [
            ],
            "file-count": 17,
            "sha256": "7bc5edc026c89f7c13c10a245244eb7543808a2d44f578546daca38f9b006c8e",
            "source": "https://repo.maven.apache.org/maven2/org/jobrunr/jobrunr-spring-boot-3-starter/6.2.0/jobrunr-spring-boot-3-starter-6.2.0-sources.jar",
            "status": "restricted"
        }
    ]
}
