{
    "id": "git/github/golang/sys/d0b11bdaac8a",
    "license": "Apache-2.0 AND BSD-3-Clause AND BSD-3-Clause",
    "licenses-discovered": [
        "Apache-2.0 AND BSD-3-Clause",
        "BSD-3-Clause"
    ],
    "copyrights": [
        "Copyright (c) The Go Authors"
    ],
    "file-count": 399,
    "scancode-version": "30.1.0",
    "authority": "https://gitlab.eclipse.org/eclipsefdn/emo-team/iplab/-/issues/3673",
    "source": "https://github.com/golang/sys/archive/d0b11bdaac8a.zip",
    "status": "approved"
}