{
    "id": "maven/mavencentral/org.springframework.boot/spring-boot-starter-freemarker/3.0.2",
    "license": "Apache-2.0",
    "authority": "https://gitlab.eclipse.org/eclipsefdn/emo-team/iplab/-/issues/7295",
    "source": "https://search.maven.org/remotecontent?filepath=org/springframework/boot/spring-boot-starter-freemarker/3.0.2/spring-boot-starter-freemarker-3.0.2-sources.jar",
    "status": "approved",
    "scans": [
        {
            "date": "March 1, 2023 at 3:22:26 p.m. GMT",
            "authority": "https://gitlab.eclipse.org/eclipsefdn/emo-team/iplab/-/issues/7295",
            "scancode-version": "31.2.1",
            "licenses-discovered": [
                "Apache-2.0"
            ],
            "copyrights": [
            ],
            "file-count": 2,
            "sha256": "4d80759610a1b92235d533d198545c0a36405e4811496257f31a716faec4472c",
            "source": "https://search.maven.org/remotecontent?filepath=org/springframework/boot/spring-boot-starter-freemarker/3.0.2/spring-boot-starter-freemarker-3.0.2-sources.jar",
            "status": "approved"
        }
    ]
}