{
    "id": "crate/cratesio/-/protobuf/3.6.0",
    "license": "MIT",
    "authority": "https://gitlab.eclipse.org/eclipsefdn/emo-team/iplab/-/issues/16607",
    "source": "https://crates.io/api/v1/crates/protobuf/3.6.0/download",
    "status": "approved",
    "scans": [
        {
            "date": "October 10, 2024, 2:13:50 p.m. GMT",
            "authority": "https://gitlab.eclipse.org/eclipsefdn/emo-team/iplab/-/issues/16607",
            "scancode-version": "31.2.1",
            "licenses-discovered": [
                "MIT"
            ],
            "copyrights": [
                "Copyright (c) 2019 Stepan Koltsov"
            ],
            "file-count": 132,
            "sha256": "3018844a02746180074f621e847703737d27d89d7f0721a7a4da317f88b16385",
            "source": "https://crates.io/api/v1/crates/protobuf/3.6.0/download",
            "status": "approved"
        }
    ]
}