{
    "id": "crate/cratesio/-/siphasher/0.3.10",
    "license": "Apache-2.0 AND MIT",
    "authority": "https://gitlab.eclipse.org/eclipsefdn/emo-team/iplab/-/issues/6665",
    "source": "https://crates.io/api/v1/crates/siphasher/0.3.10/download",
    "status": "approved",
    "scans": [
        {
            "date": "January 25, 2023 at 7:40:30 p.m. GMT",
            "authority": "https://gitlab.eclipse.org/eclipsefdn/emo-team/iplab/-/issues/6665",
            "scancode-version": "31.2.1",
            "licenses-discovered": [
                "Apache-2.0 AND MIT"
            ],
            "copyrights": [
                "Copyright 2012-2015 The Rust Project",
                "Copyright 2012-2016 The Rust Project",
                "Copyright 2014 The Rust Project",
                "Copyright 2016-2021 Frank Denis"
            ],
            "file-count": 12,
            "sha256": "7bd3e3206899af3f8b12af284fafc038cc1dc2b41d1b89dd17297221c5d225de",
            "source": "https://crates.io/api/v1/crates/siphasher/0.3.10/download",
            "status": "approved"
        }
    ]
}