{
    "id": "maven/mavencentral/org.jetbrains.kotlinx/kotlinx-serialization-json-jvm/1.6.0-RC",
    "license": "Apache-2.0",
    "authority": "https://gitlab.eclipse.org/eclipsefdn/emo-team/iplab/-/issues/10482",
    "source": "https://repo.maven.apache.org/maven2/org/jetbrains/kotlinx/kotlinx-serialization-json-jvm/1.6.0-RC/kotlinx-serialization-json-jvm-1.6.0-RC-sources.jar",
    "status": "approved",
    "scans": [
        {
            "date": "September 12, 2023 at 7:46:44 a.m. GMT",
            "authority": "https://gitlab.eclipse.org/eclipsefdn/emo-team/iplab/-/issues/10482",
            "scancode-version": "31.2.1",
            "licenses-discovered": [
                "Apache-2.0"
            ],
            "copyrights": [
                "Copyright 2017-2019 JetBrains s.r.o.",
                "Copyright 2017-2020 JetBrains s.r.o.",
                "Copyright 2017-2021 JetBrains s.r.o.",
                "Copyright 2017-2022 JetBrains s.r.o.",
                "Copyright 2017-2023 JetBrains s.r.o."
            ],
            "file-count": 45,
            "sha256": "87d9ac9b8da8ada444cf6ccdd667fa29b6cb1a3bad4c50e76ffba57963880f6d",
            "source": "https://repo.maven.apache.org/maven2/org/jetbrains/kotlinx/kotlinx-serialization-json-jvm/1.6.0-RC/kotlinx-serialization-json-jvm-1.6.0-RC-sources.jar",
            "status": "approved"
        }
    ]
}