{
    "id": "project/technology.wattadvisor/eclipse-wattadvisor/WattAdvisor/d2422228750dddfed07b0076106ed7c0f43c8b8e",
    "license": "BSD-3-Clause AND MIT AND BSD-2-Clause AND OFL-1.1 AND (GPL-2.0-only OR MIT)",
    "authority": "https://gitlab.eclipse.org/eclipsefdn/emo-team/iplab/-/issues/15674",
    "source": "https://github.com/eclipse-wattadvisor/WattAdvisor/archive/d2422228750dddfed07b0076106ed7c0f43c8b8e.zip",
    "status": "approved",
    "scans": [
        {
            "date": "July 9, 2024 at 11:32:07 p.m. GMT",
            "authority": "https://gitlab.eclipse.org/eclipsefdn/emo-team/iplab/-/issues/15674",
            "scancode-version": "31.2.1",
            "licenses-discovered": [
                "BSD-3-Clause AND MIT",
                "MIT",
                "BSD-3-Clause",
                "MIT AND OFL-1.1",
                "GPL-2.0-only AND MIT",
                "LicenseRef-scancode-unknown-spdx"
            ],
            "copyrights": [
                "(c) 1995-2022 Jean-loup Gailly & Mark Adler",
                "(c) Copyright 2023, Fraunhofer IOSB-AST.",
                "(c) OpenJS Foundation and other contributors",
                "Copyright (c) 1991-1995 Stichting Mathematisch Centrum, Amsterdam",
                "Copyright (c) 1995-2001 Corporation for National Research Initiatives",
                "Copyright (c) 1997-2002 by Secret Labs AB span $self, group",
                "Copyright (c) 2000 BeOpen.com",
                "Copyright (c) 2001-2023 Python Software Foundation",
                "Copyright (c) 2007, Eclipse Foundation, Inc.",
                "Copyright (c) 2007, Eclipse Foundation, Inc. and its licensors",
                "Copyright 1991-1995 SMC.",
                "Copyright 1995-2001 CNRI.",
                "Copyright 1995-2022 Jean-loup Gailly and Mark Adler",
                "Copyright 1995-2022 Mark Adler",
                "Copyright 1998-2024 The OpenSSL Authors",
                "Copyright 2000 BeOpen.com",
                "Copyright 2001-2023 Python Software Foundation",
                "Copyright 2007-2024 by the Sphinx team",
                "Copyright Dave Gandy 2016",
                "Copyright Sphinx contributors",
                "copyright 2023, Fraunhofer IOSB-AST",
                "copyrighted by the contributors"
            ],
            "file-count": 280,
            "sha256": "8ea6ecd3bde3cea6dceefb92bc2282bb0c1b9e1b9915d55e020db97802e450ea",
            "source": "https://github.com/eclipse-wattadvisor/WattAdvisor/archive/d2422228750dddfed07b0076106ed7c0f43c8b8e.zip",
            "status": "restricted"
        }
    ]
}