{
    "id": "maven/mavencentral/com.graphhopper/graphhopper-web-api/8.0",
    "license": "Apache-2.0",
    "authority": "https://gitlab.eclipse.org/eclipsefdn/emo-team/iplab/-/issues/11408",
    "source": "https://repo1.maven.org/maven2/com/graphhopper/graphhopper-web-api/8.0/graphhopper-web-api-8.0-sources.jar",
    "status": "approved",
    "scans": [
        {
            "date": "November 2, 2023 at 3:35:46 p.m. GMT",
            "authority": "https://gitlab.eclipse.org/eclipsefdn/emo-team/iplab/-/issues/11408",
            "scancode-version": "31.2.1",
            "licenses-discovered": [
                "Apache-2.0"
            ],
            "copyrights": [
            ],
            "file-count": 54,
            "sha256": "26e1772a6b9939de800b66d9961eaf8fa1473539d281f52ac027b7743c1487a3",
            "source": "https://repo1.maven.org/maven2/com/graphhopper/graphhopper-web-api/8.0/graphhopper-web-api-8.0-sources.jar",
            "status": "approved"
        }
    ]
}