{
    "id": "git/github/evanphx/json-patch/v5.6.0",
    "license": "BSD-3-Clause",
    "authority": "https://gitlab.eclipse.org/eclipsefdn/emo-team/iplab/-/issues/5185",
    "source": "https://github.com/evanphx/json-patch/archive/refs/tags/v5.6.0.zip",
    "status": "approved",
    "scans": [
        {
            "date": "November 25, 2022 at 5:21:51 a.m. GMT",
            "authority": "https://gitlab.eclipse.org/eclipsefdn/emo-team/iplab/-/issues/5185",
            "scancode-version": "31.2.1",
            "licenses-discovered": [
                "BSD-3-Clause"
            ],
            "copyrights": [
                "Copyright (c) 2014, Evan Phoenix"
            ],
            "file-count": 19,
            "sha256": "ae920c3e375007fd27b83cefbe7e05b9a6e96e47df237eeccacc43602add100e",
            "source": "https://github.com/evanphx/json-patch/archive/refs/tags/v5.6.0.zip",
            "status": "approved"
        }
    ]
}