{
    "id": "npm/npmjs/@angular/language-service/17.3.6",
    "license": "MIT",
    "authority": "https://gitlab.eclipse.org/eclipsefdn/emo-team/iplab/-/issues/14672",
    "source": "https://github.com/angular/angular/archive/refs/tags/17.3.6.zip",
    "status": "approved",
    "scans": [
        {
            "date": "May 9, 2024 at 3:43:05 p.m. GMT",
            "authority": "https://gitlab.eclipse.org/eclipsefdn/emo-team/iplab/-/issues/14672",
            "scancode-version": "31.2.1",
            "licenses-discovered": [
                "MIT",
                "AFL-3.0 AND AGPL-1.0-only AND AGPL-3.0-only AND AGPL-3.0-or-later AND APSL-1.0 AND APSL-1.1 AND Apache-1.1 AND Apache-2.0 AND BSD-2-Clause AND BSD-2-Clause-Patent AND BSD-2-Clause-Views AND BSD-3-Clause AND BSD-3-Clause-No-Nuclear-Warranty AND BSD-4-Clause AND BSD-4-Clause-UC AND CC-BY-SA-2.0 AND CC-BY-SA-4.0 AND CC0-1.0 AND CDDL-1.0 AND CDDL-1.1 AND CECILL-2.0 AND CECILL-2.1 AND CPOL-1.02 AND EFL-2.0 AND EPL-1.0 AND Frameworx-1.0 AND (GPL-2.0-only WITH Classpath-exception-2.0) AND HPND AND HaskellReport AND IBM-pibs AND ISC AND Interbase-1.0 AND LZMA-exception AND LicenseRef-scancode-d-fsl-1.0-en AND LicenseRef-scancode-free-unknown AND LicenseRef-scancode-proprietary-license AND LicenseRef-scancode-unknown AND MIT AND MS-PL AND MS-RL AND NGPL AND Spencer-86 AND TMate AND Unlicense AND WTFPL AND Zimbra-1.3 AND Zimbra-1.4",
                "CC-BY-4.0 AND MIT",
                "CC-BY-4.0",
                "LicenseRef-scancode-free-unknown",
                "Apache-2.0 AND LicenseRef-scancode-free-unknown",
                "Apache-2.0",
                "LicenseRef-scancode-proprietary-license",
                "BSD-3-Clause"
            ],
            "copyrights": [
                "(c) 2007 Steven Levithan",
                "(c) 2010-2024 Google LLC. https://angular.io",
                "(c) An Engine",
                "(c) ChildInjector ServicesC CarService3",
                "(c) Sindre Sorhus",
                "Copyright (c) 2005 Tom Wu",
                "Copyright (c) 2005-2009 Tom Wu",
                "Copyright (c) 2006 Google Inc.",
                "Copyright (c) 2007 Kris Zyp SitePen (www.sitepen.com)",
                "Copyright (c) 2010-2024 Google LLC. https://angular.dev/license",
                "Copyright (c) 2010-2024 Google LLC. https://angular.io/license",
                "Copyright (c) 2011-2017 KARASZI Istvan <github@spam.raszi.hu>",
                "Copyright (c) 2012, Mark Cavage",
                "Copyright (c) 2012-2014 TJ Holowaychuk",
                "Copyright (c) 2013 Ted Unangst <tedu@openbsd.org>",
                "Copyright (c) 2013, Yahoo! Inc.",
                "Copyright (c) 2013-present, Facebook, Inc.",
                "Copyright (c) 2014 Jon Schlinkert",
                "Copyright (c) 2014 Jonathan Ong",
                "Copyright (c) 2014-2015, Jon Schlinkert",
                "Copyright (c) 2014-2015, Jordan Suchow, Michael Pacer, and Lara A. Ross",
                "Copyright (c) 2014-2017, Jon Schlinkert",
                "Copyright (c) 2014-2018, Jon Schlinkert",
                "Copyright (c) 2015 Douglas Christopher Wilson",
                "Copyright (c) 2015 Jed Watson",
                "Copyright (c) 2015 Jon Schlinkert",
                "Copyright (c) 2015, Jon Schlinkert",
                "Copyright (c) 2015, Salesforce.com, Inc.",
                "Copyright (c) 2015-2016, Jon Schlinkert",
                "Copyright (c) 2015-2017, Jon Schlinkert",
                "Copyright (c) 2015-2018, Jon Schlinkert",
                "Copyright (c) Luke Edwards <luke.edwards05@gmail.com> (lukeed.com)",
                "Copyright (c) Marak Squires",
                "Copyright (c) Microsoft Corporation",
                "Copyright (c) Sindre Sorhus <sindresorhus@gmail.com> (sindresorhus.com)",
                "Copyright 1997 Niels Provos <provos@physnet.uni-hamburg.de>",
                "Copyright 2009-2016 Jeremy Ashkenas, DocumentCloud and Investigative Reporters & Editors",
                "Copyright 2010 LearnBoost <dev@learnboost.com>",
                "Copyright 2010-2012 Mikeal Rogers",
                "Copyright 2011 Mark Cavage <mcavage@gmail.com>",
                "Copyright 2012 Joyent, Inc.",
                "Copyright 2012-2016 The Dojo Foundation <http://dojofoundation.org/>",
                "Copyright 2015 Joyent, Inc.",
                "Copyright 2015 Kyle E. Mitchell",
                "Copyright 2015 The Bazel Authors",
                "Copyright 2016 Joyent, Inc.",
                "Copyright 2016, Joyent Inc",
                "Copyright 2017 Bertrand Gaillard",
                "Copyright 2017 Joyent, Inc.",
                "Copyright 2019 Google Inc.",
                "Copyright Google Inc.",
                "Copyright Google LLC",
                "Copyright Google LLC.",
                "Copyright JS Foundation and other contributors <https://js.foundation/>",
                "Copyright JS Foundation and other contributors, https://js.foundation",
                "Copyright Jeremy Ashkenas, DocumentCloud and Investigative Reporters & Editors",
                "Copyright Joyent, Inc. and other Node contributors",
                "Copyright jQuery Foundation and other contributors <https://jquery.org/>",
                "Google (c) 2010",
                "Google (c) 2010-2022",
                "Google (c) 2010-2024",
                "copyright (c) 2018 Denis Pushkarev",
                "copyright 2010-2011, Google Corporation.Open",
                "copyright 2010-2011, Google Corporation.Open SansBold1.10 1ASC OpenSans-BoldOpen Sans BoldVersion",
                "copyright 2010-2011, Google Corporation.Open SansLight1.10 1ASC OpenSans-LightOpen Sans LightVersion",
                "copyright 2010-2011, Google Corporation.Open SansRegular1.10 1ASC OpenSans-RegularOpen Sans RegularVersion",
                "copyright 2011, Google Corporation.Open",
                "copyright 2011, Google Corporation.Open SansSemiBold1.10 1ASC OpenSans-SemiBoldOpen Sans SemiBoldVersion"
            ],
            "file-count": 13221,
            "sha256": "64e3ddc8f68ce67f6591f426961f2d78a12ab18b5125ccd0550128087fd0b83d",
            "source": "https://github.com/angular/angular/archive/refs/tags/17.3.6.zip",
            "status": "restricted"
        }
    ]
}