{
    "id": "maven/mavencentral/org.locationtech.sfcurve/sfcurve-api_2.12/0.2.2",
    "license": "Apache-2.0",
    "authority": "https://gitlab.eclipse.org/eclipsefdn/emo-team/iplab/-/issues/5067",
    "source": "https://search.maven.org/remotecontent?filepath=org/locationtech/sfcurve/sfcurve-api_2.12/0.2.2/sfcurve-api_2.12-0.2.2-sources.jar",
    "status": "approved",
    "scans": [
        {
            "date": "November 24, 2022 at 5:50:00 p.m. GMT",
            "authority": "https://gitlab.eclipse.org/eclipsefdn/emo-team/iplab/-/issues/5067",
            "scancode-version": "31.2.1",
            "licenses-discovered": [
                "Apache-2.0"
            ],
            "copyrights": [
                "Copyright (c) 2015 Azavea"
            ],
            "file-count": 4,
            "sha256": "6020702d8bc4f5f51ccdbcb794235c77939be702c1bb3e2f3679414f468c793a",
            "source": "https://search.maven.org/remotecontent?filepath=org/locationtech/sfcurve/sfcurve-api_2.12/0.2.2/sfcurve-api_2.12-0.2.2-sources.jar",
            "status": "approved"
        }
    ]
}