{
    "id": "maven/mavencentral/org.apache.jena/jena-dboe-storage/4.8.0",
    "license": "Apache-2.0",
    "authority": "https://gitlab.eclipse.org/eclipsefdn/emo-team/iplab/-/issues/8907",
    "source": "https://repo.maven.apache.org/maven2/org/apache/jena/jena-dboe-storage/4.8.0/jena-dboe-storage-4.8.0-sources.jar",
    "status": "approved",
    "scans": [
        {
            "date": "June 14, 2023 at 5:50:19 p.m. GMT",
            "authority": "https://gitlab.eclipse.org/eclipsefdn/emo-team/iplab/-/issues/8907",
            "scancode-version": "31.2.1",
            "licenses-discovered": [
                "Apache-2.0"
            ],
            "copyrights": [
            ],
            "file-count": 22,
            "sha256": "316730f272e9c15a7a98c1a1010c2c3600bd83e07b67856ec9589554447c086a",
            "source": "https://repo.maven.apache.org/maven2/org/apache/jena/jena-dboe-storage/4.8.0/jena-dboe-storage-4.8.0-sources.jar",
            "status": "approved"
        }
    ]
}