{
    "id": "npm/npmjs/-/string.prototype.trim/1.2.8",
    "license": "MIT",
    "authority": "https://gitlab.eclipse.org/eclipsefdn/emo-team/iplab/-/issues/10361",
    "source": "https://github.com/es-shims/String.prototype.trim/archive/refs/tags/v1.2.8.zip",
    "status": "approved",
    "scans": [
        {
            "date": "September 8, 2023 at 1:30:54 p.m. GMT",
            "authority": "https://gitlab.eclipse.org/eclipsefdn/emo-team/iplab/-/issues/10361",
            "scancode-version": "31.2.1",
            "licenses-discovered": [
                "MIT"
            ],
            "copyrights": [
                "Copyright (c) 2015 Jordan Harband"
            ],
            "file-count": 20,
            "sha256": "78b43a2fd19d6871475de8daa7d151ae77a894e3a13190ea95c682d867f2e743",
            "source": "https://github.com/es-shims/String.prototype.trim/archive/refs/tags/v1.2.8.zip",
            "status": "approved"
        }
    ]
}