{
    "id": "maven/mavencentral/com.azure.resourcemanager/azure-resourcemanager-cdn/2.44.0",
    "license": "MIT",
    "authority": "https://gitlab.eclipse.org/eclipsefdn/emo-team/iplab/-/issues/16928",
    "source": "https://repo1.maven.org/maven2/com/azure/resourcemanager/azure-resourcemanager-cdn/2.44.0/azure-resourcemanager-cdn-2.44.0-sources.jar",
    "status": "approved",
    "scans": [
        {
            "date": "October 29, 2024, 3:51:44 a.m. GMT",
            "authority": "https://gitlab.eclipse.org/eclipsefdn/emo-team/iplab/-/issues/16928",
            "scancode-version": "31.2.1",
            "licenses-discovered": [
                "MIT"
            ],
            "copyrights": [
                "Copyright (c) Microsoft Corporation"
            ],
            "file-count": 444,
            "sha256": "aab980a89ec7fe5a32bcd62f8868ef6c55a05d6b703f8a01d1e468dedd60d6e1",
            "source": "https://repo1.maven.org/maven2/com/azure/resourcemanager/azure-resourcemanager-cdn/2.44.0/azure-resourcemanager-cdn-2.44.0-sources.jar",
            "status": "approved"
        }
    ]
}