{
    "id": "npm/npmjs/-/mime-db/1.33.0",
    "license": "MIT",
    "licenses-discovered": [
        "MIT"
    ],
    "copyrights": [
        "Copyright (c) 2014 Jonathan Ong",
        "Copyright (c) 2014 Jonathan Ong me@jongleberry.com"
    ],
    "file-count": 6,
    "scancode-version": "31.2.1",
    "authority": "https://gitlab.eclipse.org/eclipsefdn/emo-team/iplab/-/issues/4695",
    "source": "https://registry.npmjs.org/mime-db/-/mime-db-1.33.0.tgz",
    "status": "approved"
}