{
    "id": "nuget/nuget/-/Namotion.Reflection/2.1.2",
    "license": "MIT",
    "authority": "https://gitlab.eclipse.org/eclipsefdn/emo-team/iplab/-/issues/9320",
    "source": "https://github.com/RicoSuter/Namotion.Reflection/archive/refs/tags/v2.1.2.zip",
    "status": "approved",
    "scans": [
        {
            "date": "July 14, 2023 at 3:30:41 p.m. GMT",
            "authority": "https://gitlab.eclipse.org/eclipsefdn/emo-team/iplab/-/issues/9320",
            "scancode-version": "31.2.1",
            "licenses-discovered": [
            ],
            "copyrights": [
                "(c) 2023 GitHub, Inc."
            ],
            "file-count": 1,
            "sha256": "8d02dfce601c46bca6c15837e2a827f5b2ab5c7bf1004c4e132bd92ddbfb3d58",
            "source": "https://github.com/RicoSuter/Namotion.Reflection/releases/tag/v2.1.2",
            "status": "restricted"
        },
        {
            "date": "July 14, 2023 at 4:01:45 p.m. GMT",
            "authority": "https://gitlab.eclipse.org/eclipsefdn/emo-team/iplab/-/issues/9320",
            "scancode-version": "31.2.1",
            "licenses-discovered": [
                "MIT"
            ],
            "copyrights": [
                "Copyright (c) 2019 Rico Suter",
                "Copyright (c) Microsoft",
                "Copyright (c) Rico Suter"
            ],
            "file-count": 59,
            "sha256": "9c9eb286fddd58d06561cf9ce78f45f08b5d949104b42105a8ffa9ca61e91d1f",
            "source": "https://github.com/RicoSuter/Namotion.Reflection/archive/refs/tags/v2.1.2.zip",
            "status": "approved"
        }
    ]
}