{
    "id": "maven/mavencentral/com.comcast/ip4s-core_2.13/3.4.0",
    "license": "Apache-2.0",
    "authority": "https://gitlab.eclipse.org/eclipsefdn/emo-team/iplab/-/issues/12634",
    "source": "https://repo1.maven.org/maven2/com/comcast/ip4s-core_2.13/3.4.0/ip4s-core_2.13-3.4.0-sources.jar",
    "status": "approved",
    "scans": [
        {
            "date": "January 7, 2024 at 11:49:37 p.m. GMT",
            "authority": "https://gitlab.eclipse.org/eclipsefdn/emo-team/iplab/-/issues/12634",
            "scancode-version": "31.2.1",
            "licenses-discovered": [
                "Apache-2.0"
            ],
            "copyrights": [
                "Copyright 2018 Comcast Cable Communications Management, LLC"
            ],
            "file-count": 19,
            "sha256": "62b2075f192e0f20eed8159148deafde45b7e43a785e053f0bcbc9845a681b88",
            "source": "https://repo1.maven.org/maven2/com/comcast/ip4s-core_2.13/3.4.0/ip4s-core_2.13-3.4.0-sources.jar",
            "status": "approved"
        }
    ]
}