{
    "id": "maven/mavencentral/org.apache.httpcomponents.core5/httpcore5-h2/5.3",
    "license": "Apache-2.0",
    "authority": "https://gitlab.eclipse.org/eclipsefdn/emo-team/iplab/-/issues/16135",
    "source": "https://repo1.maven.org/maven2/org/apache/httpcomponents/core5/httpcore5-h2/5.3/httpcore5-h2-5.3-sources.jar",
    "status": "approved",
    "scans": [
        {
            "date": "September 12, 2024, 2:09:25 p.m. GMT",
            "authority": "https://gitlab.eclipse.org/eclipsefdn/emo-team/iplab/-/issues/16135",
            "scancode-version": "31.2.1",
            "licenses-discovered": [
                "Apache-2.0"
            ],
            "copyrights": [
            ],
            "file-count": 116,
            "sha256": "7ded341cc6ccbbcaf80046a949915eea42c51e85a5cc07352ac1cd1c91f324e4",
            "source": "https://repo1.maven.org/maven2/org/apache/httpcomponents/core5/httpcore5-h2/5.3/httpcore5-h2-5.3-sources.jar",
            "status": "approved"
        }
    ]
}