{
    "id": "npm/npmjs/-/postcss-reduce-initial/6.1.0",
    "license": "MIT AND CC0-1.0",
    "authority": "https://gitlab.eclipse.org/eclipsefdn/emo-team/iplab/-/issues/16191",
    "source": "https://github.com/cssnano/cssnano/archive/refs/tags/cssnano@6.1.0.zip",
    "status": "approved",
    "scans": [
        {
            "date": "September 18, 2024, 7:49:52 p.m. GMT",
            "authority": "https://gitlab.eclipse.org/eclipsefdn/emo-team/iplab/-/issues/16191",
            "scancode-version": "31.2.1",
            "licenses-discovered": [
                "MIT",
                "GPL-2.0-only",
                "CC0-1.0"
            ],
            "copyrights": [
                "(c) 2014 - 2018 YOOtheme",
                "(c) Ben Briggs (http://beneb.info)",
                "(c) Ben Briggs (https://beneb.info)",
                "(c) Bogdan Chadkin",
                "Copyright (c) 2009-2017, Imperavi LLC.",
                "Copyright (c) 2017 CJ Patoilo",
                "Copyright (c) Ben Briggs <beneb.info@gmail.com> (http://beneb.info)",
                "Copyright (c) Bogdan Chadkin <trysound@yandex.ru>",
                "Copyright 2011-2018 The Bootstrap Authors",
                "Copyright 2011-2018 Twitter, Inc.",
                "Copyright 2013 Contributors",
                "Copyright 2014 Contributors",
                "Copyright 2014 Dan Malarkey",
                "Copyright 2014, Dave Gamache www.getskeleton.com",
                "Copyright 2015 Bogdan Chadkin <trysound@yandex.ru>",
                "Copyright 2015 Contributor",
                "Copyright 2016 James Kolce, Keenan Payne and ConciseCSS Contributors",
                "Copyright 2016 Justineo <justice360@gmail.com>",
                "Copyright 2018 Pim Brouwers",
                "Copyright 2019 Bigfish https://www.bigfish.tv",
                "Copyright Mathias Bynens <https://mathiasbynens.be/> https://github.com/mathiasbynens/mothereff.in"
            ],
            "file-count": 813,
            "sha256": "c6d73834622a30229cc1f26c0fb8f4dc6730c0f339579fc6d1fdc8c213274c31",
            "source": "https://github.com/cssnano/cssnano/archive/refs/tags/cssnano@6.1.0.zip",
            "status": "restricted"
        }
    ]
}