{
    "id": "maven/mavencentral/androidx.arch.core/core-runtime/2.1.0",
    "license": "Apache-2.0",
    "authority": "https://gitlab.eclipse.org/eclipsefdn/emo-team/iplab/-/issues/10399",
    "source": "https://dl.google.com/android/maven2/androidx/arch/core/core-runtime/2.1.0/core-runtime-2.1.0-sources.jar",
    "status": "approved",
    "scans": [
        {
            "date": "September 11, 2023 at 9:23:48 p.m. GMT",
            "authority": "https://gitlab.eclipse.org/eclipsefdn/emo-team/iplab/-/issues/10399",
            "scancode-version": "31.2.1",
            "licenses-discovered": [
                "Apache-2.0"
            ],
            "copyrights": [
                "Copyright (c) 2017 The Android Open Source Project"
            ],
            "file-count": 4,
            "sha256": "913acdee357814e814745466a46a793e8ad7410086ba4548458b83cd6a98424b",
            "source": "https://dl.google.com/android/maven2/androidx/arch/core/core-runtime/2.1.0/core-runtime-2.1.0-sources.jar",
            "status": "approved"
        }
    ]
}