{
    "id": "maven/mavencentral/org.geotools/gt-transform/28.1",
    "license": "LGPL-2.1-only",
    "authority": "https://gitlab.eclipse.org/eclipsefdn/emo-team/iplab/-/issues/6688",
    "source": "https://repo.osgeo.org/repository/geotools-releases/org/geotools/gt-transform/28.1/gt-transform-28.1-sources.jar",
    "status": "approved",
    "scans": [
        {
            "date": "January 26, 2023 at 3:23:56 p.m. GMT",
            "authority": "https://gitlab.eclipse.org/eclipsefdn/emo-team/iplab/-/issues/6688",
            "scancode-version": "31.2.1",
            "licenses-discovered": [
                "LGPL-2.1-only"
            ],
            "copyrights": [
                "(c) 2012 - 2015, Open Source Geospatial Foundation",
                "(c) 2012, Open Source Geospatial Foundation",
                "(c) 2023, Open Source Geospatial Foundation"
            ],
            "file-count": 20,
            "sha256": "36ec4aad7646a9cee271f6f7b3850323ebdfa61b9be722973bbd416fb8aa62dd",
            "source": "https://repo.osgeo.org/repository/geotools-releases/org/geotools/gt-transform/28.1/gt-transform-28.1-sources.jar",
            "status": "approved"
        }
    ]
}