{
    "id": "maven/mavencentral/software.amazon.awssdk/third-party-jackson-core/2.19.26",
    "license": "Apache-2.0",
    "authority": "https://gitlab.eclipse.org/eclipsefdn/emo-team/iplab/-/issues/7949",
    "source": "https://search.maven.org/remotecontent?filepath=software/amazon/awssdk/third-party-jackson-core/2.19.26/third-party-jackson-core-2.19.26-sources.jar",
    "status": "approved",
    "scans": [
        {
            "date": "April 25, 2023 at 2:20:11 p.m. GMT",
            "authority": "https://gitlab.eclipse.org/eclipsefdn/emo-team/iplab/-/issues/7949",
            "scancode-version": "31.2.1",
            "licenses-discovered": [
                "Apache-2.0"
            ],
            "copyrights": [
                "Copyright Amazon.com, Inc. or its affiliates"
            ],
            "file-count": 4,
            "sha256": "b0fdb54c0bb6fe48c14059926322c4744bee9233ccdba15bf6d28f7a07932b55",
            "source": "https://search.maven.org/remotecontent?filepath=software/amazon/awssdk/third-party-jackson-core/2.19.26/third-party-jackson-core-2.19.26-sources.jar",
            "status": "approved"
        }
    ]
}