{
    "license": "EPL-2.0",
    "file-count": 28,
    "authority": "https://gitlab.eclipse.org/eclipsefdn/emo-team/iplab/-/issues/1490",
    "scancode-version": "30.1.0",
    "licenses-discovered": [
        "EPL-2.0"
    ],
    "id": "maven/mavencentral/org.junit.platform/junit-platform-suite-api/1.8.1",
    "source": "https://search.maven.org/remotecontent?filepath=org/junit/platform/junit-platform-suite-api/1.8.1/junit-platform-suite-api-1.8.1-sources.jar",
    "status": "approved"
}