{
    "license": "MIT",
    "file-count": 1977,
    "authority": "https://gitlab.eclipse.org/eclipsefdn/emo-team/iplab/-/issues/1712",
    "scancode-version": "30.1.0",
    "licenses-discovered": [
        "MIT",
        "LicenseRef-scancode-ocb-open-source-2013",
        "LicenseRef-scancode-public-domain"
    ],
    "id": "maven/mavencentral/org.bouncycastle/bcprov-jdk15on/1.70",
    "source": "https://search.maven.org/remotecontent?filepath=org/bouncycastle/bcprov-jdk15on/1.70/bcprov-jdk15on-1.70-sources.jar",
    "status": "approved"
}
