{
    "id": "npm/npmjs/-/emmet/2.4.5",
    "license": "MIT",
    "authority": "https://gitlab.eclipse.org/eclipsefdn/emo-team/iplab/-/issues/9251",
    "source": "https://registry.yarnpkg.com/emmet/-/emmet-2.4.5.tgz",
    "status": "approved",
    "scans": [
        {
            "date": "July 4, 2023 at 12:37:17 p.m. GMT",
            "authority": "https://gitlab.eclipse.org/eclipsefdn/emo-team/iplab/-/issues/9251",
            "scancode-version": "31.2.1",
            "licenses-discovered": [
                "MIT"
            ],
            "copyrights": [
                "Copyright (c) 2020 Sergey Chikuyonok <serge.che@gmail.com>"
            ],
            "file-count": 37,
            "sha256": "3aa300674ba38f54dc0dacda376146fcd5a1fbef770a3fc190ac0b82231c526c",
            "source": "https://registry.yarnpkg.com/emmet/-/emmet-2.4.5.tgz",
            "status": "approved"
        }
    ]
}