{
    "id": "nuget/nuget/-/IdentityModel/7.0.0",
    "license": "Apache-2.0 AND MIT",
    "authority": "https://gitlab.eclipse.org/eclipsefdn/emo-team/iplab/-/issues/15661",
    "source": "https://github.com/IdentityModel/IdentityModel/archive/refs/tags/7.0.0.zip",
    "status": "approved",
    "scans": [
        {
            "date": "July 9, 2024 at 10:21:05 p.m. GMT",
            "authority": "https://gitlab.eclipse.org/eclipsefdn/emo-team/iplab/-/issues/15661",
            "scancode-version": "31.2.1",
            "licenses-discovered": [
                "Apache-2.0",
                "MIT",
                "Apache-2.0 AND MIT"
            ],
            "copyrights": [
                "(c) 2018 - WebApplication1",
                "(c) JS Foundation and other contributors",
                "Copyright (c) .NET Foundation",
                "Copyright (c) 2010-2013 Diego Perini",
                "Copyright (c) 2011-2016 Twitter, Inc.",
                "Copyright (c) 2017 Jorn Zaefferer",
                "Copyright (c) Brock Allen & Dominick Baier",
                "Copyright (c) Microsoft Corporation",
                "Copyright 2011-2016 Twitter, Inc.",
                "Copyright 2017-2018 Brock Allen & Dominick Baier",
                "Copyright JS Foundation and other contributors",
                "Copyright JS Foundation and other contributors, https://js.foundation",
                "Copyright Jorn Zaefferer",
                "Copyright jQuery Foundation and other contributors"
            ],
            "file-count": 211,
            "sha256": "01ec7b3e8e8c550df9dcd4f135f2980700d288c70630d3c30912841b95628baa",
            "source": "https://github.com/IdentityModel/IdentityModel/archive/refs/tags/7.0.0.zip",
            "status": "approved"
        }
    ]
}