{
    "id": "maven/mavencentral/io.fabric8/openshift-model-config/6.11.0",
    "license": "Apache-2.0",
    "authority": "https://gitlab.eclipse.org/eclipsefdn/emo-team/iplab/-/issues/14156",
    "source": "https://repo1.maven.org/maven2/io/fabric8/openshift-model-config/6.11.0/openshift-model-config-6.11.0-sources.jar",
    "status": "approved",
    "scans": [
        {
            "date": "March 26, 2024 at 4:26:00 p.m. GMT",
            "authority": "https://gitlab.eclipse.org/eclipsefdn/emo-team/iplab/-/issues/14156",
            "scancode-version": "31.2.1",
            "licenses-discovered": [
                "Apache-2.0"
            ],
            "copyrights": [
                "Copyright (c) 2015 Red Hat, Inc."
            ],
            "file-count": 608,
            "sha256": "c974a5ced23ff3f8d44bce776f3e4bf3f815b3831d39a5aaef128f3488e90135",
            "source": "https://repo1.maven.org/maven2/io/fabric8/openshift-model-config/6.11.0/openshift-model-config-6.11.0-sources.jar",
            "status": "approved"
        }
    ]
}