{
    "id": "maven/mavencentral/org.geotools.xsd/gt-xsd-filter/30.4",
    "license": "LGPL-2.1-only",
    "authority": "https://gitlab.eclipse.org/eclipsefdn/emo-team/iplab/-/issues/15587",
    "source": "https://repo.osgeo.org/repository/geotools-releases/org/geotools/xsd/gt-xsd-filter/30.4/gt-xsd-filter-30.4-sources.jar",
    "status": "approved",
    "scans": [
        {
            "date": "July 3, 2024 at 3:25:06 p.m. GMT",
            "authority": "https://gitlab.eclipse.org/eclipsefdn/emo-team/iplab/-/issues/15587",
            "scancode-version": "31.2.1",
            "licenses-discovered": [
                "LGPL-2.1-only"
            ],
            "copyrights": [
                "(c) 2002-2008, Open Source Geospatial Foundation",
                "(c) 2002-2015, Open Source Geospatial Foundation",
                "(c) 2002-2019, Open Source Geospatial Foundation",
                "(c) 2012, Open Source Geospatial Foundation",
                "Copyright (c) 2002,2003,2004,2010 Open Geospatial Consortium",
                "Copyright (c) 2002,2003,2004,2010 Open Geospatial Consortium. To",
                "Copyright (c) 2010 Open Geospatial Consortium. To"
            ],
            "file-count": 88,
            "sha256": "e8d25732b9cf510c4e95c40204739836350c40bfed49f79ebcb478bdb090bbee",
            "source": "https://repo.osgeo.org/repository/geotools-releases/org/geotools/xsd/gt-xsd-filter/30.4/gt-xsd-filter-30.4-sources.jar",
            "status": "approved"
        }
    ]
}