{
    "id": "maven/mavencentral/io.fabric8/openshift-model-whereabouts/6.11.0",
    "license": "Apache-2.0",
    "authority": "https://gitlab.eclipse.org/eclipsefdn/emo-team/iplab/-/issues/14100",
    "source": "https://repo1.maven.org/maven2/io/fabric8/openshift-model-whereabouts/6.11.0/openshift-model-whereabouts-6.11.0-sources.jar",
    "status": "approved",
    "scans": [
        {
            "date": "March 26, 2024 at 11:44:29 a.m. GMT",
            "authority": "https://gitlab.eclipse.org/eclipsefdn/emo-team/iplab/-/issues/14100",
            "scancode-version": "31.2.1",
            "licenses-discovered": [
                "Apache-2.0"
            ],
            "copyrights": [
                "Copyright (c) 2015 Red Hat, Inc."
            ],
            "file-count": 29,
            "sha256": "f8344f215321661deaed38c8d73a72c423963911f3828b74310739c5ee109482",
            "source": "https://repo1.maven.org/maven2/io/fabric8/openshift-model-whereabouts/6.11.0/openshift-model-whereabouts-6.11.0-sources.jar",
            "status": "approved"
        }
    ]
}