{
    "id": "maven/mavencentral/org.springframework/spring-expression/6.2.0",
    "license": "Apache-2.0",
    "authority": "https://gitlab.eclipse.org/eclipsefdn/emo-team/iplab/-/issues/17544",
    "source": "https://repo1.maven.org/maven2/org/springframework/spring-expression/6.2.0/spring-expression-6.2.0-sources.jar",
    "status": "approved",
    "scans": [
        {
            "date": "November 29, 2024 at 4:21:20 a.m. GMT",
            "authority": "https://gitlab.eclipse.org/eclipsefdn/emo-team/iplab/-/issues/17544",
            "scancode-version": "31.2.1",
            "licenses-discovered": [
                "Apache-2.0"
            ],
            "copyrights": [
                "Copyright 2002-2012 the original author or authors",
                "Copyright 2002-2013 the original author or authors",
                "Copyright 2002-2016 the original author or authors",
                "Copyright 2002-2017 the original author or authors",
                "Copyright 2002-2018 the original author or authors",
                "Copyright 2002-2019 the original author or authors",
                "Copyright 2002-2021 the original author or authors",
                "Copyright 2002-2022 the original author or authors",
                "Copyright 2002-2023 the original author or authors",
                "Copyright 2002-2024 the original author or authors"
            ],
            "file-count": 123,
            "sha256": "1bf8f961298929342460b84a1731a19fe1002fd1cff086ce32ebf6cec74b589d",
            "source": "https://repo1.maven.org/maven2/org/springframework/spring-expression/6.2.0/spring-expression-6.2.0-sources.jar",
            "status": "approved"
        }
    ]
}