{
    "id": "maven/mavencentral/org.apache.jena/apache-jena-libs/4.7.0",
    "license": "Apache-2.0",
    "authority": "https://gitlab.eclipse.org/eclipsefdn/emo-team/iplab/-/issues/8149",
    "source": "https://search.maven.org/remotecontent?filepath=org/apache/jena/apache-jena-libs/4.7.0/apache-jena-libs-4.7.0.pom",
    "status": "approved",
    "scans": [
        {
            "date": "May 10, 2023 at 7:05:15 a.m. GMT",
            "authority": "https://gitlab.eclipse.org/eclipsefdn/emo-team/iplab/-/issues/8149",
            "scancode-version": "31.2.1",
            "licenses-discovered": [
                "Apache-2.0"
            ],
            "copyrights": [
            ],
            "file-count": 1,
            "sha256": "91b3c033edad5bc7471544aa9534ca2310c940791d92c756c9df77092aa0a672",
            "source": "https://search.maven.org/remotecontent?filepath=org/apache/jena/apache-jena-libs/4.7.0/apache-jena-libs-4.7.0.pom",
            "status": "approved"
        }
    ]
}