{
    "id": "npm/npmjs/-/iterator.prototype/1.1.5",
    "license": "MIT",
    "authority": "https://gitlab.eclipse.org/eclipsefdn/emo-team/iplab/-/issues/18395",
    "source": "https://github.com/es-shims/Iterator.prototype/archive/refs/tags/v1.1.5.zip",
    "status": "approved",
    "scans": [
        {
            "date": "January 8, 2025 at 1:43:51 p.m. GMT",
            "authority": "https://gitlab.eclipse.org/eclipsefdn/emo-team/iplab/-/issues/18395",
            "scancode-version": "31.2.1",
            "licenses-discovered": [
                "MIT"
            ],
            "copyrights": [
                "Copyright (c) 2022 Jordan Harband"
            ],
            "file-count": 14,
            "sha256": "051b980dbcbec9d52f272aab1f19acefe222fd7a9b5f76d8761e583b307b7552",
            "source": "https://github.com/es-shims/Iterator.prototype/archive/refs/tags/v1.1.5.zip",
            "status": "approved"
        }
    ]
}