{
    "license": "BSD-3-Clause",
    "file-count": 72,
    "authority": "https://gitlab.eclipse.org/eclipsefdn/emo-team/iplab/-/issues/1495",
    "scancode-version": "30.1.0",
    "licenses-discovered": [
        "BSD-3-Clause",
        "LicenseRef-scancode-proprietary-license"
    ],
    "id": "maven/mavencentral/org.antlr/ST4/4.3.1",
    "source": "https://search.maven.org/remotecontent?filepath=org/antlr/ST4/4.3.1/ST4-4.3.1-sources.jar",
    "status": "approved"
}
