{
    "id": "p2/orbit/p2.eclipse.plugin/org.eclipse.jdt.junit.runtime/3.5.300.v20200720-0748",
    "license": "EPL-1.0 AND EPL-2.0 AND EPL-2.0",
    "licenses-discovered": [
        "EPL-1.0 AND EPL-2.0",
        "EPL-2.0"
    ],
    "copyrights": [
        "(c) 2008 VeriSign, Inc.",
        "Copyright (c) 2000, 2008 IBM Corporation and others",
        "Copyright (c) 2000, 2013 IBM Corporation and others",
        "Copyright (c) 2000, 2018 IBM Corporation and others",
        "Copyright (c) 2000, 2019 IBM Corporation and others",
        "Copyright (c) 2005 IBM Corporation and others",
        "Copyright (c) 2006 IBM Corporation and others",
        "Copyright (c) 2006, 2007 IBM Corporation and others",
        "Copyright (c) 2006, 2008 IBM Corporation and others",
        "Copyright (c) 2006, 2013 IBM Corporation and others",
        "Copyright (c) 2006, 2017 IBM Corporation and others",
        "Copyright (c) 2006, 2019 IBM Corporation and others"
    ],
    "file-count": 35,
    "scancode-version": "31.2.1",
    "authority": "https://gitlab.eclipse.org/eclipsefdn/emo-team/iplab/-/issues/4081",
    "source": "https://search.maven.org/remotecontent?filepath=org/eclipse/jdt/org.eclipse.jdt.junit.runtime/3.5.300/org.eclipse.jdt.junit.runtime-3.5.300-sources.jar",
    "status": "approved"
}