{
    "id": "project/openhw.corev/openhwgroup/cva6-sdk/cb35d1dba01da51b1489fb109f1b5598bd655267",
    "license": "Apache-2.0 AND SHL-0.51",
    "authority": "https://gitlab.eclipse.org/eclipsefdn/emo-team/iplab/-/issues/7904",
    "source": "https://github.com/openhwgroup/cva6-sdk/archive/cb35d1dba01da51b1489fb109f1b5598bd655267.zip",
    "status": "approved",
    "scans": [
        {
            "date": "April 18, 2023 at 4:49:30 a.m. GMT",
            "authority": "https://gitlab.eclipse.org/eclipsefdn/emo-team/iplab/-/issues/7904",
            "scancode-version": "31.2.1",
            "licenses-discovered": [
                "Apache-2.0 AND SHL-0.51",
                "GPL-2.0-or-later"
            ],
            "copyrights": [
                "(c) Xilinx, Inc.",
                "Copyright (c) 2001 Erik Andersen <andersen@codepoet.org>",
                "Copyright (c) 2005 SDG Systems, LLC",
                "Copyright (c) 2007 Richard Betts",
                "Copyright (c) 2014 Ondrej Zary",
                "Copyright (c) 2018 LowRISC CIC",
                "Copyright 2019 ETH Zurich and University of Bologna",
                "copyright (c) 2005 SDG Systems, LLC",
                "copyright (c) 2005-2006 Pierre Ossman",
                "portions copyright (c) 2015 Microchip Technology"
            ],
            "file-count": 34,
            "sha256": "0fd5a6e73d2a6daa9d643bf45b5e386a8198b8cc3c1f2e43cd4f7035fbb2fcb6",
            "source": "https://github.com/openhwgroup/cva6-sdk/archive/cb35d1dba01da51b1489fb109f1b5598bd655267.zip",
            "status": "restricted"
        }
    ]
}
