{
    "id": "maven/mavencentral/com.azure.resourcemanager/azure-resourcemanager-cosmos/2.31.0",
    "license": "MIT",
    "authority": "https://gitlab.eclipse.org/eclipsefdn/emo-team/iplab/-/issues/10873",
    "source": "https://repo.maven.apache.org/maven2/com/azure/resourcemanager/azure-resourcemanager-cosmos/2.31.0/azure-resourcemanager-cosmos-2.31.0-sources.jar",
    "status": "approved",
    "scans": [
        {
            "date": "October 4, 2023 at 12:30:03 p.m. GMT",
            "authority": "https://gitlab.eclipse.org/eclipsefdn/emo-team/iplab/-/issues/10873",
            "scancode-version": "31.2.1",
            "licenses-discovered": [
                "MIT"
            ],
            "copyrights": [
                "(c) 2008 VeriSign, Inc.",
                "Copyright (c) Microsoft Corporation"
            ],
            "file-count": 454,
            "sha256": "38771dda9a0e6bbfe9615283d58f2ad84d98e40737439d158a8b26d8a6d8b562",
            "source": "https://repo.maven.apache.org/maven2/com/azure/resourcemanager/azure-resourcemanager-cosmos/2.31.0/azure-resourcemanager-cosmos-2.31.0-sources.jar",
            "status": "approved"
        }
    ]
}