{
    "id": "maven/mavencentral/biz.aQute.bnd/biz.aQute.bndlib/6.4.0",
    "license": "Apache-2.0",
    "source": "https://search.maven.org/remotecontent?filepath=biz/aQute/bnd/biz.aQute.bndlib/6.4.0/biz.aQute.bndlib-6.4.0-sources.jar",
    "status": "approved",
    "scans": [
        {
            "date": "December 1, 2022 at 5:31:50 a.m. GMT",
            "authority": "https://gitlab.eclipse.org/eclipsefdn/emo-team/iplab/-/issues/5269",
            "scancode-version": "31.2.1",
            "licenses-discovered": [
                "Apache-2.0 AND BSD-2-Clause AND BSD-3-Clause AND CDDL-1.0 AND EPL-1.0 AND GPL-2.0-only AND GPL-3.0-only AND LGPL-2.1-only AND MIT",
                "Apache-2.0",
                "BSD-2-Clause AND BSD-2-Clause-Views",
                "BSD-3-Clause",
                "CDDL-1.0",
                "CPL-1.0",
                "EPL-1.0",
                "EPL-2.0 AND LicenseRef-scancode-free-unknown",
                "GPL-2.0-only",
                "GPL-2.0-or-later",
                "GPL-3.0-only",
                "GPL-3.0-or-later",
                "LGPL-2.1-only",
                "LGPL-2.1-or-later",
                "MIT",
                "MPL-2.0",
                "Apache-2.0 AND LicenseRef-scancode-josl-1.0",
                "Apache-2.0 AND LicenseRef-scancode-free-unknown"
            ],
            "copyrights": [
                "Copyright (c) OSGi Alliance (2005, 2017)",
                "Copyright (c) OSGi Alliance (2005, 2020)",
                "Copyright (c) OSGi Alliance (2012, 2017)",
                "Copyright (c) OSGi Alliance (2013, 2016)",
                "Copyright (c) OSGi Alliance (2013, 2017)",
                "Copyright (c) OSGi Alliance (2013, 2018)",
                "Copyright (c) OSGi Alliance (2014, 2016)",
                "Copyright (c) OSGi Alliance (2016)",
                "Copyright (c) OSGi Alliance (2016, 2018)",
                "Copyright (c) OSGi Alliance (2018)",
                "Copyright (c) OSGi Alliance (2020)",
                "Copyright 2002-2017 the original author or authors",
                "OSGi (c) 2002"
            ],
            "file-count": 701,
            "sha256": "ef5bce1a5b6c050772a6a107e68b94a743d23b54e13b491f7ea40be3e5161686",
            "source": "https://search.maven.org/remotecontent?filepath=biz/aQute/bnd/biz.aQute.bndlib/6.4.0/biz.aQute.bndlib-6.4.0-sources.jar",
            "status": "approved"
        },
        {
            "date": "December 12, 2022 at 9:26:27 a.m. GMT",
            "authority": "https://gitlab.eclipse.org/eclipsefdn/emo-team/iplab/-/issues/5663",
            "scancode-version": "31.2.1",
            "licenses-discovered": [
                "Apache-2.0 AND BSD-2-Clause AND BSD-3-Clause AND CDDL-1.0 AND EPL-1.0 AND GPL-2.0-only AND GPL-3.0-only AND LGPL-2.1-only AND MIT",
                "Apache-2.0",
                "BSD-2-Clause AND BSD-2-Clause-Views",
                "BSD-3-Clause",
                "CDDL-1.0",
                "CPL-1.0",
                "EPL-1.0",
                "EPL-2.0 AND LicenseRef-scancode-free-unknown",
                "GPL-2.0-only",
                "GPL-2.0-or-later",
                "GPL-3.0-only",
                "GPL-3.0-or-later",
                "LGPL-2.1-only",
                "LGPL-2.1-or-later",
                "MIT",
                "MPL-2.0",
                "Apache-2.0 AND LicenseRef-scancode-josl-1.0",
                "Apache-2.0 AND LicenseRef-scancode-free-unknown"
            ],
            "copyrights": [
                "Copyright (c) OSGi Alliance (2005, 2017)",
                "Copyright (c) OSGi Alliance (2005, 2020)",
                "Copyright (c) OSGi Alliance (2012, 2017)",
                "Copyright (c) OSGi Alliance (2013, 2016)",
                "Copyright (c) OSGi Alliance (2013, 2017)",
                "Copyright (c) OSGi Alliance (2013, 2018)",
                "Copyright (c) OSGi Alliance (2014, 2016)",
                "Copyright (c) OSGi Alliance (2016)",
                "Copyright (c) OSGi Alliance (2016, 2018)",
                "Copyright (c) OSGi Alliance (2018)",
                "Copyright (c) OSGi Alliance (2020)",
                "Copyright 2002-2017 the original author or authors",
                "OSGi (c) 2002"
            ],
            "file-count": 701,
            "sha256": "ef5bce1a5b6c050772a6a107e68b94a743d23b54e13b491f7ea40be3e5161686",
            "source": "https://search.maven.org/remotecontent?filepath=biz/aQute/bnd/biz.aQute.bndlib/6.4.0/biz.aQute.bndlib-6.4.0-sources.jar",
            "status": "restricted"
        }
    ],
    "authority": "https://gitlab.eclipse.org/eclipsefdn/emo-team/iplab/-/issues/5663"
}
