{
    "id": "pypi/pypi/-/nbconvert/7.5.0",
    "license": "BSD-3-Clause AND (MIT AND OFL-1.1)",
    "authority": "https://gitlab.eclipse.org/eclipsefdn/emo-team/iplab/-/issues/14996",
    "source": "https://files.pythonhosted.org/packages/27/6d/dac44403efb5b75ae98c4b503481a775feb1258f53015427d959e9f0e492/nbconvert-7.5.0.tar.gz",
    "status": "approved",
    "scans": [
        {
            "date": "May 29, 2024 at 12:17:40 p.m. GMT",
            "authority": "https://gitlab.eclipse.org/eclipsefdn/emo-team/iplab/-/issues/14996",
            "scancode-version": "31.2.1",
            "licenses-discovered": [
                "BSD-3-Clause",
                "MIT AND OFL-1.1",
                "BSD-3-Clause AND LicenseRef-scancode-proprietary-license",
                "BSD-2-Clause",
                "BSD-2-Clause AND BSD-3-Clause"
            ],
            "copyrights": [
                "(c) Ivan Sagalaev <Maniac@SoftwareManiacs.Org> Adapted from GitHub",
                "Copyright (c) 2001-2015, IPython Development Team",
                "Copyright (c) 2013, the IPython Development Team",
                "Copyright (c) 2014 The IPython Development Team",
                "Copyright (c) 2014-2016, Jupyter Development Team",
                "Copyright (c) 2014-2017, Jupyter Development Team",
                "Copyright (c) 2014-2017, PhosphorJS",
                "Copyright (c) 2015-, Jupyter Development Team",
                "Copyright (c) 2016, the IPython Development Team",
                "Copyright (c) 2017, Jupyter Development Team",
                "Copyright (c) IPython Development Team",
                "Copyright (c) Jupyter Development Team",
                "Copyright 2011-2016 Twitter, Inc.",
                "copyright 2015- s, Jupyter Development Team"
            ],
            "file-count": 277,
            "sha256": "f78fd22fd2410b960d5d9bcecf3e1d6c7bdc5fec2c865964c84aa4e74e6e88da",
            "source": "https://files.pythonhosted.org/packages/27/6d/dac44403efb5b75ae98c4b503481a775feb1258f53015427d959e9f0e492/nbconvert-7.5.0.tar.gz",
            "status": "restricted"
        }
    ]
}