{
    "id": "p2/orbit/p2.eclipse.plugin/org.commonmark-gfm-strikethrough/0.21.0.v20230927-1332",
    "license": "BSD-2-Clause",
    "authority": "https://gitlab.eclipse.org/eclipsefdn/emo-team/iplab/-/issues/10697",
    "source": "https://download.eclipse.org/tools/orbit/simrel/orbit-aggregation/milestone/S202310110718/plugins/org.commonmark-gfm-strikethrough.source_0.21.0.v20230927-1332.jar",
    "status": "approved",
    "scans": [
        {
            "date": "October 12, 2023 at 12:13:23 a.m. GMT",
            "authority": "https://gitlab.eclipse.org/eclipsefdn/emo-team/iplab/-/issues/10697",
            "scancode-version": "31.2.1",
            "licenses-discovered": [
                "BSD-2-Clause"
            ],
            "copyrights": [
                "(c) 2008 VeriSign, Inc.",
                "Copyright (c) 2015, Atlassian Pty Ltd"
            ],
            "file-count": 12,
            "sha256": "ce61cc0cf7f82d0f663c49bf45d4d4d7c2fe6fe67c89546f7ca4d3641cee137d",
            "source": "https://download.eclipse.org/tools/orbit/simrel/orbit-aggregation/milestone/S202310110718/plugins/org.commonmark-gfm-strikethrough.source_0.21.0.v20230927-1332.jar",
            "status": "approved"
        }
    ]
}