{
    "id": "maven/mavencentral/io.gatling.highcharts/gatling-charts-highcharts/3.9.2",
    "license": "None",
    "authority": "https://gitlab.eclipse.org/eclipsefdn/emo-team/iplab/-/issues/10218",
    "source": "https://repo.maven.apache.org/maven2/io/gatling/highcharts/gatling-charts-highcharts/3.9.2/gatling-charts-highcharts-3.9.2-sources.jar",
    "status": "restricted",
    "scans": [
        {
            "date": "August 24, 2023 at 7:27:50 a.m. GMT",
            "authority": "https://gitlab.eclipse.org/eclipsefdn/emo-team/iplab/-/issues/10218",
            "scancode-version": "31.2.1",
            "licenses-discovered": [
            ],
            "copyrights": [
                "(c) 2009-2016 Torstein Honsi",
                "Copyright 2011-2022 Gatling Corp",
                "Copyright 2011-2023 GatlingCorp (https://gatling.io)"
            ],
            "file-count": 32,
            "sha256": "21feaed04c55509b8d9a77499ce552360dc0f46b35878d08ce5f1bc2e7e2176e",
            "source": "https://repo.maven.apache.org/maven2/io/gatling/highcharts/gatling-charts-highcharts/3.9.2/gatling-charts-highcharts-3.9.2-sources.jar",
            "status": "restricted"
        }
    ]
}