{
    "id": "go/golang/github.com%2Fyudai/golcs/v0.0.0-20170316035057-ecda9a501e82",
    "license": "MIT",
    "authority": "https://gitlab.eclipse.org/eclipsefdn/emo-team/iplab/-/issues/12234",
    "source": "https://proxy.golang.org/github.com%2Fyudai/golcs/@v/v0.0.0-20170316035057-ecda9a501e82.zip",
    "status": "approved",
    "scans": [
        {
            "date": "December 21, 2023 at 7:18:18 a.m. GMT",
            "authority": "https://gitlab.eclipse.org/eclipsefdn/emo-team/iplab/-/issues/12234",
            "scancode-version": "31.2.1",
            "licenses-discovered": [
                "MIT"
            ],
            "copyrights": [
                "Copyright (c) 2015 Iwasaki Yudai"
            ],
            "file-count": 4,
            "sha256": "ab50327aa849e409b14f5373543635fb53476792b65a1914f6f90c46fc64ee44",
            "source": "https://proxy.golang.org/github.com%2Fyudai/golcs/@v/v0.0.0-20170316035057-ecda9a501e82.zip",
            "status": "approved"
        }
    ]
}