{
    "id": "maven/mavencentral/org.apache.maven.wagon/wagon-file/3.5.3",
    "license": "Apache-2.0",
    "authority": "https://gitlab.eclipse.org/eclipsefdn/emo-team/iplab/-/issues/6006",
    "source": "https://search.maven.org/remotecontent?filepath=org/apache/maven/wagon/wagon-file/3.5.3/wagon-file-3.5.3-sources.jar",
    "status": "approved",
    "scans": [
        {
            "date": "December 23, 2022 at 7:07:31 p.m. GMT",
            "authority": "https://gitlab.eclipse.org/eclipsefdn/emo-team/iplab/-/issues/6006",
            "scancode-version": "31.2.1",
            "licenses-discovered": [
                "Apache-2.0"
            ],
            "copyrights": [
            ],
            "file-count": 5,
            "sha256": "7ff40a83542d19c3534f32b38bf05384f4b78d6ac03bcd2353266df1402980dc",
            "source": "https://search.maven.org/remotecontent?filepath=org/apache/maven/wagon/wagon-file/3.5.3/wagon-file-3.5.3-sources.jar",
            "status": "approved"
        }
    ]
}