{
    "id": "project/eclipse.pde/-/eclipse.pdePR924/0.0",
    "license": "EPL-2.0",
    "authority": "https://gitlab.eclipse.org/eclipsefdn/emo-team/iplab/-/issues/11597",
    "source": "https://github.com/eclipse-pde/eclipse.pde/pull/919.patch",
    "status": "approved",
    "scans": [
        {
            "date": "November 15, 2023 at 5:12:27 p.m. GMT",
            "authority": "https://gitlab.eclipse.org/eclipsefdn/emo-team/iplab/-/issues/11597",
            "scancode-version": "31.2.1",
            "licenses-discovered": [
                "EPL-2.0"
            ],
            "copyrights": [
                "Copyright (c) 2017, 2019 bndtools project and others",
                "Copyright (c) 2017, 2020 bndtools project and others",
                "Copyright (c) 2017, 2021 bndtools project and others",
                "Copyright (c) 2017, 2023 bndtools project and others"
            ],
            "file-count": 1,
            "sha256": "720705406c3b6ac56fb5618b8d25e7203c82a509469c7b04d8c0068b0013de6b",
            "source": "https://github.com/eclipse-pde/eclipse.pde/pull/919.patch",
            "status": "restricted"
        }
    ]
}
