{
    "id": "maven/mavencentral/org.apache.activemq/activemq-broker/5.16.7",
    "license": "Apache-2.0",
    "authority": "https://gitlab.eclipse.org/eclipsefdn/emo-team/iplab/-/issues/11500",
    "source": "https://repo1.maven.org/maven2/org/apache/activemq/activemq-broker/5.16.7/activemq-broker-5.16.7-sources.jar",
    "status": "approved",
    "scans": [
        {
            "date": "November 10, 2023 at 3:54:18 p.m. GMT",
            "authority": "https://gitlab.eclipse.org/eclipsefdn/emo-team/iplab/-/issues/11500",
            "scancode-version": "31.2.1",
            "licenses-discovered": [
                "Apache-2.0"
            ],
            "copyrights": [
            ],
            "file-count": 494,
            "sha256": "c396deffd8e743824f0b57eb3a133e83c79f4dce0be50184f13cea559aed0f35",
            "source": "https://repo1.maven.org/maven2/org/apache/activemq/activemq-broker/5.16.7/activemq-broker-5.16.7-sources.jar",
            "status": "approved"
        }
    ]
}