{
    "id": "npm/npmjs/-/node-fetch-native/1.6.4",
    "license": "MIT",
    "authority": "https://gitlab.eclipse.org/eclipsefdn/emo-team/iplab/-/issues/14006",
    "source": "https://github.com/unjs/node-fetch-native/archive/refs/tags/v1.6.4.zip",
    "status": "approved",
    "scans": [
        {
            "date": "March 22, 2024 at 3:22:30 p.m. GMT",
            "authority": "https://gitlab.eclipse.org/eclipsefdn/emo-team/iplab/-/issues/14006",
            "scancode-version": "31.2.1",
            "licenses-discovered": [
                "MIT"
            ],
            "copyrights": [
                "Copyright (c) 2013 Nathan Rajlich <nathan@tootallnate.net>",
                "Copyright (c) 2016 - 2020 Node Fetch Team",
                "Copyright (c) 2017 Toru Nagashima",
                "Copyright (c) Matteo Collina and Undici contributors",
                "Copyright (c) Pooya Parsa <pooya@pi0.io>"
            ],
            "file-count": 35,
            "sha256": "eccb4f05ffe08620e7b5b3f3c418f9b9b85dc4dff3c6fb2e1ce4191a21674e3b",
            "source": "https://github.com/unjs/node-fetch-native/archive/refs/tags/v1.6.4.zip",
            "status": "approved"
        }
    ]
}