{
    "id": "go/golang/github.com%2Fgrpc-ecosystem/grpc-gateway/v1.9.5",
    "license": "Apache-2.0 AND BSD-3-Clause",
    "authority": "https://gitlab.eclipse.org/eclipsefdn/emo-team/iplab/-/issues/12508",
    "source": "https://proxy.golang.org/github.com%2Fgrpc-ecosystem/grpc-gateway/@v/v1.9.5.zip",
    "status": "approved",
    "scans": [
        {
            "date": "December 26, 2023 at 6:53:01 a.m. GMT",
            "authority": "https://gitlab.eclipse.org/eclipsefdn/emo-team/iplab/-/issues/12508",
            "scancode-version": "31.2.1",
            "licenses-discovered": [
                "BSD-3-Clause",
                "JSON",
                "Apache-2.0"
            ],
            "copyrights": [
                "Copyright (c) 2015, Gengo, Inc.",
                "Copyright (c) 2015, Google Inc.",
                "Copyright 2017 Google Inc.",
                "Copyright 2018 Google LLC",
                "Copyright 2018 Google LLC."
            ],
            "file-count": 257,
            "sha256": "b6d15099186cabf7f8adf09ff886285c3a8c2d87382c0e5e8011125b12bb1cf6",
            "source": "https://proxy.golang.org/github.com%2Fgrpc-ecosystem/grpc-gateway/@v/v1.9.5.zip",
            "status": "restricted"
        }
    ]
}
