{
    "id": "pypi/pypi/-/pycparser/2.20",
    "license": "LGPL-2.0-or-later AND BSD-3-Clause",
    "authority": "https://gitlab.eclipse.org/eclipsefdn/emo-team/iplab/-/issues/4768",
    "source": "https://files.pythonhosted.org/packages/0f/86/e19659527668d70be91d0369aeaa055b4eb396b0f387a4f92293a20035bd/pycparser-2.20.tar.gz",
    "status": "restricted",
    "scans": [
        {
            "date": "November 10, 2022 at 8:39:20 p.m. GMT",
            "authority": "https://gitlab.eclipse.org/eclipsefdn/emo-team/iplab/-/issues/4768",
            "scancode-version": "31.2.1",
            "licenses-discovered": [
                "LGPL-2.0-or-later",
                "BSD-3-Clause"
            ],
            "copyrights": [
                "Copyright (c) 2001-2017 David M. Beazley (Dabeaz LLC)",
                "Copyright (c) 2008-2017, Eli Bendersky",
                "David Beazley (http://www.dabeaz.com) Copyright (c) 2017"
            ],
            "file-count": 185,
            "sha256": "2d475327684562c3a96cc71adf7dc8c4f0565175cf86b6d7a404ff4c771f15f0",
            "source": "https://files.pythonhosted.org/packages/0f/86/e19659527668d70be91d0369aeaa055b4eb396b0f387a4f92293a20035bd/pycparser-2.20.tar.gz",
            "status": "restricted"
        }
    ]
}