{
    "id": "npm/npmjs/@vueuse/shared/10.1.0",
    "license": "MIT",
    "authority": "https://gitlab.eclipse.org/eclipsefdn/emo-team/iplab/-/issues/8124",
    "source": "https://github.com/vueuse/vueuse/archive/v10.1.0.zip",
    "status": "approved",
    "scans": [
        {
            "date": "May 3, 2023 at 8:33:51 a.m. GMT",
            "authority": "https://gitlab.eclipse.org/eclipsefdn/emo-team/iplab/-/issues/8124",
            "scancode-version": "31.2.1",
            "licenses-discovered": [
                "MIT"
            ],
            "copyrights": [
                "(c) 2019-PRESENT Anthony Fu (https://github.com/antfu)",
                "(c) 2021-PRESENT Anthony Fu (https://github.com/antfu)",
                "(c) 2021-PRESENT Archer Gu (https://github.com/ArcherGu)",
                "(c) 2021-PRESENT Jacob Clevenger (https://github.com/wheatjs)",
                "Copyright (c) 2019-PRESENT Anthony Fu <https://github.com/antfu>",
                "Copyright (c) 2020-PRESENT Anthony Fu and VueUse"
            ],
            "file-count": 1092,
            "sha256": "daa01c2afa3dfe229f0d28b48c57c05b67a5fafcbbd6fe0b056f70a615a7f828",
            "source": "https://github.com/vueuse/vueuse/archive/v10.1.0.zip",
            "status": "approved"
        }
    ]
}