{
    "id": "project/automotive.tractusx/-/matchmaking-agent/1.12.17-SNAPSHOT",
    "license": "Apache-2.0",
    "authority": "https://gitlab.eclipse.org/eclipsefdn/emo-team/iplab/-/issues/14224",
    "source": "https://patch-diff.githubusercontent.com/raw/eclipse-tractusx/knowledge-agents/pull/104.patch",
    "status": "approved",
    "scans": [
        {
            "date": "April 11, 2024 at 9:26:26 a.m. GMT",
            "authority": "https://gitlab.eclipse.org/eclipsefdn/emo-team/iplab/-/issues/14224",
            "scancode-version": "31.2.1",
            "licenses-discovered": [
                "LicenseRef-scancode-unknown-spdx OR LicenseRef-scancode-unknown-spdx AND Apache-2.0"
            ],
            "copyrights": [
                "Copyright (c) 2020 - 2022 Microsoft Corporation",
                "Copyright (c) 2020, 2021 Fraunhofer Institute for Software and Systems Engineering",
                "Copyright (c) 2020, 2021 Microsoft Corporation",
                "Copyright (c) 2021 Bayerische Motoren Werke Aktiengesellschaft",
                "Copyright (c) 2021, 2024 Contributors",
                "Copyright (c) 2022 Microsoft Corporation",
                "Copyright (c) 2022,2023 Contributors",
                "Copyright (c) 2022,2024 Contributors",
                "Copyright (c) 2023 ,2024 Contributors",
                "Copyright (c) 2023 Bayerische Motoren Werke Aktiengesellschaft",
                "Copyright (c) 2023 Contributors",
                "Copyright (c) 2023, 2024 T-Systems International GmbH",
                "Copyright (c) 2024 Contributors",
                "Copyright (c) 2024 T-Systems International GmbH"
            ],
            "file-count": 1,
            "sha256": "a52be03c75a3bf90ddbc1aa2633e1819cb7d9cf14abf009e7ad491ef24d38b8a",
            "source": "https://patch-diff.githubusercontent.com/raw/eclipse-tractusx/knowledge-agents/pull/104.patch",
            "status": "restricted"
        }
    ]
}
