{
    "id": "pypi/pypi/-/uvloop/0.21.0",
    "license": "(MIT OR Apache-2.0) AND ISC AND (ISC AND LicenseRef-FSF) AND (GPL-2.0-or-later WITH LicenseRef-Autoconf-exception) AND (GPL-3.0-or-later WITH LicenseRef-Autoconf-exception) AND (FSFULLR AND FSFUL AND (GPL-2.0-or-later WITH Libtool-exception)) AND BSD-2-Clause AND MIT AND CC-BY-4.0 AND (FSFUL AND (GPL-2.0-or-later WITH Libtool-exception)) AND LicenseRef-FSF AND FSFULLR AND (X11 AND LicenseRef-Publi-domain)",
    "authority": "https://gitlab.eclipse.org/eclipsefdn/emo-team/iplab/-/issues/19385",
    "source": "https://files.pythonhosted.org/packages/af/c0/854216d09d33c543f12a44b393c402e89a920b1a0a7dc634c42de91b9cf6/uvloop-0.21.0.tar.gz",
    "status": "approved",
    "scans": [
        {
            "date": "February 11, 2025 at 9:54:41 p.m. GMT",
            "authority": "https://gitlab.eclipse.org/eclipsefdn/emo-team/iplab/-/issues/19385",
            "scancode-version": "31.2.1",
            "licenses-discovered": [
                "Apache-2.0",
                "MIT",
                "Apache-2.0 AND MIT",
                "FSFULLR AND LicenseRef-scancode-fsf-unlimited-no-warranty",
                "GPL-2.0-or-later AND LicenseRef-scancode-autoconf-simple-exception-2.0",
                "ISC",
                "GPL-3.0-or-later AND LicenseRef-scancode-autoconf-simple-exception AND LicenseRef-scancode-free-unknown",
                "FSFUL AND GPL-2.0-or-later AND Libtool-exception",
                "X11",
                "CC-BY-4.0",
                "BSD-2-Clause AND ISC AND MIT",
                "GPL-2.0-or-later AND GPL-3.0-or-later AND Libtool-exception",
                "ISC AND LicenseRef-scancode-fsf-unlimited-no-warranty",
                "FSFUL",
                "BSD-2-Clause",
                "Autoconf-exception-2.0 AND GPL-3.0-or-later",
                "FSFUL AND FSFULLR AND GPL-2.0-or-later AND Libtool-exception",
                "Autoconf-exception-2.0 AND GPL-2.0-or-later",
                "FSFULLR"
            ],
            "copyrights": [
                "(c) (c) L",
                "Copyright (c) 1992-1996, 1998-2017, 2020-2021 Free Software Foundation",
                "Copyright (c) 1992-1996, 1998-2017, 2020-2021 Free Software Foundation, Inc.",
                "Copyright (c) 1994 X Consortium",
                "Copyright (c) 1994-2021 Free Software Foundation, Inc.",
                "Copyright (c) 1996-1999 by Internet Software Consortium",
                "Copyright (c) 1996-2001, 2003-2015 Free Software Foundation, Inc.",
                "Copyright (c) 1996-2015 Free Software Foundation, Inc.",
                "Copyright (c) 1996-2021 Free Software Foundation, Inc.",
                "Copyright (c) 1997-2021 Free Software Foundation, Inc.",
                "Copyright (c) 1999-2021 Free Software Foundation, Inc.",
                "Copyright (c) 2001-2021 Free Software Foundation, Inc.",
                "Copyright (c) 2002-2021 Free Software Foundation, Inc.",
                "Copyright (c) 2003-2021 Free Software Foundation, Inc.",
                "Copyright (c) 2004 by Internet Systems Consortium, Inc.",
                "Copyright (c) 2004, 2011-2015 Free Software Foundation, Inc.",
                "Copyright (c) 2004-2005, 2007, 2009, 2011-2015 Free Software Foundation, Inc.",
                "Copyright (c) 2004-2005, 2007-2008, 2011-2015 Free Software Foundation, Inc.",
                "Copyright (c) 2004-2005, 2007-2009, 2011-2015 Free Software Foundation, Inc.",
                "Copyright (c) 2004-2015 Free Software Foundation, Inc.",
                "Copyright (c) 2004-2021 Free Software Foundation, Inc.",
                "Copyright (c) 2006-2008 Diego Petteno",
                "Copyright (c) 2006-2008 xine project",
                "Copyright (c) 2006-2021 Free Software Foundation, Inc.",
                "Copyright (c) 2008 Steven G. Johnson <stevenj@alum.mit.edu>",
                "Copyright (c) 2009-2021 Free Software Foundation, Inc.",
                "Copyright (c) 2010-2015 Free Software Foundation, Inc.",
                "Copyright (c) 2010-2021 Free Software Foundation, Inc.",
                "Copyright (c) 2011 Daniel Richard G. <skunk@iSKUNK.ORG>",
                "Copyright (c) 2011 Free Software Foundation, Inc.",
                "Copyright (c) 2011-2021 Free Software Foundation, Inc.",
                "Copyright (c) 2013, Ben Noordhuis <info@bnoordhuis.nl>",
                "Copyright (c) 2014 Free Software Foundation, Inc.",
                "Copyright (c) 2014, Ben Noordhuis <info@bnoordhuis.nl>",
                "Copyright (c) 2015 Saul Ibarra Corretge <saghul@gmail.com>",
                "Copyright (c) 2015, Ben Noordhuis <info@bnoordhuis.nl>",
                "Copyright (c) 2015-present MagicStack Inc. http://magic.io",
                "Copyright (c) 2015-present libuv project contributors",
                "Copyright (c) 2016-present the uvloop authors and contributors",
                "Copyright (c) 2021 Free Software Foundation, Inc.",
                "Copyright (c) 2021 libuv project",
                "Copyright 1992-2022 Free Software Foundation, Inc.",
                "Copyright 2002 Niels Provos <provos@citi.umich.edu>",
                "Copyright 2017 - Refael Ackermann",
                "Copyright Bert Belder",
                "Copyright Fedor Indutny",
                "Copyright Joyent, Inc. and other Node contributors",
                "Copyright The libuv project and contributors",
                "Copyright libuv contributors",
                "Copyright libuv project and contributors",
                "Copyright libuv project and other Node contributors",
                "Copyright libuv project contributors",
                "Copyright the libuv project contributors",
                "copyright 2016-present, MagicStack, Inc",
                "copyright Niels Provos. Two",
                "copyright the Internet Systems Consortium, Inc."
            ],
            "file-count": 493,
            "sha256": "3bf12b0fda68447806a7ad847bfa591613177275d35b6724b1ee573faa3704e3",
            "source": "https://files.pythonhosted.org/packages/af/c0/854216d09d33c543f12a44b393c402e89a920b1a0a7dc634c42de91b9cf6/uvloop-0.21.0.tar.gz",
            "status": "restricted"
        }
    ]
}