{
    "id": "maven/mavencentral/org.wildfly.security/wildfly-elytron-sasl-anonymous/2.2.1.Final",
    "license": "Apache-2.0",
    "authority": "https://gitlab.eclipse.org/eclipsefdn/emo-team/iplab/-/issues/9525",
    "source": "https://repo.maven.apache.org/maven2/org/wildfly/security/wildfly-elytron-sasl-anonymous/2.2.1.Final/wildfly-elytron-sasl-anonymous-2.2.1.Final-sources.jar",
    "status": "approved",
    "scans": [
        {
            "date": "July 17, 2023 at 3:36:26 p.m. GMT",
            "authority": "https://gitlab.eclipse.org/eclipsefdn/emo-team/iplab/-/issues/9525",
            "scancode-version": "31.2.1",
            "licenses-discovered": [
                "Apache-2.0"
            ],
            "copyrights": [
                "Copyright 2014 Red Hat, Inc., and individual contributors",
                "Copyright 2018 Red Hat, Inc., and individual contributors"
            ],
            "file-count": 10,
            "sha256": "da156b7631fd405d020cd5f4cdc89c40060f31938657db8b5f97953ae73bc140",
            "source": "https://repo.maven.apache.org/maven2/org/wildfly/security/wildfly-elytron-sasl-anonymous/2.2.1.Final/wildfly-elytron-sasl-anonymous-2.2.1.Final-sources.jar",
            "status": "approved"
        }
    ]
}