{
    "id": "maven/mavencentral/org.apache.httpcomponents/httpclient-osgi/4.5.12",
    "license": "Apache-2.0",
    "licenses-discovered": [
        "Apache-2.0"
    ],
    "file-count": 22,
    "scancode-version": "30.1.0",
    "authority": "https://gitlab.eclipse.org/eclipsefdn/emo-team/iplab/-/issues/2142",
    "source": "https://search.maven.org/remotecontent?filepath=org/apache/httpcomponents/httpclient-osgi/4.5.12/httpclient-osgi-4.5.12-sources.jar",
    "status": "approved"
}