{
    "id": "maven/mavencentral/io.dropwizard.metrics/metrics-graphite/4.2.19",
    "license": "None",
    "authority": "https://gitlab.eclipse.org/eclipsefdn/emo-team/iplab/-/issues/19748",
    "source": "https://repo1.maven.org/maven2/io/dropwizard/metrics/metrics-graphite/4.2.19/metrics-graphite-4.2.19-sources.jar",
    "status": "restricted",
    "scans": [
        {
            "date": "March 1, 2025 at 1:38:14 a.m. GMT",
            "authority": "https://gitlab.eclipse.org/eclipsefdn/emo-team/iplab/-/issues/19748",
            "scancode-version": "31.2.1",
            "licenses-discovered": [
            ],
            "copyrights": [
            ],
            "file-count": 10,
            "sha256": "2a842538e490e341846460443a3eefb89df161f682d09c7be582d308587871b6",
            "source": "https://repo1.maven.org/maven2/io/dropwizard/metrics/metrics-graphite/4.2.19/metrics-graphite-4.2.19-sources.jar",
            "status": "restricted"
        }
    ]
}