{
    "id": "maven/mavencentral/com.github.java-json-tools/uri-template/0.10",
    "license": "Apache-2.0 OR LGPL-3.0-only)",
    "licenses-discovered": [
        "Apache-2.0",
        "LGPL-3.0-only",
        "Apache-2.0 AND GPL-1.0-or-later AND LGPL-3.0-only"
    ],
    "file-count": 40,
    "scancode-version": "30.1.0",
    "authority": "https://gitlab.eclipse.org/eclipsefdn/emo-team/iplab/-/issues/15288",
    "source": "https://repo1.maven.org/maven2/com/github/java-json-tools/uri-template/0.10/uri-template-0.10-sources.jar",
    "status": "approved",
    "scans": [
        {
            "date": "June 14, 2024 at 4:59:02 p.m. GMT",
            "authority": "https://gitlab.eclipse.org/eclipsefdn/emo-team/iplab/-/issues/15288",
            "scancode-version": "31.2.1",
            "licenses-discovered": [
                "Apache-2.0",
                "LGPL-3.0-only",
                "Apache-2.0 AND GPL-1.0-or-later AND LGPL-3.0-only"
            ],
            "copyrights": [
                "Copyright (c) 2007 Free Software Foundation, Inc. <http://fsf.org/>",
                "Copyright (c) 2014, Francis Galiegue (fgaliegue@gmail.com)"
            ],
            "file-count": 40,
            "sha256": "0a6879ce9842df2c63ed4ae52dfab20e74ea7f8b5bc3c8b87b80d82d07439ea8",
            "source": "https://repo1.maven.org/maven2/com/github/java-json-tools/uri-template/0.10/uri-template-0.10-sources.jar",
            "status": "restricted"
        }
    ]
}