{
    "id": "maven/mavencentral/org.openeuler/jsse/1.0.7",
    "license": "GPL-2.0-only WITH Classpath-exception-2.0",
    "authority": "https://gitlab.eclipse.org/eclipsefdn/emo-team/iplab/-/issues/11884",
    "source": "https://repo1.maven.org/maven2/org/openeuler/jsse/1.0.7/jsse-1.0.7-sources.jar",
    "status": "approved",
    "scans": [
        {
            "date": "December 13, 2023 at 7:36:45 a.m. GMT",
            "authority": "https://gitlab.eclipse.org/eclipsefdn/emo-team/iplab/-/issues/11884",
            "scancode-version": "31.2.1",
            "licenses-discovered": [
                "GPL-2.0-only WITH Classpath-exception-2.0"
            ],
            "copyrights": [
                "(c) 1998 VeriSign, Inc.",
                "(c) 1999 VeriSign, Inc.",
                "(c) 2006 VeriSign, Inc.",
                "(c) 2006 thawte, Inc.",
                "(c) 2007 GeoTrust Inc.",
                "(c) 2007 VeriSign, Inc.",
                "(c) 2007 thawte, Inc.",
                "(c) 2008 GeoTrust Inc.",
                "(c) 2008 VeriSign, Inc.",
                "(c) 2008 thawte, Inc.",
                "Copyright (c) 1995, 2015, Oracle and/or its affiliates",
                "Copyright (c) 1996, 2018, Oracle and/or its affiliates",
                "Copyright (c) 1996, 2020, Oracle and/or its affiliates",
                "Copyright (c) 1996, 2023, Oracle and/or its affiliates",
                "Copyright (c) 1997, 2018, Oracle and/or its affiliates",
                "Copyright (c) 1999, 2018, Oracle and/or its affiliates",
                "Copyright (c) 1999, 2020, Oracle and/or its affiliates",
                "Copyright (c) 2001, 2018, Oracle and/or its affiliates",
                "Copyright (c) 2002, 2012, Oracle and/or its affiliates",
                "Copyright (c) 2002, 2016, Oracle and/or its affiliates",
                "Copyright (c) 2002, 2017, Oracle and/or its affiliates",
                "Copyright (c) 2002, 2018, Oracle and/or its affiliates",
                "Copyright (c) 2002, 2019, Oracle and/or its affiliates",
                "Copyright (c) 2002, 2020, Oracle and/or its affiliates",
                "Copyright (c) 2002, 2021, Oracle and/or its affiliates",
                "Copyright (c) 2003, 2018, Oracle and/or its affiliates",
                "Copyright (c) 2003, 2019, Oracle and/or its affiliates",
                "Copyright (c) 2003, 2023, Oracle and/or its affiliates",
                "Copyright (c) 2004, 2018, Oracle and/or its affiliates",
                "Copyright (c) 2005, 2010, Oracle and/or its affiliates",
                "Copyright (c) 2005, 2013, Oracle and/or its affiliates",
                "Copyright (c) 2005, 2017, Oracle and/or its affiliates",
                "Copyright (c) 2006, 2018, Oracle and/or its affiliates",
                "Copyright (c) 2007, 2013, Oracle and/or its affiliates",
                "Copyright (c) 2009, 2020, Oracle and/or its affiliates",
                "Copyright (c) 2010, 2018, Oracle and/or its affiliates",
                "Copyright (c) 2011, 2017, Oracle and/or its affiliates",
                "Copyright (c) 2012, 2018, Oracle and/or its affiliates",
                "Copyright (c) 2012, 2020, Oracle and/or its affiliates",
                "Copyright (c) 2014, Oracle and/or its affiliates",
                "Copyright (c) 2015, 2018, Oracle and/or its affiliates",
                "Copyright (c) 2015, 2019, Oracle and/or its affiliates",
                "Copyright (c) 2015, 2020, Oracle and/or its affiliates",
                "Copyright (c) 2015, Oracle and/or its affiliates",
                "Copyright (c) 2017, 2018, Oracle and/or its affiliates",
                "Copyright (c) 2017, Oracle and/or its affiliates",
                "Copyright (c) 2017, Red Hat, Inc. and/or its affiliates",
                "Copyright (c) 2018, 20121, Oracle and/or its affiliates",
                "Copyright (c) 2018, 2019, Oracle and/or its affiliates",
                "Copyright (c) 2018, 2020 Oracle and/or its affiliates",
                "Copyright (c) 2018, 2020, Oracle and/or its affiliates",
                "Copyright (c) 2018, 2021, Oracle and/or its affiliates",
                "Copyright (c) 2018, 2023, Oracle and/or its affiliates",
                "Copyright (c) 2018, 2023,Oracle and/or its affiliates",
                "Copyright (c) 2018, Oracle and/or its affiliates",
                "Copyright (c) 2019, Oracle and/or its affiliates",
                "Copyright (c) 2020, Azul Systems, Inc.",
                "Copyright (c) 2020, Oracle and/or its affiliates",
                "Copyright (c) 2020, Red Hat, Inc.",
                "Copyright (c) 2021, Huawei Technologies Co., Ltd.",
                "Copyright (c) 2021, Oracle and/or its affiliates",
                "Copyright (c) 2022, Huawei Technologies Co., Ltd."
            ],
            "file-count": 176,
            "sha256": "66bfb306f1d7e03f3aaa98f43cea60eb6b18503541a3b8c1a401e7f894c4bc06",
            "source": "https://repo1.maven.org/maven2/org/openeuler/jsse/1.0.7/jsse-1.0.7-sources.jar",
            "status": "restricted"
        }
    ]
}
