{
    "id": "maven/mavencentral/com.google.api.grpc/gapic-google-cloud-storage-v2/2.22.6-alpha",
    "license": "Apache-2.0",
    "authority": "https://gitlab.eclipse.org/eclipsefdn/emo-team/iplab/-/issues/11519",
    "source": "https://repo1.maven.org/maven2/com/google/api/grpc/gapic-google-cloud-storage-v2/2.22.6-alpha/gapic-google-cloud-storage-v2-2.22.6-alpha-sources.jar",
    "status": "approved",
    "scans": [
        {
            "date": "November 13, 2023 at 9:52:16 a.m. GMT",
            "authority": "https://gitlab.eclipse.org/eclipsefdn/emo-team/iplab/-/issues/11519",
            "scancode-version": "31.2.1",
            "licenses-discovered": [
                "Apache-2.0"
            ],
            "copyrights": [
                "Copyright 2023 Google LLC"
            ],
            "file-count": 11,
            "sha256": "764d5c5f68c63e894a4ec11055e5050bde27c007b8bfca3ab1f14389b3af4351",
            "source": "https://repo1.maven.org/maven2/com/google/api/grpc/gapic-google-cloud-storage-v2/2.22.6-alpha/gapic-google-cloud-storage-v2-2.22.6-alpha-sources.jar",
            "status": "approved"
        }
    ]
}