{
    "id": "maven/mavencentral/org.webjars.bowergithub.webcomponents/shadycss/1.8.0",
    "license": "None",
    "authority": "https://gitlab.eclipse.org/eclipsefdn/emo-team/iplab/-/issues/11205",
    "source": "https://repo.maven.apache.org/maven2/org/webjars/bowergithub/webcomponents/shadycss/1.8.0/shadycss-1.8.0-sources.jar",
    "status": "restricted",
    "scans": [
        {
            "date": "October 25, 2023 at 9:55:37 p.m. GMT",
            "authority": "https://gitlab.eclipse.org/eclipsefdn/emo-team/iplab/-/issues/11205",
            "scancode-version": "31.2.1",
            "licenses-discovered": [
            ],
            "copyrights": [
            ],
            "file-count": 0,
            "sha256": "8739c76e681f900923b900c9df0ef75cf421d39cabb54650c4b9ad19b6a76d85",
            "source": "https://repo.maven.apache.org/maven2/org/webjars/bowergithub/webcomponents/shadycss/1.8.0/shadycss-1.8.0-sources.jar",
            "status": "restricted"
        }
    ]
}