{
    "id": "maven/mavencentral/org.mockito/mockito-junit-jupiter/5.9.0",
    "license": "MIT",
    "authority": "https://gitlab.eclipse.org/eclipsefdn/emo-team/iplab/-/issues/12773",
    "source": "https://repo1.maven.org/maven2/org/mockito/mockito-junit-jupiter/5.9.0/mockito-junit-jupiter-5.9.0-sources.jar",
    "status": "approved",
    "scans": [
        {
            "date": "January 15, 2024 at 9:14:39 a.m. GMT",
            "authority": "https://gitlab.eclipse.org/eclipsefdn/emo-team/iplab/-/issues/12773",
            "scancode-version": "31.2.1",
            "licenses-discovered": [
                "MIT"
            ],
            "copyrights": [
                "Copyright (c) 2007 Mockito",
                "Copyright (c) 2018 Mockito"
            ],
            "file-count": 7,
            "sha256": "fd610a7f100a13480133db6b52c5d24eb5d34a2b895f3fbb4c4051d669f10e28",
            "source": "https://repo1.maven.org/maven2/org/mockito/mockito-junit-jupiter/5.9.0/mockito-junit-jupiter-5.9.0-sources.jar",
            "status": "approved"
        }
    ]
}