{
    "id": "-/-/vscode/language-features-subset/1.76.0",
    "license": "MIT AND Apache-2.0",
    "authority": "https://gitlab.eclipse.org/eclipsefdn/emo-team/iplab/-/issues/7312",
    "source": "https://gitlab.eclipse.org/eclipsefdn/emo-team/iplab/uploads/2a7eb06248213888e5162880cb91687a/language-features-1.76.0.zip",
    "status": "approved",
    "scans": [
        {
            "date": "March 2, 2023 at 4:32:06 p.m. GMT",
            "authority": "https://gitlab.eclipse.org/eclipsefdn/emo-team/iplab/-/issues/7312",
            "scancode-version": "31.2.1",
            "licenses-discovered": [
                "MIT",
                "Apache-2.0"
            ],
            "copyrights": [
                "Copyright (c) 2014 Jonathan Ong",
                "Copyright (c) 2015 Douglas Christopher Wilson",
                "Copyright (c) 2015-2022 Douglas Christopher Wilson",
                "Copyright (c) Microsoft Corporation",
                "Copyright (c) Microsoft and contributors"
            ],
            "file-count": 26,
            "sha256": "34c1e7f2036fa025c017f4c315c0e3f7f71616928646760940ece8025fe74d79",
            "source": "https://gitlab.eclipse.org/eclipsefdn/emo-team/iplab/uploads/2a7eb06248213888e5162880cb91687a/language-features-1.76.0.zip",
            "status": "approved"
        }
    ]
}