{
    "id": "maven/mavencentral/org.springframework.security/spring-security-oauth2-client/5.7.5",
    "license": "Apache-2.0",
    "licenses-discovered": [
        "Apache-2.0"
    ],
    "copyrights": [
        "Copyright 2002-2017 the original author or authors",
        "Copyright 2002-2018 the original author or authors",
        "Copyright 2002-2019 the original author or authors",
        "Copyright 2002-2020 the original author or authors",
        "Copyright 2002-2021 the original author or authors",
        "Copyright 2002-2022 the original author or authors"
    ],
    "file-count": 162,
    "scancode-version": "31.2.1",
    "authority": "https://gitlab.eclipse.org/eclipsefdn/emo-team/iplab/-/issues/4326",
    "source": "https://search.maven.org/remotecontent?filepath=org/springframework/security/spring-security-oauth2-client/5.7.5/spring-security-oauth2-client-5.7.5-sources.jar",
    "status": "approved"
}