{
    "id": "maven/mavencentral/org.wildfly.security/wildfly-elytron-sasl-oauth2/2.2.1.Final",
    "license": "Apache-2.0",
    "authority": "https://gitlab.eclipse.org/eclipsefdn/emo-team/iplab/-/issues/9479",
    "source": "https://repo.maven.apache.org/maven2/org/wildfly/security/wildfly-elytron-sasl-oauth2/2.2.1.Final/wildfly-elytron-sasl-oauth2-2.2.1.Final-sources.jar",
    "status": "approved",
    "scans": [
        {
            "date": "July 17, 2023 at 11:36:50 a.m. GMT",
            "authority": "https://gitlab.eclipse.org/eclipsefdn/emo-team/iplab/-/issues/9479",
            "scancode-version": "31.2.1",
            "licenses-discovered": [
                "Apache-2.0"
            ],
            "copyrights": [
                "Copyright 2016 Red Hat, Inc., and individual contributors",
                "Copyright 2018 Red Hat, Inc., and individual contributors"
            ],
            "file-count": 9,
            "sha256": "4d19e4f25e7d32095951d83858e44dccdefccfba0658adbcaeeffbbdf3ea9ff4",
            "source": "https://repo.maven.apache.org/maven2/org/wildfly/security/wildfly-elytron-sasl-oauth2/2.2.1.Final/wildfly-elytron-sasl-oauth2-2.2.1.Final-sources.jar",
            "status": "approved"
        }
    ]
}