{
    "id": "maven/mavencentral/io.fabric8/kubernetes-model-batch/6.11.0",
    "license": "Apache-2.0",
    "authority": "https://gitlab.eclipse.org/eclipsefdn/emo-team/iplab/-/issues/14092",
    "source": "https://repo1.maven.org/maven2/io/fabric8/kubernetes-model-batch/6.11.0/kubernetes-model-batch-6.11.0-sources.jar",
    "status": "approved",
    "scans": [
        {
            "date": "March 26, 2024 at 10:19:42 a.m. GMT",
            "authority": "https://gitlab.eclipse.org/eclipsefdn/emo-team/iplab/-/issues/14092",
            "scancode-version": "31.2.1",
            "licenses-discovered": [
                "Apache-2.0"
            ],
            "copyrights": [
                "Copyright (c) 2015 Red Hat, Inc."
            ],
            "file-count": 69,
            "sha256": "92d07328ad77dc932a66621c5ac4ec012f73a1cb1b5b281e7ee7f55c0c56edc9",
            "source": "https://repo1.maven.org/maven2/io/fabric8/kubernetes-model-batch/6.11.0/kubernetes-model-batch-6.11.0-sources.jar",
            "status": "approved"
        }
    ]
}