{
    "id": "maven/mavencentral/org.wildfly.security/wildfly-elytron-auth-server-deprecated/2.2.1.Final",
    "license": "Apache-2.0",
    "authority": "https://gitlab.eclipse.org/eclipsefdn/emo-team/iplab/-/issues/9502",
    "source": "https://repo.maven.apache.org/maven2/org/wildfly/security/wildfly-elytron-auth-server-deprecated/2.2.1.Final/wildfly-elytron-auth-server-deprecated-2.2.1.Final-sources.jar",
    "status": "approved",
    "scans": [
        {
            "date": "July 17, 2023 at 11:13:52 a.m. GMT",
            "authority": "https://gitlab.eclipse.org/eclipsefdn/emo-team/iplab/-/issues/9502",
            "scancode-version": "31.2.1",
            "licenses-discovered": [
                "Apache-2.0"
            ],
            "copyrights": [
                "Copyright 2014 Red Hat, Inc., and individual contributors",
                "Copyright 2015 Red Hat, Inc., and individual contributors",
                "Copyright 2016 Red Hat, Inc., and individual contributors",
                "Copyright 2018 Red Hat, Inc., and individual contributors"
            ],
            "file-count": 9,
            "sha256": "8142c33d97c15ccb9dc4e0179ed10c90cb92b0c9c8b6b69d6321077c028df974",
            "source": "https://repo.maven.apache.org/maven2/org/wildfly/security/wildfly-elytron-auth-server-deprecated/2.2.1.Final/wildfly-elytron-auth-server-deprecated-2.2.1.Final-sources.jar",
            "status": "approved"
        }
    ]
}