{
    "id": "maven/mavencentral/io.fabric8/openshift-model-console/6.6.0",
    "license": "Apache-2.0",
    "authority": "https://gitlab.eclipse.org/eclipsefdn/emo-team/iplab/-/issues/8361",
    "source": "https://search.maven.org/remotecontent?filepath=io/fabric8/openshift-model-console/6.6.0/openshift-model-console-6.6.0-sources.jar",
    "status": "approved",
    "scans": [
        {
            "date": "May 5, 2023 at 5:11:07 a.m. GMT",
            "authority": "https://gitlab.eclipse.org/eclipsefdn/emo-team/iplab/-/issues/8361",
            "scancode-version": "31.2.1",
            "licenses-discovered": [
                "Apache-2.0"
            ],
            "copyrights": [
                "Copyright (c) 2015 Red Hat, Inc."
            ],
            "file-count": 132,
            "sha256": "803d9a199d078d6560f3737abd0f1c06f4e223870c7f80f7ebdadeced6418ea5",
            "source": "https://search.maven.org/remotecontent?filepath=io/fabric8/openshift-model-console/6.6.0/openshift-model-console-6.6.0-sources.jar",
            "status": "approved"
        }
    ]
}