{
    "id": "maven/mavencentral/com.jgoodies/jgoodies-common/1.8.1",
    "license": "BSD-3-Clause",
    "authority": "https://gitlab.eclipse.org/eclipsefdn/emo-team/iplab/-/issues/14176",
    "source": "https://repo1.maven.org/maven2/com/jgoodies/jgoodies-common/1.8.1/jgoodies-common-1.8.1-sources.jar",
    "status": "approved",
    "alternate-ids": [
        "p2/orbit/p2.eclipse.plugin/com.jgoodies.common/1.8.1"
    ],
    "scans": [
        {
            "date": "March 27, 2024 at 11:56:21 a.m. GMT",
            "authority": "https://gitlab.eclipse.org/eclipsefdn/emo-team/iplab/-/issues/14176",
            "scancode-version": "31.2.1",
            "licenses-discovered": [
                "BSD-3-Clause"
            ],
            "copyrights": [
                "Copyright (c) 2002-2014 JGoodies Software GmbH.",
                "Copyright (c) 2009-2014 JGoodies Software GmbH.",
                "Copyright (c) 2012-2014 JGoodies Software GmbH.",
                "Copyright (c) 2013-2014 JGoodies Software GmbH."
            ],
            "file-count": 38,
            "sha256": "dabc447d59a3a0193393ef4ca3855740e2e95cf719cbf36d9b5dd5e51393492f",
            "source": "https://repo1.maven.org/maven2/com/jgoodies/jgoodies-common/1.8.1/jgoodies-common-1.8.1-sources.jar",
            "status": "approved"
        }
    ]
}
