{
    "id": "npm/npmjs/-/immutable/4.2.0",
    "license": "MIT",
    "authority": "https://gitlab.eclipse.org/eclipsefdn/emo-team/iplab/-/issues/5979",
    "source": "https://github.com/immutable-js/immutable-js/archive/v4.2.0.zip",
    "status": "approved",
    "scans": [
        {
            "date": "December 23, 2022 at 6:06:35 p.m. GMT",
            "authority": "https://gitlab.eclipse.org/eclipsefdn/emo-team/iplab/-/issues/5979",
            "scancode-version": "31.2.1",
            "licenses-discovered": [
                "MIT"
            ],
            "copyrights": [
                "Copyright (c) 2014-present, Lee Byron and other contributors"
            ],
            "file-count": 222,
            "sha256": "1377a92d6aab9940f3663f459c6e0fc44619fc504a2f2746e6b6d2a84aaadffb",
            "source": "https://github.com/immutable-js/immutable-js/archive/v4.2.0.zip",
            "status": "approved"
        }
    ]
}