{
    "id": "maven/mavencentral/it.unibz.inf.ontop/ontop-obda-core/5.1.0",
    "license": "Apache-2.0",
    "authority": "https://gitlab.eclipse.org/eclipsefdn/emo-team/iplab/-/issues/11623",
    "source": "https://repo1.maven.org/maven2/it/unibz/inf/ontop/ontop-obda-core/5.1.0/ontop-obda-core-5.1.0-sources.jar",
    "status": "approved",
    "scans": [
        {
            "date": "November 21, 2023 at 8:32:48 a.m. GMT",
            "authority": "https://gitlab.eclipse.org/eclipsefdn/emo-team/iplab/-/issues/11623",
            "scancode-version": "31.2.1",
            "licenses-discovered": [
                "Apache-2.0"
            ],
            "copyrights": [
                "Copyright (c) 2009 - 2014 Free University of Bozen-Bolzano"
            ],
            "file-count": 58,
            "sha256": "767d72ae1007f234f1e327efa1709c0d49112a139f42ddfd7033e1bb3f3393f3",
            "source": "https://repo1.maven.org/maven2/it/unibz/inf/ontop/ontop-obda-core/5.1.0/ontop-obda-core-5.1.0-sources.jar",
            "status": "approved"
        }
    ]
}