{
    "id": "npm/npmjs/-/typedoc-plugin-external-module-map/2.0.1",
    "license": "MIT",
    "authority": "https://gitlab.eclipse.org/eclipsefdn/emo-team/iplab/-/issues/17821",
    "source": "https://registry.npmjs.org/typedoc-plugin-external-module-map/-/typedoc-plugin-external-module-map-2.0.1.tgz",
    "status": "approved",
    "scans": [
        {
            "date": "December 11, 2024 at 2:05:23 p.m. GMT",
            "authority": "https://gitlab.eclipse.org/eclipsefdn/emo-team/iplab/-/issues/17821",
            "scancode-version": "31.2.1",
            "licenses-discovered": [
                "MIT"
            ],
            "copyrights": [
                "Copyright (c) 2016 Chris Thielen"
            ],
            "file-count": 15,
            "sha256": "b3ca668f27297e9c6c295b09ee390e956b7ca4bd6f91338cf61f9aaa425d2c89",
            "source": "https://registry.npmjs.org/typedoc-plugin-external-module-map/-/typedoc-plugin-external-module-map-2.0.1.tgz",
            "status": "approved"
        }
    ]
}