{
    "id": "npm/npmjs/@vuetify/loader-shared/1.7.1",
    "license": "MIT",
    "authority": "https://gitlab.eclipse.org/eclipsefdn/emo-team/iplab/-/issues/6949",
    "source": "https://github.com/vuetifyjs/vuetify-loader/archive/v1.7.1.zip",
    "status": "approved",
    "scans": [
        {
            "date": "February 3, 2023 at 8:40:23 p.m. GMT",
            "authority": "https://gitlab.eclipse.org/eclipsefdn/emo-team/iplab/-/issues/6949",
            "scancode-version": "31.2.1",
            "licenses-discovered": [
                "MIT"
            ],
            "copyrights": [
                "Copyright (c) 2016-2019 John Jeremy Leider"
            ],
            "file-count": 40,
            "sha256": "e079d36ae544355c6e677f0047016b5aa59f79959418baaae31712b76f45486b",
            "source": "https://github.com/vuetifyjs/vuetify-loader/archive/v1.7.1.zip",
            "status": "approved"
        }
    ]
}