{
    "id": "maven/mavencentral/org.springframework.data/spring-data-mongodb/4.4.2",
    "license": "Apache-2.0",
    "authority": "https://gitlab.eclipse.org/eclipsefdn/emo-team/iplab/-/issues/19211",
    "source": "https://repo1.maven.org/maven2/org/springframework/data/spring-data-mongodb/4.4.2/spring-data-mongodb-4.4.2-sources.jar",
    "status": "approved",
    "scans": [
        {
            "date": "January 27, 2025 at 8:47:39 p.m. GMT",
            "authority": "https://gitlab.eclipse.org/eclipsefdn/emo-team/iplab/-/issues/19211",
            "scancode-version": "31.2.1",
            "licenses-discovered": [
                "Apache-2.0"
            ],
            "copyrights": [
                "Copyright 2002-2025 the original author or authors",
                "Copyright 2008-2025 the original author or authors",
                "Copyright 2010-2025 the original author or authors",
                "Copyright 2011-2025 the original author or authors",
                "Copyright 2012-2025 the original author or authors",
                "Copyright 2013-2025 the original author or authors",
                "Copyright 2014-2025 the original author or authors",
                "Copyright 2015-2025 the original author or authors",
                "Copyright 2016-2025 the original author or authors",
                "Copyright 2017-2025 the original author or authors",
                "Copyright 2018-2025 the original author or authors",
                "Copyright 2019-2022 the original author or authors",
                "Copyright 2019-2025 the original author or authors",
                "Copyright 2020-2025 the original author or authors",
                "Copyright 2021-2025 the original author or authors",
                "Copyright 2022-2025 the original author or authors",
                "Copyright 2023-2025 the original author or authors",
                "Copyright 2024-2025 the original author or authors"
            ],
            "file-count": 641,
            "sha256": "4a21214cc75cd6a96d4bea236cef1b97723aa1b321ef7aa5ccecfd063f74c7ef",
            "source": "https://repo1.maven.org/maven2/org/springframework/data/spring-data-mongodb/4.4.2/spring-data-mongodb-4.4.2-sources.jar",
            "status": "approved"
        }
    ]
}