{
    "id": "maven/mavencentral/com.vaadin/vaadin-text-field-flow/24.3.7",
    "license": "Apache-2.0",
    "authority": "https://gitlab.eclipse.org/eclipsefdn/emo-team/iplab/-/issues/13718",
    "source": "https://repo1.maven.org/maven2/com/vaadin/vaadin-text-field-flow/24.3.7/vaadin-text-field-flow-24.3.7-sources.jar",
    "status": "approved",
    "scans": [
        {
            "date": "March 15, 2024 at 2:37:41 p.m. GMT",
            "authority": "https://gitlab.eclipse.org/eclipsefdn/emo-team/iplab/-/issues/13718",
            "scancode-version": "31.2.1",
            "licenses-discovered": [
                "Apache-2.0"
            ],
            "copyrights": [
                "Copyright 2000-2023 Vaadin Ltd."
            ],
            "file-count": 22,
            "sha256": "599f0a08d43d8b4420f6c42a67f20b7ff0fe35d8c3283aa6d4543fa6ab68a52a",
            "source": "https://repo1.maven.org/maven2/com/vaadin/vaadin-text-field-flow/24.3.7/vaadin-text-field-flow-24.3.7-sources.jar",
            "status": "approved"
        }
    ]
}