{
    "id": "maven/mavencentral/io.micrometer/micrometer-commons/1.13.0",
    "license": "Apache-2.0 AND (Apache-2.0 AND MIT)",
    "authority": "https://gitlab.eclipse.org/eclipsefdn/emo-team/iplab/-/issues/14826",
    "source": "https://repo1.maven.org/maven2/io/micrometer/micrometer-commons/1.13.0/micrometer-commons-1.13.0-sources.jar",
    "status": "approved",
    "scans": [
        {
            "date": "May 20, 2024 at 10:54:27 p.m. GMT",
            "authority": "https://gitlab.eclipse.org/eclipsefdn/emo-team/iplab/-/issues/14826",
            "scancode-version": "31.2.1",
            "licenses-discovered": [
                "Apache-2.0",
                "Apache-2.0 AND MIT"
            ],
            "copyrights": [
                "Copyright (c) 2004-2011 QOS.ch",
                "Copyright 2002-2017 the original author or authors",
                "Copyright 2012 The Netty Project",
                "Copyright 2013 The Netty Project",
                "Copyright 2017 The Netty Project",
                "Copyright 2017 VMware, Inc.",
                "Copyright 2017-2021 VMware, Inc.",
                "Copyright 2019 VMware, Inc.",
                "Copyright 2022 VMware, Inc.",
                "Copyright 2023 VMware, Inc.",
                "Copyright 2023 the original author or authors"
            ],
            "file-count": 36,
            "sha256": "76325fa3037f13b25a15cb54d931490ecd66dff1dd5880320c936a40a4072802",
            "source": "https://repo1.maven.org/maven2/io/micrometer/micrometer-commons/1.13.0/micrometer-commons-1.13.0-sources.jar",
            "status": "approved"
        }
    ]
}