{
    "id": "maven/mavencentral/org.bouncycastle/bcpg-jdk18on/1.71",
    "license": "Apache-2.0",
    "licenses-discovered": [
        "Apache-2.0"
    ],
    "file-count": 245,
    "scancode-version": "30.1.0",
    "authority": "https://gitlab.eclipse.org/eclipsefdn/emo-team/iplab/-/issues/2665",
    "source": "https://search.maven.org/remotecontent?filepath=org/bouncycastle/bcpg-jdk18on/1.71/bcpg-jdk18on-1.71-sources.jar",
    "status": "approved"
}