{
    "id": "npm/npmjs/-/pinia/2.0.33",
    "license": "MIT",
    "authority": "https://gitlab.eclipse.org/eclipsefdn/emo-team/iplab/-/issues/7540",
    "source": "https://registry.yarnpkg.com/pinia/-/pinia-2.0.33.tgz",
    "status": "approved",
    "scans": [
        {
            "date": "March 26, 2023 at 9:41:28 p.m. GMT",
            "authority": "https://gitlab.eclipse.org/eclipsefdn/emo-team/iplab/-/issues/7540",
            "scancode-version": "31.2.1",
            "licenses-discovered": [
                "MIT"
            ],
            "copyrights": [
                "(c) 2023 Eduardo San Martin Morote",
                "Copyright (c) 2019-present Eduardo San Martin Morote"
            ],
            "file-count": 12,
            "sha256": "8b6cc994db9551e268b0b187ab65f2cd11d5aaca7e0f31259b8481ba6d91e99f",
            "source": "https://registry.yarnpkg.com/pinia/-/pinia-2.0.33.tgz",
            "status": "approved"
        }
    ]
}