{
    "id": "maven/mavencentral/io.vertx/vertx-proton/4.3.4",
    "license": "Apache-2.0",
    "licenses-discovered": [
        "Apache-2.0"
    ],
    "copyrights": [
        "Copyright 2016 the original author or authors",
        "Copyright 2016, 2017 the original author or authors",
        "Copyright 2018 the original author or authors",
        "Copyright 2019 the original author or authors"
    ],
    "file-count": 64,
    "scancode-version": "31.2.1",
    "authority": "https://gitlab.eclipse.org/eclipsefdn/emo-team/iplab/-/issues/4364",
    "source": "https://search.maven.org/remotecontent?filepath=io/vertx/vertx-proton/4.3.4/vertx-proton-4.3.4-sources.jar",
    "status": "approved"
}