{
    "id": "maven/mavencentral/org.flowable/flowable-task-service/6.8.0",
    "license": "Apache-2.0",
    "authority": "https://gitlab.eclipse.org/eclipsefdn/emo-team/iplab/-/issues/6457",
    "source": "https://search.maven.org/remotecontent?filepath=org/flowable/flowable-task-service/6.8.0/flowable-task-service-6.8.0-sources.jar",
    "status": "approved",
    "scans": [
        {
            "date": "January 23, 2023 at 8:06:40 p.m. GMT",
            "authority": "https://gitlab.eclipse.org/eclipsefdn/emo-team/iplab/-/issues/6457",
            "scancode-version": "31.2.1",
            "licenses-discovered": [
                "Apache-2.0"
            ],
            "copyrights": [
            ],
            "file-count": 207,
            "sha256": "e8f95cebfb81581e0e75455c9604e89536176ee8809bc757063b77e9ddd55d46",
            "source": "https://search.maven.org/remotecontent?filepath=org/flowable/flowable-task-service/6.8.0/flowable-task-service-6.8.0-sources.jar",
            "status": "approved"
        }
    ]
}