{
    "id": "npm/npmjs/-/nx/15.1.1",
    "license": "MIT AND MIT-0 AND (CC0-1.0 AND MIT) AND (ISC AND MIT)",
    "authority": "https://gitlab.eclipse.org/eclipsefdn/emo-team/iplab/-/issues/4983",
    "source": "https://registry.npmjs.org/nx/-/nx-15.1.1.tgz",
    "status": "approved",
    "scans": [
        {
            "date": "November 17, 2022 at 6:33:52 p.m. GMT",
            "authority": "https://gitlab.eclipse.org/eclipsefdn/emo-team/iplab/-/issues/4983",
            "scancode-version": "31.2.1",
            "licenses-discovered": [
                "MIT",
                "MIT-0",
                "CC0-1.0 AND MIT",
                "ISC AND MIT"
            ],
            "copyrights": [
                "(c) Se (c)",
                "(c) const projects",
                "Copyright (c) 2012-2014 Chris Pettitt",
                "Copyright (c) 2013-2014 Ralf S. Engelschall (http://engelschall.com)",
                "Copyright (c) 2014-2022 Denis Pushkarev",
                "Copyright (c) 2015 David Khourshid",
                "Copyright (c) 2015-present Jason Miller",
                "Copyright (c) 2016 David Mark Clements",
                "Copyright (c) 2016-2018, 2020, The Cytoscape Consortium",
                "Copyright (c) 2016-2022, The Cytoscape Consortium",
                "Copyright (c) 2017 David Mark Clements & Matteo Collina",
                "Copyright (c) 2017 Michel Weststrate",
                "Copyright (c) 2017-2022 Narwhal Technologies Inc.",
                "Copyright (c) 2017-present atomiks",
                "Copyright (c) 2018 David Mark Clements, Matteo Collina & Ruben Bridgewater",
                "Copyright (c) 2018 Jed Watson",
                "Copyright (c) 2018 atomiks",
                "Copyright (c) 2018-2021, The Cytoscape Consortium",
                "Copyright (c) 2019 Federico Zivolo",
                "Copyright (c) Facebook, Inc. and its affiliates",
                "Copyright (c) Mateusz Burzynski",
                "Copyright (c) Microsoft Corporation",
                "Copyright (c) React Training 2015-2019",
                "Copyright (c) React Training 2016-2020",
                "Copyright (c) Remix Software 2020-2021",
                "Copyright (c) Remix Software 2020-2022",
                "Copyright (c) Remix Software Inc.",
                "Copyright Gaetan Renaudeau",
                "Copyright OpenJS Foundation and other contributors <https://openjsf.org/>",
                "copyright Jeremy Ashkenas, DocumentCloud and Investigative Reporters & Editors <http://underscorejs.org/>",
                "copyright Koen Bok"
            ],
            "file-count": 587,
            "sha256": "964aa659a3df452e798ea02fc9890118e7ccbadca603c10b01243be8b56db598",
            "source": "https://registry.npmjs.org/nx/-/nx-15.1.1.tgz",
            "status": "approved"
        }
    ]
}