{
    "id": "npm/npmjs/-/rc-picker/4.4.1",
    "license": "MIT",
    "authority": "https://gitlab.eclipse.org/eclipsefdn/emo-team/iplab/-/issues/14562",
    "source": "https://registry.yarnpkg.com/rc-picker/-/rc-picker-4.4.1.tgz",
    "status": "approved",
    "scans": [
        {
            "date": "April 24, 2024 at 5:15:18 a.m. GMT",
            "authority": "https://gitlab.eclipse.org/eclipsefdn/emo-team/iplab/-/issues/14562",
            "scancode-version": "31.2.1",
            "licenses-discovered": [
                "MIT"
            ],
            "copyrights": [
                "Copyright (c) 2019-present afc163"
            ],
            "file-count": 561,
            "sha256": "f883bfc30662a980825b548cc8c9909bf51f3b928098242d965e5ea4ec9201a1",
            "source": "https://registry.yarnpkg.com/rc-picker/-/rc-picker-4.4.1.tgz",
            "status": "approved"
        }
    ]
}