{
    "id": "maven/mavencentral/io.micrometer/micrometer-observation/1.11.1",
    "license": "Apache-2.0",
    "authority": "https://gitlab.eclipse.org/eclipsefdn/emo-team/iplab/-/issues/9242",
    "source": "https://repo.maven.apache.org/maven2/io/micrometer/micrometer-observation/1.11.1/micrometer-observation-1.11.1-sources.jar",
    "status": "approved",
    "scans": [
        {
            "date": "July 4, 2023 at 9:26:24 a.m. GMT",
            "authority": "https://gitlab.eclipse.org/eclipsefdn/emo-team/iplab/-/issues/9242",
            "scancode-version": "31.2.1",
            "licenses-discovered": [
                "Apache-2.0"
            ],
            "copyrights": [
                "Copyright 2002-2021 the original author or authors",
                "Copyright 2021 VMware, Inc.",
                "Copyright 2022 VMware, Inc.",
                "Copyright 2023 VMware, Inc."
            ],
            "file-count": 38,
            "sha256": "99a3f3c6d5dc36f40f836ef13399842a3325d33d9b49739f2c1a2dba93518879",
            "source": "https://repo.maven.apache.org/maven2/io/micrometer/micrometer-observation/1.11.1/micrometer-observation-1.11.1-sources.jar",
            "status": "approved"
        }
    ]
}