{
    "id": "npm/npmjs/@types/jsdom/21.1.3",
    "license": "MIT",
    "authority": "https://gitlab.eclipse.org/eclipsefdn/emo-team/iplab/-/issues/10806",
    "source": "https://registry.yarnpkg.com/@types/jsdom/-/jsdom-21.1.3.tgz",
    "status": "approved",
    "scans": [
        {
            "date": "October 3, 2023 at 2:28:44 a.m. GMT",
            "authority": "https://gitlab.eclipse.org/eclipsefdn/emo-team/iplab/-/issues/10806",
            "scancode-version": "31.2.1",
            "licenses-discovered": [
                "MIT"
            ],
            "copyrights": [
                "Copyright (c) Microsoft Corporation"
            ],
            "file-count": 5,
            "sha256": "ce2bc9068741ad8c874465f968a5828411903c74c76ff80ea2bd779cd73b2a50",
            "source": "https://registry.yarnpkg.com/@types/jsdom/-/jsdom-21.1.3.tgz",
            "status": "approved"
        }
    ]
}