{
    "id": "maven/mavencentral/androidx.cursoradapter/cursoradapter/1.0.0",
    "license": "Apache-2.0",
    "authority": "https://gitlab.eclipse.org/eclipsefdn/emo-team/iplab/-/issues/10496",
    "source": "https://dl.google.com/android/maven2/androidx/cursoradapter/cursoradapter/1.0.0/cursoradapter-1.0.0-sources.jar",
    "status": "approved",
    "scans": [
        {
            "date": "September 12, 2023 at 7:52:04 a.m. GMT",
            "authority": "https://gitlab.eclipse.org/eclipsefdn/emo-team/iplab/-/issues/10496",
            "scancode-version": "31.2.1",
            "licenses-discovered": [
                "Apache-2.0"
            ],
            "copyrights": [
                "Copyright 2018 The Android Open Source Project"
            ],
            "file-count": 5,
            "sha256": "99b72a3aec8c9edfd9de20f5913ce4c413bca2f0cf9877b504e26aa03ef50323",
            "source": "https://dl.google.com/android/maven2/androidx/cursoradapter/cursoradapter/1.0.0/cursoradapter-1.0.0-sources.jar",
            "status": "approved"
        }
    ]
}