{
    "id": "npm/npmjs/-/socket.io-parser/4.2.3",
    "license": "MIT",
    "authority": "https://gitlab.eclipse.org/eclipsefdn/emo-team/iplab/-/issues/8535",
    "source": "https://registry.npmjs.org/socket.io-parser/-/socket.io-parser-4.2.3.tgz",
    "status": "approved",
    "scans": [
        {
            "date": "May 24, 2023 at 9:39:17 p.m. GMT",
            "authority": "https://gitlab.eclipse.org/eclipsefdn/emo-team/iplab/-/issues/8535",
            "scancode-version": "31.2.1",
            "licenses-discovered": [
            ],
            "copyrights": [
            ],
            "file-count": 1,
            "sha256": "d5558cd419c8d46bdc958064cb97f963d1ea793866414c025906ec15033512ed",
            "source": "https://github.com/socketio/socket.io-parser/archive/v4.2.3.zip",
            "status": "restricted"
        },
        {
            "date": "May 24, 2023 at 10:10:00 p.m. GMT",
            "authority": "https://gitlab.eclipse.org/eclipsefdn/emo-team/iplab/-/issues/8535",
            "scancode-version": "31.2.1",
            "licenses-discovered": [
                "MIT"
            ],
            "copyrights": [
                "Copyright (c) 2014 Guillermo Rauch <guillermo@learnboost.com>"
            ],
            "file-count": 24,
            "sha256": "bd4c9cb8399fc166b96ddd62798d8421673c2469647786ad3739c29ea4aaccac",
            "source": "https://registry.npmjs.org/socket.io-parser/-/socket.io-parser-4.2.3.tgz",
            "status": "approved"
        }
    ]
}