{
    "id": "maven/mavencentral/com.google.api/api-common/2.26.0",
    "license": "BSD-3-Clause",
    "authority": "https://gitlab.eclipse.org/eclipsefdn/emo-team/iplab/-/issues/13419",
    "source": "https://repo1.maven.org/maven2/com/google/api/api-common/2.26.0/api-common-2.26.0-sources.jar",
    "status": "approved",
    "scans": [
        {
            "date": "February 26, 2024 at 8:38:14 a.m. GMT",
            "authority": "https://gitlab.eclipse.org/eclipsefdn/emo-team/iplab/-/issues/13419",
            "scancode-version": "31.2.1",
            "licenses-discovered": [
                "BSD-3-Clause"
            ],
            "copyrights": [
                "Copyright 2016, Google Inc.",
                "Copyright 2017, Google Inc.",
                "Copyright 2018, Google Inc.",
                "Copyright 2023, Google Inc."
            ],
            "file-count": 29,
            "sha256": "035598551f3f19dd95e21dadf67658ebe6de3d91f794bde3e3ae727212a20d9b",
            "source": "https://repo1.maven.org/maven2/com/google/api/api-common/2.26.0/api-common-2.26.0-sources.jar",
            "status": "approved"
        }
    ]
}