{
    "id": "go/golang/github.com%2Fgo-openapi/jsonreference/v0.19.5",
    "license": "Apache-2.0",
    "authority": "https://gitlab.eclipse.org/eclipsefdn/emo-team/iplab/-/issues/5622",
    "source": "https://proxy.golang.org/github.com%2Fgo-openapi/jsonreference/@v/v0.19.5.zip",
    "status": "approved",
    "scans": [
        {
            "date": "December 10, 2022 at 10:54:55 p.m. GMT",
            "authority": "https://gitlab.eclipse.org/eclipsefdn/emo-team/iplab/-/issues/5622",
            "scancode-version": "31.2.1",
            "licenses-discovered": [
                "Apache-2.0"
            ],
            "copyrights": [
                "Copyright (c) 2004, 2006 The Linux Foundation and its contributors",
                "Copyright 2013 sigu-399 https://github.com/sigu-399"
            ],
            "file-count": 10,
            "sha256": "807e01410541971cb5620ecc98a91162f8e00e5a5c7087cf6ff43a2e1cfa2c8b",
            "source": "https://proxy.golang.org/github.com%2Fgo-openapi/jsonreference/@v/v0.19.5.zip",
            "status": "approved"
        }
    ]
}