{
    "id": "go/golang/github.com%2Fgo-gl%2Fglfw%2Fv3.3/glfw/v0.0.0-20191125211704-12ad95a8df72",
    "license": "(BSD-3-Clause AND Zlib AND MIT AND Unlicense) AND Apache-2.0 AND LGPL-2.1-or-later",
    "authority": "https://gitlab.eclipse.org/eclipsefdn/emo-team/iplab/-/issues/5665",
    "source": "https://proxy.golang.org/github.com%2Fgo-gl%2Fglfw%2Fv3.3/glfw/@v/v0.0.0-20191125211704-12ad95a8df72.zip",
    "status": "approved",
    "scans": [
        {
            "date": "December 12, 2022 at 4:55:09 a.m. GMT",
            "authority": "https://gitlab.eclipse.org/eclipsefdn/emo-team/iplab/-/issues/5641",
            "scancode-version": "31.2.1",
            "licenses-discovered": [
                "BSD-3-Clause",
                "Zlib",
                "LicenseRef-scancode-unknown AND MIT AND Unlicense",
                "LicenseRef-scancode-other-permissive",
                "LicenseRef-scancode-khronos",
                "Apache-2.0",
                "LicenseRef-scancode-public-domain-disclaimer",
                "LGPL-2.1-or-later"
            ],
            "copyrights": [
                "Copyright (c) 1997-2013 Sam Lantinga <slouken@libsdl.org>",
                "Copyright (c) 2002-2006 Marcus Geelnard",
                "Copyright (c) 2004, 2005 Tristan Grimmer",
                "Copyright (c) 2006-2008 Alexander Chemeris",
                "Copyright (c) 2006-2016 Camilla Lowy <elmindreda@glfw.org>",
                "Copyright (c) 2006-2017 Camilla Lowy <elmindreda@glfw.org>",
                "Copyright (c) 2006-2018 Camilla Lowy <elmindreda@glfw.org>",
                "Copyright (c) 2006-2019 Camilla Lowy",
                "Copyright (c) 2006-2019 Camilla Lowy <elmindreda@glfw.org>",
                "Copyright (c) 2008-2018 The Khronos Group Inc.",
                "Copyright (c) 2009-2016 Camilla Lowy <elmindreda@glfw.org>",
                "Copyright (c) 2009-2019 Camilla Lowy <elmindreda@glfw.org>",
                "Copyright (c) 2010-2016 Camilla Lowy <elmindreda@glfw.org>",
                "Copyright (c) 2012 Marcus Geelnard",
                "Copyright (c) 2012 The glfw3-go Authors",
                "Copyright (c) 2012 Torsten Walluhn <tw@mad-cad.net>",
                "Copyright (c) 2012, Kim Grasman",
                "Copyright (c) 2014 Jonas Adahl <jadahl@gmail.com>",
                "Copyright (c) 2014-2017 The Khronos Group Inc.",
                "Copyright (c) 2016 Google Inc.",
                "Copyright (c) 2016-2017 Camilla Lowy <elmindreda@glfw.org>",
                "Copyright (c) 2016-2018 Micha Mettke",
                "Copyright (c) 2016-2019 Camilla Lowy <elmindreda@glfw.org>",
                "Copyright (c) the Wine project",
                "Copyright 2008 Andrew Fenn"
            ],
            "file-count": 105,
            "sha256": "2a9960535e4a71b2c79fee9bf8097b73efa0991d18f70e820f6dbe5e236a5df2",
            "source": "https://proxy.golang.org/github.com%2Fgo-gl%2Fglfw%2Fv3.3/glfw/@v/v0.0.0-20191125211704-12ad95a8df72.zip",
            "status": "restricted"
        },
        {
            "date": "December 12, 2022 at 5:20:30 p.m. GMT",
            "authority": "https://gitlab.eclipse.org/eclipsefdn/emo-team/iplab/-/issues/5665",
            "scancode-version": "31.2.1",
            "licenses-discovered": [
                "BSD-3-Clause",
                "Zlib",
                "LicenseRef-scancode-unknown AND MIT AND Unlicense",
                "LicenseRef-scancode-other-permissive",
                "LicenseRef-scancode-khronos",
                "Apache-2.0",
                "LicenseRef-scancode-public-domain-disclaimer",
                "LGPL-2.1-or-later"
            ],
            "copyrights": [
                "Copyright (c) 1997-2013 Sam Lantinga <slouken@libsdl.org>",
                "Copyright (c) 2002-2006 Marcus Geelnard",
                "Copyright (c) 2004, 2005 Tristan Grimmer",
                "Copyright (c) 2006-2008 Alexander Chemeris",
                "Copyright (c) 2006-2016 Camilla Lowy <elmindreda@glfw.org>",
                "Copyright (c) 2006-2017 Camilla Lowy <elmindreda@glfw.org>",
                "Copyright (c) 2006-2018 Camilla Lowy <elmindreda@glfw.org>",
                "Copyright (c) 2006-2019 Camilla Lowy",
                "Copyright (c) 2006-2019 Camilla Lowy <elmindreda@glfw.org>",
                "Copyright (c) 2008-2018 The Khronos Group Inc.",
                "Copyright (c) 2009-2016 Camilla Lowy <elmindreda@glfw.org>",
                "Copyright (c) 2009-2019 Camilla Lowy <elmindreda@glfw.org>",
                "Copyright (c) 2010-2016 Camilla Lowy <elmindreda@glfw.org>",
                "Copyright (c) 2012 Marcus Geelnard",
                "Copyright (c) 2012 The glfw3-go Authors",
                "Copyright (c) 2012 Torsten Walluhn <tw@mad-cad.net>",
                "Copyright (c) 2012, Kim Grasman",
                "Copyright (c) 2014 Jonas Adahl <jadahl@gmail.com>",
                "Copyright (c) 2014-2017 The Khronos Group Inc.",
                "Copyright (c) 2016 Google Inc.",
                "Copyright (c) 2016-2017 Camilla Lowy <elmindreda@glfw.org>",
                "Copyright (c) 2016-2018 Micha Mettke",
                "Copyright (c) 2016-2019 Camilla Lowy <elmindreda@glfw.org>",
                "Copyright (c) the Wine project",
                "Copyright 2008 Andrew Fenn"
            ],
            "file-count": 105,
            "sha256": "2a9960535e4a71b2c79fee9bf8097b73efa0991d18f70e820f6dbe5e236a5df2",
            "source": "https://proxy.golang.org/github.com%2Fgo-gl%2Fglfw%2Fv3.3/glfw/@v/v0.0.0-20191125211704-12ad95a8df72.zip",
            "status": "restricted"
        }
    ]
}
