{
    "id": "maven/mavencentral/software.amazon.awssdk/aws-xml-protocol/2.29.1",
    "license": "Apache-2.0",
    "authority": "https://gitlab.eclipse.org/eclipsefdn/emo-team/iplab/-/issues/17004",
    "source": "https://repo1.maven.org/maven2/software/amazon/awssdk/aws-xml-protocol/2.29.1/aws-xml-protocol-2.29.1-sources.jar",
    "status": "approved",
    "scans": [
        {
            "date": "November 1, 2024, 3:43:24 a.m. GMT",
            "authority": "https://gitlab.eclipse.org/eclipsefdn/emo-team/iplab/-/issues/17004",
            "scancode-version": "31.2.1",
            "licenses-discovered": [
                "Apache-2.0"
            ],
            "copyrights": [
                "Copyright Amazon.com, Inc. or its affiliates"
            ],
            "file-count": 32,
            "sha256": "cbc4eec7671a7ede6aefb47392a6c220e19b41fe2f7bf82412e322332bb130d1",
            "source": "https://repo1.maven.org/maven2/software/amazon/awssdk/aws-xml-protocol/2.29.1/aws-xml-protocol-2.29.1-sources.jar",
            "status": "approved"
        }
    ]
}