{
    "id": "maven/mavencentral/org.springframework.boot/spring-boot-starter-tomcat/2.7.5",
    "license": "Apache-2.0",
    "licenses-discovered": [
        "Apache-2.0"
    ],
    "copyrights": [
    ],
    "file-count": 2,
    "scancode-version": "31.2.1",
    "authority": "https://gitlab.eclipse.org/eclipsefdn/emo-team/iplab/-/issues/4305",
    "source": "https://search.maven.org/remotecontent?filepath=org/springframework/boot/spring-boot-starter-tomcat/2.7.5/spring-boot-starter-tomcat-2.7.5-sources.jar",
    "status": "approved"
}