{
    "id": "nuget/nuget/-/ReportPortal.Client/3.4.0",
    "license": "Apache-2.0",
    "authority": "https://gitlab.eclipse.org/eclipsefdn/emo-team/iplab/-/issues/9298",
    "source": "https://github.com/reportportal/client-net/archive/refs/tags/3.4.0.zip",
    "status": "approved",
    "scans": [
        {
            "date": "July 8, 2023 at 5:42:34 a.m. GMT",
            "authority": "https://gitlab.eclipse.org/eclipsefdn/emo-team/iplab/-/issues/9298",
            "scancode-version": "31.2.1",
            "licenses-discovered": [
                "Apache-2.0"
            ],
            "copyrights": [
            ],
            "file-count": 103,
            "sha256": "df515468818f18c860befdd80587024e251b35fdeaffc39ef1a88d37e849eb9d",
            "source": "https://github.com/reportportal/client-net/archive/refs/tags/3.4.0.zip",
            "status": "approved"
        }
    ]
}