{
    "id": "maven/mavencentral/org.hibernate/hibernate-search-serialization-avro/5.10.7.Final",
    "license": "LGPL-2.1-only",
    "authority": "https://gitlab.eclipse.org/eclipsefdn/emo-team/iplab/-/issues/9404",
    "source": "https://repo.maven.apache.org/maven2/org/hibernate/hibernate-search-serialization-avro/5.10.7.Final/hibernate-search-serialization-avro-5.10.7.Final-sources.jar",
    "status": "approved",
    "scans": [
        {
            "date": "July 14, 2023 at 1:24:49 p.m. GMT",
            "authority": "https://gitlab.eclipse.org/eclipsefdn/emo-team/iplab/-/issues/9404",
            "scancode-version": "31.2.1",
            "licenses-discovered": [
                "LGPL-2.1-only"
            ],
            "copyrights": [
            ],
            "file-count": 106,
            "sha256": "f65a370fc6561cb8bfe026559666a9670c80688abc4f28ea5f098dff26031e52",
            "source": "https://repo.maven.apache.org/maven2/org/hibernate/hibernate-search-serialization-avro/5.10.7.Final/hibernate-search-serialization-avro-5.10.7.Final-sources.jar",
            "status": "approved"
        }
    ]
}