{
    "id": "npm/npmjs/-/globals/13.18.0",
    "license": "MIT",
    "authority": "https://gitlab.eclipse.org/eclipsefdn/emo-team/iplab/-/issues/4992",
    "source": "https://registry.npmjs.org/globals/-/globals-13.18.0.tgz",
    "status": "approved",
    "scans": [
        {
            "date": "November 17, 2022 at 6:28:55 p.m. GMT",
            "authority": "https://gitlab.eclipse.org/eclipsefdn/emo-team/iplab/-/issues/4992",
            "scancode-version": "31.2.1",
            "licenses-discovered": [
                "MIT"
            ],
            "copyrights": [
                "Copyright (c) Sindre Sorhus <sindresorhus@gmail.com> (https://sindresorhus.com)"
            ],
            "file-count": 6,
            "sha256": "62ec433602b9194254e74ae3045ca8908c39c2e22a78059642d4aee761dc2ab1",
            "source": "https://registry.npmjs.org/globals/-/globals-13.18.0.tgz",
            "status": "approved"
        }
    ]
}