{
    "id": "maven/mavencentral/org.ow2.asm/asm-analysis/9.5",
    "license": "BSD-3-Clause",
    "authority": "https://gitlab.eclipse.org/eclipsefdn/emo-team/iplab/-/issues/7704",
    "source": "https://search.maven.org/remotecontent?filepath=org/ow2/asm/asm-analysis/9.5/asm-analysis-9.5-sources.jar",
    "status": "approved",
    "scans": [
        {
            "date": "March 30, 2023 at 5:24:27 a.m. GMT",
            "authority": "https://gitlab.eclipse.org/eclipsefdn/emo-team/iplab/-/issues/7704",
            "scancode-version": "31.2.1",
            "licenses-discovered": [
                "BSD-3-Clause"
            ],
            "copyrights": [
                "Copyright (c) 2000-2011 INRIA, France Telecom"
            ],
            "file-count": 15,
            "sha256": "d859066a137b718be56b2702969086e2b18e5e1d56b552524513cc5f0323b212",
            "source": "https://search.maven.org/remotecontent?filepath=org/ow2/asm/asm-analysis/9.5/asm-analysis-9.5-sources.jar",
            "status": "approved"
        }
    ]
}