{
    "id": "maven/mavencentral/androidx.resourceinspection/resourceinspection-annotation/1.0.1",
    "license": "Apache-2.0",
    "authority": "https://gitlab.eclipse.org/eclipsefdn/emo-team/iplab/-/issues/10431",
    "source": "https://dl.google.com/android/maven2/androidx/resourceinspection/resourceinspection-annotation/1.0.1/resourceinspection-annotation-1.0.1-sources.jar",
    "status": "approved",
    "scans": [
        {
            "date": "September 11, 2023 at 8:44:13 p.m. GMT",
            "authority": "https://gitlab.eclipse.org/eclipsefdn/emo-team/iplab/-/issues/10431",
            "scancode-version": "31.2.1",
            "licenses-discovered": [
                "Apache-2.0"
            ],
            "copyrights": [
                "Copyright 2021 The Android Open Source Project"
            ],
            "file-count": 4,
            "sha256": "cdca7861ae17115f8d74f9f197d1a4f8b0217ca035a3990da2e2c1ca1fa7f822",
            "source": "https://dl.google.com/android/maven2/androidx/resourceinspection/resourceinspection-annotation/1.0.1/resourceinspection-annotation-1.0.1-sources.jar",
            "status": "approved"
        }
    ]
}