{
    "id": "nuget/nuget/-/ReportPortal.Shared/3.5.0",
    "license": "Apache-2.0",
    "authority": "https://gitlab.eclipse.org/eclipsefdn/emo-team/iplab/-/issues/9301",
    "source": "https://github.com/reportportal/commons-net/archive/refs/tags/3.5.0.zip",
    "status": "approved",
    "scans": [
        {
            "date": "July 8, 2023 at 5:39:28 a.m. GMT",
            "authority": "https://gitlab.eclipse.org/eclipsefdn/emo-team/iplab/-/issues/9301",
            "scancode-version": "31.2.1",
            "licenses-discovered": [
                "Apache-2.0"
            ],
            "copyrights": [
            ],
            "file-count": 155,
            "sha256": "58d7a21d671e3abfedd6bf13c289041065329bec4f246c259981c6265b718537",
            "source": "https://github.com/reportportal/commons-net/archive/refs/tags/3.5.0.zip",
            "status": "approved"
        }
    ]
}