{
    "id": "maven/mavencentral/com.yahoo.elide/elide-swagger/7.1.2",
    "license": "Apache-2.0",
    "authority": "https://gitlab.eclipse.org/eclipsefdn/emo-team/iplab/-/issues/17487",
    "source": "https://repo1.maven.org/maven2/com/yahoo/elide/elide-swagger/7.1.2/elide-swagger-7.1.2-sources.jar",
    "status": "approved",
    "scans": [
        {
            "date": "November 26, 2024 at 10:38:47 p.m. GMT",
            "authority": "https://gitlab.eclipse.org/eclipsefdn/emo-team/iplab/-/issues/17487",
            "scancode-version": "31.2.1",
            "licenses-discovered": [
                "Apache-2.0"
            ],
            "copyrights": [
                "Copyright 2016, Yahoo Inc.",
                "Copyright 2017, Yahoo Inc.",
                "Copyright 2021, Yahoo Inc.",
                "Copyright 2023, the original author or authors",
                "Copyright 2024, the original author or authors"
            ],
            "file-count": 21,
            "sha256": "d87aac51ed82770038488f88eff002229e31aa43f10851d7670aac9dfc62eb7e",
            "source": "https://repo1.maven.org/maven2/com/yahoo/elide/elide-swagger/7.1.2/elide-swagger-7.1.2-sources.jar",
            "status": "approved"
        }
    ]
}