{
    "id": "maven/mavencentral/edu.ucar/grib/4.5.5",
    "license": "NetCDF",
    "licenses-discovered": [
        "AGPL-3.0-or-later",
        "NetCDF"
    ],
    "file-count": 491,
    "scancode-version": "30.1.0",
    "authority": "https://gitlab.eclipse.org/eclipsefdn/emo-team/iplab/-/issues/3038",
    "source": "https://search.maven.org/remotecontent?filepath=edu/ucar/grib/4.5.5/grib-4.5.5-sources.jar",
    "status": "approved",
    "workswith": [
        "tools.orbit"
    ],
    "copyrights": [
        "Copyright (c) - University Corporation for Atmospheric Research/Unidata"
    ]
}
