{
    "id": "maven/mavencentral/org.testng/testng/7.9.0",
    "license": "Apache-2.0",
    "authority": "https://gitlab.eclipse.org/eclipsefdn/emo-team/iplab/-/issues/14215",
    "source": "https://repo1.maven.org/maven2/org/testng/testng/7.9.0/testng-7.9.0-sources.jar",
    "status": "approved",
    "scans": [
        {
            "date": "April 4, 2024 at 12:52:13 a.m. GMT",
            "authority": "https://gitlab.eclipse.org/eclipsefdn/emo-team/iplab/-/issues/14215",
            "scancode-version": "31.2.1",
            "licenses-discovered": [
                "Apache-2.0"
            ],
            "copyrights": [
                "author cbeust Jan 28, 2006",
                "author cbeust Jun 6, 2006"
            ],
            "file-count": 420,
            "sha256": "ed50cb7c5ff5d7b36c9e641a87d2cac61e0acf3c07861064e2c357b451737214",
            "source": "https://repo1.maven.org/maven2/org/testng/testng/7.9.0/testng-7.9.0-sources.jar",
            "status": "approved"
        }
    ]
}