{
    "id": "p2/orbit/p2.eclipse.plugin/org.apache.batik.constants/1.17.0.v20231009-1000",
    "license": "Apache-2.0",
    "authority": "https://gitlab.eclipse.org/eclipsefdn/emo-team/iplab/-/issues/15355",
    "source": "https://repo1.maven.org/maven2/org/apache/xmlgraphics/batik-constants/1.17/batik-constants-1.17-sources.jar",
    "status": "approved",
    "scans": [
        {
            "date": "June 14, 2024 at 9:23:58 p.m. GMT",
            "authority": "https://gitlab.eclipse.org/eclipsefdn/emo-team/iplab/-/issues/15351",
            "scancode-version": "31.2.1",
            "licenses-discovered": [
                "Apache-2.0"
            ],
            "copyrights": [
            ],
            "file-count": 4,
            "sha256": "023422098fc9d0ecf35ab6c5b94e884016e5db625d05000f8ebe5eb383fe2045",
            "source": "https://repo1.maven.org/maven2/org/apache/xmlgraphics/batik-constants/1.17/batik-constants-1.17-sources.jar",
            "status": "approved"
        },
        {
            "date": "June 14, 2024 at 9:25:16 p.m. GMT",
            "authority": "https://gitlab.eclipse.org/eclipsefdn/emo-team/iplab/-/issues/15353",
            "scancode-version": "31.2.1",
            "licenses-discovered": [
                "Apache-2.0"
            ],
            "copyrights": [
            ],
            "file-count": 4,
            "sha256": "023422098fc9d0ecf35ab6c5b94e884016e5db625d05000f8ebe5eb383fe2045",
            "source": "https://repo1.maven.org/maven2/org/apache/xmlgraphics/batik-constants/1.17/batik-constants-1.17-sources.jar",
            "status": "approved"
        },
        {
            "date": "June 14, 2024 at 9:31:41 p.m. GMT",
            "authority": "https://gitlab.eclipse.org/eclipsefdn/emo-team/iplab/-/issues/15355",
            "scancode-version": "31.2.1",
            "licenses-discovered": [
                "Apache-2.0"
            ],
            "copyrights": [
            ],
            "file-count": 4,
            "sha256": "023422098fc9d0ecf35ab6c5b94e884016e5db625d05000f8ebe5eb383fe2045",
            "source": "https://repo1.maven.org/maven2/org/apache/xmlgraphics/batik-constants/1.17/batik-constants-1.17-sources.jar",
            "status": "approved"
        }
    ]
}