{
    "id": "maven/mavencentral/com.google.api.grpc/proto-google-iam-admin-v1/3.46.0",
    "license": "Apache-2.0",
    "authority": "https://gitlab.eclipse.org/eclipsefdn/emo-team/iplab/-/issues/16725",
    "source": "https://repo1.maven.org/maven2/com/google/api/grpc/proto-google-iam-admin-v1/3.46.0/proto-google-iam-admin-v1-3.46.0-sources.jar",
    "status": "approved",
    "scans": [
        {
            "date": "October 15, 2024, 5:52:29 p.m. GMT",
            "authority": "https://gitlab.eclipse.org/eclipsefdn/emo-team/iplab/-/issues/16725",
            "scancode-version": "31.2.1",
            "licenses-discovered": [
                "Apache-2.0"
            ],
            "copyrights": [
                "Copyright 2024 Google LLC"
            ],
            "file-count": 101,
            "sha256": "7cffbf2184a277ab6ce8f7574c06233c584e4a30af644d5b45dc9d232e9ad0eb",
            "source": "https://repo1.maven.org/maven2/com/google/api/grpc/proto-google-iam-admin-v1/3.46.0/proto-google-iam-admin-v1-3.46.0-sources.jar",
            "status": "approved"
        }
    ]
}