{
    "id": "git/github/de-vri-es/setup-git-credentials/v2",
    "license": "Apache-2.0 AND MIT AND BSD-2-Clause AND CC-BY-4.0 AND Unicode-TOU",
    "authority": "https://gitlab.eclipse.org/eclipsefdn/emo-team/iplab/-/issues/7981",
    "source": "https://github.com/de-vri-es/setup-git-credentials/archive/refs/tags/v2.zip",
    "status": "approved",
    "scans": [
        {
            "date": "April 27, 2023 at 3:14:56 p.m. GMT",
            "authority": "https://gitlab.eclipse.org/eclipsefdn/emo-team/iplab/-/issues/7981",
            "scancode-version": "31.2.1",
            "licenses-discovered": [
                "BSD-2-Clause",
                "MIT",
                "Apache-2.0",
                "CC-BY-4.0 AND LicenseRef-scancode-khronos AND LicenseRef-scancode-unicode AND LicenseRef-scancode-unknown AND MIT AND W3C-20150513",
                "BSD-3-Clause AND MIT"
            ],
            "copyrights": [
                "(c) by W3C",
                "Copyright (c) 1991-2017 Unicode, Inc.",
                "Copyright (c) 2010-2020 Robert Kieffer and other contributors",
                "Copyright (c) 2012 Koichi Kobayashi",
                "Copyright (c) 2018 The Khronos Group Inc.",
                "Copyright (c) 2018 WHATWG",
                "Copyright (c) 2019, Fusion Engineering <oss@fusion.engineering>",
                "Copyright (c) GitHub, Inc.",
                "Copyright (c) Microsoft Corporation",
                "Copyright (c) Paul Johnston 1999 - 2009 Other contributors Greg Holt, Andrew Kepert, Ydnar, Lostinet",
                "Copyright (c) YEAR W3C(r) (MIT, ERCIM, Keio, Beihang). Disclaimers",
                "Copyright 2011, Sebastian Tschan https://blueimp.net",
                "Copyright 2019 GitHub",
                "Copyright Joyent, Inc. and other Node contributors",
                "Copyright Node.js contributors"
            ],
            "file-count": 447,
            "sha256": "9fbbbfdc104cf44b1ee3a906a7acdec4f43193935d3e3949e7edadf0ca9a29d7",
            "source": "https://github.com/de-vri-es/setup-git-credentials/archive/refs/tags/v2.zip",
            "status": "restricted"
        }
    ]
}
