{
    "id": "maven/mavencentral/org.apache.httpcomponents/httpclient/4.5.13",
    "license": "Apache-2.0",
    "authority": "https://gitlab.eclipse.org/eclipsefdn/emo-team/iplab/-/issues/15248",
    "source": "https://repo1.maven.org/maven2/org/apache/httpcomponents/httpclient/4.5.13/httpclient-4.5.13-sources.jar",
    "status": "approved",
    "scans": [
        {
            "date": "June 14, 2024 at 3:18:10 p.m. GMT",
            "authority": "https://gitlab.eclipse.org/eclipsefdn/emo-team/iplab/-/issues/15248",
            "scancode-version": "31.2.1",
            "licenses-discovered": [
                "Apache-2.0"
            ],
            "copyrights": [
            ],
            "file-count": 431,
            "sha256": "b1e9194fd83ce135831e28346731d9644cb2a08dea37ada2aa56ceb8f1b0c566",
            "source": "https://repo1.maven.org/maven2/org/apache/httpcomponents/httpclient/4.5.13/httpclient-4.5.13-sources.jar",
            "status": "approved"
        }
    ]
}