{
    "id": "npm/npmjs/-/react-bootstrap/2.5.0",
    "license": "MIT AND (BSD-3-Clause AND MIT)",
    "licenses-discovered": [
        "MIT",
        "BSD-3-Clause AND MIT"
    ],
    "copyrights": [
        "Copyright (c) Facebook, Inc.",
        "Copyright (c) Facebook, Inc. and its affiliates",
        "Copyright (c) Jed Watson",
        "Copyright (c) Stephen J. Collings, Matthew Honnibal, Pieter Vanderwerff"
    ],
    "file-count": 660,
    "scancode-version": "30.1.0",
    "authority": "https://gitlab.eclipse.org/eclipsefdn/emo-team/iplab/-/issues/3260",
    "source": "https://registry.npmjs.org/react-bootstrap/-/react-bootstrap-2.5.0.tgz",
    "status": "approved"
}