{
    "id": "maven/mavencentral/org.scalactic/scalactic_2.13/3.2.12",
    "license": "Apache-2.0",
    "authority": "https://gitlab.eclipse.org/eclipsefdn/emo-team/iplab/-/issues/5515",
    "source": "https://search.maven.org/remotecontent?filepath=org/scalactic/scalactic_2.13/3.2.12/scalactic_2.13-3.2.12-sources.jar",
    "status": "approved",
    "scans": [
        {
            "date": "December 9, 2022 at 4:06:48 a.m. GMT",
            "authority": "https://gitlab.eclipse.org/eclipsefdn/emo-team/iplab/-/issues/5515",
            "scancode-version": "31.2.1",
            "licenses-discovered": [
                "Apache-2.0"
            ],
            "copyrights": [
                "Copyright 2001-2012 Artima, Inc.",
                "Copyright 2001-2013 Artima, Inc.",
                "Copyright 2001-2014 Artima, Inc.",
                "Copyright 2001-2015 Artima, Inc.",
                "Copyright 2001-2016 Artima, Inc.",
                "Copyright 2001-2017 Artima, Inc.",
                "Copyright 2001-2018 Artima, Inc.",
                "Copyright 2001-2019 Artima, Inc."
            ],
            "file-count": 69,
            "sha256": "bb92140696756c4aac426d8ec6dc83de667f63e25dc209796a368abcb4bc5c4b",
            "source": "https://search.maven.org/remotecontent?filepath=org/scalactic/scalactic_2.13/3.2.12/scalactic_2.13-3.2.12-sources.jar",
            "status": "approved"
        }
    ]
}