{
    "id": "npm/npmjs/-/editorconfig-checker/5.0.1",
    "license": "MIT AND (BSD-3-Clause AND MIT)",
    "authority": "https://gitlab.eclipse.org/eclipsefdn/emo-team/iplab/-/issues/7486",
    "source": "https://registry.yarnpkg.com/editorconfig-checker/-/editorconfig-checker-5.0.1.tgz",
    "status": "approved",
    "scans": [
        {
            "date": "March 22, 2023 at 2:09:13 a.m. GMT",
            "authority": "https://gitlab.eclipse.org/eclipsefdn/emo-team/iplab/-/issues/7486",
            "scancode-version": "31.2.1",
            "licenses-discovered": [
                "MIT",
                "BSD-3-Clause AND MIT"
            ],
            "copyrights": [
                "(c) extraPathPercentEncodeSet.has",
                "Copyright (c) 2011-2017 KARASZI Istvan <github@spam.raszi.hu>",
                "Copyright (c) 2012-2014, Bram Stein",
                "Copyright (c) 2014-2017, Jon Schlinkert",
                "Copyright (c) 2017 Max Strubing",
                "Copyright Joyent, Inc. and other Node contributors"
            ],
            "file-count": 4,
            "sha256": "dffe2060ad5ab02b7c4e194f5f56f6c2f1e88777e466681cd353b2cc7bcd8d83",
            "source": "https://registry.yarnpkg.com/editorconfig-checker/-/editorconfig-checker-5.0.1.tgz",
            "status": "approved"
        }
    ]
}