{
    "id": "npm/npmjs/-/ws/8.15.0",
    "license": "MIT",
    "authority": "https://gitlab.eclipse.org/eclipsefdn/emo-team/iplab/-/issues/11992",
    "source": "https://github.com/websockets/ws/archive/refs/tags/8.15.0.zip",
    "status": "approved",
    "scans": [
        {
            "date": "December 13, 2023 at 3:23:40 p.m. GMT",
            "authority": "https://gitlab.eclipse.org/eclipsefdn/emo-team/iplab/-/issues/11992",
            "scancode-version": "31.2.1",
            "licenses-discovered": [
                "MIT"
            ],
            "copyrights": [
                "Copyright (c) 2011 Einar Otto Stangvik <einaros@gmail.com>",
                "Copyright (c) 2013 Arnout Kazemier and contributors",
                "Copyright (c) 2016 Luigi Pinca and contributors",
                "Copyright Node.js contributors"
            ],
            "file-count": 61,
            "sha256": "356707f7ef46ac9621506e3f2ba719b31b3b9d010442add4ceca6f437eaca661",
            "source": "https://github.com/websockets/ws/archive/refs/tags/8.15.0.zip",
            "status": "approved"
        }
    ]
}