{
    "license": "LGPL-2.0-or-later AND MIT",
    "file-count": 426,
    "authority": "https://gitlab.eclipse.org/eclipsefdn/emo-team/iplab/-/issues/1122",
    "scancode-version": "21.3.31",
    "licenses-discovered": [
        "MIT",
        "LGPL-2.0-or-later"
    ],
    "id": "npm/npmjs/-/jsdom/15.1.1",
    "source": "https://registry.npmjs.org/jsdom/-/jsdom-15.1.1.tgz",
    "status": "restricted",
    "workswith": [
        "ecd.sprotty"
    ]
}
