{
    "id": "maven/mavencentral/org.apache.camel.springboot/camel-amqp-starter/3.22.2",
    "license": "Apache-2.0",
    "authority": "https://gitlab.eclipse.org/eclipsefdn/emo-team/iplab/-/issues/14969",
    "source": "https://repo1.maven.org/maven2/org/apache/camel/springboot/camel-amqp-starter/3.22.2/camel-amqp-starter-3.22.2-sources.jar",
    "status": "approved",
    "scans": [
        {
            "date": "May 29, 2024 at 11:47:38 a.m. GMT",
            "authority": "https://gitlab.eclipse.org/eclipsefdn/emo-team/iplab/-/issues/14969",
            "scancode-version": "31.2.1",
            "licenses-discovered": [
                "Apache-2.0"
            ],
            "copyrights": [
            ],
            "file-count": 9,
            "sha256": "73eb6f247544ab22688bea552bba10e12d8300859ea12598a740de1df21fcb29",
            "source": "https://repo1.maven.org/maven2/org/apache/camel/springboot/camel-amqp-starter/3.22.2/camel-amqp-starter-3.22.2-sources.jar",
            "status": "approved"
        }
    ]
}