{
    "id": "maven/mavencentral/com.fasterxml.jackson.datatype/jackson-datatype-jakarta-jsonp/2.15.0",
    "license": "Apache-2.0",
    "authority": "https://gitlab.eclipse.org/eclipsefdn/emo-team/iplab/-/issues/9180",
    "source": "https://repo.maven.apache.org/maven2/com/fasterxml/jackson/datatype/jackson-datatype-jakarta-jsonp/2.15.0/jackson-datatype-jakarta-jsonp-2.15.0-sources.jar",
    "status": "approved",
    "scans": [
        {
            "date": "June 26, 2023 at 7:03:37 a.m. GMT",
            "authority": "https://gitlab.eclipse.org/eclipsefdn/emo-team/iplab/-/issues/9180",
            "scancode-version": "31.2.1",
            "licenses-discovered": [
            ],
            "copyrights": [
            ],
            "file-count": 1,
            "sha256": "af708062dc4d72fd89128ba13ed0c2af60e00b584d68b6263a6a739b8f9b6f57",
            "source": "https://repo.maven.apache.org/maven2/com/fasterxml/jackson/datatype/jackson-datatype-jakarta-jsonp/2.15.0/jackson-datatype-jakarta-jsonp-2.15.0-sources.jar",
            "status": "restricted"
        },
        {
            "date": "June 26, 2023 at 7:27:16 p.m. GMT",
            "authority": "https://gitlab.eclipse.org/eclipsefdn/emo-team/iplab/-/issues/9180",
            "scancode-version": "31.2.1",
            "licenses-discovered": [
                "Apache-2.0"
            ],
            "copyrights": [
            ],
            "file-count": 12,
            "sha256": "af708062dc4d72fd89128ba13ed0c2af60e00b584d68b6263a6a739b8f9b6f57",
            "source": "https://repo.maven.apache.org/maven2/com/fasterxml/jackson/datatype/jackson-datatype-jakarta-jsonp/2.15.0/jackson-datatype-jakarta-jsonp-2.15.0-sources.jar",
            "status": "approved"
        }
    ]
}