{
    "id": "npm/npmjs/-/jsdom/22.0.0",
    "license": "MIT AND LGPL-2.0-or-later",
    "authority": "https://gitlab.eclipse.org/eclipsefdn/emo-team/iplab/-/issues/8188",
    "source": "https://registry.yarnpkg.com/jsdom/-/jsdom-22.0.0.tgz",
    "status": "approved",
    "scans": [
        {
            "date": "May 3, 2023 at 12:30:41 p.m. GMT",
            "authority": "https://gitlab.eclipse.org/eclipsefdn/emo-team/iplab/-/issues/8188",
            "scancode-version": "31.2.1",
            "licenses-discovered": [
                "MIT",
                "LGPL-2.0-or-later"
            ],
            "copyrights": [
                "Copyright (c) 2000 Lars Knoll (knoll@kde.org)",
                "Copyright (c) 2003, 2004, 2005, 2006, 2007, 2008, 2009, 2010, 2011 Apple Inc.",
                "Copyright (c) 2010 Elijah Insua"
            ],
            "file-count": 471,
            "sha256": "00ef2ca7980eea0cce44abc4df58149eb0542630b48c6577fd250151237d6fd8",
            "source": "https://registry.yarnpkg.com/jsdom/-/jsdom-22.0.0.tgz",
            "status": "approved"
        }
    ]
}