{
    "id": "npm/npmjs/-/typed-array-buffer/1.0.0",
    "license": "MIT",
    "authority": "https://gitlab.eclipse.org/eclipsefdn/emo-team/iplab/-/issues/9658",
    "source": "https://registry.yarnpkg.com/typed-array-buffer/-/typed-array-buffer-1.0.0.tgz",
    "status": "approved",
    "scans": [
        {
            "date": "July 19, 2023 at 3:03:50 p.m. GMT",
            "authority": "https://gitlab.eclipse.org/eclipsefdn/emo-team/iplab/-/issues/9658",
            "scancode-version": "31.2.1",
            "licenses-discovered": [
                "MIT"
            ],
            "copyrights": [
                "Copyright (c) 2023 Jordan Harband"
            ],
            "file-count": 8,
            "sha256": "623836899b28e6353dc4521d4db42ab43e90f73c7e552e24b6e01bea1be7aa7d",
            "source": "https://registry.yarnpkg.com/typed-array-buffer/-/typed-array-buffer-1.0.0.tgz",
            "status": "approved"
        }
    ]
}