{
    "id": "project/ecd.opensmartclide/eclipse-opensmartclide/smartclide-deployment-interpreter-service/eac267485ce91c525ba5ee1c0a141c1597e83627",
    "license": "EPL-2.0 AND Apache-2.0",
    "authority": "https://gitlab.eclipse.org/eclipsefdn/emo-team/iplab/-/issues/6884",
    "source": "https://github.com/eclipse-opensmartclide/smartclide-deployment-interpreter-service/archive/eac267485ce91c525ba5ee1c0a141c1597e83627.zip",
    "status": "approved",
    "scans": [
        {
            "date": "January 30, 2023 at 10:27:09 p.m. GMT",
            "authority": "https://gitlab.eclipse.org/eclipsefdn/emo-team/iplab/-/issues/6884",
            "scancode-version": "31.2.1",
            "licenses-discovered": [
                "EPL-2.0",
                "Apache-2.0"
            ],
            "copyrights": [
                "Copyright 2007-present the original author or authors"
            ],
            "file-count": 100,
            "sha256": "0d42122c700c8044fd61ad3589b5a07258f760a065733f5d1d37b981be86b72d",
            "source": "https://github.com/eclipse-opensmartclide/smartclide-deployment-interpreter-service/archive/eac267485ce91c525ba5ee1c0a141c1597e83627.zip",
            "status": "restricted"
        }
    ]
}
