{
    "id": "maven/mavencentral/com.nimbusds/oauth2-oidc-sdk/11.10",
    "license": "Apache-2.0",
    "authority": "https://gitlab.eclipse.org/eclipsefdn/emo-team/iplab/-/issues/13308",
    "source": "https://repo1.maven.org/maven2/com/nimbusds/oauth2-oidc-sdk/11.10/oauth2-oidc-sdk-11.10-sources.jar",
    "status": "approved",
    "scans": [
        {
            "date": "February 19, 2024 at 5:52:01 p.m. GMT",
            "authority": "https://gitlab.eclipse.org/eclipsefdn/emo-team/iplab/-/issues/13308",
            "scancode-version": "31.2.1",
            "licenses-discovered": [
                "Apache-2.0"
            ],
            "copyrights": [
                "Copyright 2012-2016, Connect2id Ltd and contributors",
                "Copyright 2012-2020, Connect2id Ltd and contributors",
                "Copyright 2012-2021, Connect2id Ltd and contributors",
                "Copyright 2012-2022 Connect2id Ltd and contributors",
                "Copyright 2012-2023, Connect2id Ltd and contributors"
            ],
            "file-count": 509,
            "sha256": "17e71b34772135e769c8b15d72154d89843b8a4d6cf760df9e811b8f3723a39b",
            "source": "https://repo1.maven.org/maven2/com/nimbusds/oauth2-oidc-sdk/11.10/oauth2-oidc-sdk-11.10-sources.jar",
            "status": "approved"
        }
    ]
}