{
    "id": "maven/mavencentral/org.bytedeco/scipy/1.9.3-1.5.8",
    "license": "Apache-2.0 OR GPL-2.0-or-later WITH Classpath-exception-2.0",
    "authority": "https://gitlab.eclipse.org/eclipsefdn/emo-team/iplab/-/issues/6787",
    "source": "https://search.maven.org/remotecontent?filepath=org/bytedeco/scipy/1.9.3-1.5.8/scipy-1.9.3-1.5.8-sources.jar",
    "status": "approved",
    "scans": [
        {
            "date": "January 27, 2023 at 10:27:44 p.m. GMT",
            "authority": "https://gitlab.eclipse.org/eclipsefdn/emo-team/iplab/-/issues/6787",
            "scancode-version": "31.2.1",
            "licenses-discovered": [
                "Apache-2.0 AND (GPL-2.0-or-later WITH Classpath-exception-2.0)"
            ],
            "copyrights": [
                "Copyright (c) 2019 Samuel Audet"
            ],
            "file-count": 4,
            "sha256": "5c5bffecde7803b1d0d64397ed31453bc31797dc84ac9b05ffc1df5875440db8",
            "source": "https://search.maven.org/remotecontent?filepath=org/bytedeco/scipy/1.9.3-1.5.8/scipy-1.9.3-1.5.8-sources.jar",
            "status": "restricted"
        }
    ]
}
