{
    "id": "maven/mavencentral/software.amazon.awssdk/checksums-spi/2.28.17",
    "license": "Apache-2.0",
    "authority": "https://gitlab.eclipse.org/eclipsefdn/emo-team/iplab/-/issues/16517",
    "source": "https://repo1.maven.org/maven2/software/amazon/awssdk/checksums-spi/2.28.17/checksums-spi-2.28.17-sources.jar",
    "status": "approved",
    "scans": [
        {
            "date": "October 8, 2024, 11:02:12 p.m. GMT",
            "authority": "https://gitlab.eclipse.org/eclipsefdn/emo-team/iplab/-/issues/16517",
            "scancode-version": "31.2.1",
            "licenses-discovered": [
                "Apache-2.0"
            ],
            "copyrights": [
                "Copyright Amazon.com, Inc. or its affiliates"
            ],
            "file-count": 5,
            "sha256": "c6860af1d9350977089ef0c5ee15b73b875acf5a598c33323c27aa7ce4275453",
            "source": "https://repo1.maven.org/maven2/software/amazon/awssdk/checksums-spi/2.28.17/checksums-spi-2.28.17-sources.jar",
            "status": "approved"
        }
    ]
}