{
    "id": "npm/npmjs/-/vuestic-ui/1.6.2",
    "license": "MIT",
    "authority": "https://gitlab.eclipse.org/eclipsefdn/emo-team/iplab/-/issues/7541",
    "source": "https://github.com/epicmaxco/vuestic-ui/archive/v1.6.2.zip",
    "status": "approved",
    "scans": [
        {
            "date": "March 26, 2023 at 9:40:48 p.m. GMT",
            "authority": "https://gitlab.eclipse.org/eclipsefdn/emo-team/iplab/-/issues/7541",
            "scancode-version": "31.2.1",
            "licenses-discovered": [
                "MIT"
            ],
            "copyrights": [
                "Copyright (c) 2012 by Daniel Bruce",
                "Copyright (c) 2012 by Daniel BruceEntypoMediumFontForge",
                "Copyright (c) 2021 Epicmax"
            ],
            "file-count": 2056,
            "sha256": "a4255e1910ad7afbad249e32879d5bf3232a9d5f912178421361487932d5fff4",
            "source": "https://github.com/epicmaxco/vuestic-ui/archive/v1.6.2.zip",
            "status": "approved"
        }
    ]
}