{
    "id": "npm/npmjs/@vue/compiler-dom/3.5.1",
    "license": "MIT AND ISC",
    "authority": "https://gitlab.eclipse.org/eclipsefdn/emo-team/iplab/-/issues/16068",
    "source": "https://github.com/vuejs/core/archive/refs/tags/v3.5.1.zip",
    "status": "approved",
    "scans": [
        {
            "date": "September 4, 2024 at 9:59:58 p.m. GMT",
            "authority": "https://gitlab.eclipse.org/eclipsefdn/emo-team/iplab/-/issues/16068",
            "scancode-version": "31.2.1",
            "licenses-discovered": [
                "MIT",
                "ISC"
            ],
            "copyrights": [
                "(c) 2018-present Yuxi",
                "Copyright (c) 2013-present, Yuxi",
                "Copyright (c) 2018-present, Yuxi",
                "Copyright 2010, 2011, Chris Winberry <chris@winberry.net>"
            ],
            "file-count": 695,
            "sha256": "6f05c35373fdc142c4e46ab4ee9b0d41d409974df5381848c20d72b613e86d98",
            "source": "https://github.com/vuejs/core/archive/refs/tags/v3.5.1.zip",
            "status": "approved"
        }
    ]
}