{
    "id": "maven/mavencentral/io.opentelemetry/opentelemetry-semconv/1.19.0-alpha",
    "license": "Apache-2.0",
    "authority": "https://gitlab.eclipse.org/eclipsefdn/emo-team/iplab/-/issues/5224",
    "source": "https://search.maven.org/remotecontent?filepath=io/opentelemetry/opentelemetry-semconv/1.19.0-alpha/opentelemetry-semconv-1.19.0-alpha-sources.jar",
    "status": "approved",
    "scans": [
        {
            "date": "November 28, 2022 at 11:58:52 p.m. GMT",
            "authority": "https://gitlab.eclipse.org/eclipsefdn/emo-team/iplab/-/issues/5224",
            "scancode-version": "31.2.1",
            "licenses-discovered": [
                "Apache-2.0"
            ],
            "copyrights": [
            ],
            "file-count": 5,
            "sha256": "732c440339853264d1a358b70d7240d2d3ecef854a37b8eb047a374dc62cb496",
            "source": "https://search.maven.org/remotecontent?filepath=io/opentelemetry/opentelemetry-semconv/1.19.0-alpha/opentelemetry-semconv-1.19.0-alpha-sources.jar",
            "status": "approved"
        }
    ]
}