{
    "id": "maven/mavencentral/org.apache.jena/jena-shex/4.9.0",
    "license": "Apache-2.0",
    "authority": "https://gitlab.eclipse.org/eclipsefdn/emo-team/iplab/-/issues/14709",
    "source": "https://repo1.maven.org/maven2/org/apache/jena/jena-shex/4.9.0/jena-shex-4.9.0-sources.jar",
    "status": "approved",
    "scans": [
        {
            "date": "May 14, 2024 at 7:48:37 a.m. GMT",
            "authority": "https://gitlab.eclipse.org/eclipsefdn/emo-team/iplab/-/issues/14709",
            "scancode-version": "31.2.1",
            "licenses-discovered": [
                "Apache-2.0"
            ],
            "copyrights": [
            ],
            "file-count": 93,
            "sha256": "d1da5fae134bf8524c60aef74dbca994b66922ca28eb67d05fab60c2c9313862",
            "source": "https://repo1.maven.org/maven2/org/apache/jena/jena-shex/4.9.0/jena-shex-4.9.0-sources.jar",
            "status": "approved"
        }
    ]
}