{
    "id": "project/automotive.sdv-blueprints/eclipse-sdv-blueprints/fleet-management/21bf8f0170a394ffe06193873e6cdbb11630dfa7",
    "license": "Apache-2.0 AND EDL-1.0",
    "authority": "https://gitlab.eclipse.org/eclipsefdn/emo-team/iplab/-/issues/9218",
    "source": "https://github.com/eclipse-sdv-blueprints/fleet-management/archive/21bf8f0170a394ffe06193873e6cdbb11630dfa7.zip",
    "status": "approved",
    "scans": [
        {
            "date": "September 21, 2023 at 5:21:50 p.m. GMT",
            "authority": "https://gitlab.eclipse.org/eclipsefdn/emo-team/iplab/-/issues/9218",
            "scancode-version": "31.2.1",
            "licenses-discovered": [
                "Apache-2.0",
                "BSD-3-Clause",
                "MIT",
                "Zlib",
                "LicenseRef-scancode-proprietary-license",
                "BSD-3-Clause AND MIT",
                "ISC AND LicenseRef-scancode-openssl AND LicenseRef-scancode-ssleay-windows AND MIT AND OpenSSL",
                "ISC",
                "LicenseRef-scancode-unicode"
            ],
            "copyrights": [
                "Copyright (c) 1991-2022 Unicode, Inc.",
                "Copyright (c) 1995-1998 Eric Young (eay@cryptsoft.com)",
                "Copyright (c) 1998-2011 The OpenSSL Project",
                "Copyright (c) 2013, Julien Schmidt",
                "Copyright (c) 2014 Alex Crichton",
                "Copyright (c) 2014 Carl Lerche",
                "Copyright (c) 2014 Carl Lerche and other MIO contributors",
                "Copyright (c) 2014 Mathijs van de Nes",
                "Copyright (c) 2014-2019 Geoffroy Couprie",
                "Copyright (c) 2014-2021 Sean McArthur",
                "Copyright (c) 2015 Danny Guo",
                "Copyright (c) 2015, Google Inc.",
                "Copyright (c) 2015-2016 the fiat-crypto",
                "Copyright (c) 2015-2019 Doug Tangren",
                "Copyright (c) 2016 Alex Crichton",
                "Copyright (c) 2016 Federico Giraud",
                "Copyright (c) 2016 Paul Mason",
                "Copyright (c) 2016 Titus Wormer <tituswormer@gmail.com>",
                "Copyright (c) 2017 Stephen M. Coakley",
                "Copyright (c) 2017 h2 authors",
                "Copyright (c) 2018 Akash Kurdekar",
                "Copyright (c) 2018 Carl Lerche",
                "Copyright (c) 2018 David Tolnay",
                "Copyright (c) 2018 Sean McArthur",
                "Copyright (c) 2018-2019 Sean McArthur",
                "Copyright (c) 2019 Axum",
                "Copyright (c) 2019 Carl Lerche",
                "Copyright (c) 2019 Hyper",
                "Copyright (c) 2019 Stepan Koltsov",
                "Copyright (c) 2019 Tokio",
                "Copyright (c) 2019 Tower",
                "Copyright (c) 2019 Yoshua Wuyts",
                "Copyright (c) 2020 Lucio Franco",
                "Copyright (c) 2020 Matias Rodriguez",
                "Copyright (c) 2021 Stephen M. Coakley",
                "Copyright (c) 2022 Ibraheem Ahmed",
                "Copyright (c) 2023 Tokio",
                "Copyright (c) WHATWG",
                "Copyright 2015 Brian Smith",
                "Copyright 2015-2016 Brian Smith",
                "Copyright 2023 Contributors",
                "Copyright Robert Bosch GmbH, 2022",
                "holder is Tim Hudson (tjh@cryptsoft.com)"
            ],
            "file-count": 116,
            "sha256": "3a101e95addf71954ca975efaf7fdca4100a243b85de52a3e09445a76c52afd1",
            "source": "https://github.com/eclipse-sdv-blueprints/fleet-management/archive/21bf8f0170a394ffe06193873e6cdbb11630dfa7.zip",
            "status": "restricted"
        }
    ]
}
