{
    "id": "nuget/nuget/-/xunit.analyzers/1.18.0",
    "license": "Apache-2.0 AND MIT",
    "authority": "https://gitlab.eclipse.org/eclipsefdn/emo-team/iplab/-/issues/19066",
    "source": "https://github.com/xunit/xunit.analyzers/archive/refs/tags/1.18.0.zip",
    "status": "approved",
    "scans": [
        {
            "date": "January 21, 2025 at 4:33:03 a.m. GMT",
            "authority": "https://gitlab.eclipse.org/eclipsefdn/emo-team/iplab/-/issues/19066",
            "scancode-version": "31.2.1",
            "licenses-discovered": [
                "Apache-2.0 AND MIT",
                "Apache-2.0 AND LicenseRef-scancode-free-unknown",
                "Apache-2.0",
                "MIT"
            ],
            "copyrights": [
                "Copyright (c) .NET Foundation",
                "Copyright (c) .NET Foundation and Contributors"
            ],
            "file-count": 360,
            "sha256": "a8091c7e7b95f33606bf43e1d8cb067ffd1434f06849675c421cda36b82cdb69",
            "source": "https://github.com/xunit/xunit.analyzers/archive/refs/tags/1.18.0.zip",
            "status": "restricted"
        }
    ]
}