{
    "id": "maven/mavencentral/software.amazon.awssdk/third-party-jackson-core/2.17.252",
    "license": "Apache-2.0",
    "licenses-discovered": [
        "Apache-2.0"
    ],
    "copyrights": [
        "Copyright AOL Inc. - Apache",
        "Copyright Amazon.com, Inc.",
        "Copyright James Murty",
        "Copyright The Apache Software Foundation"
    ],
    "file-count": 4,
    "scancode-version": "30.1.0",
    "authority": "https://gitlab.eclipse.org/eclipsefdn/emo-team/iplab/-/issues/3166",
    "source": "https://search.maven.org/remotecontent?filepath=software/amazon/awssdk/third-party-jackson-core/2.17.252/third-party-jackson-core-2.17.252-sources.jar",
    "status": "approved"
}