{
    "id": "crate/cratesio/-/zenoh-config/1.0.1",
    "license": "Apache-2.0 AND EPL-2.0 AND (EPL-2.0 OR Apache-2.0)",
    "authority": "https://gitlab.eclipse.org/eclipsefdn/emo-team/iplab/-/issues/17060",
    "source": "https://crates.io/api/v1/crates/zenoh-config/1.0.1/download",
    "status": "approved",
    "scans": [
        {
            "date": "November 5, 2024, 1:04:16 p.m. GMT",
            "authority": "https://gitlab.eclipse.org/eclipsefdn/emo-team/iplab/-/issues/17060",
            "scancode-version": "31.2.1",
            "licenses-discovered": [
                "Apache-2.0 AND EPL-2.0",
                "EPL-2.0 OR Apache-2.0"
            ],
            "copyrights": [
                "Copyright (c) 2023 ZettaScale Technology",
                "Copyright (c) 2024 ZettaScale Technology"
            ],
            "file-count": 10,
            "sha256": "15d3ddf489ec055bc7498d66f6bb2cce8278314fbadb40aa34a37bc0125f494f",
            "source": "https://crates.io/api/v1/crates/zenoh-config/1.0.1/download",
            "status": "approved"
        }
    ]
}