{
    "id": "npm/npmjs/-/lerna/7.3.0",
    "license": "MIT AND (ISC AND MIT) AND ISC",
    "authority": "https://gitlab.eclipse.org/eclipsefdn/emo-team/iplab/-/issues/10785",
    "source": "https://github.com/lerna/lerna/archive/refs/tags/v7.3.0.zip",
    "status": "approved",
    "scans": [
        {
            "date": "October 2, 2023 at 2:05:56 p.m. GMT",
            "authority": "https://gitlab.eclipse.org/eclipsefdn/emo-team/iplab/-/issues/10785",
            "scancode-version": "31.2.1",
            "licenses-discovered": [
                "MIT",
                "ISC AND MIT",
                "ISC"
            ],
            "copyrights": [
                "Copyright (c) 2015-present Lerna",
                "Copyright (c) 2018 Tester McPerson <test@example.com>"
            ],
            "file-count": 1740,
            "sha256": "c18569e398510ec61936c7e2574ed59bdb8b5424023bb6bc1f6ab8dfc7b7a8c3",
            "source": "https://github.com/lerna/lerna/archive/refs/tags/v7.3.0.zip",
            "status": "approved"
        }
    ]
}