{
    "id": "maven/mavencentral/org.activiti/activiti-expression-language/8.4.0",
    "license": "Apache-2.0",
    "authority": "https://gitlab.eclipse.org/eclipsefdn/emo-team/iplab/-/issues/14529",
    "source": "https://maven.alfresco.com/nexus/service/local/repositories/activiti-releases/content//org/activiti/activiti-expression-language/8.4.0/activiti-expression-language-8.4.0-sources.jar",
    "status": "approved",
    "scans": [
        {
            "date": "April 24, 2024 at 4:22:25 a.m. GMT",
            "authority": "https://gitlab.eclipse.org/eclipsefdn/emo-team/iplab/-/issues/14529",
            "scancode-version": "31.2.1",
            "licenses-discovered": [
                "Apache-2.0"
            ],
            "copyrights": [
                "Copyright 2010-2020 Alfresco Software, Ltd."
            ],
            "file-count": 17,
            "sha256": "e417769feeecf76f96ee08bb1b9f6e97108f4efc203aef0d1deca986d1aa7595",
            "source": "https://maven.alfresco.com/nexus/service/local/repositories/activiti-releases/content//org/activiti/activiti-expression-language/8.4.0/activiti-expression-language-8.4.0-sources.jar",
            "status": "approved"
        }
    ]
}