{
    "id": "git/github/bugsnag/panicwrap/e2c28503fcd0",
    "license": "MIT",
    "authority": "https://gitlab.eclipse.org/eclipsefdn/emo-team/iplab/-/issues/5133",
    "source": "https://github.com/bugsnag/panicwrap/archive/e2c28503fcd0.zip",
    "status": "approved",
    "scans": [
        {
            "date": "November 24, 2022 at 8:27:15 p.m. GMT",
            "authority": "https://gitlab.eclipse.org/eclipsefdn/emo-team/iplab/-/issues/5133",
            "scancode-version": "31.2.1",
            "licenses-discovered": [
                "MIT"
            ],
            "copyrights": [
                "Copyright (c) 2013 Mitchell Hashimoto"
            ],
            "file-count": 8,
            "sha256": "f6deb419b90e045f8ffb8ed49608ce04af84e1821aa2a9dacee72fda6e9637d2",
            "source": "https://github.com/bugsnag/panicwrap/archive/e2c28503fcd0.zip",
            "status": "approved"
        }
    ]
}