{
    "id": "npm/npmjs/-/allure-playwright/2.14.0",
    "license": "Apache-2.0",
    "authority": "https://gitlab.eclipse.org/eclipsefdn/emo-team/iplab/-/issues/13570",
    "source": "https://github.com/allure-framework/allure-js/archive/refs/tags/v2.14.0.zip",
    "status": "approved",
    "scans": [
        {
            "date": "March 8, 2024 at 1:17:55 a.m. GMT",
            "authority": "https://gitlab.eclipse.org/eclipsefdn/emo-team/iplab/-/issues/13570",
            "scancode-version": "31.2.1",
            "licenses-discovered": [
                "MIT",
                "Apache-2.0",
                "ISC",
                "Apache-2.0 AND CC-BY-4.0 AND MIT AND OFL-1.1",
                "BSD-3-Clause AND Beerware AND MIT",
                "BSD-3-Clause",
                "Beerware AND MIT",
                "JSON AND MIT",
                "Apache-2.0 AND Unlicense",
                "BSD-2-Clause",
                "Apache-2.0 AND MIT",
                "ISC AND MIT",
                "LicenseRef-scancode-free-unknown AND MIT",
                "BSD-2-Clause-Views",
                "Python-2.0",
                "BSD-3-Clause AND ISC",
                "Unlicense",
                "BSD-3-Clause AND MIT",
                "CC-BY-4.0",
                "LicenseRef-scancode-proprietary-license",
                "Apache-2.0 AND BSD-3-Clause AND MIT",
                "MIT AND X11",
                "Artistic-2.0",
                "0BSD AND MIT",
                "Apache-2.0 AND CC-BY-4.0",
                "Apache-2.0 AND BSD-2-Clause",
                "LicenseRef-scancode-mit-addition",
                "ISC AND JSON",
                "MIT-0",
                "BSD-2-Clause AND BSD-3-Clause",
                "BSD-2-Clause AND BSD-3-Clause AND MIT",
                "BSD-2-Clause AND MIT",
                "MIT AND WTFPL",
                "MPL-2.0",
                "CC-BY-SA-4.0",
                "CC-BY-SA-4.0 AND ISC",
                "LicenseRef-scancode-unicode",
                "MPL-1.0",
                "BSD-2-Clause AND BSD-3-Clause AND MIT AND MPL-1.0",
                "BlueOak-1.0.0",
                "LicenseRef-scancode-json-pd",
                "LGPL-2.0-or-later",
                "AFL-2.1 AND AFL-3.0 AND BSD-3-Clause",
                "AFL-2.1 AND BSD-3-Clause",
                "WTFPL",
                "CC0-1.0 AND MIT",
                "LicenseRef-scancode-proprietary-license AND MIT",
                "Apache-2.0 AND BSD-2-Clause AND BSD-3-Clause",
                "Apache-2.0 AND BSD-3-Clause",
                "BSD-2-Clause AND JSON AND MIT",
                "BSD-2-Clause AND JSON",
                "BSD-2-Clause AND BSD-3-Clause AND ISC AND MIT",
                "CC0-1.0",
                "Apache-2.0 AND CC-BY-4.0 AND ISC AND MIT",
                "Apache-2.0 AND BSD-2-Clause AND BSD-3-Clause AND CC-BY-SA-4.0 AND ISC AND LicenseRef-scancode-mit-synopsys AND MIT",
                "Apache-2.0 AND BSD-2-Clause AND MIT",
                "AGPL-3.0-or-later AND Apache-2.0",
                "0BSD AND Apache-2.0",
                "0BSD",
                "ISC AND WTFPL",
                "LGPL-2.1-or-later",
                "AGPL-1.0-only AND AGPL-3.0-or-later AND Apache-2.0 AND BSD-2-Clause AND BSD-3-Clause AND BSD-3-Clause-Clear AND GPL-1.0-only AND GPL-2.0-only AND GPL-3.0-or-later AND LGPL-2.0-only AND LGPL-2.1-only AND LGPL-3.0-or-later AND LicenseRef-scancode-agpl-2.0 AND LicenseRef-scancode-other-permissive AND MPL-1.0",
                "Autoconf-exception-3.0 AND Classpath-exception-2.0 AND GPL-3.0-linking-exception AND GPL-3.0-only AND LGPL-3.0-linking-exception AND LLVM-exception AND LZMA-exception AND LicenseRef-scancode-llgpl AND OCaml-LGPL-linking-exception AND Qt-GPL-exception-1.0 AND Qt-LGPL-exception-1.1 AND Swift-exception",
                "CC-BY-3.0",
                "CC-BY-3.0 AND JSON AND MIT",
                "BSD-2-Clause AND CC-BY-3.0 AND GCC-exception-2.0 AND GPL-2.0-only AND JSON AND MIT",
                "AGPL-3.0-only AND AGPL-3.0-or-later AND APSL-1.0 AND APSL-1.1 AND Apache-1.1 AND Apache-2.0 AND BSD-2-Clause AND BSD-2-Clause-Patent AND BSD-2-Clause-Views AND BSD-3-Clause AND BSD-3-Clause-Modification AND BSD-3-Clause-No-Military-License AND BSD-4-Clause AND BSD-4-Clause-Shortened AND BSD-4-Clause-UC AND CAL-1.0 AND CAL-1.0-Combined-Work-Exception AND CC-BY-3.0 AND CC-BY-SA-2.0 AND CC-BY-SA-4.0 AND CC0-1.0 AND CDDL-1.0 AND CDDL-1.1 AND CECILL-2.0 AND CECILL-2.1 AND CERN-OHL-1.1 AND CERN-OHL-1.2 AND CERN-OHL-P-2.0 AND CERN-OHL-S-2.0 AND CERN-OHL-W-2.0 AND CPOL-1.02 AND EFL-2.0 AND EPL-1.0 AND Frameworx-1.0 AND GFDL-1.1-invariants-only AND GFDL-1.1-invariants-or-later AND GFDL-1.1-no-invariants-only AND GFDL-1.1-no-invariants-or-later AND GFDL-1.2-invariants-only AND GFDL-1.2-invariants-or-later AND GFDL-1.2-no-invariants-only AND GFDL-1.2-no-invariants-or-later AND GFDL-1.3-invariants-only AND GFDL-1.3-invariants-or-later AND GFDL-1.3-no-invariants-only AND GFDL-1.3-no-invariants-or-later AND GPL-2.0-only AND HPND AND HPND-sell-variant AND HaskellReport AND IBM-pibs AND Interbase-1.0 AND LicenseRef-scancode-d-fsl-1.0-en AND LicenseRef-scancode-free-unknown AND LicenseRef-scancode-mulanpsl-1.0-en AND LicenseRef-scancode-mulanpsl-2.0-en AND Linux-man-pages-copyleft AND MS-PL AND MS-RL AND NAIST-2003 AND NCGL-UK-2.0 AND NGPL AND NIST-PD AND NIST-PD-fallback AND NTP-0 AND OFL-1.1-no-RFN AND OGC-1.0 AND OGDL-Taiwan-1.0 AND OGL-Canada-2.0 AND OGL-UK-1.0 AND OGL-UK-2.0 AND OGL-UK-3.0 AND PSF-2.0 AND Parity-6.0.0 AND Parity-7.0.0 AND PolyForm-Noncommercial-1.0.0 AND PolyForm-Small-Business-1.0.0 AND SSPL-1.0 AND Spencer-86 AND TAPR-OHL-1.0 AND TMate AND TU-Berlin-1.0 AND TU-Berlin-2.0 AND UCL-1.0 AND Zimbra-1.3 AND Zimbra-1.4 AND copyleft-next-0.3.0 AND copyleft-next-0.3.1 AND etalab-2.0 AND libselinux-1.0",
                "BSD-3-Clause-Clear",
                "CC0-1.0 AND WTFPL",
                "MIT OR CC0-1.0",
                "CC-BY-4.0 AND LicenseRef-scancode-khronos AND LicenseRef-scancode-unicode AND LicenseRef-scancode-unknown AND MIT AND W3C-20150513",
                "GPL-3.0-only AND MIT",
                "Apache-2.0 AND BSD-2-Clause AND CC0-1.0 AND ISC AND MIT",
                "BSD-2-Clause AND ISC AND MIT",
                "Apache-2.0 AND BSD-3-Clause AND ISC AND MIT",
                "LicenseRef-scancode-mit-synopsys",
                "LicenseRef-scancode-markus-kuhn-license"
            ],
            "copyrights": [
                "(c) ,D Qd h co",
                "(c) / const group",
                "(c) 2007-2012 Steven Levithan <http://xregexp.com/>",
                "(c) 2008-2012 Steven Levithan <http://xregexp.com/>",
                "(c) 2009-2012 Steven Levithan <http://xregexp.com/>",
                "(c) 2009-2020 Jeremy Ashkenas, DocumentCloud and Investigative Reporters & Editors Underscore",
                "(c) 2010-2012 Steven Levithan <http://xregexp.com/>",
                "(c) 2011 Colin Snover <http://zetafleet.com>",
                "(c) 2011 Gary Court",
                "(c) 2012 Steven Levithan <http://xregexp.com/>",
                "(c) 2013 Rod Vagg <rod@vagg.org> https://github.com/rvagg/prr",
                "(c) 2013 Tim Griesser Checkit",
                "(c) 2013-2015 Tim Griesser Checkit",
                "(c) 2014 bahmutov (https://twitter.com/bahmutov)",
                "(c) 2014-present SheetJS http://sheetjs.com",
                "(c) 2015 Ari Porad (@ariporad) <http://ariporad.com>",
                "(c) 2015, Jon Schlinkert",
                "(c) 2017 Unicode(r), Inc.",
                "(c) 2018 Denis Pushkarev",
                "(c) 2019 Denis Pushkarev",
                "(c) 2020 Andrea Giammarchi",
                "(c) 2020 Andrea Giammarchi, (ISC)",
                "(c) 2020 Shirshak Bajgain",
                "(c) 2020 by Philipp Dunkel, Ben Noordhuis, Elan Shankar, Paul Miller",
                "(c) 2020-present Andrea Giammarchi",
                "(c) 2021 Anthony Fu (https://github.com/antfu)",
                "(c) 2022 Anthony Fu (https://github.com/antfu)",
                "(c) 2024 Cypress.io",
                "(c) 2024 Tim Perry",
                "(c) Andrea Giammarchi",
                "(c) Antonio V (https://github.com/toniov)",
                "(c) Ariel Mashraki (https://github.com/a8m)",
                "(c) Ben Drucker (http://bendrucker.me)",
                "(c) Bs(t,i,e,o) else i Bv(n,t,e,o,r)",
                "(c) Ca (c)",
                "(c) CodeceptJS Team (http://codecept.io)",
                "(c) Copyright 2024 Pavol Hejny (https://pavolhejny.com/)",
                "(c) EGOIST (https://github.com/egoist)",
                "(c) Gustaf Andersson",
                "(c) Isaac Z. Schlueter (http://github.com/isaacs), James Talmage (http://github.com/jamestalmage)",
                "(c) JS Foundation and other contributors",
                "(c) Jared Wray",
                "(c) Jason Miller (https://jasonformat.com/)",
                "(c) Javier Blanco (http://jbgutierrez.info)",
                "(c) Julien Fontanet (http://julien.isonoe.net)",
                "(c) Kevin Martensson (http://github.com/kevva)",
                "(c) Kevin Martensson (https://github.com/kevva)",
                "(c) Leonardo Quixada (https://twitter.com/lquixada/)",
                "(c) Luke Childs",
                "(c) Luke Childs 2017-2021 and Jared Wray 2022",
                "(c) Luke Edwards (http://lukeed.com)",
                "(c) Luke Edwards (https://lukeed.com)",
                "(c) Markus Ekholm",
                "(c) Nathan Friedly (http://www.nfriedly.com/)",
                "(c) Object C",
                "(c) Paul Miller <https://paulmillr.com>",
                "(c) Petka Antonov, John-David Dalton, Sindre Sorhus",
                "(c) Postdot Technologies, Inc",
                "(c) Sa (c)",
                "(c) Sasha Koss (https://kossnocorp.mit-license.org/)",
                "(c) Sindre Sorhus",
                "(c) Sindre Sorhus (http://sindresorhus.com)",
                "(c) Sindre Sorhus (https://sindresorhus.com)",
                "(c) Sindre Sorhus (https://sindresorhus.com), Paul Miller (https://paulmillr.com)",
                "(c) Terkel Gjervig (https://terkel.com)",
                "(c) Titus Wormer",
                "(c) Tn (c)",
                "(c) Unknown Bu",
                "(c) Unknown Hs",
                "(c) Unknown Ws",
                "(c) Unknown Xd V",
                "(c) Vasily Polovnyov <vast@whiteants.net>",
                "(c) Vsevolod Strukchinsky (http://github.com/floatdrop)",
                "(c) Ya (c)",
                "(c) Ziggy Jonsson (ziggy.jonsson.nyc@gmail.com)",
                "(c) b.value",
                "(c) by W3C",
                "(c) extraPathPercentEncodeSet.has",
                "Copyright (c) 1991 - 1995, Stichting Mathematisch Centrum Amsterdam, The Netherlands",
                "Copyright (c) 1991-2001 The National Gallery",
                "Copyright (c) 1991-2017 Unicode, Inc.",
                "Copyright (c) 1995-2001 Corporation for National Research Initiatives",
                "Copyright (c) 1997 - 2002, Makoto Matsumoto and Takuji Nishimura",
                "Copyright (c) 1998 - 2009, Paul Johnston & Contributors",
                "Copyright (c) 1999-2001 Gregory P. Ward",
                "Copyright (c) 2000 Lars Knoll (knoll@kde.org)",
                "Copyright (c) 2001, 2002, 2003, 2004, 2005, 2006, 2007, 2008, 2009, 2010, 2011, 2012, 2013, 2014, 2015, 2016, 2017, 2018, 2019, 2020 Python Software Foundation",
                "Copyright (c) 2002, 2003 Python Software Foundation",
                "Copyright (c) 2002-2008 Kris Kowal <http://cixar.com/~kris.kowal>",
                "Copyright (c) 2003, 2004, 2005, 2006, 2007, 2008, 2009, 2010, 2011 Apple Inc.",
                "Copyright (c) 2003-2004 Lawrence E. Rosen",
                "Copyright (c) 2003-2005 Tom Wu",
                "Copyright (c) 2004 Sam Hocevar <sam@hocevar.net>",
                "Copyright (c) 2004-2008 by Mulle Kybernetik",
                "Copyright (c) 2004-2010 by Mulle Kybernetik",
                "Copyright (c) 2004-2013 Mulle Kybernetik. NSPrincipalClass",
                "Copyright (c) 2004-2014 Erik Doernenburg and contributors",
                "Copyright (c) 2004-2016 Erik Doernenburg and contributors",
                "Copyright (c) 2004-2018 Erik Doernenburg and contributors",
                "Copyright (c) 2005 Tom Wu",
                "Copyright (c) 2005-2009 Tom Wu",
                "Copyright (c) 2005-2015, The Dojo Foundation",
                "Copyright (c) 2005-2018 Erik Doernenburg and contributors",
                "Copyright (c) 2006-2018 Erik Doernenburg and contributors",
                "Copyright (c) 2007-2010 Benjamin Curtis <http://search.cpan.org/~jasonk/Data-Faker-0.07/>",
                "Copyright (c) 2007-2010 Benjamin Curtis http://search.cpan.org/~jasonk/Data-Faker-0.07",
                "Copyright (c) 2007-2010 by Mulle Kybernetik",
                "Copyright (c) 2007-2012 Steven Levithan <http://xregexp.com/>",
                "Copyright (c) 2007-2014 Erik Doernenburg and contributors",
                "Copyright (c) 2007-2014, Alexandru Marasteanu",
                "Copyright (c) 2007-2016 Erik Doernenburg and contributors",
                "Copyright (c) 2007-2017 Diego Perini",
                "Copyright (c) 2007-2018 Einar Lielmanis, Liam Newman, and contributors",
                "Copyright (c) 2007-2018 Erik Doernenburg and contributors",
                "Copyright (c) 2007-2019 Diego Perini",
                "Copyright (c) 2007-2019 Diego Perini (http://www.iport.it/)",
                "Copyright (c) 2007-2023 Diego Perini",
                "Copyright (c) 2007-present, < pkg.author > < pkg.license >",
                "Copyright (c) 2007-present, Alexandru Marasteanu <hello@alexei.ro>",
                "Copyright (c) 2008, Fair Oaks Labs, Inc.",
                "Copyright (c) 2008-2009 Bjoern Hoehrmann <bjoern@hoehrmann.de>",
                "Copyright (c) 2008-2015, Fair Oaks Labs, Inc.",
                "Copyright (c) 2008-2016 Pivotal Labs",
                "Copyright (c) 2008-2017 Pivotal Labs",
                "Copyright (c) 2008-2018 Pivotal Labs",
                "Copyright (c) 2008-2019 Pivotal Labs",
                "Copyright (c) 2008-2022 Pivotal Labs",
                "Copyright (c) 2009 Google Inc.",
                "Copyright (c) 2009 Thomas Robinson <280north.com>",
                "Copyright (c) 2009 by Mulle Kybernetik",
                "Copyright (c) 2009-2010 by Mulle Kybernetik",
                "Copyright (c) 2009-2011, Mozilla Foundation and contributors",
                "Copyright (c) 2009-2014 Erik Doernenburg and contributors",
                "Copyright (c) 2009-2015, Kevin Decker <kpdecker@gmail.com>",
                "Copyright (c) 2009-2016 Erik Doernenburg and contributors",
                "Copyright (c) 2009-2018 Erik Doernenburg and contributors",
                "Copyright (c) 2009-2020 Jeremy Ashkenas, DocumentCloud and Investigative Reporters & Editors",
                "Copyright (c) 2009-2022 Isaac Z. Schlueter and Contributors",
                "Copyright (c) 2009-2023 Isaac Z. Schlueter and Contributors",
                "Copyright (c) 2010 Adaltas",
                "Copyright (c) 2010 Benjamin Thomas, Robert Kieffer",
                "Copyright (c) 2010 Elijah Insua",
                "Copyright (c) 2010 Jonas Nicklas",
                "Copyright (c) 2010 LearnBoost <dev@learnboost.com>",
                "Copyright (c) 2010 Sencha Inc.",
                "Copyright (c) 2010 Thomas Fuchs (http://script.aculo.us/thomas)",
                "Copyright (c) 2010, Linden Research, Inc.",
                "Copyright (c) 2010-2011, The Dojo Foundation",
                "Copyright (c) 2010-2012 Mikeal Rogers",
                "Copyright (c) 2010-2012 Robert Kieffer",
                "Copyright (c) 2010-2012, Christian Johansen, christian@cjohansen.no and August Lilleaas, august.lilleaas@gmail.com",
                "Copyright (c) 2010-2012, The Dojo Foundation",
                "Copyright (c) 2010-2014 Bruce Williams",
                "Copyright (c) 2010-2014, Christian Johansen, christian@cjohansen.no",
                "Copyright (c) 2010-2014, The Dojo Foundation",
                "Copyright (c) 2010-2015 Linux Foundation and its Contributors",
                "Copyright (c) 2010-2016 Charlie Robbins, Jarrett Cruger & the Contributors",
                "Copyright (c) 2010-2016 Robert Kieffer and other contributors",
                "Copyright (c) 2010-2017, Christian Johansen, christian@cjohansen.no",
                "Copyright (c) 2010-2018 Caolan McMahon",
                "Copyright (c) 2010-2018 Erik Doernenburg and contributors",
                "Copyright (c) 2010-2019 Juriy kangax Zaytsev",
                "Copyright (c) 2010-2020 Python Software Foundation",
                "Copyright (c) 2010-2020 Robert Kieffer and other contributors",
                "Copyright (c) 2010-2020 by Philipp Dunkel, Ben Noordhuis, Elan Shankar, Paul Miller",
                "Copyright (c) 2010-2023 Isaac Z. Schlueter and Contributors",
                "Copyright (c) 2011 2012 2013 Forward",
                "Copyright (c) 2011 Alexander Shtuchkin",
                "Copyright (c) 2011 Andrei Mackenzie",
                "Copyright (c) 2011 Ariya Hidayat <ariya.hidayat@gmail.com>",
                "Copyright (c) 2011 Debuggable Limited <felix@debuggable.com>",
                "Copyright (c) 2011 Dmitry Nizovtsev",
                "Copyright (c) 2011 Dominic Tarr",
                "Copyright (c) 2011 Einar Otto Stangvik <einaros@gmail.com>",
                "Copyright (c) 2011 Enrico Marino",
                "Copyright (c) 2011 Enrico Marino <enrico.marino@email.com>",
                "Copyright (c) 2011 Fabrice Bellard",
                "Copyright (c) 2011 Felix Geisendorfer (felix@debuggable.com)",
                "Copyright (c) 2011 Google Inc.",
                "Copyright (c) 2011 Heather Arthur <fayearthur@gmail.com>",
                "Copyright (c) 2011 Jake Luer <jake@alogicalparadox.com>",
                "Copyright (c) 2011 LearnBoost",
                "Copyright (c) 2011 Mark Cavage",
                "Copyright (c) 2011 Olivier Poitrey <rs@rhapsodyk.net>",
                "Copyright (c) 2011 Rodney Rehm",
                "Copyright (c) 2011 TJ Holowaychuk",
                "Copyright (c) 2011 TJ Holowaychuk <tj@vision-media.ca>",
                "Copyright (c) 2011 Tim Koschutzki (tim@debuggable.com) Felix Geisendorfer (felix@debuggable.com)",
                "Copyright (c) 2011 Troy Goode <troygoode@gmail.com>",
                "Copyright (c) 2011 by Beau Gunderson",
                "Copyright (c) 2011 by Charlie McConnell",
                "Copyright (c) 2011 by antimatter15 (antimatter15@gmail.com)",
                "Copyright (c) 2011, Yahoo Inc.",
                "Copyright (c) 2011-2012 Ariya Hidayat <ariya.hidayat@gmail.com>",
                "Copyright (c) 2011-2012 Tim Caswell",
                "Copyright (c) 2011-2013 Bermi Ferrer <bermi@bermilabs.com>",
                "Copyright (c) 2011-2013 Jake Luer <jake@alogicalparadox.com>",
                "Copyright (c) 2011-2013 Jake Luer jake@alogicalparadox.com",
                "Copyright (c) 2011-2014 Jake Luer <jake@alogicalparadox.com>",
                "Copyright (c) 2011-2014 TJ Holowaychuk",
                "Copyright (c) 2011-2014, Walmart",
                "Copyright (c) 2011-2015 Paul Vorbach (http://paul.vorba.ch/) and contributors (https://github.com/pvorb/node-clone/graphs/contributors)",
                "Copyright (c) 2011-2015 Paul Vorbach <paul@vorba.ch>",
                "Copyright (c) 2011-2015 by Vitaly Puzrin",
                "Copyright (c) 2011-2016 Heather Arthur <fayearthur@gmail.com>",
                "Copyright (c) 2011-2016 Jake Luer <jake@alogicalparadox.com>",
                "Copyright (c) 2011-2016, Heather Arthur and Josh Junon",
                "Copyright (c) 2011-2017 Almende B.V, http://almende.com",
                "Copyright (c) 2011-2017 JP Richardson",
                "Copyright (c) 2011-2017 JP Richardson (https://github.com/jprichardson)",
                "Copyright (c) 2011-2017 KARASZI Istvan <github@spam.raszi.hu>",
                "Copyright (c) 2011-2018 Rodolphe Stoclin",
                "Copyright (c) 2011-2019 by Yehuda Katz",
                "Copyright (c) 2011-2020, Sideway Inc, and project contributors",
                "Copyright (c) 2011-2022 Isaac Z. Schlueter and Contributors",
                "Copyright (c) 2011-2022 Isaac Z. Schlueter, Ben Noordhuis, and Contributors",
                "Copyright (c) 2011-2022 Isaac Z. Schlueter, Ben Noordhuis, and Contributors https://github.com/isaacs/node-graceful-fs/blob/main/LICENSE On Windows",
                "Copyright (c) 2011-2022 OpenJS Foundation and contributors, https://openjsf.org",
                "Copyright (c) 2011-2023 Isaac Z. Schlueter and Contributors",
                "Copyright (c) 2011-2023 James Halliday (mail@substack.net) and Isaac Z. Schlueter (i@izs.me)",
                "Copyright (c) 2012 - 2013 Near Infinity Corporation",
                "Copyright (c) 2012 - 2015 fengmk2 <fengmk2@gmail.com>",
                "Copyright (c) 2012 Ariya Hidayat <ariya.hidayat@gmail.com>",
                "Copyright (c) 2012 Arpad Borsos <arpad.borsos@googlemail.com>",
                "Copyright (c) 2012 Barnesandnoble.com, llc, Donavon West, and Domenic Denicola",
                "Copyright (c) 2012 Dominic Tarr",
                "Copyright (c) 2012 EditorConfig Team",
                "Copyright (c) 2012 Federico Romero",
                "Copyright (c) 2012 Felix Geisendorfer (felix@debuggable.com) and contributors",
                "Copyright (c) 2012 Google Inc.",
                "Copyright (c) 2012 Heather Arthur",
                "Copyright (c) 2012 IndigoUnited",
                "Copyright (c) 2012 Isaac Z. Schlueter",
                "Copyright (c) 2012 J. Ryan Stinnett <jryans@gmail.com>",
                "Copyright (c) 2012 James Halliday",
                "Copyright (c) 2012 James Halliday <mail@substack.net>",
                "Copyright (c) 2012 James Halliday, Josh Duff, and other contributors",
                "Copyright (c) 2012 John Freeman <jfreeman08@gmail.com>",
                "Copyright (c) 2012 Joost-Wim Boekesteijn <joost-wim@boekesteijn.nl>",
                "Copyright (c) 2012 Kris Kowal <kris.kowal@cixar.com>",
                "Copyright (c) 2012 Kuba Niegowski",
                "Copyright (c) 2012 Mark Cavage",
                "Copyright (c) 2012 Mathias Bynens <mathias@qiwi.be>",
                "Copyright (c) 2012 Nathan Rajlich <nathan@tootallnate.net>",
                "Copyright (c) 2012 ProxV, Inc.",
                "Copyright (c) 2012 Raynos",
                "Copyright (c) 2012 Robert Gust-Bardon <donate@robert.gust-bardon.org>",
                "Copyright (c) 2012 Robert Kieffer",
                "Copyright (c) 2012 Simon Boudrias",
                "Copyright (c) 2012 TJ Holowaychuk <tj@vision-media.ca>",
                "Copyright (c) 2012 Tim Caswell",
                "Copyright (c) 2012 Vitaly Puzrin (https://github.com/puzrin)",
                "Copyright (c) 2012 Yusuke Suzuki (http://github.com/Constellation) (twitter Constellation (http://twitter.com/Constellation)) and other contributors",
                "Copyright (c) 2012 Yusuke Suzuki (twitter Constellation) and other contributors",
                "Copyright (c) 2012 Yusuke Suzuki <utatane.tea@gmail.com>",
                "Copyright (c) 2012 by Jun Woong",
                "Copyright (c) 2012 by Marcel Klehr <mklehr@gmx.net>",
                "Copyright (c) 2012 by Vitaly Puzrin",
                "Copyright (c) 2012, 2011 Ariya Hidayat (http://ariya.ofilabs.com/about) (twitter ariyahidayat (http://twitter.com/ariyahidayat)) and other contributors",
                "Copyright (c) 2012, 2013 Thorsten Lorenz <thlorenz@gmx.de>",
                "Copyright (c) 2012, 2013, 2014, 2015, 2016, 2017, 2018, 2019 Phil Booth",
                "Copyright (c) 2012, Chris Andrews",
                "Copyright (c) 2012, Joshua Bell",
                "Copyright (c) 2012, Joyent, Inc.",
                "Copyright (c) 2012, Mark Cavage",
                "Copyright (c) 2012, Yahoo! Inc.",
                "Copyright (c) 2012-2013 Corey Hart",
                "Copyright (c) 2012-2013 Jake Luer <jake@alogicalparadox.com>",
                "Copyright (c) 2012-2013 Mathias Bynens <mathias@qiwi.be>",
                "Copyright (c) 2012-2013 Michael Ficarra <escodegen.copyright@michael.ficarra.me>",
                "Copyright (c) 2012-2013 TJ Holowaychuk",
                "Copyright (c) 2012-2013 Yusuke Suzuki (twitter Constellation) and other contributors",
                "Copyright (c) 2012-2013 Yusuke Suzuki <utatane.tea@gmail.com>",
                "Copyright (c) 2012-2013, Christopher Jeffrey (MIT License) https://github.com/chjj/term.js",
                "Copyright (c) 2012-2014 Andris Reinman",
                "Copyright (c) 2012-2014 Chris Talkington",
                "Copyright (c) 2012-2014 Federico Romero",
                "Copyright (c) 2012-2014 Isaac Z. Schlueter",
                "Copyright (c) 2012-2014 Jake Luer <jake@alogicalparadox.com>",
                "Copyright (c) 2012-2014 Jeffrey Mealo",
                "Copyright (c) 2012-2014 Raynos",
                "Copyright (c) 2012-2014 Roman Shtylman",
                "Copyright (c) 2012-2014 Roman Shtylman <shtylman@gmail.com>",
                "Copyright (c) 2012-2014 TJ Holowaychuk",
                "Copyright (c) 2012-2014 TJ Holowaychuk <tj@vision-media.ca>",
                "Copyright (c) 2012-2014 Yusuke Suzuki <utatane.tea@gmail.com>",
                "Copyright (c) 2012-2014 by Woong Jun and Tim Oxley",
                "Copyright (c) 2012-2014 by various contributors",
                "Copyright (c) 2012-2014, Walmart",
                "Copyright (c) 2012-2015 Lauri Rooden <lauri@rooden.ee>",
                "Copyright (c) 2012-2015 Rod Vagg (https://github.com/rvagg) ( rvagg (https://twitter.com/rvagg))",
                "Copyright (c) 2012-2015 Sakthipriyan Vairamani <thechargingvolcano@gmail.com>",
                "Copyright (c) 2012-2015, JP Richardson <jprichardson@gmail.com>",
                "Copyright (c) 2012-2016 Jake Luer <jake@alogicalparadox.com>",
                "Copyright (c) 2012-2016 Yusuke Suzuki (http://github.com/Constellation) (twitter Constellation (http://twitter.com/Constellation)) and other contributors",
                "Copyright (c) 2012-2017 by Ingvar Stepanyan",
                "Copyright (c) 2012-2018 Aseem Kishore, and others",
                "Copyright (c) 2012-2018 by various contributors",
                "Copyright (c) 2012-2019 Paul Miller (https://paulmillr.com), Elan Shanker",
                "Copyright (c) 2012-2019 Thorsten Lorenz, Paul Miller (https://paulmillr.com)",
                "Copyright (c) 2012-2019 Thorsten Lorenz, Paul Miller <https://paulmillr.com>",
                "Copyright (c) 2012-2020 by various contributors",
                "Copyright (c) 2012-2020, Sideway Inc, and project contributors",
                "Copyright (c) 2012-2021 Faisal Salman",
                "Copyright (c) 2012-2021 Faisal Salman <f@faisalman.com>",
                "Copyright (c) 2012-2022 by various contributors",
                "Copyright (c) 2012-2022, Project contributors",
                "Copyright (c) 2012-2022, Sideway. Inc.",
                "Copyright (c) 2012-2023 Faisal Salman",
                "Copyright (c) 2012-2023, Markus Ekholm",
                "Copyright (c) 2013 Alex Seville <hi@alexanderseville.com>",
                "Copyright (c) 2013 Alexey Kuzmin (http://github.com/alexeykuzmin)",
                "Copyright (c) 2013 Andrew Plummer http://sugarjs.com",
                "Copyright (c) 2013 Andrey Sitnik <andrey@sitnik.ru>",
                "Copyright (c) 2013 Arnout Kazemier and contributors",
                "Copyright (c) 2013 Bart van der Schoor",
                "Copyright (c) 2013 Ben Newman <bn@cs.stanford.edu>",
                "Copyright (c) 2013 Benbria",
                "Copyright (c) 2013 Braveg1rl",
                "Copyright (c) 2013 Brian J. Brennan",
                "Copyright (c) 2013 Cowboy Ben Alman",
                "Copyright (c) 2013 Dominic Tarr",
                "Copyright (c) 2013 Edmond Meinfelder",
                "Copyright (c) 2013 Forbes Lindesay",
                "Copyright (c) 2013 Gary Court, Jens Taylor",
                "Copyright (c) 2013 Google Inc.",
                "Copyright (c) 2013 Irakli Gozalishvili <rfobic@gmail.com>",
                "Copyright (c) 2013 J. Pommerening",
                "Copyright (c) 2013 Jake Luer <jake@alogicalparadox.com>",
                "Copyright (c) 2013 Jake Luer <jake@alogicalparadox.com> (http://alogicalparadox.com)",
                "Copyright (c) 2013 Jake Luer <jake@qualiancy.com>",
                "Copyright (c) 2013 Jake Luer <jake@qualiancy.com> (http://qualiancy.com)",
                "Copyright (c) 2013 Jake Luer jake@qualiancy.com (http://qualiancy.com)",
                "Copyright (c) 2013 James Halliday",
                "Copyright (c) 2013 James Halliday (mail@substack.net)",
                "Copyright (c) 2013 Jonathan Ong",
                "Copyright (c) 2013 Jonathan Ong <me@jongleberry.com>",
                "Copyright (c) 2013 Jordan Harband",
                "Copyright (c) 2013 Josh Chisholm",
                "Copyright (c) 2013 Josh Glazebrook",
                "Copyright (c) 2013 Joyent Inc.",
                "Copyright (c) 2013 Julian Gruber <julian@juliangruber.com>",
                "Copyright (c) 2013 Kael Zhang <i@kael.me> , contributors http://kael.me",
                "Copyright (c) 2013 Liucw",
                "Copyright (c) 2013 Manuel Stofer",
                "Copyright (c) 2013 Matt McKegg",
                "Copyright (c) 2013 Max Ogden",
                "Copyright (c) 2013 Meryn Stol",
                "Copyright (c) 2013 Mikola Lysenko",
                "Copyright (c) 2013 Nathan Rajlich <nathan@tootallnate.net>",
                "Copyright (c) 2013 Oleg Nechiporenko",
                "Copyright (c) 2013 Ozgur Ozcitak",
                "Copyright (c) 2013 Ramesh Nair (http://www.hiddentao.com/)",
                "Copyright (c) 2013 Raynos",
                "Copyright (c) 2013 Rod Vagg rvagg (https://twitter.com/rvagg)",
                "Copyright (c) 2013 Roman Shtylman <shtylman@gmail.com>",
                "Copyright (c) 2013 Ruben Verborgh",
                "Copyright (c) 2013 Sam",
                "Copyright (c) 2013 Sam Decrock <sam.decrock@gmail.com>",
                "Copyright (c) 2013 Sam Decrock https://github.com/SamDecrock",
                "Copyright (c) 2013 Ted Unangst <tedu@openbsd.org>",
                "Copyright (c) 2013 Thiago de Arruda",
                "Copyright (c) 2013 Tim Griesser",
                "Copyright (c) 2013 Tim Perry",
                "Copyright (c) 2013 Trent Mick",
                "Copyright (c) 2013 Troy Goode <troygoode@gmail.com>",
                "Copyright (c) 2013 Yusuke Suzuki (http://github.com/Constellation) (twitter Constellation (http://twitter.com/Constellation)) and other contributors",
                "Copyright (c) 2013 Yusuke Suzuki <utatane.tea@gmail.com>",
                "Copyright (c) 2013 hij1nx",
                "Copyright (c) 2013 jake luer <jake@alogicalparadox.com>",
                "Copyright (c) 2013 jut-io",
                "Copyright (c) 2013, Deoxxa Development",
                "Copyright (c) 2013, Dominic Tarr",
                "Copyright (c) 2013, Facebook, Inc.",
                "Copyright (c) 2013, Joel Feenstra",
                "Copyright (c) 2013, Josh Chisholm",
                "Copyright (c) 2013,2014 Edmond Meinfelder",
                "Copyright (c) 2013,2014 Edmond Meinfelder <edmond@stdarg.com>",
                "Copyright (c) 2013-2014 Jonathan Ong",
                "Copyright (c) 2013-2014 Jonathan Ong <me@jongleberry.com>",
                "Copyright (c) 2013-2014 Yusuke Suzuki <utatane.tea@gmail.com>",
                "Copyright (c) 2013-2014, 2016, 2018, 2023 Linus Unneback",
                "Copyright (c) 2013-2015 Petka Antonov",
                "Copyright (c) 2013-2015 Roman Shtylman <shtylman@gmail.com>",
                "Copyright (c) 2013-2016 Petka Antonov",
                "Copyright (c) 2013-2017 Jared Hanson",
                "Copyright (c) 2013-2017 Josh Glazebrook",
                "Copyright (c) 2013-2017 Petka Antonov",
                "Copyright (c) 2013-2018 Erik Doernenburg and contributors",
                "Copyright (c) 2013-2018 Petka Antonov",
                "Copyright (c) 2013-2018 Viacheslav Lotsmanov",
                "Copyright (c) 2013-2018 sha.js contributors",
                "Copyright (c) 2013-2018, Viacheslav Lotsmanov",
                "Copyright (c) 2013-2019 Ivan Nikulin (ifaaan@gmail.com, https://github.com/inikulin)",
                "Copyright (c) 2013-2019 Petka Antonov",
                "Copyright (c) 2013-2019 bl contributors",
                "Copyright (c) 2013-2021 Jakub Szwacz",
                "Copyright (c) 2014 Alex Bell",
                "Copyright (c) 2014 Andres Suarez",
                "Copyright (c) 2014 Andrew Kelley",
                "Copyright (c) 2014 Arnout Kazemier",
                "Copyright (c) 2014 Blake Embrey (hello@blakeembrey.com)",
                "Copyright (c) 2014 Chris Talkington",
                "Copyright (c) 2014 Christian Bromann",
                "Copyright (c) 2014 Daniel Cousens",
                "Copyright (c) 2014 Dave Justice",
                "Copyright (c) 2014 Douglas Christopher Wilson",
                "Copyright (c) 2014 Douglas Christopher Wilson <doug@somethingdoug.com>",
                "Copyright (c) 2014 Drew Young",
                "Copyright (c) 2014 Erik Doernenburg",
                "Copyright (c) 2014 Erik Doernenburg and contributors",
                "Copyright (c) 2014 Evan Wallace",
                "Copyright (c) 2014 Federico Romero",
                "Copyright (c) 2014 Forbes Lindesay",
                "Copyright (c) 2014 Gabriel Llamas",
                "Copyright (c) 2014 Gleb Bahmutov",
                "Copyright (c) 2014 Google Inc.",
                "Copyright (c) 2014 Gregg Caines",
                "Copyright (c) 2014 IndigoUnited",
                "Copyright (c) 2014 Ivan Nikulin <ifaaan@gmail.com>",
                "Copyright (c) 2014 James Talmage <james.talmage@jrtechnical.com>",
                "Copyright (c) 2014 Jameson Little",
                "Copyright (c) 2014 Jason Quense",
                "Copyright (c) 2014 Jeremie Miller",
                "Copyright (c) 2014 Joe Blau <josephblau@gmail.com>",
                "Copyright (c) 2014 Johannes Plunien",
                "Copyright (c) 2014 Jon Schlinkert",
                "Copyright (c) 2014 Jonathan Ong",
                "Copyright (c) 2014 Jonathan Ong <me@jongleberry.com>",
                "Copyright (c) 2014 Jonathan Ong me@jongleberry.com",
                "Copyright (c) 2014 Jordan Harband",
                "Copyright (c) 2014 Josh Wolfe",
                "Copyright (c) 2014 KARASZI Istvan",
                "Copyright (c) 2014 Kensho",
                "Copyright (c) 2014 Kyle Robinson Young",
                "Copyright (c) 2014 LevelUP",
                "Copyright (c) 2014 Liu Yang zation1@gmail.com",
                "Copyright (c) 2014 Mario Kozjak, kozjakm1@gmail.com",
                "Copyright (c) 2014 Mathias Buus",
                "Copyright (c) 2014 Matt Lavin <matt.lavin@gmail.com>",
                "Copyright (c) 2014 Max Ogden and other contributors",
                "Copyright (c) 2014 Maxime Thirouin, Jason Campbell & Kevin Martensson",
                "Copyright (c) 2014 Mulle Kybernetik",
                "Copyright (c) 2014 Nathan Rajlich <nathan@tootallnate.net>",
                "Copyright (c) 2014 Permission",
                "Copyright (c) 2014 Petka Antonov",
                "Copyright (c) 2014 Petka Antonov 2015 Sindre Sorhus",
                "Copyright (c) 2014 Robert Kieffer",
                "Copyright (c) 2014 Rod Vagg",
                "Copyright (c) 2014 Rod Vagg rvagg (https://twitter.com/rvagg)",
                "Copyright (c) 2014 Sergii Iavorskyi",
                "Copyright (c) 2014 Simon Boudrias",
                "Copyright (c) 2014 Stefan Thomas",
                "Copyright (c) 2014 TJ Holowaychuk <tj@vision-media.ca>",
                "Copyright (c) 2014 Taylor Hakes",
                "Copyright (c) 2014 The xterm.js authors",
                "Copyright (c) 2014 Thiago de Arruda <tpadilha84@gmail.com>",
                "Copyright (c) 2014 YANDEX LLC",
                "Copyright (c) 2014 Yehuda Katz and contributors",
                "Copyright (c) 2014 Yusuke Suzuki (https://github.com/Constellation) (twitter Constellation (https://twitter.com/Constellation)) and other contributors",
                "Copyright (c) 2014 Yusuke Suzuki <utatane.tea@gmail.com>",
                "Copyright (c) 2014 conopsys",
                "Copyright (c) 2014 object-hash contributors",
                "Copyright (c) 2014, 2015, 2016, 2017, 2018 Simon Lydell",
                "Copyright (c) 2014, 2015, 2016, 2017, 2018, 2019, 2020, 2021, 2022, 2023, 2024 Simon Lydell",
                "Copyright (c) 2014, Domenic Denicola",
                "Copyright (c) 2014, Eugene Ware",
                "Copyright (c) 2014, Hugh Kennedy",
                "Copyright (c) 2014, Josh Chisholm",
                "Copyright (c) 2014, Naitik Shah",
                "Copyright (c) 2014, Nathan LaFreniere and other contributors (https://github.com/ljharb/qs/graphs/contributors)",
                "Copyright (c) 2014, Yahoo! Inc.",
                "Copyright (c) 2014-2015 Calvin Metcalf and browserify-sign contributors",
                "Copyright (c) 2014-2015 Douglas Christopher Wilson",
                "Copyright (c) 2014-2015 Jon Schlinkert",
                "Copyright (c) 2014-2015, Jon Schlinkert",
                "Copyright (c) 2014-2016 Calvin Metcalf & contributors",
                "Copyright (c) 2014-2016 Douglas Christopher Wilson",
                "Copyright (c) 2014-2016 Erik Doernenburg and contributors",
                "Copyright (c) 2014-2016 Jonathan Ong me@jongleberry.com and Contributors",
                "Copyright (c) 2014-2016 Jonathan Ong me@jongleberry.com and contributors",
                "Copyright (c) 2014-2016 Kevin Beaty",
                "Copyright (c) 2014-2016 TJ Holowaychuk <tj@vision-media.ca>",
                "Copyright (c) 2014-2016 Zoltan Frombach",
                "Copyright (c) 2014-2016 by Vitaly Puzrin",
                "Copyright (c) 2014-2016, Jon Schlinkert",
                "Copyright (c) 2014-2017 Calvin Metcalf & contributors",
                "Copyright (c) 2014-2017 Calvin Metcalf, Fedor Indutny & contributors",
                "Copyright (c) 2014-2017 Debitoor (https://debitoor.com/)",
                "Copyright (c) 2014-2017 Douglas Christopher Wilson",
                "Copyright (c) 2014-2017 Douglas Christopher Wilson <doug@somethingdoug.com>",
                "Copyright (c) 2014-2017 TJ Holowaychuk <tj@vision-media.ca>",
                "Copyright (c) 2014-2017 browserify-aes contributors",
                "Copyright (c) 2014-2017 createECDH contributors",
                "Copyright (c) 2014-2017, Jon Schlinkert",
                "Copyright (c) 2014-2018 Douglas Christopher Wilson",
                "Copyright (c) 2014-2018 Erik Doernenburg and contributors",
                "Copyright (c) 2014-2018 Suguru Motegi",
                "Copyright (c) 2014-2018, Jon Schlinkert",
                "Copyright (c) 2014-2018, Matteo Collina <hello@matteocollina.com>",
                "Copyright (c) 2014-2019 Pivotal Labs",
                "Copyright (c) 2014-2020 Teambition",
                "Copyright (c) 2014-2021, Matteo Collina <hello@matteocollina.com>",
                "Copyright (c) 2014-2022 Douglas Christopher Wilson",
                "Copyright (c) 2014-2022 Douglas Christopher Wilson <doug@somethingdoug.com>",
                "Copyright (c) 2014-2022 Jos de Jong <wjosdejong@gmail.com>",
                "Copyright (c) 2014-2022 Patrik Simek and contributors",
                "Copyright (c) 2014-2023, Jon Schlinkert",
                "Copyright (c) 2014-present Matt Zabriskie",
                "Copyright (c) 2014-present Matt Zabriskie & Collaborators",
                "Copyright (c) 2014-present Sebastian McKenzie and other contributors",
                "Copyright (c) 2014-present SheetJS LLC",
                "Copyright (c) 2014-present, Facebook, Inc.",
                "Copyright (c) 2014-present, Jon Schlinkert",
                "Copyright (c) 2015 Alexey Litvinov",
                "Copyright (c) 2015 Andreas Lubbe",
                "Copyright (c) 2015 Ben Mosher",
                "Copyright (c) 2015 Benbria",
                "Copyright (c) 2015 Brian Donovan",
                "Copyright (c) 2015 Calvin Metcalf",
                "Copyright (c) 2015 Chen Gengyuan, Inspect JS",
                "Copyright (c) 2015 Chris Talkington",
                "Copyright (c) 2015 Cypress.io, LLC",
                "Copyright (c) 2015 Daniel Cousens",
                "Copyright (c) 2015 DavertMik <davert@codegyre.com> (http://codegyre.com)",
                "Copyright (c) 2015 Desmond Brand (dmnd@desmondbrand.com)",
                "Copyright (c) 2015 Dmitry Ivanov",
                "Copyright (c) 2015 Douglas Christopher Wilson",
                "Copyright (c) 2015 Douglas Christopher Wilson <doug@somethingdoug.com>",
                "Copyright (c) 2015 EcmaScript Shims",
                "Copyright (c) 2015 Elijah Insua",
                "Copyright (c) 2015 Erik Doernenburg",
                "Copyright (c) 2015 Ingvar Stepanyan <me@rreverser.com>",
                "Copyright (c) 2015 JD Ballard",
                "Copyright (c) 2015 Javier Blanco",
                "Copyright (c) 2015 Jed Watson",
                "Copyright (c) 2015 Jed Watson <jed.watson@me.com>",
                "Copyright (c) 2015 Johannes Plunien",
                "Copyright (c) 2015 John Hiesey",
                "Copyright (c) 2015 Jon Schlinkert",
                "Copyright (c) 2015 Jon Schlinkert (https://github.com/jonschlinkert)",
                "Copyright (c) 2015 Jordan Harband",
                "Copyright (c) 2015 Joris van der Wel",
                "Copyright (c) 2015 Jose F. Romaniello",
                "Copyright (c) 2015 Josh Junon",
                "Copyright (c) 2015 Kyle E. Mitchell",
                "Copyright (c) 2015 Luke Page & Original Contributors",
                "Copyright (c) 2015 Mathias Buus",
                "Copyright (c) 2015 Matteo Collina",
                "Copyright (c) 2015 Nathan Friedly <nathan@nfriedly.com> (http://nfriedly.com/)",
                "Copyright (c) 2015 Nicolas Bevacqua",
                "Copyright (c) 2015 Orlin Georgiev",
                "Copyright (c) 2015 Petka Antonov",
                "Copyright (c) 2015 Rich Harris",
                "Copyright (c) 2015 Rod Vagg",
                "Copyright (c) 2015 Rod Vagg rvagg (https://twitter.com/rvagg)",
                "Copyright (c) 2015 Roy Riojas",
                "Copyright (c) 2015 Sarosia",
                "Copyright (c) 2015 Stanley Ng",
                "Copyright (c) 2015 Tiancheng Timothy Gu",
                "Copyright (c) 2015 Tilde, Inc.",
                "Copyright (c) 2015 Titus Wormer",
                "Copyright (c) 2015 Titus Wormer <tituswormer@gmail.com>",
                "Copyright (c) 2015 Toru Nagashima",
                "Copyright (c) 2015 Unshift.io, Arnout Kazemier",
                "Copyright (c) 2015 YANDEX LLC",
                "Copyright (c) 2015 Yusuke Suzuki <utatane.tea@gmail.com>",
                "Copyright (c) 2015, 2019 Elan Shanker",
                "Copyright (c) 2015, 2019 Elan Shanker, 2021 Blaine Bublitz <blaine.bublitz@gmail.com> , Eric Schoffstall <yo@contra.io> and other contributors",
                "Copyright (c) 2015, Ahmad Nassri <ahmad@ahmadnassri.com>",
                "Copyright (c) 2015, Contributors",
                "Copyright (c) 2015, David Bonnet <david@bonnet.cc>",
                "Copyright (c) 2015, Glen Maddern",
                "Copyright (c) 2015, Ilya Radchenko <ilya@burstcreations.com>",
                "Copyright (c) 2015, Jon Schlinkert",
                "Copyright (c) 2015, Rebecca Turner",
                "Copyright (c) 2015, Salesforce.com, Inc.",
                "Copyright (c) 2015, Scott Motte",
                "Copyright (c) 2015, Wes Todd",
                "Copyright (c) 2015-20 these people (https://github.com/Rich-Harris/estree-walker/graphs/contributors)",
                "Copyright (c) 2015-2016 Sebastian Mayr",
                "Copyright (c) 2015-2016, Jon Schlinkert",
                "Copyright (c) 2015-2017 Charles Samborski",
                "Copyright (c) 2015-2017 Evgeny Poberezkin",
                "Copyright (c) 2015-2018 Erik Doernenburg and contributors",
                "Copyright (c) 2015-2018 Google, Inc., Netflix, Inc., Microsoft Corp. and contributors",
                "Copyright (c) 2015-2020 TypeStack",
                "Copyright (c) 2015-2020, Matteo Collina <matteo.collina@gmail.com>",
                "Copyright (c) 2015-2020, Salesforce.com, Inc.",
                "Copyright (c) 2015-2021 Andi Dittrich",
                "Copyright (c) 2015-2021 Ole Michelsen",
                "Copyright (c) 2015-2022 Douglas Christopher Wilson",
                "Copyright (c) 2015-2022 Douglas Christopher Wilson <doug@somethingdoug.com>",
                "Copyright (c) 2015-2023 Benjamin Coe, Isaac Z. Schlueter, and Contributors",
                "Copyright (c) 2015-2023 Isaac Z. Schlueter and Contributors",
                "Copyright (c) 2015-present, Brian Woodward",
                "Copyright (c) 2015-present, Facebook, Inc.",
                "Copyright (c) 2015-present, Facebook, Inc. https://github.com/facebook/create-react-app/blob/master/LICENSE",
                "Copyright (c) 2015-present, Jon Schlinkert",
                "Copyright (c) 2015-present, Parse, LLC.",
                "Copyright (c) 2016 - 2020 Node Fetch Team",
                "Copyright (c) 2016 Alex Indigo",
                "Copyright (c) 2016 Andrey Okonetchnikov",
                "Copyright (c) 2016 Antoine Bluchet <soyuka@gmail.com>",
                "Copyright (c) 2016 Ben Noordhuis <info@bnoordhuis.nl>",
                "Copyright (c) 2016 Brian Terlson",
                "Copyright (c) 2016 Charlie Rudolph",
                "Copyright (c) 2016 CoderPuppy",
                "Copyright (c) 2016 David Frank",
                "Copyright (c) 2016 David Mark Clements",
                "Copyright (c) 2016 Denys Kniazevych <webschik@gmail.com>",
                "Copyright (c) 2016 Diwank Singh Tomer",
                "Copyright (c) 2016 Douglas Christopher Wilson",
                "Copyright (c) 2016 Douglas Christopher Wilson <doug@somethingdoug.com>",
                "Copyright (c) 2016 Douglas Christopher Wilson doug@somethingdoug.com",
                "Copyright (c) 2016 James M. Greene",
                "Copyright (c) 2016 Jimmy Karl Roland Warting",
                "Copyright (c) 2016 John Hiesey",
                "Copyright (c) 2016 John McLaughlin",
                "Copyright (c) 2016 Jonas Kello",
                "Copyright (c) 2016 Jordan Gensler",
                "Copyright (c) 2016 Jordan Harband",
                "Copyright (c) 2016 Jorik Tangelder",
                "Copyright (c) 2016 Joshua Holbrook",
                "Copyright (c) 2016 Kevin Gravier",
                "Copyright (c) 2016 Kirill Fomichev",
                "Copyright (c) 2016 Luigi Pinca and contributors",
                "Copyright (c) 2016 Lukas Geiger",
                "Copyright (c) 2016 Mael Nison",
                "Copyright (c) 2016 Mathias Buus",
                "Copyright (c) 2016 Oliver Nightingale",
                "Copyright (c) 2016 Paolo Fragomeni <http://www.github.com/0x00a> and Contributors",
                "Copyright (c) 2016 Pat Sissons <patricksissons@gmail.com>",
                "Copyright (c) 2016 Rene Saarsoo",
                "Copyright (c) 2016 Simon Boudrias (twitter vaxilart (https://twitter.com/Vaxilart))",
                "Copyright (c) 2016 Thomas Watson Steen",
                "Copyright (c) 2016 Titus Wormer <tituswormer@gmail.com>",
                "Copyright (c) 2016 Wei Song",
                "Copyright (c) 2016 William Blankenship",
                "Copyright (c) 2016 Wix",
                "Copyright (c) 2016 YANDEX LLC",
                "Copyright (c) 2016 Zeit, Inc.",
                "Copyright (c) 2016 angus croll",
                "Copyright (c) 2016 conopsys",
                "Copyright (c) 2016 crypto-browserify",
                "Copyright (c) 2016 unional",
                "Copyright (c) 2016, 2018 Linus Unneback",
                "Copyright (c) 2016, Contributors",
                "Copyright (c) 2016, Istanbul Code Coverage",
                "Copyright (c) 2016, James M. Greene",
                "Copyright (c) 2016, Jon Schlinkert (http://github.com/jonschlinkert)",
                "Copyright (c) 2016, Jon Schlinkert (https://github.com/jonschlinkert)",
                "Copyright (c) 2016, Joyent, Inc.",
                "Copyright (c) 2016, Mark Wubben",
                "Copyright (c) 2016, Rebecca Turner <me@re-becca.org>",
                "Copyright (c) 2016, Scott Motte",
                "Copyright (c) 2016, Weo.io <info@weo.io>",
                "Copyright (c) 2016-2017 Thomas Watson Steen",
                "Copyright (c) 2016-2018 Ari Porad",
                "Copyright (c) 2016-2018 Kevin Gravier",
                "Copyright (c) 2016-2018 Permission",
                "Copyright (c) 2016-2018 Rob Wu <rob@robwu.nl>",
                "Copyright (c) 2016-2018, James M. Greene",
                "Copyright (c) 2016-2021 Thomas Watson Steen",
                "Copyright (c) 2016-2022 Isaac Z. Schlueter <i@izs.me> , James Talmage <james@talmage.io> (github.com/jamestalmage), and Contributors",
                "Copyright (c) 2016-2022 Isaac Z. Schlueter and Contributors",
                "Copyright (c) 2016-2023 Thomas Watson Steen",
                "Copyright (c) 2016-present, Charlike Mike Reagent (https://tunnckocore.com) <opensource@tunnckocore.com> & contributors",
                "Copyright (c) 2016-present, Facebook, Inc.",
                "Copyright (c) 2016-present, Jon Schlinkert",
                "Copyright (c) 2017 - present Saugat Acharya",
                "Copyright (c) 2017 Andrew Powell <andrew@shellscape.org>",
                "Copyright (c) 2017 Apple Inc.",
                "Copyright (c) 2017 Braveg1rl",
                "Copyright (c) 2017 Calvin Metcalf",
                "Copyright (c) 2017 Chai.js Assertion Library",
                "Copyright (c) 2017 Dave Kerr",
                "Copyright (c) 2017 David Mark Clements & Matteo Collina",
                "Copyright (c) 2017 Dmitry Soshnikov",
                "Copyright (c) 2017 ECMAScript Shims",
                "Copyright (c) 2017 Eric Wendelin and other contributors",
                "Copyright (c) 2017 Esa-Matti Suuronen and Thomas Grainger",
                "Copyright (c) 2017 Evgeniy Pavlov",
                "Copyright (c) 2017 Evgeny Poberezkin",
                "Copyright (c) 2017 Fedor Indutny",
                "Copyright (c) 2017 Gustaf Andersson",
                "Copyright (c) 2017 Hunter Loftis <hunter@hunterloftis.com>",
                "Copyright (c) 2017 JakubPawlowicz.com",
                "Copyright (c) 2017 Khaled Al-Ansari",
                "Copyright (c) 2017 Larry Bahr",
                "Copyright (c) 2017 Leonardo Quixada",
                "Copyright (c) 2017 Luke Childs",
                "Copyright (c) 2017 Lupo Montero <lupomontero@gmail.com>",
                "Copyright (c) 2017 Lupo Montero lupomontero@gmail.com",
                "Copyright (c) 2017 Made With MOXY Lda",
                "Copyright (c) 2017 Martin Munoz and contributors",
                "Copyright (c) 2017 Node.js",
                "Copyright (c) 2017 Permission",
                "Copyright (c) 2017 Sam Decrock <sam.decrock@gmail.com>",
                "Copyright (c) 2017 Samuel Reed <samuel.trace.reed@gmail.com>",
                "Copyright (c) 2017 Sergey Rubanov (https://github.com/chicoxyzzy)",
                "Copyright (c) 2017 Stanley Ng",
                "Copyright (c) 2017 TJ Holowaychuk <tj@vision-media.ca>",
                "Copyright (c) 2017 Titus Wormer <tituswormer@gmail.com>",
                "Copyright (c) 2017 Wix",
                "Copyright (c) 2017 Wix.com",
                "Copyright (c) 2017 Xianshun Chen",
                "Copyright (c) 2017 by Jan Boelsche (jan@lagomorph.de)",
                "Copyright (c) 2017 by Marijn Haverbeke <marijn@haverbeke.berlin> and others",
                "Copyright (c) 2017 crypto-browserify",
                "Copyright (c) 2017 crypto-browserify contributors",
                "Copyright (c) 2017 these people (https://github.com/rollup/rollup/graphs/contributors)",
                "Copyright (c) 2017, 2018, 2019, 2020, 2021, 2022, 2023 Simon Lydell and contributors",
                "Copyright (c) 2017, Contributors",
                "Copyright (c) 2017, Emil Bay <github@tixz.dk>",
                "Copyright (c) 2017, Jon Schlinkert (https://github.com/jonschlinkert)",
                "Copyright (c) 2017, Joyent, Inc.",
                "Copyright (c) 2017, Ryan Zimmerman <opensrc@ryanzim.com>",
                "Copyright (c) 2017, crypto-browserify contributors",
                "Copyright (c) 2017-2018 by Adrian Heine",
                "Copyright (c) 2017-2019 Justin Ridgewell",
                "Copyright (c) 2017-2019 Zeit, Inc.",
                "Copyright (c) 2017-2019 by ZEIT, Inc.",
                "Copyright (c) 2017-2022 npm, Inc., Isaac Z. Schlueter, and Contributors",
                "Copyright (c) 2017-2023 Haydn Paterson",
                "Copyright (c) 2017-2023 npm, Inc., Isaac Z. Schlueter, and Contributors",
                "Copyright (c) 2017-present Dmitry Soshnikov <dmitry.soshnikov@gmail.com>",
                "Copyright (c) 2017-present by Andrea Giammarchi",
                "Copyright (c) 2017-present, Jon Schlinkert",
                "Copyright (c) 2017-present, Jon Schlinkert (https://github.com/jonschlinkert)",
                "Copyright (c) 2017-present, Yuxi",
                "Copyright (c) 2018 Ahmad Nassri <ahmad@ahmadnassri.com>",
                "Copyright (c) 2018 David Mark Clements, Matteo Collina & Ruben Bridgewater",
                "Copyright (c) 2018 Dmitry Shirokov",
                "Copyright (c) 2018 Ethan Davis",
                "Copyright (c) 2018 Huafu Gandon",
                "Copyright (c) 2018 Jordan Harband",
                "Copyright (c) 2018 Lars-Magnus Skog",
                "Copyright (c) 2018 Leo Natan",
                "Copyright (c) 2018 Made With MOXY Lda",
                "Copyright (c) 2018 Mathias Buus",
                "Copyright (c) 2018 NAN WG Members",
                "Copyright (c) 2018 NAN contributors",
                "Copyright (c) 2018 NAN contributors - Rod Vagg <https://github.com/rvagg>",
                "Copyright (c) 2018 Nicolas DUBIEN",
                "Copyright (c) 2018 Nikita Skovoroda <chalkerx@gmail.com>",
                "Copyright (c) 2018 Rodolphe Stoclin",
                "Copyright (c) 2018 Simone Primarosa",
                "Copyright (c) 2018 Szymon Marczak",
                "Copyright (c) 2018 Terkel Gjervig Nielsen",
                "Copyright (c) 2018 The Khronos Group Inc.",
                "Copyright (c) 2018 Tobias Reich",
                "Copyright (c) 2018 Toru Nagashima",
                "Copyright (c) 2018 Trevor Brindle",
                "Copyright (c) 2018 Triston Jones",
                "Copyright (c) 2018 WHATWG",
                "Copyright (c) 2018 Wix",
                "Copyright (c) 2018 inspiredware",
                "Copyright (c) 2018, Andrea Giammarchi",
                "Copyright (c) 2018, Gajus Kuizinas (http://gajus.com/)",
                "Copyright (c) 2018, Jon Schlinkert (https://github.com/jonschlinkert)",
                "Copyright (c) 2018, Salesforce.com, Inc.",
                "Copyright (c) 2018, Sinon.JS",
                "Copyright (c) 2018-2019 Testim.io",
                "Copyright (c) 2018-2020 Guy Bedford",
                "Copyright (c) 2018-2020, Andrea Giammarchi",
                "Copyright (c) 2018-2021 Josh Junon",
                "Copyright (c) 2018-2021, Andrea Giammarchi",
                "Copyright (c) 2018-2022 Guy Bedford",
                "Copyright (c) 2018-present Artem Zakharchenko",
                "Copyright (c) 2018-present, Jon Schlinkert (https://github.com/jonschlinkert)",
                "Copyright (c) 2018-present, iamkun",
                "Copyright (c) 2019 Andres Suarez",
                "Copyright (c) 2019 Baruch Velez",
                "Copyright (c) 2019 CFWare, LLC",
                "Copyright (c) 2019 Cypress.io",
                "Copyright (c) 2019 David Frank",
                "Copyright (c) 2019 Elan Shanker, Paul Miller (https://paulmillr.com)",
                "Copyright (c) 2019 Jed Mao",
                "Copyright (c) 2019 Jordan Harband",
                "Copyright (c) 2019 Mathias Buus",
                "Copyright (c) 2019 Mykola Grybyk",
                "Copyright (c) 2019 Patrick Juchli",
                "Copyright (c) 2019 Rich Harris",
                "Copyright (c) 2019 Richie Bendall",
                "Copyright (c) 2019 RollupJS",
                "Copyright (c) 2019 Simen Bekkhus",
                "Copyright (c) 2019 Sindre Sorhus <sindresorhus@gmail.com> (https://sindresorhus.com), Paul Miller (https://paulmillr.com)",
                "Copyright (c) 2019 Szymon Marczak",
                "Copyright (c) 2019 W3C and Jeff Carpenter jeffcarp@chromium.org",
                "Copyright (c) 2019 Wix",
                "Copyright (c) 2019 Yousaf Nabi",
                "Copyright (c) 2019 and later, KFlash and others",
                "Copyright (c) 2019 codecept.js",
                "Copyright (c) 2019 typescript-eslint and other contributors",
                "Copyright (c) 2019, Brian Woodward (https://github.com/doowb)",
                "Copyright (c) 2019, Contributors",
                "Copyright (c) 2019, Human Who Codes",
                "Copyright (c) 2019, Jon Schlinkert (https://github.com/jonschlinkert)",
                "Copyright (c) 2019, Mapbox",
                "Copyright (c) 2019, Udit Vasu",
                "Copyright (c) 2019-2020, Sideway, Inc. and Project contributors",
                "Copyright (c) 2019-2020, Sideway. Inc, and project contributors",
                "Copyright (c) 2019-2023 Isaac Z. Schlueter and Contributors",
                "Copyright (c) 2019-present, Yuxi",
                "Copyright (c) 2020 Anudeep",
                "Copyright (c) 2020 Apple Inc.",
                "Copyright (c) 2020 CFWare, LLC",
                "Copyright (c) 2020 CodeceptJS",
                "Copyright (c) 2020 Evan Wallace",
                "Copyright (c) 2020 Exodus Movement",
                "Copyright (c) 2020 George Griffiths",
                "Copyright (c) 2020 Inspect JS",
                "Copyright (c) 2020 James Halliday (mail@substack.net) and Mathias Buus",
                "Copyright (c) 2020 James M Snell and the Piscina contributors",
                "Copyright (c) 2020 Jordan Harband",
                "Copyright (c) 2020 Mael Nison <nison.mael@gmail.com>",
                "Copyright (c) 2020 Marak Squires http://github.com/marak/faker.js",
                "Copyright (c) 2020 Marak Squires www.marak.com",
                "Copyright (c) 2020 Nathan Rajlich",
                "Copyright (c) 2020 Nicolo Ribaudo and other contributors",
                "Copyright (c) 2020 Node.js contributors",
                "Copyright (c) 2020 Postman Inc.",
                "Copyright (c) 2020 Ryan Zimmerman <opensrc@ryanzim.com>",
                "Copyright (c) 2020 Samal Rasmussen",
                "Copyright (c) 2020 Shirshak",
                "Copyright (c) 2020 The Preact Authors",
                "Copyright (c) 2020 Titus Wormer <tituswormer@gmail.com>",
                "Copyright (c) 2020 Vercel, Inc.",
                "Copyright (c) 2020 argparse.js authors",
                "Copyright (c) 2020, Vsevolod Strukchinsky",
                "Copyright (c) 2020-present Artem Zakharchenko",
                "Copyright (c) 2020-present, Yuxi",
                "Copyright (c) 2021 A11yance",
                "Copyright (c) 2021 Alexey Raspopov, Kostiantyn Denysov, Anton Verinov",
                "Copyright (c) 2021 Anthony Fu <https://github.com/antfu>",
                "Copyright (c) 2021 Anudeep",
                "Copyright (c) 2021 Brett Zamir",
                "Copyright (c) 2021 Dmitry Shirokov",
                "Copyright (c) 2021 ECMAScript Shims",
                "Copyright (c) 2021 Inspect JS",
                "Copyright (c) 2021 Jason Miller",
                "Copyright (c) 2021 Jimmy Warting",
                "Copyright (c) 2021 Jordan Harband",
                "Copyright (c) 2021 Mathias Buus",
                "Copyright (c) 2021 NAN contributors",
                "Copyright (c) 2021 PactumJS",
                "Copyright (c) 2021 Sasha Koss and Lesha Koss https://kossnocorp.mit-license.org",
                "Copyright (c) 2021 Simon Seyock",
                "Copyright (c) 2021 Titus Wormer",
                "Copyright (c) 2021 UnTS",
                "Copyright (c) 2021 typescript-eslint and other contributors",
                "Copyright (c) 2021 typicode",
                "Copyright (c) 2021, Andrea Giammarchi",
                "Copyright (c) 2021, Rebecca Stevens",
                "Copyright (c) 2021-Present Vitest Team",
                "Copyright (c) 2021-present Artem Zakharchenko",
                "Copyright (c) 2021-present Nick K.",
                "Copyright (c) 2021-present dominikg and contributors (https://github.com/dominikg/tsconfck/graphs/contributors)",
                "Copyright (c) 2022 Anthony Fu <https://github.com/antfu>",
                "Copyright (c) 2022 Anton Kastritskiy",
                "Copyright (c) 2022 ECMAScript Shims",
                "Copyright (c) 2022 Haydn Paterson",
                "Copyright (c) 2022 Inspect JS",
                "Copyright (c) 2022 Jason Mulligan",
                "Copyright (c) 2022 Jordan Harband",
                "Copyright (c) 2022 Michael Mclaughlin",
                "Copyright (c) 2022 Michael Mclaughlin <M8ch88l@gmail.com>",
                "Copyright (c) 2022 Simon Boudrias",
                "Copyright (c) 2022 Simon Boudrias (twitter vaxilart (https://twitter.com/Vaxilart))",
                "Copyright (c) 2022 Sindre Sorhus",
                "Copyright (c) 2022 Tinylibs",
                "Copyright (c) 2022 matzkoh",
                "Copyright (c) 2022, Jason Mulligan",
                "Copyright (c) 2022, Jon Schlinkert (https://github.com/jonschlinkert)",
                "Copyright (c) 2022, Sindre Sorhus",
                "Copyright (c) 2023 ECMAScript Shims",
                "Copyright (c) 2023 Inspect JS",
                "Copyright (c) 2023 Jordan Harband",
                "Copyright (c) 2023 OpenJS Foundation",
                "Copyright (c) 2023 WebdriverIO Community",
                "Copyright (c) 2023, Jon Schlinkert (https://github.com/jonschlinkert)",
                "Copyright (c) 2023-present, sapphi-red",
                "Copyright (c) 2024 Jordan Harband",
                "Copyright (c) 2024 Matt Zabriskie and contributors",
                "Copyright (c) 2024 Mattias Buelens",
                "Copyright (c) Andrew Powell <andrew@shellscape.org>",
                "Copyright (c) Ariel Mashraki <ariel@mashraki.co.il>",
                "Copyright (c) Ben Briggs <beneb.info@gmail.com> (http://beneb.info)",
                "Copyright (c) Ben Drucker <bvdrucker@gmail.com>",
                "Copyright (c) Bogdan Chadkin <trysound@yandex.ru>",
                "Copyright (c) Cenk Kilic <cenk@kilic.dev> (https://srcs.kilic.dev), Sam Verschueren <sam.verschueren@gmail.com>",
                "Copyright (c) Chad Walker",
                "Copyright (c) Cucumber Ltd",
                "Copyright (c) DABH (https://github.com/DABH)",
                "Copyright (c) DC",
                "Copyright (c) Declan de Wet",
                "Copyright (c) Denis Malinochkin",
                "Copyright (c) Domenic Denicola",
                "Copyright (c) Domenic Denicola <d@domenic.me>",
                "Copyright (c) Donald Stufft and individual contributors",
                "Copyright (c) EGOIST",
                "Copyright (c) Facebook, Inc. and its affiliates",
                "Copyright (c) Felix Bohm",
                "Copyright (c) Feross Aboukhadijeh",
                "Copyright (c) Feross Aboukhadijeh (http://feross.org)",
                "Copyright (c) Feross Aboukhadijeh (http://feross.org), and other contributors",
                "Copyright (c) Feross Aboukhadijeh (https://feross.org)",
                "Copyright (c) Feross Aboukhadijeh, and other contributors",
                "Copyright (c) George Zahariev",
                "Copyright (c) GitHub, Inc.",
                "Copyright (c) GraphQL Contributors",
                "Copyright (c) Hiroki Osame <hiroki.osame@gmail.com>",
                "Copyright (c) Ika <ikatyang@gmail.com> (https://github.com/ikatyang)",
                "Copyright (c) Isaac Z. Schlueter",
                "Copyright (c) Isaac Z. Schlueter <i@izs.me> , James Talmage <james@talmage.io> (github.com/jamestalmage), and Contributors",
                "Copyright (c) Isaac Z. Schlueter and Contributors",
                "Copyright (c) JS Foundation and other contributors",
                "Copyright (c) James Halliday",
                "Copyright (c) James Halliday and browserify contributors",
                "Copyright (c) James Long and contributors",
                "Copyright (c) James Talmage <james@talmage.io> (https://github.com/jamestalmage)",
                "Copyright (c) John Hiesey and other contributors",
                "Copyright (c) Jordan Harband and contributors",
                "Copyright (c) Jorge Bucaran <https://jorgebucaran.com>",
                "Copyright (c) Julien Biezemans and contributors",
                "Copyright (c) Kevin Martensson <kevinmartensson@gmail.com>",
                "Copyright (c) Luke Childs <lukechilds123@gmail.com> (https://lukechilds.co.uk)",
                "Copyright (c) Luke Edwards <luke.edwards05@gmail.com> (https://lukeed.com)",
                "Copyright (c) Luke Edwards <luke.edwards05@gmail.com> (lukeed.com)",
                "Copyright (c) MMXV",
                "Copyright (c) Marak Squires",
                "Copyright (c) Meryn Stol 'Author",
                "Copyright (c) Meta Platforms, Inc. and affiliates",
                "Copyright (c) Microsoft",
                "Copyright (c) Microsoft Corporation",
                "Copyright (c) Nikita Vasilyev",
                "Copyright (c) Open JS Foundation",
                "Copyright (c) OpenAI (https://openai.com)",
                "Copyright (c) OpenJS Foundation and other contributors",
                "Copyright (c) Patrick Steele-Idem <pnidem@gmail.com> (psteeleidem.com)",
                "Copyright (c) Paul Johnston 1999 - 2009 Other contributors Greg Holt, Andrew Kepert, Ydnar, Lostinet",
                "Copyright (c) Petka Antonov Benjamin Gruenbaum",
                "Copyright (c) Pooya Parsa <pooya@pi0.io>",
                "Copyright (c) Rod Vagg",
                "Copyright (c) Rod Vagg rvagg (https://twitter.com/rvagg) and additional contributors",
                "Copyright (c) Roy Riojas & Jared Wray",
                "Copyright (c) Roy Riojas and Jared Wray",
                "Copyright (c) Sam Decrock <https://github.com/SamDecrock/>",
                "Copyright (c) Sebastian Mayr",
                "Copyright (c) Sindre Sorhus <sindresorhus@gmail.com> (https://sindresorhus.com)",
                "Copyright (c) Sindre Sorhus <sindresorhus@gmail.com> (https:/sindresorhus.com)",
                "Copyright (c) Sindre Sorhus <sindresorhus@gmail.com> (sindresorhus.com)",
                "Copyright (c) Stephen Sugden <me@stephensugden.com> (stephensugden.com)",
                "Copyright (c) Steven Vachon <contact@svachon.com> (svachon.com)",
                "Copyright (c) Vsevolod Strukchinsky <floatdrop@gmail.com>",
                "Copyright (c) Wix.com",
                "Copyright (c) YEAR W3C(r) (MIT, ERCIM, Keio, Beihang). Disclaimers",
                "Copyright (c) YEARS Erik Doernenburg and contributors",
                "Copyright (c) jQuery Foundation, Inc. and Contributors",
                "Copyright (c) node-modules and other contributors",
                "Copyright (c) npm, Inc.",
                "Copyright (c) npm, Inc. and Contributors",
                "Copyright 1997 Niels Provos <provos@physnet.uni-hamburg.de>",
                "Copyright 2004-2005 by Jason Kohles",
                "Copyright 2006, Jeremy White <jwhite@codeweavers.com>",
                "Copyright 2006, Kevin Krammer <kevin.krammer@gmx.at>",
                "Copyright 2008 Fair Oaks Labs, Inc.",
                "Copyright 2008 Netflix, Inc.",
                "Copyright 2009 www.hamcrest.org",
                "Copyright 2009, 2010, 2011 Isaac Z. Schlueter",
                "Copyright 2009-2010, Fathi Boudra <fabo@freedesktop.org>",
                "Copyright 2009-2010, Rex Dieter <rdieter@fedoraproject.org>",
                "Copyright 2009-2011 Mozilla Foundation and contributors",
                "Copyright 2009-2015 Jeremy Ashkenas, DocumentCloud and Investigative Reporters & Editors",
                "Copyright 2010 James Halliday (mail@substack.net)",
                "Copyright 2010 LearnBoost <dev@learnboost.com>",
                "Copyright 2010 Mulle Kybernetik",
                "Copyright 2010-2012 Mikeal Rogers",
                "Copyright 2011 Chris Andrews",
                "Copyright 2011 Gary Court",
                "Copyright 2011 Mark Cavage <mcavage@gmail.com>",
                "Copyright 2011 Mozilla Foundation and contributors",
                "Copyright 2011 The Closure Compiler Authors",
                "Copyright 2011 by Jan Tonellato",
                "Copyright 2011 by antimatter15 (antimatter15@gmail.com)",
                "Copyright 2011, Sebastian Tschan https://blueimp.net",
                "Copyright 2011-2022 OpenJS Foundation and contributors",
                "Copyright 2012 (c) Mihai Bazon <mihai.bazon@gmail.com>",
                "Copyright 2012 - 2017 jindw <jindw@xidea.org> and other contributors",
                "Copyright 2012 Chris Andrews",
                "Copyright 2012 Irakli Gozalishvili",
                "Copyright 2012 Joyent, Inc.",
                "Copyright 2012 Square Inc.",
                "Copyright 2012 Yahoo! Inc.",
                "Copyright 2012 the V8 project authors",
                "Copyright 2012-2013 (c) Mihai Bazon <mihai.bazon@gmail.com>",
                "Copyright 2012-2015 Acorn",
                "Copyright 2012-2015 The Dojo Foundation <http://dojofoundation.org/>",
                "Copyright 2012-2015 Yahoo! Inc.",
                "Copyright 2012-2015, Yahoo Inc.",
                "Copyright 2012-2016, JP Richardson <jprichardson@gmail.com>",
                "Copyright 2012-2018 (c) Mihai Bazon <mihai.bazon@gmail.com>",
                "Copyright 2012-2019 (c) Mihai Bazon <mihai.bazon@gmail.com>",
                "Copyright 2013 AJ O'Neal",
                "Copyright 2013 Andrey Sitnik <andrey@sitnik.ru>",
                "Copyright 2013 David Bau",
                "Copyright 2013 Google Inc.",
                "Copyright 2013 Lovell Fuller and others",
                "Copyright 2013 Michael Hart (michael.hart.au@gmail.com)",
                "Copyright 2013 Naitik Shah",
                "Copyright 2013 The Chromium Authors",
                "Copyright 2013 Thorsten Lorenz",
                "Copyright 2013, 2014, 2015, 2016, 2017, 2018, 2019, 2020 Lovell Fuller and contributors",
                "Copyright 2013, 2014, 2015, 2016, 2017, 2018, 2019, 2020, 2021, 2022 Lovell Fuller and contributors",
                "Copyright 2013-2016 Dulin Marat and other contributors",
                "Copyright 2014 Andrey Sitnik <andrey@sitnik.ru> and other contributors",
                "Copyright 2014 Anthony McCormick",
                "Copyright 2014 Contributors (ben@npmjs.com)",
                "Copyright 2014 Giovanni Bassi and Elemar Jr",
                "Copyright 2014 Google Inc.",
                "Copyright 2014 Joyent, Inc. and other Node contributors",
                "Copyright 2014 Julien Fontanet",
                "Copyright 2014 Kensho",
                "Copyright 2014 Kensho https://www.kensho.com",
                "Copyright 2014 Mozilla Foundation and contributors",
                "Copyright 2014 The Chromium Authors",
                "Copyright 2014 Yahoo! Inc.",
                "Copyright 2014, 2015, 2016, 2017, 2018 Simon Lydell",
                "Copyright 2014, 2015, 2016, 2017, 2018, 2019, 2020, 2021, 2022, 2023 Simon Lydell",
                "Copyright 2014-2015 Sebastian McKenzie <sebmck@gmail.com>",
                "Copyright 2014-2015 various",
                "Copyright 2014-2018 Chen, Yi-Cyuan",
                "Copyright 2014-2018 Gilmore Davidson <gilmoreorless@gmail.com>",
                "Copyright 2014-present Olivier Lalonde <olalonde@gmail.com> , James Talmage <james@talmage.io> , Ruben Verborgh",
                "Copyright 2015 Calvin Metcalf",
                "Copyright 2015 Glen Maddern",
                "Copyright 2015 Joyent, Inc.",
                "Copyright 2015 Mark Dalgleish <mark.john.dalgleish@gmail.com>",
                "Copyright 2015 Postdot Technologies Pvt. Ltd.",
                "Copyright 2015 Shamasis Bhattacharya <mail@shamasis.net>",
                "Copyright 2015 Tiancheng Timothy Gu",
                "Copyright 2015 Yahoo! Inc.",
                "Copyright 2015 hamcrest.org",
                "Copyright 2015, Yahoo Inc.",
                "Copyright 2015-present Alexander Madyankin <alexander@madyankin.name>",
                "Copyright 2015-present Facebook, Inc.",
                "Copyright 2015. Apache",
                "Copyright 2016 Bogdan Chadkin <trysound@yandex.ru>",
                "Copyright 2016 Google Inc.",
                "Copyright 2016 Joyent Inc.",
                "Copyright 2016 Joyent, Inc.",
                "Copyright 2016 Nolan Lawson",
                "Copyright 2016 Postdot Technologies, Inc",
                "Copyright 2016 Postdot Technologies, Inc.",
                "Copyright 2016 The Lighthouse Authors",
                "Copyright 2016 Trent Mick",
                "Copyright 2016, Joyent Inc",
                "Copyright 2016, Joyent, Inc.",
                "Copyright 2016, Postdot Technologies, Inc.",
                "Copyright 2016-2018 Kornel Lesinski",
                "Copyright 2016-2024 Qameta Software Inc",
                "Copyright 2017 - Refael Ackermann",
                "Copyright 2017 Andrey Sitnik <andrey@sitnik.ru>",
                "Copyright 2017 Ethan Davis",
                "Copyright 2017 Francois Nguyen and others",
                "Copyright 2017 Google Inc.",
                "Copyright 2017 Joyent, Inc.",
                "Copyright 2017 Kat Marchan",
                "Copyright 2017 Lovell Fuller and others",
                "Copyright 2017 Renee Kooi <renee@kooi.me>",
                "Copyright 2017 The Chromium Authors",
                "Copyright 2017-2022 (c) npm, Inc.",
                "Copyright 2018 Eemeli Aro <eemeli@gmail.com>",
                "Copyright 2018 Glen Maddern",
                "Copyright 2018 Google Inc.",
                "Copyright 2018 Google LLC",
                "Copyright 2018 Joyent, Inc.",
                "Copyright 2018 Kilian Valkhof",
                "Copyright 2018 Logan Smyth <loganfsmyth@gmail.com>",
                "Copyright 2018 Renee Kooi <renee@kooi.me>",
                "Copyright 2018 Rich Harris",
                "Copyright 2018 Stefan Penner",
                "Copyright 2018 The diff-match-patch",
                "Copyright 2018 kumavis",
                "Copyright 2018, Microsoft",
                "Copyright 2019 - present Christopher J. Brody and other contributors",
                "Copyright 2019 David Mark Clements <david.mark.clements@gmail.com>",
                "Copyright 2019 Google Inc.",
                "Copyright 2019 Google LLC",
                "Copyright 2019 JS Foundation and other contributors",
                "Copyright 2019 Justin Ridgewell <jridgewell@google.com>",
                "Copyright 2019 Microsoft Corporation",
                "Copyright 2019 Renee Kooi <renee@kooi.me>",
                "Copyright 2019 Ron Buckton",
                "Copyright 2019 ehmicky <ehmicky@gmail.com>",
                "Copyright 2020 A11yance",
                "Copyright 2020 Filament Anomalous Technologies",
                "Copyright 2020 GaneshSPatil",
                "Copyright 2020 Google Inc.",
                "Copyright 2020 Google LLC",
                "Copyright 2020 Google LLC.",
                "Copyright 2020 Joyent Inc.",
                "Copyright 2020 Yann Armelin",
                "Copyright 2021 (c) npm, Inc.",
                "Copyright 2021 Google Inc.",
                "Copyright 2021 Google LLC.",
                "Copyright 2021 Trent Mick",
                "Copyright 2022 Andrey Sitnik <andrey@sitnik.ru> and other contributors",
                "Copyright 2022 Fonticons, Inc.",
                "Copyright 2022 Google Inc.",
                "Copyright 2022 Google LLC.",
                "Copyright 2022 Justin Ridgewell <jridgewell@google.com>",
                "Copyright 2022 Justin Ridgewell <justin@ridgewell.name>",
                "Copyright 2022 Qameta Software",
                "Copyright 2022 The Chromium Authors",
                "Copyright 2022 ehmicky <ehmicky@gmail.com>",
                "Copyright 2023 Google Inc.",
                "Copyright 2023 Google LLC.",
                "Copyright 2024 Mattias Buelens, Diwank Singh Tomer and other contributors",
                "Copyright Angel Marin, Paul Johnston 2000 - 2009. Other contributors Greg Holt, Andrew Kepert, Ydnar, Lostinet",
                "Copyright Brian White",
                "Copyright Caolan McMahon",
                "Copyright Eemeli Aro <eemeli@gmail.com>",
                "Copyright Fedor Indutny, 2012",
                "Copyright Fedor Indutny, 2014",
                "Copyright Fedor Indutny, 2015",
                "Copyright Fedor Indutny, 2017",
                "Copyright Google Inc.",
                "Copyright Isaac Z.",
                "Copyright Isaac Z. Schlueter",
                "Copyright Isaac Z. Schlueter and Contributors",
                "Copyright JS Foundation and other contributors",
                "Copyright JS Foundation and other contributors <https://js.foundation/>",
                "Copyright JS Foundation and other contributors, https://js.foundation",
                "Copyright James Halliday (mail@substack.net) and Isaac Z. Schlueter (i@izs.me)",
                "Copyright Jeremy Ashkenas, DocumentCloud and Investigative Reporters & Editors",
                "Copyright Joyent, Inc.",
                "Copyright Joyent, Inc. and other Node contributors",
                "Copyright Louis-Dominique Dubeau and contributors",
                "Copyright Mathias Bynens <https://mathiasbynens.be/>",
                "Copyright Michael Ciniawsky <michael.ciniawsky@gmail.com>",
                "Copyright Microsoft Corporation",
                "Copyright Mulle Kybernetik 2010",
                "Copyright Node.js contributors",
                "Copyright OpenJS Foundation and other contributors <https://openjsf.org/>",
                "Copyright OpenJS Foundation and other contributors, <www.openjsf.org>",
                "Copyright Paul Johnston 2000 - 2002. Other contributors Greg Holt, Andrew Kepert, Ydnar, Lostinet",
                "Copyright Plato http://stackoverflow.com/a/19385911/995876 CC BY-SA",
                "Copyright Postdot Technologies, Inc.",
                "Copyright Wernham Hogg",
                "Copyright by https://github.com/Georgegriff",
                "Copyright jQuery Foundation and other contributors <https://jquery.org/>",
                "Copyright npm, Inc",
                "Copyright npm, Inc.",
                "Copyright spdx-correct.js contributors",
                "Kensho (c) 2014 kensho (https://twitter.com/kensho)",
                "Markus Ekholm copyright 2012-2023",
                "NSHumanReadableCopyright (c) 2015 hamcrest.org",
                "Portions Copyright (c) 2016-present, Facebook, Inc.",
                "Portions Copyright (c) Microsoft Corporation",
                "Portions Copyright 2017 Google Inc.",
                "Pp (c) Ac",
                "Tv (c) Gn",
                "Vt qt (c) Component",
                "copyright (c) 2012-2014 Chris Talkington",
                "copyright (c) 2013 Jake Luer, jake@alogicalparadox.com",
                "copyright (c) 2014 Chris Talkington",
                "copyright (c) 2019 Denis Pushkarev",
                "copyright (c) 2019 Jake Teton-Landis",
                "copyright (c) Microsoft Corporation",
                "copyright 2007-2012 by Steven Levithan (http://stevenlevithan.com/)",
                "copyright 2009-2015 Jeremy Ashkenas, DocumentCloud and Investigative Reporters & Editors <http://underscorejs.org/>",
                "copyright 2012-2018 Alexander Schenkel <alex@alexi.ch>",
                "copyright 2014 s",
                "copyright 2015 Missing",
                "copyright 2015 Toru Nagashima",
                "copyright 2016 Desmond Brand",
                "copyright 2016 Toru Nagashima",
                "copyright 2022 Jason Mulligan <jason.mulligan@avoidwork.com>",
                "copyright C2 A9",
                "copyright Chen, Yi-Cyuan 2014-2018",
                "copyright Jeremy Ashkenas, DocumentCloud and Investigative Reporters & Editors <http://underscorejs.org/>",
                "copyright Louis-Dominique Dubeau",
                "copyright Sindre Sorhus",
                "copyright ahmadnassri.com (https://www.ahmadnassri.com/)"
            ],
            "file-count": 60339,
            "sha256": "47bbeeb8b9dcc4aa22854a5a55362d4662e72118b7d63a37ab6afa151221c293",
            "source": "https://github.com/allure-framework/allure-js/archive/refs/tags/v2.14.0.zip",
            "status": "restricted"
        }
    ]
}
