{
    "id": "npm/npmjs/@storybook/instrumenter/8.3.4",
    "license": "MIT",
    "authority": "https://gitlab.eclipse.org/eclipsefdn/emo-team/iplab/-/issues/16438",
    "source": "https://github.com/storybookjs/storybook/archive/refs/tags/v8.3.4.zip",
    "status": "approved",
    "scans": [
        {
            "date": "September 30, 2024, 9:12:10 p.m. GMT",
            "authority": "https://gitlab.eclipse.org/eclipsefdn/emo-team/iplab/-/issues/16438",
            "scancode-version": "31.2.1",
            "licenses-discovered": [
                "GPL-1.0-or-later",
                "MIT",
                "BSD-2-Clause AND ISC AND MIT",
                "OFL-1.1",
                "ISC"
            ],
            "copyrights": [
                "(c) 2017-present Renaud Tertrais",
                "(c) Unknown J2 V",
                "(c) Unknown Ks",
                "(c) Unknown Wu",
                "(c) Unknown Xs",
                "Copyright (c) 2016 Oxyno-zeta (Havrileck Alexandre)",
                "Copyright (c) 2017 The swc Project",
                "Copyright (c) 2024 Storybook",
                "Copyright 2011-2020 Tilde Inc. and contributors",
                "Copyright 2020 The Rubik Filtered Project",
                "Gt qt (c) Component",
                "Portions Copyright 2006-2011 Strobe Inc.",
                "Portions Copyright 2008-2011 Apple Inc."
            ],
            "file-count": 4976,
            "sha256": "df9b79ee5e04197d66d1f731382efdc8deb3d50790ddcfbf817078dc03a41d67",
            "source": "https://github.com/storybookjs/storybook/archive/refs/tags/v8.3.4.zip",
            "status": "restricted"
        }
    ]
}