{
    "id": "npm/npmjs/-/core-js-compat/3.30.2",
    "license": "MIT AND BSD-3-Clause",
    "authority": "https://gitlab.eclipse.org/eclipsefdn/emo-team/iplab/-/issues/8418",
    "source": "https://github.com/zloirock/core-js/archive/v3.30.2.zip",
    "status": "approved",
    "scans": [
        {
            "date": "May 9, 2023 at 12:51:47 p.m. GMT",
            "authority": "https://gitlab.eclipse.org/eclipsefdn/emo-team/iplab/-/issues/8418",
            "scancode-version": "31.2.1",
            "licenses-discovered": [
                "MIT",
                "LicenseRef-scancode-free-unknown",
                "JSON",
                "BSD-3-Clause"
            ],
            "copyrights": [
                "(c) 2014-2023 Denis Pushkarev",
                "(c) web-platform-tests contributors",
                "(c) zbar', base about:blank', href http://example.com/foo",
                "Copyright (c) 2012 Ecma International",
                "Copyright (c) 2014-2023 Denis Pushkarev",
                "copyright (c) 2014-2023 Denis Pushkarev"
            ],
            "file-count": 3735,
            "sha256": "2fd36e9c6a1cd330cfed3a4f616e324254426bb87aeaefbe3de0d2b9347dd62c",
            "source": "https://github.com/zloirock/core-js/archive/v3.30.2.zip",
            "status": "restricted"
        }
    ]
}
