{
    "id": "npm/npmjs/-/tar-fs/2.1.2",
    "license": "MIT",
    "authority": "https://gitlab.eclipse.org/eclipsefdn/emo-team/iplab/-/issues/18687",
    "source": "https://registry.yarnpkg.com/tar-fs/-/tar-fs-2.1.2.tgz",
    "status": "approved",
    "scans": [
        {
            "date": "January 14, 2025 at 5:24:52 p.m. GMT",
            "authority": "https://gitlab.eclipse.org/eclipsefdn/emo-team/iplab/-/issues/18687",
            "scancode-version": "31.2.1",
            "licenses-discovered": [
                "MIT"
            ],
            "copyrights": [
                "Copyright (c) 2014 Mathias Buus"
            ],
            "file-count": 17,
            "sha256": "595025df636a02b49619ceffed3d781ba6ff3cb6e3659d869bee02fc3d3b070e",
            "source": "https://registry.yarnpkg.com/tar-fs/-/tar-fs-2.1.2.tgz",
            "status": "approved"
        }
    ]
}