{
    "id": "npm/npmjs/-/request-light/0.7.0",
    "license": "MIT",
    "authority": "https://gitlab.eclipse.org/eclipsefdn/emo-team/iplab/-/issues/6941",
    "source": "https://registry.yarnpkg.com/request-light/-/request-light-0.7.0.tgz",
    "status": "approved",
    "scans": [
        {
            "date": "February 3, 2023 at 4:11:14 a.m. GMT",
            "authority": "https://gitlab.eclipse.org/eclipsefdn/emo-team/iplab/-/issues/6941",
            "scancode-version": "31.2.1",
            "licenses-discovered": [
                "MIT"
            ],
            "copyrights": [
                "Copyright (c) Microsoft",
                "Copyright (c) Microsoft Corporation"
            ],
            "file-count": 7,
            "sha256": "15d60d0da12c1e9eff0bc8f0f00417e760b672165fe9a77b64639de29285ace5",
            "source": "https://registry.yarnpkg.com/request-light/-/request-light-0.7.0.tgz",
            "status": "approved"
        }
    ]
}