{
    "id": "npm/npmjs/-/find-git-exec/0.0.4",
    "license": "MIT",
    "licenses-discovered": [
        "MIT"
    ],
    "file-count": 13,
    "scancode-version": "30.1.0",
    "authority": "https://gitlab.eclipse.org/eclipsefdn/emo-team/iplab/-/issues/1934",
    "source": "https://github.com/TypeFox/find-git-exec/archive/v0.0.4.zip",
    "status": "approved"
}