{
    "id": "maven/mavencentral/org.wildfly.security/wildfly-elytron-http-deprecated/2.2.1.Final",
    "license": "Apache-2.0",
    "authority": "https://gitlab.eclipse.org/eclipsefdn/emo-team/iplab/-/issues/9449",
    "source": "https://repo.maven.apache.org/maven2/org/wildfly/security/wildfly-elytron-http-deprecated/2.2.1.Final/wildfly-elytron-http-deprecated-2.2.1.Final-sources.jar",
    "status": "approved",
    "scans": [
        {
            "date": "July 17, 2023 at 9:25:48 a.m. GMT",
            "authority": "https://gitlab.eclipse.org/eclipsefdn/emo-team/iplab/-/issues/9449",
            "scancode-version": "31.2.1",
            "licenses-discovered": [
                "Apache-2.0"
            ],
            "copyrights": [
                "Copyright 2018 Red Hat, Inc., and individual contributors"
            ],
            "file-count": 5,
            "sha256": "e909a5361f87adcfc98e57194858dfd218179d48b5b6b94e4f0890a08b722714",
            "source": "https://repo.maven.apache.org/maven2/org/wildfly/security/wildfly-elytron-http-deprecated/2.2.1.Final/wildfly-elytron-http-deprecated-2.2.1.Final-sources.jar",
            "status": "approved"
        }
    ]
}