{
    "id": "npm/npmjs/-/object-inspect/1.13.0",
    "license": "MIT",
    "authority": "https://gitlab.eclipse.org/eclipsefdn/emo-team/iplab/-/issues/11078",
    "source": "https://github.com/inspect-js/object-inspect/archive/refs/tags/v1.13.0.zip",
    "status": "approved",
    "scans": [
        {
            "date": "October 16, 2023 at 9:00:17 p.m. GMT",
            "authority": "https://gitlab.eclipse.org/eclipsefdn/emo-team/iplab/-/issues/11078",
            "scancode-version": "31.2.1",
            "licenses-discovered": [
                "MIT"
            ],
            "copyrights": [
                "Copyright (c) 2013 James Halliday"
            ],
            "file-count": 39,
            "sha256": "933d2ae4d4aa4893a24fc78488a0a5008ba71f7114e7cea0a41936a10b344c90",
            "source": "https://github.com/inspect-js/object-inspect/archive/refs/tags/v1.13.0.zip",
            "status": "approved"
        }
    ]
}