{
    "id": "go/golang/github.com%2Fgolangci/go-misc/v0.0.0-20180628070357-927a3d87b613",
    "license": "BSD-3-Clause AND (GPL-2.0-only OR MIT)",
    "authority": "https://gitlab.eclipse.org/eclipsefdn/emo-team/iplab/-/issues/12504",
    "source": "https://proxy.golang.org/github.com%2Fgolangci/go-misc/@v/v0.0.0-20180628070357-927a3d87b613.zip",
    "status": "approved",
    "scans": [
        {
            "date": "December 26, 2023 at 7:03:06 a.m. GMT",
            "authority": "https://gitlab.eclipse.org/eclipsefdn/emo-team/iplab/-/issues/12504",
            "scancode-version": "31.2.1",
            "licenses-discovered": [
                "BSD-3-Clause",
                "GPL-2.0-only AND MIT"
            ],
            "copyrights": [
                "Copyright (c) 2008, Tony Tomov, tony@trirand.com",
                "Copyright (c) 2012 Remy Oudompheng",
                "Copyright 2011 The Go Authors",
                "Copyright 2012 Remy Oudompheng",
                "Copyright 2017 Remy Oudompheng"
            ],
            "file-count": 87,
            "sha256": "f32867c059bdaca53136007f22705cb3d724067f3510c03d56251955f37558c5",
            "source": "https://proxy.golang.org/github.com%2Fgolangci/go-misc/@v/v0.0.0-20180628070357-927a3d87b613.zip",
            "status": "restricted"
        }
    ]
}
