{
    "id": "pypi/pypi/-/fastapi/0.115.7",
    "license": "MIT",
    "authority": "https://gitlab.eclipse.org/eclipsefdn/emo-team/iplab/-/issues/19828",
    "source": "https://files.pythonhosted.org/packages/a2/f5/3f921e59f189e513adb9aef826e2841672d50a399fead4e69afdeb808ff4/fastapi-0.115.7.tar.gz",
    "status": "approved",
    "scans": [
        {
            "date": "March 1, 2025 at 7:35:08 a.m. GMT",
            "authority": "https://gitlab.eclipse.org/eclipsefdn/emo-team/iplab/-/issues/19828",
            "scancode-version": "31.2.1",
            "licenses-discovered": [
                "MIT",
                "Apache-2.0",
                "LicenseRef-scancode-unknown"
            ],
            "copyrights": [
                "Copyright (c) 2018 Sebastian Ramirez"
            ],
            "file-count": 1187,
            "sha256": "0f106da6c01d88a6786b3248fb4d7a940d071f6f488488898ad5d354b25ed015",
            "source": "https://files.pythonhosted.org/packages/a2/f5/3f921e59f189e513adb9aef826e2841672d50a399fead4e69afdeb808ff4/fastapi-0.115.7.tar.gz",
            "status": "restricted"
        }
    ]
}