{
    "id": "npm/npmjs/@shikijs/engine-javascript/1.23.0",
    "license": "MIT AND (Apache-2.0 AND MIT)",
    "authority": "https://gitlab.eclipse.org/eclipsefdn/emo-team/iplab/-/issues/17407",
    "source": "https://github.com/shikijs/shiki/archive/refs/tags/v1.23.0.zip",
    "status": "approved",
    "scans": [
        {
            "date": "November 22, 2024, 1:19:57 p.m. GMT",
            "authority": "https://gitlab.eclipse.org/eclipsefdn/emo-team/iplab/-/issues/17407",
            "scancode-version": "31.2.1",
            "licenses-discovered": [
                "MIT",
                "Apache-2.0 AND MIT"
            ],
            "copyrights": [
                "Copyright (c) 2021 Pine Wu",
                "Copyright (c) 2021 Pine Wu, 2023-PRESENT Anthony",
                "Copyright (c) 2023 Anthony Fu <https://github.com/antfu>",
                "Copyright (c) Microsoft Corporation"
            ],
            "file-count": 468,
            "sha256": "b818aa720e450770c6e28df11316e0c09488f31bff46fdc91bee5b059a2964f2",
            "source": "https://github.com/shikijs/shiki/archive/refs/tags/v1.23.0.zip",
            "status": "approved"
        }
    ]
}