{
    "id": "npm/npmjs/@typescript-eslint/eslint-plugin/5.19.0",
    "license": "BSD-2-Clause AND MIT",
    "licenses-discovered": [
        "BSD-2-Clause",
        "MIT"
    ],
    "copyrights": [
        "Copyright (c) Facebook, Inc. and its affiliates",
        "Copyright (c) TypeScript ESLint and other contributors",
        "Copyright (c) unional",
        "Copyright JS Foundation and other contributors, https://js.foundation",
        "Copyright Joyent, Inc. and other Node contributors"
    ],
    "file-count": 3817,
    "scancode-version": "30.1.0",
    "authority": "https://gitlab.eclipse.org/eclipsefdn/emo-team/iplab/-/issues/3097",
    "source": "https://github.com/typescript-eslint/typescript-eslint/archive/v5.19.0.zip",
    "status": "approved"
}