{
    "id": "maven/mavencentral/io.gatling/gatling-charts/3.12.0",
    "license": "Apache-2.0 AND MIT",
    "authority": "https://gitlab.eclipse.org/eclipsefdn/emo-team/iplab/-/issues/19554",
    "source": "https://repo1.maven.org/maven2/io/gatling/gatling-charts/3.12.0/gatling-charts-3.12.0-sources.jar",
    "status": "approved",
    "scans": [
        {
            "date": "February 26, 2025 at 10:38:05 a.m. GMT",
            "authority": "https://gitlab.eclipse.org/eclipsefdn/emo-team/iplab/-/issues/19554",
            "scancode-version": "31.2.1",
            "licenses-discovered": [
                "Apache-2.0",
                "MIT"
            ],
            "copyrights": [
                "(c) JS Foundation and other contributors",
                "Copyright 2011-2024 GatlingCorp (https://gatling.io)",
                "Copyright 2012 Twitter, Inc. http://www.apache.org/licenses/LICENSE-2.0.txt"
            ],
            "file-count": 81,
            "sha256": "a4796f2fbf2807354c48dd44ce8901ad7f737dbecf9da5dac6f7227aa7500aa4",
            "source": "https://repo1.maven.org/maven2/io/gatling/gatling-charts/3.12.0/gatling-charts-3.12.0-sources.jar",
            "status": "approved"
        }
    ]
}