{
    "id": "maven/mavencentral/org.apache.lucene/lucene-analysis-smartcn/9.4.2",
    "license": "Apache-2.0",
    "authority": "https://gitlab.eclipse.org/eclipsefdn/emo-team/iplab/-/issues/5637",
    "source": "https://search.maven.org/remotecontent?filepath=org/apache/lucene/lucene-analysis-smartcn/9.4.2/lucene-analysis-smartcn-9.4.2-sources.jar",
    "status": "approved",
    "scans": [
        {
            "date": "December 11, 2022 at 2:17:17 p.m. GMT",
            "authority": "https://gitlab.eclipse.org/eclipsefdn/emo-team/iplab/-/issues/5637",
            "scancode-version": "31.2.1",
            "licenses-discovered": [
                "Apache-2.0"
            ],
            "copyrights": [
            ],
            "file-count": 22,
            "sha256": "7d77b98352aadf90dd793ca5be5ac304319c6709f558dcdbf37d17da22d3c309",
            "source": "https://search.maven.org/remotecontent?filepath=org/apache/lucene/lucene-analysis-smartcn/9.4.2/lucene-analysis-smartcn-9.4.2-sources.jar",
            "status": "approved"
        }
    ]
}