{
    "id": "git/github/docopt/docopt-go/ee0de3bc6815",
    "license": "MIT",
    "authority": "https://gitlab.eclipse.org/eclipsefdn/emo-team/iplab/-/issues/5160",
    "source": "https://github.com/docopt/docopt-go/archive/ee0de3bc6815.zip",
    "status": "approved",
    "scans": [
        {
            "date": "November 24, 2022 at 8:47:05 p.m. GMT",
            "authority": "https://gitlab.eclipse.org/eclipsefdn/emo-team/iplab/-/issues/5160",
            "scancode-version": "31.2.1",
            "licenses-discovered": [
                "MIT"
            ],
            "copyrights": [
                "Copyright (c) 2013 Keith Batten",
                "Copyright (c) 2013 Keith Batten, kbatten@gmail.com",
                "Copyright (c) 2016 David Irvine"
            ],
            "file-count": 36,
            "sha256": "51198fbbf98a7b4b8c55e04d2d40b5215bc9dd5340948c04de07260c70414b13",
            "source": "https://github.com/docopt/docopt-go/archive/ee0de3bc6815.zip",
            "status": "approved"
        }
    ]
}