{
    "id": "git/github/valyala/bytebufferpool/v1.0.0",
    "license": "MIT",
    "licenses-discovered": [
        "MIT"
    ],
    "copyrights": [
        "Copyright (c) Aliaksandr Valialkin, VertaMedia"
    ],
    "file-count": 10,
    "scancode-version": "30.1.0",
    "authority": "https://gitlab.eclipse.org/eclipsefdn/emo-team/iplab/-/issues/3739",
    "source": "https://github.com/valyala/bytebufferpool/archive/refs/tags/v1.0.0.zip",
    "status": "approved"
}