{
    "id": "p2/orbit/p2.eclipse-plugin/org.apache.cxf.cxf-rt-frontend-jaxrs/3.3.1",
    "license": "Apache-2.0",
    "licenses-discovered": [
        "Apache-2.0"
    ],
    "file-count": 232,
    "scancode-version": "30.1.0",
    "authority": "https://gitlab.eclipse.org/eclipsefdn/emo-team/iplab/-/issues/2378",
    "source": "https://search.maven.org/remotecontent?filepath=org/apache/cxf/cxf-rt-frontend-jaxrs/3.3.1/cxf-rt-frontend-jaxrs-3.3.1-sources.jar",
    "status": "approved"
}