{
    "id": "npm/npmjs/-/stackback/0.0.2",
    "license": "BSD-3-Clause AND MIT",
    "authority": "https://gitlab.eclipse.org/eclipsefdn/emo-team/iplab/-/issues/8129",
    "source": "https://github.com/shtylman/node-stackback/archive/v0.0.2.zip",
    "status": "approved",
    "scans": [
        {
            "date": "May 3, 2023 at 8:09:51 a.m. GMT",
            "authority": "https://gitlab.eclipse.org/eclipsefdn/emo-team/iplab/-/issues/8129",
            "scancode-version": "31.2.1",
            "licenses-discovered": [
                "BSD-3-Clause",
                "MIT"
            ],
            "copyrights": [
                "Copyright 2012 the V8 project authors"
            ],
            "file-count": 6,
            "sha256": "5e57771041306d7d1abf7809b837b2d1990f13b7785c9b31c992096406b79865",
            "source": "https://github.com/shtylman/node-stackback/archive/v0.0.2.zip",
            "status": "approved"
        }
    ]
}