{
    "id": "crate/cratesio/-/itertools/0.13.0",
    "license": "Apache-2.0 AND MIT AND Apache-2.0 AND MIT",
    "authority": "https://gitlab.eclipse.org/eclipsefdn/emo-team/iplab/-/issues/16961",
    "source": "https://crates.io/api/v1/crates/itertools/0.13.0/download",
    "status": "approved",
    "scans": [
        {
            "date": "October 30, 2024, 10:32:36 a.m. GMT",
            "authority": "https://gitlab.eclipse.org/eclipsefdn/emo-team/iplab/-/issues/16961",
            "scancode-version": "31.2.1",
            "licenses-discovered": [
                "Apache-2.0 AND MIT",
                "Apache-2.0",
                "MIT"
            ],
            "copyrights": [
                "Copyright (c) 2015 Permission"
            ],
            "file-count": 84,
            "sha256": "413ee7dfc52ee1a4949ceeb7dbc8a33f2d6c088194d9f922fb8318faf1f01186",
            "source": "https://crates.io/api/v1/crates/itertools/0.13.0/download",
            "status": "approved"
        }
    ]
}