{
    "id": "maven/mavencentral/com.networknt/json-schema-validator/1.4.0",
    "license": "Apache-2.0 AND Unicode-TOU",
    "authority": "https://gitlab.eclipse.org/eclipsefdn/emo-team/iplab/-/issues/13812",
    "source": "https://repo1.maven.org/maven2/com/networknt/json-schema-validator/1.4.0/json-schema-validator-1.4.0-sources.jar",
    "status": "approved",
    "scans": [
        {
            "date": "March 17, 2024 at 7:03:16 a.m. GMT",
            "authority": "https://gitlab.eclipse.org/eclipsefdn/emo-team/iplab/-/issues/13812",
            "scancode-version": "31.2.1",
            "licenses-discovered": [
                "Apache-2.0",
                "LicenseRef-scancode-unicode"
            ],
            "copyrights": [
                "(c) 2022 Unicode(r), Inc.",
                "Copyright (c) 2016 Network New Technologies Inc.",
                "Copyright (c) 2020 Network New Technologies Inc.",
                "Copyright (c) 2022 Network New Technologies Inc.",
                "Copyright (c) 2023 Network New Technologies Inc.",
                "Copyright (c) 2023 the original author or authors",
                "Copyright (c) 2024 the original author or authors"
            ],
            "file-count": 246,
            "sha256": "dae20bf499311f03c2e5509e0600d584ff4f725d165dfc05da4bae755f2c0622",
            "source": "https://repo1.maven.org/maven2/com/networknt/json-schema-validator/1.4.0/json-schema-validator-1.4.0-sources.jar",
            "status": "restricted"
        }
    ]
}
