{
    "id": "maven/mavencentral/io.github.openfeign/feign-form/13.5",
    "license": "Apache-2.0",
    "authority": "https://gitlab.eclipse.org/eclipsefdn/emo-team/iplab/-/issues/18218",
    "source": "https://repo1.maven.org/maven2/io/github/openfeign/feign-form/13.5/feign-form-13.5-sources.jar",
    "status": "approved",
    "scans": [
        {
            "date": "January 7, 2025 at 8:53:55 a.m. GMT",
            "authority": "https://gitlab.eclipse.org/eclipsefdn/emo-team/iplab/-/issues/18218",
            "scancode-version": "31.2.1",
            "licenses-discovered": [
                "Apache-2.0"
            ],
            "copyrights": [
                "Copyright (c) 2012 The Feign Authors (feign@commonhaus.dev)"
            ],
            "file-count": 22,
            "sha256": "991fbc42a6d0e318cfff034368da0b2249da6bedd28268b05d7145614ed074e1",
            "source": "https://repo1.maven.org/maven2/io/github/openfeign/feign-form/13.5/feign-form-13.5-sources.jar",
            "status": "approved"
        }
    ]
}