{
    "license": "Apache-2.0 AND MIT",
    "file-count": 85,
    "authority": "https://gitlab.eclipse.org/eclipsefdn/emo-team/iplab/-/issues/1080",
    "scancode-version": "21.3.31",
    "licenses-discovered": [
        "MIT",
        "Apache-2.0",
        "LicenseRef-scancode-public-domain"
    ],
    "id": "npm/npmjs/-/brotli/1.3.2",
    "source": "https://github.com/devongovett/brotli.js/archive/v1.3.2.zip",
    "status": "approved"
}
