{
    "id": "npm/npmjs/-/eslint-plugin-react-refresh/0.4.13",
    "license": "MIT",
    "authority": "https://gitlab.eclipse.org/eclipsefdn/emo-team/iplab/-/issues/16852",
    "source": "https://github.com/ArnaudBarre/eslint-plugin-react-refresh/archive/refs/tags/v0.4.13.zip",
    "status": "approved",
    "scans": [
        {
            "date": "October 22, 2024, 5:44:28 a.m. GMT",
            "authority": "https://gitlab.eclipse.org/eclipsefdn/emo-team/iplab/-/issues/16852",
            "scancode-version": "31.2.1",
            "licenses-discovered": [
                "MIT"
            ],
            "copyrights": [
                "Copyright (c) Arnaud Barre (https://github.com/ArnaudBarre)"
            ],
            "file-count": 14,
            "sha256": "1276d03aa38131f7a29c6c2c852f87373e15141d46cfb61bd769eb2e8c8816c0",
            "source": "https://github.com/ArnaudBarre/eslint-plugin-react-refresh/archive/refs/tags/v0.4.13.zip",
            "status": "approved"
        }
    ]
}