{
    "id": "crate/cratesio/-/zerovec-derive/0.10.2",
    "license": "Unicode-3.0",
    "authority": "https://gitlab.eclipse.org/eclipsefdn/emo-team/iplab/-/issues/15421",
    "source": "https://crates.io/api/v1/crates/zerovec-derive/0.10.2/download",
    "status": "approved",
    "scans": [
        {
            "date": "June 15, 2024 at 2:40:10 a.m. GMT",
            "authority": "https://gitlab.eclipse.org/eclipsefdn/emo-team/iplab/-/issues/15421",
            "scancode-version": "31.2.1",
            "licenses-discovered": [
                "LicenseRef-scancode-unknown-spdx"
            ],
            "copyrights": [
                "(c) 1995-2016 International Business Machines Corporation and others",
                "Copyright (c) 2020-2024 Unicode, Inc."
            ],
            "file-count": 15,
            "sha256": "97cf56601ee5052b4417d90c8755c6683473c926039908196cf35d99f893ebe7",
            "source": "https://crates.io/api/v1/crates/zerovec-derive/0.10.2/download",
            "status": "restricted"
        }
    ]
}