{
    "id": "maven/mavencentral/org.cyclonedx/cyclonedx-maven-plugin/2.9.0",
    "license": "Apache-2.0",
    "authority": "https://gitlab.eclipse.org/eclipsefdn/emo-team/iplab/-/issues/16547",
    "source": "https://repo1.maven.org/maven2/org/cyclonedx/cyclonedx-maven-plugin/2.9.0/cyclonedx-maven-plugin-2.9.0-sources.jar",
    "status": "approved",
    "scans": [
        {
            "date": "October 9, 2024, 4:55:58 a.m. GMT",
            "authority": "https://gitlab.eclipse.org/eclipsefdn/emo-team/iplab/-/issues/16547",
            "scancode-version": "31.2.1",
            "licenses-discovered": [
                "Apache-2.0"
            ],
            "copyrights": [
                "Copyright (c) OWASP Foundation"
            ],
            "file-count": 15,
            "sha256": "60d28c86f6fdff04e878105ad827f75c07e682d4405f0d0c086acbaa0b115ad0",
            "source": "https://repo1.maven.org/maven2/org/cyclonedx/cyclonedx-maven-plugin/2.9.0/cyclonedx-maven-plugin-2.9.0-sources.jar",
            "status": "approved"
        }
    ]
}