{
    "id": "npm/npmjs/-/html-minifier-terser/7.2.0",
    "license": "MIT AND BSD-2-Clause AND BSD-3-Clause AND (MPL-1.1 OR Apache-2.0)",
    "authority": "https://gitlab.eclipse.org/eclipsefdn/emo-team/iplab/-/issues/12058",
    "source": "https://github.com/terser/html-minifier-terser/archive/refs/tags/v7.2.0.zip",
    "status": "approved",
    "scans": [
        {
            "date": "December 14, 2023 at 8:55:14 a.m. GMT",
            "authority": "https://gitlab.eclipse.org/eclipsefdn/emo-team/iplab/-/issues/12058",
            "scancode-version": "31.2.1",
            "licenses-discovered": [
                "MIT",
                "MPL-1.0"
            ],
            "copyrights": [
                "Copyright (c) 2010-2019 Juriy kangax Zaytsev",
                "Copyright (c) 2014-2016 Zoltan Frombach"
            ],
            "file-count": 36,
            "sha256": "0a54d3a392e10d8229fb2d50d4060783b304cc495eba91b487263ab2918ceeba",
            "source": "https://github.com/terser/html-minifier-terser/archive/refs/tags/v7.2.0.zip",
            "status": "restricted"
        }
    ]
}
