{
    "id": "maven/mavencentral/org.apache.maven.resolver/maven-resolver-impl/1.8.2",
    "license": "Apache-2.0",
    "licenses-discovered": [
        "Apache-2.0"
    ],
    "copyrights": [
        "Copyright The Apache Software Foundation"
    ],
    "file-count": 103,
    "scancode-version": "30.1.0",
    "authority": "https://gitlab.eclipse.org/eclipsefdn/emo-team/iplab/-/issues/3756",
    "source": "https://search.maven.org/remotecontent?filepath=org/apache/maven/resolver/maven-resolver-impl/1.8.2/maven-resolver-impl-1.8.2-sources.jar",
    "status": "approved"
}