{
    "id": "project/technology.os-gov/eclipse-os-gov/os-gov/d14a82f119c726be41095bf496b6f674161edc3a",
    "license": "Apache-2.0",
    "authority": "https://gitlab.eclipse.org/eclipsefdn/emo-team/iplab/-/issues/11703",
    "source": "https://gitlab.eclipse.org/api/v4/projects/eclipse%2Fos-gov%2Fos-gov/repository/archive.zip?sha=d14a82f119c726be41095bf496b6f674161edc3a",
    "status": "approved",
    "scans": [
        {
            "date": "November 28, 2023 at 3:57:51 p.m. GMT",
            "authority": "https://gitlab.eclipse.org/eclipsefdn/emo-team/iplab/-/issues/11703",
            "scancode-version": "31.2.1",
            "licenses-discovered": [
                "Apache-2.0"
            ],
            "copyrights": [
                "Copyright 2023 Boris Baldassari"
            ],
            "file-count": 2,
            "sha256": "5563e6a36ed5e275e8208e5ffcdd92846d6679ec6bf1224d5522b4aed54d7bae",
            "source": "https://gitlab.eclipse.org/api/v4/projects/eclipse%2Fos-gov%2Fos-gov/repository/archive.zip?sha=d14a82f119c726be41095bf496b6f674161edc3a",
            "status": "restricted"
        }
    ]
}
