{
    "id": "npm/npmjs/-/socket.io-client/4.5.4",
    "license": "MIT",
    "authority": "https://gitlab.eclipse.org/eclipsefdn/emo-team/iplab/-/issues/5047",
    "source": "https://registry.npmjs.org/socket.io-client/-/socket.io-client-4.5.4.tgz",
    "status": "approved",
    "scans": [
        {
            "date": "November 23, 2022 at 1:28:29 p.m. GMT",
            "authority": "https://gitlab.eclipse.org/eclipsefdn/emo-team/iplab/-/issues/5047",
            "scancode-version": "31.2.1",
            "licenses-discovered": [
                "MIT"
            ],
            "copyrights": [
                "(c) 2014-2022 Guillermo Rauch",
                "Copyright (c) 2014 Guillermo Rauch"
            ],
            "file-count": 48,
            "sha256": "4ab1bc6b11b6b1ef1a8556280fd73fede9a147e6de709c80b561edd8b82ad2c9",
            "source": "https://registry.npmjs.org/socket.io-client/-/socket.io-client-4.5.4.tgz",
            "status": "approved"
        }
    ]
}