{
    "id": "npm/npmjs/-/unicode-property-aliases-ecmascript/2.1.0",
    "license": "MIT AND Unicode-3.0",
    "authority": "https://gitlab.eclipse.org/eclipsefdn/emo-team/iplab/-/issues/19201",
    "source": "https://github.com/mathiasbynens/unicode-property-aliases-ecmascript/archive/refs/tags/v2.1.0.zip",
    "status": "approved",
    "scans": [
        {
            "date": "January 26, 2025 at 4:13:06 a.m. GMT",
            "authority": "https://gitlab.eclipse.org/eclipsefdn/emo-team/iplab/-/issues/19201",
            "scancode-version": "31.2.1",
            "licenses-discovered": [
                "MIT",
                "LicenseRef-scancode-unicode"
            ],
            "copyrights": [
                "(c) 2022 Unicode(r), Inc.",
                "Copyright Mathias Bynens <https://mathiasbynens.be/>"
            ],
            "file-count": 10,
            "sha256": "181ecafa1ec24736baad87810ea889c7f8b492294eb63ec867b32ac815006fed",
            "source": "https://github.com/mathiasbynens/unicode-property-aliases-ecmascript/archive/refs/tags/v2.1.0.zip",
            "status": "restricted"
        }
    ]
}