{
    "id": "npm/npmjs/-/playwright/1.8.1",
    "license": "Apache-2.0 AND MIT AND CC0-1.0 AND LGPL-2.1-only",
    "licenses-discovered": [
        "Apache-2.0",
        "Apache-2.0 AND MIT",
        "Apache-2.0 AND CC0-1.0",
        "LGPL-2.1-only",
        "LGPL-2.1-or-later"
    ],
    "copyrights": [
        "(c) Sindre Sorhus",
        "Copyright (c) 1991, 1999 Free Software Foundation, Inc.",
        "Copyright (c) Facebook, Inc. and its affiliates",
        "Copyright (c) Microsoft Corporation",
        "Copyright (c) d- d the FFmpeg developers",
        "Copyright 1995-2017 Jean-loup Gailly and Mark Adler",
        "Copyright 1995-2017 Mark Adler",
        "Copyright 2017 Google Inc.",
        "Copyright 2018 Google Inc.",
        "Copyright 2019 Google Inc.",
        "Copyright 2019 Microsoft Corporation",
        "Copyright Microsoft Corporation",
        "Portions Copyright (c) Microsoft Corporation",
        "Portions Copyright 2017 Google Inc.",
        "copyright (c) Microsoft Corporation",
        "copyrighted by the Free Software Foundation"
    ],
    "file-count": 205,
    "scancode-version": "31.2.1",
    "authority": "https://gitlab.eclipse.org/eclipsefdn/emo-team/iplab/-/issues/4512",
    "source": "https://registry.npmjs.org/playwright/-/playwright-1.8.1.tgz",
    "status": "approved"
}
