{
    "id": "git/github/ASzc/change-string-case-action/v5",
    "license": "ISC AND MIT AND BSD-3-Clause AND Apache-2.0 AND (BSD-3-Clause AND MIT) AND BSD-2-Clause",
    "authority": "https://gitlab.eclipse.org/eclipsefdn/emo-team/iplab/-/issues/7987",
    "source": "https://github.com/ASzc/change-string-case-action/archive/refs/tags/v5.zip",
    "status": "approved",
    "scans": [
        {
            "date": "April 27, 2023 at 2:16:33 p.m. GMT",
            "authority": "https://gitlab.eclipse.org/eclipsefdn/emo-team/iplab/-/issues/7987",
            "scancode-version": "31.2.1",
            "licenses-discovered": [
                "ISC",
                "MIT",
                "BSD-3-Clause",
                "Apache-2.0",
                "BSD-3-Clause AND MIT",
                "BSD-2-Clause"
            ],
            "copyrights": [
                "(c) extraPathPercentEncodeSet.has",
                "Copyright (c) 2010-2020 Robert Kieffer and other contributors",
                "Copyright (c) 2012 Koichi Kobayashi",
                "Copyright (c) 2012-2014, Bram Stein",
                "Copyright (c) 2014, Domenic Denicola",
                "Copyright (c) 2014-2017, Jon Schlinkert",
                "Copyright (c) 2015-2016 Sebastian Mayr",
                "Copyright (c) 2016 David Frank",
                "Copyright (c) 2018 Octokit",
                "Copyright (c) 2018, Gregor Martynus (https://github.com/gr2m)",
                "Copyright (c) 2019 Octokit",
                "Copyright (c) 2019, Jon Schlinkert (https://github.com/jonschlinkert)",
                "Copyright (c) GitHub, Inc.",
                "Copyright (c) Gregor Martynus and contributors",
                "Copyright (c) Isaac Z. Schlueter and Contributors",
                "Copyright (c) Microsoft Corporation",
                "Copyright (c) Paul Johnston 1999 - 2009 Other contributors Greg Holt, Andrew Kepert, Ydnar, Lostinet",
                "Copyright 2011, Sebastian Tschan https://blueimp.net",
                "Copyright 2018 Gregor Martynus and other contributors",
                "Copyright 2019 GitHub",
                "Copyright 2020 Alex Szczuczko"
            ],
            "file-count": 474,
            "sha256": "727b0bf66e5600a2c367f9f6701cf81bc75d6e24e3dbfc8b509ad21237ee0e83",
            "source": "https://github.com/ASzc/change-string-case-action/archive/refs/tags/v5.zip",
            "status": "approved"
        }
    ]
}