{
    "id": "maven/mavencentral/org.geotools.ogc/net.opengis.wfs/23.3",
    "license": "LGPL-2.1-only",
    "authority": "https://gitlab.eclipse.org/eclipsefdn/emo-team/iplab/-/issues/5112",
    "source": "https://repo.osgeo.org/repository/geotools-releases/org/geotools/ogc/net.opengis.wfs/23.3/net.opengis.wfs-23.3-sources.jar",
    "status": "approved",
    "scans": [
        {
            "date": "November 24, 2022 at 4:57:15 p.m. GMT",
            "authority": "https://gitlab.eclipse.org/eclipsefdn/emo-team/iplab/-/issues/5112",
            "scancode-version": "31.2.1",
            "licenses-discovered": [
            ],
            "copyrights": [
                "Copyright (c) 2001 OGC",
                "Copyright (c) 2006,2010 Open Geospatial Consortium, Inc.",
                "Copyright (c) 2010 Open Geospatial Consortium",
                "Copyright (c) 2010 Open Geospatial Consortium, Inc."
            ],
            "file-count": 319,
            "sha256": "8ef9b9a7784b0bfd88e2401c87f3918f3257a18f43fd26e59915184cf68e6684",
            "source": "https://repo.osgeo.org/repository/geotools-releases/org/geotools/ogc/net.opengis.wfs/23.3/net.opengis.wfs-23.3-sources.jar",
            "status": "restricted"
        }
    ]
}
