{
    "id": "maven/mavencentral/androidx.lifecycle/lifecycle-runtime-compose/2.6.1",
    "license": "Apache-2.0",
    "authority": "https://gitlab.eclipse.org/eclipsefdn/emo-team/iplab/-/issues/10392",
    "source": "https://dl.google.com/android/maven2/androidx/lifecycle/lifecycle-runtime-compose/2.6.1/lifecycle-runtime-compose-2.6.1-sources.jar",
    "status": "approved",
    "scans": [
        {
            "date": "September 11, 2023 at 9:30:51 p.m. GMT",
            "authority": "https://gitlab.eclipse.org/eclipsefdn/emo-team/iplab/-/issues/10392",
            "scancode-version": "31.2.1",
            "licenses-discovered": [
                "Apache-2.0"
            ],
            "copyrights": [
                "Copyright 2022 The Android Open Source Project"
            ],
            "file-count": 2,
            "sha256": "dc61e56cf83fda48b6116e89f21846ec63d768d2e800ac0fe6993289c6dbe926",
            "source": "https://dl.google.com/android/maven2/androidx/lifecycle/lifecycle-runtime-compose/2.6.1/lifecycle-runtime-compose-2.6.1-sources.jar",
            "status": "approved"
        }
    ]
}