{
    "id": "npm/npmjs/@storybook/core-server/8.0.4",
    "license": "MIT",
    "authority": "https://gitlab.eclipse.org/eclipsefdn/emo-team/iplab/-/issues/14052",
    "source": "https://github.com/storybookjs/storybook/archive/refs/tags/v8.0.4.zip",
    "status": "approved",
    "scans": [
        {
            "date": "March 23, 2024 at 3:44:05 a.m. GMT",
            "authority": "https://gitlab.eclipse.org/eclipsefdn/emo-team/iplab/-/issues/14052",
            "scancode-version": "31.2.1",
            "licenses-discovered": [
                "GPL-1.0-or-later",
                "MIT",
                "BSD-2-Clause AND ISC AND MIT",
                "OFL-1.1",
                "ISC"
            ],
            "copyrights": [
                "(c) 2017-present Renaud Tertrais",
                "(c) Unknown J2 V",
                "(c) Unknown Ks",
                "(c) Unknown Wu",
                "(c) Unknown Xs",
                "Copyright (c) 2016 Oxyno-zeta (Havrileck Alexandre)",
                "Copyright (c) 2017 The swc Project",
                "Copyright (c) 2024 Storybook",
                "Copyright 2011-2020 Tilde Inc. and contributors",
                "Copyright 2020 The Rubik Filtered Project",
                "Gt qt (c) Component",
                "Portions Copyright 2006-2011 Strobe Inc.",
                "Portions Copyright 2008-2011 Apple Inc."
            ],
            "file-count": 5783,
            "sha256": "5600eb49f192e6c371b6d8b52d87a9853555959db61914a9f616255362e61ca2",
            "source": "https://github.com/storybookjs/storybook/archive/refs/tags/v8.0.4.zip",
            "status": "restricted"
        }
    ]
}
