{
    "id": "maven/mavencentral/com.miglayout/miglayout-core/11.4",
    "license": "BSD-3-Clause",
    "authority": "https://gitlab.eclipse.org/eclipsefdn/emo-team/iplab/-/issues/15628",
    "source": "https://repo1.maven.org/maven2/com/miglayout/miglayout-core/11.4/miglayout-core-11.4-sources.jar",
    "status": "approved",
    "scans": [
        {
            "date": "July 5, 2024 at 5:47:52 a.m. GMT",
            "authority": "https://gitlab.eclipse.org/eclipsefdn/emo-team/iplab/-/issues/15628",
            "scancode-version": "31.2.1",
            "licenses-discovered": [
                "BSD-3-Clause"
            ],
            "copyrights": [
                "Copyright (c) 2004, Mikael Grev, MiG InfoCom AB. (miglayout (at) miginfocom (dot) com)"
            ],
            "file-count": 26,
            "sha256": "22cc4cef7d791d4e25eedcbe56068d0c2562605d62a6a6912c52d12260e8a15a",
            "source": "https://repo1.maven.org/maven2/com/miglayout/miglayout-core/11.4/miglayout-core-11.4-sources.jar",
            "status": "approved"
        }
    ]
}