{
    "id": "go/golang/k8s.io/apimachinery/v0.29.0",
    "license": "Apache-2.0 AND BSD-3-Clause",
    "authority": "https://gitlab.eclipse.org/eclipsefdn/emo-team/iplab/-/issues/12934",
    "source": "https://proxy.golang.org/k8s.io/apimachinery/@v/v0.29.0.zip",
    "status": "approved",
    "scans": [
        {
            "date": "January 29, 2024 at 11:16:13 a.m. GMT",
            "authority": "https://gitlab.eclipse.org/eclipsefdn/emo-team/iplab/-/issues/12934",
            "scancode-version": "31.2.1",
            "licenses-discovered": [
                "Apache-2.0",
                "BSD-3-Clause"
            ],
            "copyrights": [
                "Copyright (c) 2009 The Go Authors",
                "Copyright 2009 The Go Authors",
                "Copyright 2013 The Go Authors",
                "Copyright 2014 The Kubernetes Authors",
                "Copyright 2015 The Kubernetes Authors",
                "Copyright 2016 The Kubernetes Authors",
                "Copyright 2017 The Kubernetes Authors",
                "Copyright 2018 The Kubernetes Authors",
                "Copyright 2019 The Kubernetes Authors",
                "Copyright 2020 The Kubernetes Authors",
                "Copyright 2021 The Kubernetes Authors",
                "Copyright 2022 The Kubernetes Authors",
                "Copyright 2023 The Kubernetes Authors"
            ],
            "file-count": 447,
            "sha256": "6badff692629b20a5881090d553f704db58e279efc0ff16a5ecf7120866da4a8",
            "source": "https://proxy.golang.org/k8s.io/apimachinery/@v/v0.29.0.zip",
            "status": "approved"
        }
    ]
}