{
    "id": "maven/mavencentral/com.azure.resourcemanager/azure-resourcemanager-search/2.29.0",
    "license": "MIT",
    "authority": "https://gitlab.eclipse.org/eclipsefdn/emo-team/iplab/-/issues/10027",
    "source": "https://repo.maven.apache.org/maven2/com/azure/resourcemanager/azure-resourcemanager-search/2.29.0/azure-resourcemanager-search-2.29.0-sources.jar",
    "status": "approved",
    "scans": [
        {
            "date": "August 11, 2023 at 2:43:54 p.m. GMT",
            "authority": "https://gitlab.eclipse.org/eclipsefdn/emo-team/iplab/-/issues/10027",
            "scancode-version": "31.2.1",
            "licenses-discovered": [
                "MIT"
            ],
            "copyrights": [
                "(c) 2008 VeriSign, Inc.",
                "Copyright (c) Microsoft Corporation"
            ],
            "file-count": 76,
            "sha256": "b423292b52802459d3278a144207182787c90016c1127d39b1f9199c78924a78",
            "source": "https://repo.maven.apache.org/maven2/com/azure/resourcemanager/azure-resourcemanager-search/2.29.0/azure-resourcemanager-search-2.29.0-sources.jar",
            "status": "approved"
        }
    ]
}