{
    "id": "maven/mavencentral/org.apache.tomcat/tomcat-api/9.0.70",
    "license": "Apache-2.0",
    "authority": "https://gitlab.eclipse.org/eclipsefdn/emo-team/iplab/-/issues/6169",
    "source": "https://search.maven.org/remotecontent?filepath=org/apache/tomcat/tomcat-api/9.0.70/tomcat-api-9.0.70-sources.jar",
    "status": "approved",
    "scans": [
        {
            "date": "January 9, 2023 at 6:30:24 p.m. GMT",
            "authority": "https://gitlab.eclipse.org/eclipsefdn/emo-team/iplab/-/issues/6169",
            "scancode-version": "31.2.1",
            "licenses-discovered": [
                "Apache-2.0"
            ],
            "copyrights": [
            ],
            "file-count": 13,
            "sha256": "f897573dbb8cbe7c41d88ea0272f39b73d8c22de36b87c5963ee5a556d6e9819",
            "source": "https://search.maven.org/remotecontent?filepath=org/apache/tomcat/tomcat-api/9.0.70/tomcat-api-9.0.70-sources.jar",
            "status": "approved"
        }
    ]
}