{
    "id": "p2/orbit/p2.eclipse.plugin/wrapped.org.apache.ant.ant-apache-regexp/1.10.14",
    "license": "Apache-2.0 AND LicenseRef-Public-domain AND W3C",
    "authority": "https://gitlab.eclipse.org/eclipsefdn/emo-team/iplab/-/issues/10635",
    "source": "https://repo.maven.apache.org/maven2/org/apache/ant/ant-apache-regexp/1.10.14/ant-apache-regexp-1.10.14-sources.jar",
    "status": "approved",
    "scans": [
        {
            "date": "September 25, 2023 at 9:33:52 p.m. GMT",
            "authority": "https://gitlab.eclipse.org/eclipsefdn/emo-team/iplab/-/issues/10635",
            "scancode-version": "31.2.1",
            "licenses-discovered": [
                "Apache-2.0 AND SAX-PD AND W3C",
                "Apache-2.0"
            ],
            "copyrights": [
            ],
            "file-count": 4,
            "sha256": "7e379247dba459f9a9f12843539c6aa014185c57542eed104688ac179293738f",
            "source": "https://repo.maven.apache.org/maven2/org/apache/ant/ant-apache-regexp/1.10.14/ant-apache-regexp-1.10.14-sources.jar",
            "status": "restricted"
        }
    ]
}
