{
    "id": "maven/mavencentral/org.apache.httpcomponents.client5/httpclient5/5.4",
    "license": "Apache-2.0 AND MPL-2.0",
    "authority": "https://gitlab.eclipse.org/eclipsefdn/emo-team/iplab/-/issues/16230",
    "source": "https://repo1.maven.org/maven2/org/apache/httpcomponents/client5/httpclient5/5.4/httpclient5-5.4-sources.jar",
    "status": "approved",
    "scans": [
        {
            "date": "September 20, 2024, 7:42:45 a.m. GMT",
            "authority": "https://gitlab.eclipse.org/eclipsefdn/emo-team/iplab/-/issues/16230",
            "scancode-version": "31.2.1",
            "licenses-discovered": [
                "Apache-2.0",
                "MPL-2.0"
            ],
            "copyrights": [
            ],
            "file-count": 384,
            "sha256": "ff08f025d31e8e6922f02f243ffa190b63e088c5348b5e86fbfabee72e32b6c9",
            "source": "https://repo1.maven.org/maven2/org/apache/httpcomponents/client5/httpclient5/5.4/httpclient5-5.4-sources.jar",
            "status": "approved"
        }
    ]
}