{
    "id": "maven/mavencentral/io.fabric8/openshift-model-operator/6.4.0",
    "license": "Apache-2.0",
    "authority": "https://gitlab.eclipse.org/eclipsefdn/emo-team/iplab/-/issues/6590",
    "source": "https://search.maven.org/remotecontent?filepath=io/fabric8/openshift-model-operator/6.4.0/openshift-model-operator-6.4.0-sources.jar",
    "status": "approved",
    "scans": [
        {
            "date": "January 24, 2023 at 9:10:37 a.m. GMT",
            "authority": "https://gitlab.eclipse.org/eclipsefdn/emo-team/iplab/-/issues/6590",
            "scancode-version": "31.2.1",
            "licenses-discovered": [
                "Apache-2.0"
            ],
            "copyrights": [
                "Copyright (c) 2015 Red Hat, Inc."
            ],
            "file-count": 672,
            "sha256": "f0695a327f36f4550976602452588054a5b3b32c50520043d258b30b1af46d0e",
            "source": "https://search.maven.org/remotecontent?filepath=io/fabric8/openshift-model-operator/6.4.0/openshift-model-operator-6.4.0-sources.jar",
            "status": "approved"
        }
    ]
}