{
    "id": "npm/npmjs/-/css-select/5.1.0",
    "license": "BSD-2-Clause AND MIT",
    "licenses-discovered": [
        "BSD-2-Clause",
        "MIT"
    ],
    "copyrights": [
        "(c) Steven Levithan",
        "Copyright (c) Felix Bohm"
    ],
    "file-count": 92,
    "scancode-version": "30.1.0",
    "authority": "https://gitlab.eclipse.org/eclipsefdn/emo-team/iplab/-/issues/3493",
    "source": "https://registry.npmjs.org/css-select/-/css-select-5.1.0.tgz",
    "status": "approved"
}