{
    "id": "git/github/qt/qtbase/v5.15.2",
    "license": "(LicenseRef-SLA OR LGPL-3.0-only OR GPL-2.0-or-later OR GPL-3.0-or-later) AND (AFL-2.1 OR GPL-2.0-or-later) AND Apache-2.0 AND blessing AND BSD-2-Clause AND BSD-3-Clause AND LicenseRef-BSD-style AND CC0-1.0 AND CC-PDDC AND (GFDL-1.3-only OR LicenseRef-SLA) AND (GPL-3.0-only WITH LicenseRef-Qt-GPL-exception-1.0 OR LicenseRef-SLA) AND (BSD-3-Clause OR LicenseRef-SLA) AND (FTL OR GPL-2.0-or-later) AND (LicenseRed-Software License Agreement OR GPL-3.0-or-later) AND (LicenseRef-Additional terms to license AND FTL) AND GDFL-1.3-only AND (GPL-2.0-only WITH LicenseRef-Linux-syscall-note) AND IJG AND Libpng AND LicenseRef-Public-domain AND LicenseRef-Arev-Fonts AND LicenseRef-AMSFonts-2.2 AND LicenseRef-Bitstream-Vera-Fonts AND MIT AND(LicenseRef-SLA OR LGPL-3.0-only OR GPL-2.0-or-later) AND LicenseRef-MIT-CMU-style AND MIT-Modern-Variant AND MIT-open-group AND LicenseRef-MIT-style AND ((LicenseRef-SLA OR LGPL-3.0-only OR GPL-2.0-or-later) AND LicenseRef-OpenSSL-exception) AND LicenseRef-Permission Notice AND SGI-B-2.0 AND LicenseRef-Permissive-license-with-conditions AND LicenseRef-Public-domain AND LicenseRef-Third Party Permissive License Notice AND LicenseRef-Unicode-TOU AND Unicode AND Unicode-DFS-2016 AND W3C-19980720 AND LicenseRef-Warranty-disclaimer AND X11 AND LicenseRef-X11-style AND LicenseRef-Zlib-style AND Zlib",
    "licenses-discovered": [
        "LGPL-2.1-only",
        "GPL-3.0-only AND LicenseRef-scancode-commercial-license AND Qt-GPL-exception-1.0",
        "GPL-2.0-only AND GPL-3.0-only AND LGPL-2.1-or-later AND LGPL-3.0-only",
        "GFDL-1.3-only",
        "GPL-2.0-only",
        "GPL-3.0-only",
        "GPL-3.0-only AND Qt-GPL-exception-1.0",
        "LGPL-3.0-only",
        "GPL-3.0-only AND LGPL-3.0-only",
        "GPL-2.0-only AND GPL-3.0-only AND LGPL-2.1-only AND LicenseRef-scancode-commercial-license AND LicenseRef-scancode-proprietary-license AND LicenseRef-scancode-unknown",
        "LGPL-2.0-or-later",
        "LGPL-2.0-or-later AND LicenseRef-scancode-commercial-license AND LicenseRef-scancode-kfqf-accepted-gpl",
        "GPL-1.0-or-later",
        "Artistic-2.0 AND EPL-1.0 AND GPL-1.0-or-later AND ZPL-2.1",
        "CDDL-1.0 AND GPL-1.0-or-later",
        "GPL-1.0-or-later AND GPL-3.0-only",
        "GPL-1.0-or-later AND GPL-3.0-only AND LGPL-3.0-only",
        "BSD-2-Clause",
        "MIT",
        "LGPL-2.1-only AND LGPL-3.0-only",
        "GPL-2.0-only AND GPL-3.0-only AND LGPL-2.0-only AND LGPL-2.1-only AND LGPL-3.0-only",
        "Apache-2.0",
        "GFDL-1.1-or-later",
        "BSD-3-Clause AND GPL-1.0-or-later AND GPL-3.0-only AND LGPL-2.1-only AND LicenseRef-scancode-commercial-license AND Qt-GPL-exception-1.0",
        "BSD-3-Clause AND LicenseRef-scancode-commercial-license",
        "GFDL-1.3-only AND LicenseRef-scancode-commercial-license",
        "LicenseRef-scancode-free-unknown",
        "LicenseRef-scancode-khronos",
        "BSD-3-Clause",
        "BSD-2-Clause AND BSD-3-Clause AND MIT",
        "SGI-B-2.0",
        "GPL-2.0-only AND LGPL-2.0-or-later AND LicenseRef-scancode-commercial-license AND LicenseRef-scancode-kfqf-accepted-gpl",
        "BSD-3-Clause AND FTL AND GPL-2.0-only AND GPL-3.0-only AND LicenseRef-scancode-unknown AND Zlib",
        "FTL AND GPL-2.0-only AND MIT AND Zlib",
        "FTL",
        "Zlib",
        "FTL AND LicenseRef-scancode-generic-exception",
        "BSD-3-Clause AND GPL-2.0-only AND GPL-3.0-only AND LicenseRef-scancode-unknown AND Zlib",
        "LicenseRef-scancode-other-permissive",
        "FTL AND LicenseRef-scancode-freetype-patent",
        "MIT-open-group",
        "Apache-2.0 AND CPL-1.0 AND LGPL-2.1-only AND MIT",
        "MIT-Modern-Variant",
        "LicenseRef-scancode-other-permissive AND MIT-Modern-Variant",
        "BSD-2-Clause AND BSD-3-Clause",
        "BSD-3-Clause AND IJG AND Zlib",
        "IJG",
        "Libpng",
        "LicenseRef-scancode-public-domain-disclaimer",
        "LicenseRef-scancode-brian-gladman",
        "CC0-1.0",
        "BSD-2-Clause AND CC0-1.0",
        "blessing",
        "LicenseRef-scancode-ams-fonts AND LicenseRef-scancode-bitstream AND LicenseRef-scancode-public-domain-disclaimer",
        "LicenseRef-scancode-bitstream",
        "LicenseRef-scancode-lcs-telegraphics",
        "LicenseRef-scancode-xfree86-1.0",
        "BSD-2-Clause AND LicenseRef-scancode-commercial-license",
        "BSD-2-Clause AND LicenseRef-scancode-digia-qt-commercial",
        "GPL-2.0-only AND GPL-3.0-only AND LGPL-3.0-or-later AND LicenseRef-scancode-commercial-license AND Qt-GPL-exception-1.0",
        "BSD-2-Clause AND LGPL-2.0-or-later AND LicenseRef-scancode-commercial-license AND LicenseRef-scancode-kfqf-accepted-gpl",
        "BSD-3-Clause AND GFDL-1.3-only AND GPL-2.0-only AND LGPL-3.0-only AND LicenseRef-scancode-commercial-license",
        "MPL-2.0",
        "MPL-1.1 AND MPL-2.0",
        "GPL-2.0-or-later AND LGPL-2.1-or-later AND LGPL-3.0-only AND MPL-1.1 AND MPL-2.0",
        "BSD-3-Clause AND GPL-1.0-or-later AND LGPL-2.0-or-later AND LGPL-3.0-only AND LicenseRef-scancode-commercial-license AND LicenseRef-scancode-kfqf-accepted-gpl",
        "LGPL-2.0-or-later AND LicenseRef-scancode-commercial-license AND LicenseRef-scancode-generic-exception AND LicenseRef-scancode-kfqf-accepted-gpl",
        "BSD-3-Clause AND LGPL-2.0-or-later AND LicenseRef-scancode-commercial-license AND LicenseRef-scancode-kfqf-accepted-gpl",
        "Unicode-DFS-2016",
        "LicenseRef-scancode-unicode",
        "GPL-3.0-only AND LicenseRef-scancode-commercial-license",
        "LGPL-2.0-or-later AND LicenseRef-scancode-commercial-license AND LicenseRef-scancode-ian-piumarta AND LicenseRef-scancode-kfqf-accepted-gpl AND LicenseRef-scancode-unicode",
        "AFL-2.1 AND GPL-2.0-or-later AND LGPL-2.0-or-later AND LicenseRef-scancode-commercial-license AND LicenseRef-scancode-kfqf-accepted-gpl",
        "AFL-2.1 AND GPL-2.0-only",
        "AFL-2.1 AND GPL-2.0-or-later",
        "GFDL-1.3-only AND GPL-2.0-only AND GPL-3.0-only AND LGPL-3.0-only AND LicenseRef-scancode-commercial-license AND Qt-GPL-exception-1.0",
        "FTL AND LGPL-2.0-or-later AND LicenseRef-scancode-commercial-license AND LicenseRef-scancode-kfqf-accepted-gpl",
        "BSD-2-Clause AND MIT-enna",
        "HPND AND LGPL-2.0-or-later AND LicenseRef-scancode-commercial-license AND LicenseRef-scancode-kfqf-accepted-gpl AND X11",
        "BSD-2-Clause AND FTL AND GPL-2.0-only AND MIT AND X11",
        "HPND AND X11",
        "GPL-2.0-only AND LGPL-3.0-only AND LicenseRef-scancode-digia-qt-commercial",
        "GPL-2.0-only AND GPL-3.0-only AND LGPL-2.1-only AND LGPL-3.0-only AND LicenseRef-scancode-digia-qt-commercial AND LicenseRef-scancode-qt-company-exception-lgpl-2.1",
        "GPL-3.0-only AND LicenseRef-scancode-commercial-license AND OpenSSL AND Qt-GPL-exception-1.0",
        "GFDL-1.3-only AND GPL-2.0-only AND GPL-3.0-only AND LGPL-3.0-only AND LicenseRef-scancode-commercial-license AND LicenseRef-scancode-generic-exception AND OpenSSL AND Qt-GPL-exception-1.0",
        "LGPL-2.0-or-later AND LicenseRef-scancode-commercial-license AND LicenseRef-scancode-kfqf-accepted-gpl AND MIT",
        "GPL-2.0-only AND LGPL-2.0-or-later AND LicenseRef-scancode-commercial-license AND LicenseRef-scancode-generic-exception AND LicenseRef-scancode-kfqf-accepted-gpl",
        "GFDL-1.3-only AND GPL-2.0-only AND GPL-3.0-only AND LGPL-3.0-or-later AND LicenseRef-scancode-commercial-license AND Qt-GPL-exception-1.0",
        "LGPL-2.0-or-later AND LicenseRef-scancode-commercial-license AND LicenseRef-scancode-kfqf-accepted-gpl AND LicenseRef-scancode-xfree86-1.0 AND MIT",
        "Apache-2.0 AND LGPL-2.0-or-later AND LicenseRef-scancode-commercial-license AND LicenseRef-scancode-kfqf-accepted-gpl",
        "GFDL-1.3-only AND GPL-1.0-or-later AND LGPL-2.0-or-later AND LicenseRef-scancode-commercial-license AND LicenseRef-scancode-digia-qt-commercial",
        "bzip2-1.0.6",
        "GPL-2.0-only AND Linux-syscall-note",
        "BSD-4-Clause AND MIT",
        "GFDL-1.3-only AND GPL-2.0-only AND LGPL-3.0-only AND LicenseRef-scancode-commercial-license",
        "GFDL-1.3-only AND GPL-2.0-only AND GPL-3.0-only AND LicenseRef-scancode-commercial-license AND LicenseRef-scancode-digia-qt-commercial AND Qt-GPL-exception-1.0",
        "BSD-3-Clause AND GPL-3.0-only AND LicenseRef-scancode-commercial-license AND Qt-GPL-exception-1.0",
        "LicenseRef-scancode-ietf",
        "W3C-19980720",
        "LicenseRef-scancode-proprietary-license",
        "CC-PDDC",
        "GPL-3.0-only AND LGPL-2.0-or-later AND LGPL-2.1-only AND LicenseRef-scancode-commercial-license",
        "GPL-3.0-only AND LicenseRef-scancode-commercial-license AND LicenseRef-scancode-public-domain-disclaimer AND Qt-GPL-exception-1.0",
        "Apache-2.0 AND LGPL-2.0-only AND LGPL-2.1-only AND LGPL-3.0-only",
        "GPL-3.0-only AND LGPL-2.0-or-later AND LicenseRef-scancode-commercial-license AND LicenseRef-scancode-kfqf-accepted-gpl AND Qt-GPL-exception-1.0",
        "GPL-3.0-only AND LGPL-2.0-or-later AND LGPL-3.0-only AND LicenseRef-scancode-commercial-license AND LicenseRef-scancode-kfqf-accepted-gpl AND Qt-GPL-exception-1.0"
    ],
    "copyrights": [
        "(c) ,$?o2Y$?1$? <$?E'O$?1$?e3/4UoU$?I!$?EI$?I http://www.w3.org/TR/NOTE-sgml-xml'>",
        "(c) AExtensible Markup Language",
        "(c) AIC1998N2EWorld Wide Web Consortium",
        "(c) AIQAEBnI L",
        "(c) Alexandre PUKALL Avril",
        "(c) American Mathematical Society",
        "(c) B PerlISSaPaiPdUThoCif",
        "(c) Carsten Haitzler and various contributors",
        "(c) Copyright IBM Corp.",
        "(c) Daniel M. Duley",
        "(c) David Turner <david@freetype.org>",
        "(c) E AIUeIACIy",
        "(c) Ee-EaEuE OIuI",
        "(c) I$?iAT g3eCXMLdT g e http://www.w3.org/XML",
        "(c) Ia (c)",
        "(c) IaeH, ANH",
        "(c) Is2ndByteIn4Bytes (c)",
        "(c) IsSecondByteRange2 (c)",
        "(c) Jean-loup Gailly and Mark Adler",
        "(c) Kris Rowley",
        "(c) M. Preus",
        "(c) Martin Preuss Schlie Close",
        "(c) QString n QString",
        "(c) SE0o OS",
        "(c) Tavmjong Bah",
        "(c) Tavmjung Bah",
        "(c) The Qt Company",
        "(c) The Qt Company Ltd. Documentation",
        "(c) Trolltech ASA",
        "(c) Unicode(r), Inc.",
        "(c) Willem Monsuwe <willem@stack.nl>",
        "(c) YouTube, LLC",
        "(c) by Bitstream, Inc.",
        "(c) by John Bradley",
        "(c) co",
        "COPYRIGHT BY SNK CORPORATION",
        "Copyright (c) 1 The Qt Company Ltd",
        "Copyright (c) 2006-11-28 Charles Poynton",
        "Copyright (c) Advanced Micro Devices, Inc.",
        "Copyright (c) Aleix Pol Gonzalez <aleixpol@kde.org> Contact https://www.qt.io/licensing",
        "Copyright (c) Alex Trotsenko Contact https://www.qt.io/licensing",
        "Copyright (c) Alexander Peslyak",
        "Copyright (c) Andre Klitzing <aklitzing@gmail.com> Contact https://www.qt.io/licensing",
        "Copyright (c) Andre Klitzing Contact https://www.qt.io/licensing",
        "Copyright (c) Andreas Dilger",
        "Copyright (c) Andrey Panin <pazke@donpac.ru>",
        "Copyright (c) Anthony Fok, ThizLinux Laboratory Ltd.",
        "Copyright (c) Apple Inc.",
        "Copyright (c) Arm Limited",
        "Copyright (c) Bart Massey, Jamey Sharp, and Josh Triplett",
        "Copyright (c) Behdad Esfahbod",
        "Copyright (c) Bitstream,Inc",
        "Copyright (c) BlackBerry Limited",
        "Copyright (c) BogDan Vatra <bogdan@kdab.com> Contact https://www.qt.io/licensing",
        "Copyright (c) BogDan Vatra <bogdan@kde.org>",
        "Copyright (c) BogDan Vatra <bogdan@kde.org> Contact http://www.qt-project.org/legal",
        "Copyright (c) BogDan Vatra <bogdan@kde.org> Contact http://www.qt.io/licensing",
        "Copyright (c) BogDan Vatra <bogdan@kde.org> Contact https://www.qt.io/licensing",
        "Copyright (c) Borgar Ovsthus Contact https://www.qt.io/licensing",
        "Copyright (c) Brian Gladman, Worcester, UK.",
        "Copyright (c) Canonical Ltd. Contact https://www.qt.io/licensing",
        "Copyright (c) Carsten Haitzler and various contributors",
        "Copyright (c) Chris Wilson",
        "Copyright (c) CodeFactory AB",
        "Copyright (c) Codethink Limited",
        "Copyright (c) Collabora Ltd",
        "Copyright (c) Cosmin Truta",
        "Copyright (c) Crimson AS <info@crimson.no>",
        "Copyright (c) D. R. Commander",
        "Copyright (c) Dan Nicholson",
        "Copyright (c) Daniel M. Duley",
        "Copyright (c) Daniel Martin",
        "Copyright (c) Dave Martindale",
        "Copyright (c) David Faure <david.faure@kdab.com> Contact https://www.qt.io/licensing",
        "Copyright (c) David Faure <faure+bluesystems@kde.org>",
        "Copyright (c) David Faure <faure+bluesystems@kde.org> Contact https://www.qt.io/licensing",
        "Copyright (c) David Faure <faure@kde.org> Contact https://www.qt.io/licensing",
        "Copyright (c) David Turner",
        "Copyright (c) David Turner and Werner Lemberg",
        "Copyright (c) Dmitry Shachnev <mitya57@gmail.com> Contact https://www.qt.io/licensing",
        "Copyright (c) Dominik Reichl <dominik.reichl@t-online.de>",
        "Copyright (c) Drew Parsons <dparsons@emerall.com> Contact https://www.qt.io/licensing",
        "Copyright (c) Eric S. Raymond",
        "Copyright (c) Frank J. T. Wojcik",
        "Copyright (c) Free Software Foundation, Inc.",
        "Copyright (c) Free Software Foundation, Inc. <http://fsf.org/>",
        "Copyright (c) Gilles Vollant",
        "Copyright (c) Giuseppe D'Angelo <dangelog@gmail.com>",
        "Copyright (c) Glenn Randers-Pehrson",
        "Copyright (c) Google, Inc.",
        "Copyright (c) Governikus GmbH & Co.",
        "Copyright (c) Governikus GmbH & Co. KG Contact https://www.qt.io/licensing",
        "Copyright (c) Gradle Inc.",
        "Copyright (c) Green Hills Software",
        "Copyright (c) Green Hills Software Contact https://www.qt.io/licensing",
        "Copyright (c) Greg Roelofs",
        "Copyright (c) Guy Eric Schalnat, Group 42, Inc.",
        "Copyright (c) Hans Petter Bieker",
        "Copyright (c) Harald Meyer. Contact https://www.qt.io/licensing",
        "Copyright (c) Hewlett-Packard Development Company, L.P. Contact https://www.qt.io/licensing",
        "Copyright (c) IBM Corporation",
        "Copyright (c) IETF Trust",
        "Copyright (c) Igalia S.L.",
        "Copyright (c) Imagination Technologies Limited, www.imgtec.com",
        "Copyright (c) Intel Corporation",
        "Copyright (c) Intel Corporation. Contact http://www.qt-project.org/legal",
        "Copyright (c) Intel Corporation. Contact https://www.qt.io/licensing",
        "Copyright (c) Ivan Komissarov <ABBAPOH@gmail.com>",
        "Copyright (c) Ivan Komissarov <ABBAPOH@gmail.com> Contact https://www.qt.io/licensing",
        "Copyright (c) Ivan Komissarov Contact https://www.qt.io/licensing",
        "Copyright (c) James Clark",
        "Copyright (c) James Su, Turbolinux Inc.",
        "Copyright (c) James Yu",
        "Copyright (c) Jean-loup Gailly",
        "Copyright (c) Jean-loup Gailly and Mark Adler",
        "Copyright (c) Jean-loup Gailly, Mark Adler",
        "Copyright (c) Jeremy Laine <jeremy.laine@m4x.org>",
        "Copyright (c) Jeremy Laine <jeremy.laine@m4x.org> Contact https://www.qt.io/licensing",
        "Copyright (c) John Bowler",
        "Copyright (c) John Layt <jlayt@kde.org>",
        "Copyright (c) John Layt <jlayt@kde.org> Contact https://www.qt.io/licensing",
        "Copyright (c) Jolla Ltd",
        "Copyright (c) Josef Weidendorfer",
        "Copyright (c) Julian Seward",
        "Copyright (c) KDAB Contact https://www.qt.io/licensing",
        "Copyright (c) Kai Pastor Contact https://www.qt.io/licensing",
        "Copyright (c) Keith Gardner <kreios4004@gmail.com> Contact https://www.qt.io/licensing",
        "Copyright (c) Keith Stribley",
        "Copyright (c) Kevin Bracey",
        "Copyright (c) Kitware, Inc. Contact https://www.qt.io/licensing",
        "Copyright (c) Klaralvdalens Datakonsult AB",
        "Copyright (c) Klaralvdalens Datakonsult AB, a KDAB Group company, info@kdab.com",
        "Copyright (c) Klaralvdalens Datakonsult AB. Contact https://www.qt.io/licensing",
        "Copyright (c) Konstantin Ritt",
        "Copyright (c) Konstantin Ritt <ritt.ks@gmail.com>",
        "Copyright (c) Konstantin Ritt Contact https://www.qt.io/licensing",
        "Copyright (c) LG Electronics Ltd",
        "Copyright (c) Laszlo Papp <lpapp@kde.org>",
        "Copyright (c) Laszlo Papp <lpapp@kde.org> Contact https://www.qt.io/licensing",
        "Copyright (c) Lawrence E. Rosen",
        "Copyright (c) Linaro Limited",
        "Copyright (c) Linux Foundation",
        "Copyright (c) Luca Beldi <v.ronin@yahoo.it> Contact https://www.qt.io/licensing",
        "Copyright (c) LunarG, Inc.",
        "Copyright (c) MIPS Technologies, Inc.",
        "Copyright (c) MIPS Technologies, Inc., California",
        "Copyright (c) MIYASAKA Masaru",
        "Copyright (c) Magnus Holmgren",
        "Copyright (c) Mail.ru Group. Contact http://www.qt.io/licensing",
        "Copyright (c) Mail.ru Group. Contact https://www.qt.io/licensing",
        "Copyright (c) Mandar Sahastrabuddhe",
        "Copyright (c) Mans Rullgard",
        "Copyright (c) Marco Martin <notmart@gmail.com>",
        "Copyright (c) Mark Adler",
        "Copyright (c) Martin Graesslin <mgraesslin@kde.org> Contact https://www.qt.io/licensing",
        "Copyright (c) Martin Hosken and SIL International",
        "Copyright (c) Martin Mitas",
        "Copyright (c) Massachusetts Institute of Technology",
        "Copyright (c) Matteo Frigo",
        "Copyright (c) Matthieu Darbois",
        "Copyright (c) Mikkel Krautz <mikkel@krautz.dk>",
        "Copyright (c) Mikkel Krautz <mikkel@krautz.dk> Contact https://www.qt.io/licensing",
        "Copyright (c) Ming-Che Chuang",
        "Copyright (c) Mizi Research Inc.",
        "Copyright (c) Mozilla Foundation",
        "Copyright (c) NVIDIA, Corporation",
        "Copyright (c) Nokia Corporation",
        "Copyright (c) Nokia Corporation and/or its subsidiary(-ies)",
        "Copyright (c) Oleksandr Tymoshenko <gonzo@bluezbox.com> Contact https://www.qt.io/licensing",
        "Copyright (c) Olivier Goffart <ogoffart@woboq.com>",
        "Copyright (c) Olivier Goffart <ogoffart@woboq.com> Contact http://www.qt.io/licensing",
        "Copyright (c) Olivier Goffart <ogoffart@woboq.com> Contact https://www.qt.io/licensing",
        "Copyright (c) Olivier Goffart <ogoffart@woboq.org> Contact https://www.qt.io/licensing",
        "Copyright (c) Olivier Goffart. Contact https://www.qt.io/licensing",
        "Copyright (c) Paul Schmidt",
        "Copyright (c) Pelagicore AG",
        "Copyright (c) Pelagicore AG Contact https://www.qt.io/licensing",
        "Copyright (c) Peter Hutterer",
        "Copyright (c) Petroules Corporation. Contact https://www.qt.io/licensing",
        "Copyright (c) Pier Luigi Fiorini <pierluigi.fiorini@gmail.com>",
        "Copyright (c) Pier Luigi Fiorini <pierluigi.fiorini@gmail.com> Contact https://www.qt.io/licensing",
        "Copyright (c) Pierre Ossman for Cendio AB",
        "Copyright (c) QNX Software Systems",
        "Copyright (c) QOS.ch",
        "Copyright (c) Red Hat, Inc Contact https://www.qt.io/licensing",
        "Copyright (c) Red Hat, Inc.",
        "Copyright (c) Red Hat, Inc., Ingo Molnar",
        "Copyright (c) Red Hat, Inc., Peter Zijlstra",
        "Copyright (c) Research",
        "Copyright (c) Research In Motion Limited",
        "Copyright (c) Research in Motion. Contact https://www.qt.io/licensing",
        "Copyright (c) Richard J. Moore <rich@kde.org>",
        "Copyright (c) Richard J. Moore <rich@kde.org> Contact https://www.qt.io/licensing",
        "Copyright (c) Rick Stockton <rickstockton@reno-computerhelp.com> Contact https://www.qt.io/licensing",
        "Copyright (c) Robert Penner",
        "Copyright (c) Robin Burchell <robin+qt@viroteck.net> Contact https://www.qt.io/licensing",
        "Copyright (c) Robin Burchell <robin.burchell@viroteck.net>",
        "Copyright (c) Robin Burchell <robin.burchell@viroteck.net> Contact https://www.qt.io/licensing",
        "Copyright (c) Ruslan Nigmatullin <euroelessar@yandex.ru> Contact https://www.qt.io/licensing",
        "Copyright (c) Sam Bushell",
        "Copyright (c) Samuel Gaist <samuel.gaist@deltech.ch> Contact https://www.qt.io/licensing",
        "Copyright (c) Samuel Gaist <samuel.gaist@edeltech.ch>",
        "Copyright (c) Samuel Gaist <samuel.gaist@edeltech.ch> Contact https://www.qt.io/licensing",
        "Copyright (c) Samuel Gaist <samuel.gaist@idiap.ch> Contact https://www.qt.io/licensing",
        "Copyright (c) Serika Kurusugawa",
        "Copyright (c) Siarhei Siamashka",
        "Copyright (c) Simon-Pierre Cadieux",
        "Copyright (c) Stephen Kelly <steveire@gmail,com> Contact https://www.qt.io/licensing",
        "Copyright (c) Stephen Kelly <steveire@gmail.com> Contact https://www.qt.io/licensing",
        "Copyright (c) Sun Microsystems, Inc.",
        "Copyright (c) Teo Mrnjavac <teo@kde.org>",
        "Copyright (c) The ANGLE Project",
        "Copyright (c) The Android Open Source Project",
        "Copyright (c) The Apache Software Foundation",
        "Copyright (c) The Chromium Authors",
        "Copyright (c) The FreeBSD Foundation",
        "Copyright (c) The Internet Society",
        "Copyright (c) The Khronos Group Inc.",
        "Copyright (c) The PNG Reference",
        "Copyright (c) The Qt Company",
        "Copyright (c) The Qt Company Ltd.",
        "Copyright (c) The Qt Company Ltd. Contact http://www.qt.io/licensing",
        "Copyright (c) The Qt Company Ltd. Contact https://www.qt.io/licensing",
        "Copyright (c) The Regents of the University of California",
        "Copyright (c) The libjpeg-turbo Project",
        "Copyright (c) Thiago Macieira <thiago@kde.org>",
        "Copyright (c) Thiago Macieira <thiago@kde.org> Contact https://www.qt.io/licensing",
        "Copyright (c) ThizLinux Laboratory Ltd.",
        "Copyright (c) Thomas G. Lane",
        "Copyright (c) Thomas G. Lane, Guido Vollbeding",
        "Copyright (c) Thomas Gleixner <tglx@linutronix.de>",
        "Copyright (c) Thorbjorn Lund Martsum - tmartsum at gmail.com",
        "Copyright (c) Thorbjorn Martsum - tmartsum at gmail.com",
        "Copyright (c) Tim Wegner",
        "Copyright (c) Tom Lane",
        "Copyright (c) Tom Tanner",
        "Copyright (c) TurboLinux, Inc.",
        "Copyright (c) Unicode, Inc.",
        "Copyright (c) University of Cambridge",
        "Copyright (c) Valve Corporation",
        "Copyright (c) Viktor Szathmary",
        "Copyright (c) Volker Krause <vkrause@kde.org> Contact https://www.qt.io/licensing",
        "Copyright (c) WU Yi, HancomLinux Inc.",
        "Copyright (c) Willem van Schaik",
        "Copyright (c) World Wide Web Consortium, (Massachusetts Institute of Technology, Institut National de Recherche en Informatique et en Automatique, Keio University)",
        "Copyright (c) X Consortium",
        "Copyright (c) Zoltan Herczeg",
        "Copyright (c) by Agner Fog",
        "Copyright (c) by Albert",
        "Copyright (c) by Armin Hasitzka, David Turner, Robert Wilhelm, and Werner Lemberg",
        "Copyright (c) by Bitstream, Inc.",
        "Copyright (c) by David Turner",
        "Copyright (c) by David Turner, Robert Wilhelm, Werner Lemberg, and George Williams",
        "Copyright (c) by David Turner, Robert Wilhelm, Werner Lemberg, and suzuki toshiya",
        "Copyright (c) by Dereg Clegg and Michael Toftdal",
        "Copyright (c) by Derek Clegg and Michael Toftdal",
        "Copyright (c) by Francesco Zappa Nardelli",
        "Copyright (c) by George Williams",
        "Copyright (c) by Google, Inc.",
        "Copyright (c) by Joel Klinghed",
        "Copyright (c) by Just van Rossum, David Turner, Robert Wilhelm, and Werner Lemberg",
        "Copyright (c) by Masatake YAMATO and Redhat K.K.",
        "Copyright (c) by Masatake YAMATO, Red Hat K.K., David Turner, Robert Wilhelm, and Werner Lemberg",
        "Copyright (c) by Masatake YAMATO, Redhat K.K, David Turner, Robert Wilhelm, and Werner Lemberg",
        "Copyright (c) by Rahul Bhalerao <rahul.bhalerao@redhat.com>",
        "Copyright (c) by Roberto Alameda",
        "Copyright (c) by Southwest Research Institute",
        "Copyright (c) by Southwest Research Institute (R) Contact http://www.qt-project.org/legal",
        "Copyright (c) by Southwest Research Institute (R) Contact https://www.qt.io/licensing",
        "Copyright (c) by Tavmjong Bah",
        "Copyright (c) by Werner Lemberg",
        "Copyright (c) by suzuki toshiya, Masatake YAMATO and Red Hat K.K.",
        "Copyright (c) by suzuki toshiya, Masatake YAMATO, Red",
        "Copyright (c) by suzuki toshiya, Masatake YAMATO, Red Hat K.K., David Turner, Robert Wilhelm, and Werner Lemberg",
        "Copyright (c) itmeo",
        "Copyright (c) ownCloud Inc",
        "Copyright (c) the Initial Developer",
        "Copyright Adobe Systems",
        "Copyright Adobe Systems Incorporated",
        "Copyright Computing Research Labs, New Mexico State University",
        "Copyright Dmitry Timoshkov",
        "Copyright Francesco Zappa Nardelli",
        "Copyright Fuji Xerox Information Systems Co.,Ltd.",
        "Copyright Huw D M Davies for Codeweavers",
        "Copyright International Color Consortium",
        "Copyright Kitware, Inc.",
        "Copyright Pierre Ossman <ossman@cendio.se> for Cendio AB",
        "Copyright Richard Tobin, HCRC",
        "Copyright Such-and-such",
        "Copyright The Open Group",
        "Copyright Tilera",
        "Copyright Zoltan Herczeg (hzmester@freemail.hu)",
        "Copyright by David Turner, Robert Wilhelm, and Werner Lemberg",
        "Copyright by Digital Equipment Corporation, Maynard, Massachusetts",
        "Copyright by Google, Inc. Google Author(s) Behdad Esfahbod",
        "Copyright by Matthew Welch",
        "Copyright by Oran Agra and Mickey Gabel",
        "Copyright by write David Turner, Robert Wilhelm, and Werner Lemberg",
        "Copyright foobar",
        "Copyright property of CompuServe Incorporated",
        "Copyright the V8 project",
        "InternalFormat (c) Format",
        "Launch (c) QShortcut",
        "QBrush (c) QPixmap",
        "QCompletionEngine (c) QMatchData",
        "TestLayout (c) TestGraphicsWidget",
        "WEsseI (c) (c)",
        "Wd (c) EeKvaq",
        "copyright (c) The FreeType Project (www.freetype.org)",
        "copyright QRectF boundingBox QFixed",
        "copyright QString family QString",
        "copyright by LCS/Telegraphics",
        "copyright by Sun Microsystems, Inc.",
        "copyright by W3C.",
        "copyrighted by me and others",
        "copyrighted by the Free Software Foundation"
    ],
    "file-count": 21962,
    "scancode-version": "30.1.0",
    "authority": "https://gitlab.eclipse.org/eclipsefdn/emo-team/iplab/-/issues/3154",
    "source": "https://github.com/qt/qtbase/archive/refs/tags/v5.15.2.zip",
    "status": "approved"
}
