{
    "id": "go/golang/sigs.k8s.io%2Fstructured-merge-diff/v4/v4.3.0",
    "license": "Apache-2.0",
    "authority": "https://gitlab.eclipse.org/eclipsefdn/emo-team/iplab/-/issues/10760",
    "source": "https://proxy.golang.org/sigs.k8s.io%2Fstructured-merge-diff/v4/@v/v4.3.0.zip",
    "status": "approved",
    "scans": [
        {
            "date": "September 29, 2023 at 4:37:19 p.m. GMT",
            "authority": "https://gitlab.eclipse.org/eclipsefdn/emo-team/iplab/-/issues/10760",
            "scancode-version": "31.2.1",
            "licenses-discovered": [
                "Apache-2.0"
            ],
            "copyrights": [
                "Copyright 2018 The Kubernetes Authors",
                "Copyright 2019 The Kubernetes Authors",
                "Copyright 2020 The Kubernetes Authors",
                "Copyright 2023 The Kubernetes Authors"
            ],
            "file-count": 120,
            "sha256": "0a5107d9269d3fc45d3abb9a1fc0c3c4788b82d848679416cb4c2bc49cad89de",
            "source": "https://proxy.golang.org/sigs.k8s.io%2Fstructured-merge-diff/v4/@v/v4.3.0.zip",
            "status": "approved"
        }
    ]
}