{
    "id": "npm/npmjs/@babel/parser/7.26.1",
    "license": "MIT AND (BSD-2-Clause AND ISC AND MIT) AND BSD-2-Clause AND BSD-3-Clause",
    "authority": "https://gitlab.eclipse.org/eclipsefdn/emo-team/iplab/-/issues/16882",
    "source": "https://github.com/babel/babel/archive/refs/tags/v7.26.1.zip",
    "status": "approved",
    "scans": [
        {
            "date": "October 26, 2024, 9:14:49 p.m. GMT",
            "authority": "https://gitlab.eclipse.org/eclipsefdn/emo-team/iplab/-/issues/16882",
            "scancode-version": "31.2.1",
            "licenses-discovered": [
                "MIT",
                "BSD-2-Clause AND ISC AND MIT",
                "BSD-2-Clause",
                "BSD-3-Clause"
            ],
            "copyrights": [
                "(c) 2014-2024 Denis Pushkarev",
                "Copyright (c) 2011-2017 KARASZI Istvan <github@spam.raszi.hu>",
                "Copyright (c) 2012 Yusuke Suzuki <utatane.tea@gmail.com>",
                "Copyright (c) 2012-2013 Ecma International",
                "Copyright (c) 2012-2014 by various contributors",
                "Copyright (c) 2014-2015 Jason Quense <jason@quense.me>",
                "Copyright (c) 2014-present Sebastian McKenzie and other contributors",
                "Copyright (c) 2014-present, Facebook, Inc.",
                "Copyright (c) 2015 Jed Watson",
                "Copyright (c) 2016 the V8 project authors",
                "Copyright (c) 2020 Rick Waldron",
                "Copyright (c) jQuery Foundation, Inc. and Contributors",
                "Copyright 2013-2015, Facebook, Inc.",
                "Copyright 2020 Bloomberg Finance L.P.",
                "Copyright JS Foundation and other contributors",
                "Copyright OpenJS Foundation and other contributors"
            ],
            "file-count": 31694,
            "sha256": "d562adbfa147d1adc1ddd3e8a34838085effc6e06fbe8065daf09fb4a80b8f1d",
            "source": "https://github.com/babel/babel/archive/refs/tags/v7.26.1.zip",
            "status": "approved"
        }
    ]
}