{
    "id": "git/github/eclipse-cdt-cloud/vscode-clangd/71338a5617193fc79d9907b301a009f495372d00",
    "license": "MIT",
    "authority": "https://gitlab.eclipse.org/eclipsefdn/emo-team/iplab/-/issues/11832",
    "source": "https://github.com/eclipse-cdt-cloud/vscode-clangd/archive/71338a5617193fc79d9907b301a009f495372d00.zip",
    "status": "approved",
    "scans": [
        {
            "date": "December 5, 2023 at 5:45:08 p.m. GMT",
            "authority": "https://gitlab.eclipse.org/eclipsefdn/emo-team/iplab/-/issues/11832",
            "scancode-version": "31.2.1",
            "licenses-discovered": [
                "MIT"
            ],
            "copyrights": [
                "Copyright (c) 2019 The"
            ],
            "file-count": 41,
            "sha256": "10730a3279eda5fc8e1b2dfc067633c7d8537d2a39aac74c78271cd06d620658",
            "source": "https://github.com/eclipse-cdt-cloud/vscode-clangd/archive/71338a5617193fc79d9907b301a009f495372d00.zip",
            "status": "restricted"
        }
    ]
}
