{
    "id": "npm/npmjs/@types/node/20.17.12",
    "license": "MIT",
    "authority": "https://gitlab.eclipse.org/eclipsefdn/emo-team/iplab/-/issues/18504",
    "source": "https://registry.npmjs.org/@types/node/-/node-20.17.12.tgz",
    "status": "approved",
    "scans": [
        {
            "date": "January 9, 2025 at 8:08:15 a.m. GMT",
            "authority": "https://gitlab.eclipse.org/eclipsefdn/emo-team/iplab/-/issues/18504",
            "scancode-version": "31.2.1",
            "licenses-discovered": [
                "MIT"
            ],
            "copyrights": [
                "Copyright (c) Microsoft Corporation",
                "Copyright Node.js contributors"
            ],
            "file-count": 66,
            "sha256": "9bfad419372a2a141aab4b3753cfaffc592172137ae1aeefe30d365566e4048d",
            "source": "https://registry.npmjs.org/@types/node/-/node-20.17.12.tgz",
            "status": "approved"
        }
    ]
}