{
    "id": "npm/npmjs/-/hasown/2.0.0",
    "license": "MIT",
    "authority": "https://gitlab.eclipse.org/eclipsefdn/emo-team/iplab/-/issues/11097",
    "source": "https://github.com/inspect-js/hasOwn/archive/refs/tags/v2.0.0.zip",
    "status": "approved",
    "scans": [
        {
            "date": "October 21, 2023 at 10:43:30 a.m. GMT",
            "authority": "https://gitlab.eclipse.org/eclipsefdn/emo-team/iplab/-/issues/11097",
            "scancode-version": "31.2.1",
            "licenses-discovered": [
                "MIT"
            ],
            "copyrights": [
                "Copyright (c) Jordan Harband and contributors"
            ],
            "file-count": 15,
            "sha256": "fdfde53d3002c54b72c7b30cad65bbcacb88aae4deaf3d0b51e93c7085d04502",
            "source": "https://github.com/inspect-js/hasOwn/archive/refs/tags/v2.0.0.zip",
            "status": "approved"
        }
    ]
}