{
    "id": "maven/mavencentral/org.junit.jupiter/junit-jupiter-params/5.10.1",
    "license": "EPL-2.0",
    "authority": "https://gitlab.eclipse.org/eclipsefdn/emo-team/iplab/-/issues/15304",
    "source": "https://repo1.maven.org/maven2/org/junit/jupiter/junit-jupiter-params/5.10.1/junit-jupiter-params-5.10.1-sources.jar",
    "status": "approved",
    "scans": [
        {
            "date": "June 14, 2024 at 6:17:14 p.m. GMT",
            "authority": "https://gitlab.eclipse.org/eclipsefdn/emo-team/iplab/-/issues/15303",
            "scancode-version": "31.2.1",
            "licenses-discovered": [
                "EPL-2.0"
            ],
            "copyrights": [
                "Copyright 2015-2021 the original author or authors",
                "Copyright 2015-2023 the original author or authors"
            ],
            "file-count": 65,
            "sha256": "532dce2ef436152405567ea75f076dc908c4d21641224ecc53913c9f09bfb131",
            "source": "https://repo1.maven.org/maven2/org/junit/jupiter/junit-jupiter-params/5.10.1/junit-jupiter-params-5.10.1-sources.jar",
            "status": "approved"
        },
        {
            "date": "June 14, 2024 at 6:18:20 p.m. GMT",
            "authority": "https://gitlab.eclipse.org/eclipsefdn/emo-team/iplab/-/issues/15304",
            "scancode-version": "31.2.1",
            "licenses-discovered": [
                "EPL-2.0"
            ],
            "copyrights": [
                "Copyright 2015-2021 the original author or authors",
                "Copyright 2015-2023 the original author or authors"
            ],
            "file-count": 65,
            "sha256": "532dce2ef436152405567ea75f076dc908c4d21641224ecc53913c9f09bfb131",
            "source": "https://repo1.maven.org/maven2/org/junit/jupiter/junit-jupiter-params/5.10.1/junit-jupiter-params-5.10.1-sources.jar",
            "status": "approved"
        }
    ]
}