{
    "id": "p2/orbit/p2.eclipse-plugin/io.fabric8.docker-maven-plugin/0.21.0",
    "license": "Apache-2.0",
    "licenses-discovered": [
        "Apache-2.0"
    ],
    "file-count": 155,
    "scancode-version": "30.1.0",
    "authority": "https://gitlab.eclipse.org/eclipsefdn/emo-team/iplab/-/issues/2242",
    "source": "https://search.maven.org/remotecontent?filepath=io/fabric8/docker-maven-plugin/0.21.0/docker-maven-plugin-0.21.0-sources.jar",
    "status": "approved"
}