{
    "id": "npm/npmjs/-/eslint-config-love/43.1.0",
    "license": "MIT",
    "authority": "https://gitlab.eclipse.org/eclipsefdn/emo-team/iplab/-/issues/13906",
    "source": "https://github.com/mightyiam/eslint-config-love/archive/refs/tags/v43.1.0.zip",
    "status": "approved",
    "scans": [
        {
            "date": "March 22, 2024 at 3:04:01 a.m. GMT",
            "authority": "https://gitlab.eclipse.org/eclipsefdn/emo-team/iplab/-/issues/13906",
            "scancode-version": "31.2.1",
            "licenses-discovered": [
                "MIT"
            ],
            "copyrights": [
            ],
            "file-count": 19,
            "sha256": "63955c00571441f13a37d023159e0fd7b9ed9d746d1687b1050989f32abdccb4",
            "source": "https://github.com/mightyiam/eslint-config-love/archive/refs/tags/v43.1.0.zip",
            "status": "approved"
        }
    ]
}