{
    "id": "nuget/nuget/-/CefSharp.Wpf/84.4.10",
    "license": "BSD-3-Clause AND Apache-2.0 AND CC-BY-3.0 AND ((MIT OR GPL-2.0-only) AND Apache-2.0) AND (MIT OR GPL-2.0-only)",
    "authority": "https://gitlab.eclipse.org/eclipsefdn/emo-team/iplab/-/issues/14816",
    "source": "https://github.com/cefsharp/CefSharp/archive/refs/tags/v84.4.10.zip",
    "status": "approved",
    "scans": [
        {
            "date": "May 20, 2024 at 10:39:43 p.m. GMT",
            "authority": "https://gitlab.eclipse.org/eclipsefdn/emo-team/iplab/-/issues/14816",
            "scancode-version": "31.2.1",
            "licenses-discovered": [
                "BSD-3-Clause",
                "BSD-3-Clause AND LicenseRef-scancode-free-unknown",
                "BSD-3-Clause AND MIT",
                "Apache-2.0 AND GPL-1.0-or-later AND MIT",
                "Apache-2.0 AND CC-BY-3.0 AND MIT",
                "GPL-1.0-or-later AND MIT",
                "MIT",
                "Apache-2.0 AND MIT",
                "Apache-2.0"
            ],
            "copyrights": [
                "(c) 2005, 2015 jQuery Foundation, Inc.",
                "Copyright (c) $CurrentYear The CefSharp Authors",
                "Copyright (c) . The CefSharp",
                "Copyright (c) 2004-2010 Alex Gorbatchev",
                "Copyright (c) 2010",
                "Copyright (c) 2010 The CefSharp Authors",
                "Copyright (c) 2011 The CefSharp Authors",
                "Copyright (c) 2012 The CefSharp Authors",
                "Copyright (c) 2012 The Chromium Authors",
                "Copyright (c) 2013",
                "Copyright (c) 2013 The CefSharp Authors",
                "Copyright (c) 2014 The CefSharp Authors",
                "Copyright (c) 2015 The CefSharp Authors",
                "Copyright (c) 2016 The CefSharp Authors",
                "Copyright (c) 2017 The CefSharp Authors",
                "Copyright (c) 2018 The CefSharp Authors",
                "Copyright (c) 2019 The CefSharp Authors",
                "Copyright (c) 2020 The CefSharp Authors",
                "Copyright (c) Microsoft 2010",
                "Copyright (c) Microsoft Corporation",
                "Copyright (c) The CefSharp Authors",
                "Copyright 2013 Twitter Inc. http://www.apache.org/licenses/LICENSE-2.0",
                "Copyright 2013 Twitter, Inc"
            ],
            "file-count": 749,
            "sha256": "7f047e5b5bac15721132882eb58d3bb275921147fc4d55ff2bbc78088090178d",
            "source": "https://github.com/cefsharp/CefSharp/archive/refs/tags/v84.4.10.zip",
            "status": "restricted"
        }
    ]
}