{
    "id": "npm/npmjs/@mui/x-date-pickers/6.19.8",
    "license": "MIT",
    "authority": "https://gitlab.eclipse.org/eclipsefdn/emo-team/iplab/-/issues/14025",
    "source": "https://github.com/mui/mui-x/archive/refs/tags/v6.19.8.zip",
    "status": "approved",
    "scans": [
        {
            "date": "March 22, 2024 at 7:11:52 p.m. GMT",
            "authority": "https://gitlab.eclipse.org/eclipsefdn/emo-team/iplab/-/issues/14025",
            "scancode-version": "31.2.1",
            "licenses-discovered": [
                "MIT",
                "LicenseRef-scancode-commercial-license AND MIT",
                "LicenseRef-scancode-commercial-license AND LicenseRef-scancode-proprietary-license AND MIT",
                "OFL-1.1",
                "LicenseRef-scancode-unknown AND MIT",
                "ISC",
                "LicenseRef-scancode-proprietary-license",
                "LicenseRef-scancode-commercial-license"
            ],
            "copyrights": [
                "Copyright (c) 2017 Dmitriy Kovalenko",
                "Copyright (c) 2017 Evgeny Poberezkin",
                "Copyright (c) 2020 Material-UI SAS",
                "Copyright 2017-2021 Indian Type Foundry",
                "Copyright 2018 IBM Corp."
            ],
            "file-count": 3993,
            "sha256": "775a538baa299ed37da80436e8a2885f57687e698008e61d689caa896334152f",
            "source": "https://github.com/mui/mui-x/archive/refs/tags/v6.19.8.zip",
            "status": "restricted"
        }
    ]
}
