{
    "id": "npm/npmjs/@pnpm/workspace.pkgs-graph/2.0.13",
    "license": "MIT",
    "authority": "https://gitlab.eclipse.org/eclipsefdn/emo-team/iplab/-/issues/12757",
    "source": "https://registry.yarnpkg.com/@pnpm/workspace.pkgs-graph/-/workspace.pkgs-graph-2.0.13.tgz",
    "status": "approved",
    "scans": [
        {
            "date": "January 12, 2024 at 11:20:36 a.m. GMT",
            "authority": "https://gitlab.eclipse.org/eclipsefdn/emo-team/iplab/-/issues/12757",
            "scancode-version": "31.2.1",
            "licenses-discovered": [
                "MIT"
            ],
            "copyrights": [
                "(c) Zoltan Kochan (https://www.kochan.io)",
                "Copyright (c) 2015-2016 Rico Sta. Cruz and other contributors",
                "Copyright (c) 2016-2023 Zoltan Kochan and other contributors"
            ],
            "file-count": 6,
            "sha256": "d894e37c858dadf9bb8c018a5d652fc87bd6f6f428209e4a805381a4b13fd0ad",
            "source": "https://registry.yarnpkg.com/@pnpm/workspace.pkgs-graph/-/workspace.pkgs-graph-2.0.13.tgz",
            "status": "approved"
        }
    ]
}