{
    "id": "go/golang/github.com%2Fprometheus/common/v0.0.0-20180110214958-89604d197083",
    "license": "Apache-2.0 AND BSD-3-Clause",
    "authority": "https://gitlab.eclipse.org/eclipsefdn/emo-team/iplab/-/issues/12368",
    "source": "https://proxy.golang.org/github.com%2Fprometheus/common/@v/v0.0.0-20180110214958-89604d197083.zip",
    "status": "approved",
    "scans": [
        {
            "date": "December 20, 2023 at 2:23:01 p.m. GMT",
            "authority": "https://gitlab.eclipse.org/eclipsefdn/emo-team/iplab/-/issues/12368",
            "scancode-version": "31.2.1",
            "licenses-discovered": [
                "Apache-2.0",
                "BSD-3-Clause"
            ],
            "copyrights": [
                "Copyright (c) 2011, Open Knowledge Foundation Ltd.",
                "Copyright 2013 The Prometheus Authors",
                "Copyright 2014 The Prometheus Authors",
                "Copyright 2015 The Prometheus Authors",
                "Copyright 2016 The Prometheus Authors",
                "Copyright 2017 The Prometheus Authors"
            ],
            "file-count": 93,
            "sha256": "796855d655242a4d2b0217c93d02c28219bb674ed739a9ed9d098d32f82da352",
            "source": "https://proxy.golang.org/github.com%2Fprometheus/common/@v/v0.0.0-20180110214958-89604d197083.zip",
            "status": "approved"
        }
    ]
}