{
    "id": "maven/mavencentral/io.helidon.config/helidon-config-yaml/4.1.3",
    "license": "Apache-2.0",
    "authority": "https://gitlab.eclipse.org/eclipsefdn/emo-team/iplab/-/issues/17296",
    "source": "https://repo1.maven.org/maven2/io/helidon/config/helidon-config-yaml/4.1.3/helidon-config-yaml-4.1.3-sources.jar",
    "status": "approved",
    "scans": [
        {
            "date": "November 19, 2024, 12:32:49 p.m. GMT",
            "authority": "https://gitlab.eclipse.org/eclipsefdn/emo-team/iplab/-/issues/17296",
            "scancode-version": "31.2.1",
            "licenses-discovered": [
                "Apache-2.0"
            ],
            "copyrights": [
                "Copyright (c) 2017, 2022 Oracle and/or its affiliates",
                "Copyright (c) 2017, 2024 Oracle and/or its affiliates",
                "Copyright (c) 2020, 2023 Oracle and/or its affiliates"
            ],
            "file-count": 8,
            "sha256": "afc150fa351b33b73e7e2a1066d40bc3cd702570fd96d6c1c61ca6067f0e70ab",
            "source": "https://repo1.maven.org/maven2/io/helidon/config/helidon-config-yaml/4.1.3/helidon-config-yaml-4.1.3-sources.jar",
            "status": "approved"
        }
    ]
}