{
    "id": "maven/mavencentral/org.apache.camel.springboot/camel-validator-starter/3.21.0",
    "license": "Apache-2.0",
    "authority": "https://gitlab.eclipse.org/eclipsefdn/emo-team/iplab/-/issues/10296",
    "source": "https://repo.maven.apache.org/maven2/org/apache/camel/springboot/camel-validator-starter/3.21.0/camel-validator-starter-3.21.0-sources.jar",
    "status": "approved",
    "scans": [
        {
            "date": "September 6, 2023 at 11:15:13 a.m. GMT",
            "authority": "https://gitlab.eclipse.org/eclipsefdn/emo-team/iplab/-/issues/10296",
            "scancode-version": "31.2.1",
            "licenses-discovered": [
                "Apache-2.0"
            ],
            "copyrights": [
            ],
            "file-count": 9,
            "sha256": "af6fa77c2350a6dae8550a6f3699f2009f202e306967d1f32ca967954b0e8828",
            "source": "https://repo.maven.apache.org/maven2/org/apache/camel/springboot/camel-validator-starter/3.21.0/camel-validator-starter-3.21.0-sources.jar",
            "status": "approved"
        }
    ]
}