{
    "id": "maven/mavencentral/org.wildfly.core/wildfly-cli/15.0.1.Final",
    "license": "Apache-2.0 AND LGPL-2.1-only AND LGPL-2.1-or-later",
    "licenses-discovered": [
        "LGPL-2.1-or-later",
        "Apache-2.0",
        "LGPL-2.1-only"
    ],
    "file-count": 525,
    "scancode-version": "30.1.0",
    "authority": "https://gitlab.eclipse.org/eclipsefdn/emo-team/iplab/-/issues/2025",
    "source": "https://search.maven.org/remotecontent?filepath=org/wildfly/core/wildfly-cli/15.0.1.Final/wildfly-cli-15.0.1.Final-sources.jar",
    "status": "restricted"
}