{
    "id": "maven/mavencentral/io.mockk/mockk-core/1.13.5",
    "license": "Apache-2.0",
    "authority": "https://gitlab.eclipse.org/eclipsefdn/emo-team/iplab/-/issues/10209",
    "source": "https://repo.maven.apache.org/maven2/io/mockk/mockk-core/1.13.5/mockk-core-1.13.5-sources.jar",
    "status": "approved",
    "scans": [
        {
            "date": "August 23, 2023 at 11:43:23 a.m. GMT",
            "authority": "https://gitlab.eclipse.org/eclipsefdn/emo-team/iplab/-/issues/10209",
            "scancode-version": "31.2.1",
            "licenses-discovered": [
            ],
            "copyrights": [
            ],
            "file-count": 2,
            "sha256": "03a4cccaf8275ece9da6e7acd074e4371db7f0942e2e99abfabc16688cd80238",
            "source": "https://repo.maven.apache.org/maven2/io/mockk/mockk-core/1.13.5/mockk-core-1.13.5-sources.jar",
            "status": "restricted"
        }
    ]
}
