{
    "id": "maven/mavencentral/org.jboss.shrinkwrap.resolver/shrinkwrap-resolver-spi-maven/3.3.0",
    "license": "Apache-2.0",
    "authority": "https://gitlab.eclipse.org/eclipsefdn/emo-team/iplab/-/issues/15109",
    "source": "https://repo1.maven.org/maven2/org/jboss/shrinkwrap/resolver/shrinkwrap-resolver-spi-maven/3.3.0/shrinkwrap-resolver-spi-maven-3.3.0-sources.jar",
    "status": "approved",
    "scans": [
        {
            "date": "June 6, 2024 at 5:23:00 p.m. GMT",
            "authority": "https://gitlab.eclipse.org/eclipsefdn/emo-team/iplab/-/issues/15109",
            "scancode-version": "31.2.1",
            "licenses-discovered": [
                "Apache-2.0"
            ],
            "copyrights": [
                "Copyright 2012, Red Hat Middleware LLC, and individual contributors by the authors"
            ],
            "file-count": 5,
            "sha256": "eec8258f4f15b51c543bcab3f6b0efc5904970ceb9d4f5508661d7b0d52ab838",
            "source": "https://repo1.maven.org/maven2/org/jboss/shrinkwrap/resolver/shrinkwrap-resolver-spi-maven/3.3.0/shrinkwrap-resolver-spi-maven-3.3.0-sources.jar",
            "status": "approved"
        }
    ]
}