{
    "id": "maven/mavencentral/com.nimbusds/oauth2-oidc-sdk/11.10.1",
    "license": "Apache-2.0",
    "authority": "https://gitlab.eclipse.org/eclipsefdn/emo-team/iplab/-/issues/13558",
    "source": "https://repo1.maven.org/maven2/com/nimbusds/oauth2-oidc-sdk/11.10.1/oauth2-oidc-sdk-11.10.1-sources.jar",
    "status": "approved",
    "scans": [
        {
            "date": "March 6, 2024 at 10:38:52 a.m. GMT",
            "authority": "https://gitlab.eclipse.org/eclipsefdn/emo-team/iplab/-/issues/13558",
            "scancode-version": "31.2.1",
            "licenses-discovered": [
                "Apache-2.0"
            ],
            "copyrights": [
                "Copyright 2012-2016, Connect2id Ltd and contributors",
                "Copyright 2012-2020, Connect2id Ltd and contributors",
                "Copyright 2012-2021, Connect2id Ltd and contributors",
                "Copyright 2012-2022 Connect2id Ltd and contributors",
                "Copyright 2012-2023, Connect2id Ltd and contributors"
            ],
            "file-count": 509,
            "sha256": "85b3933e7374792083bd625bd17214074ed6d5b7f23058727bc9effd1b7d9fa3",
            "source": "https://repo1.maven.org/maven2/com/nimbusds/oauth2-oidc-sdk/11.10.1/oauth2-oidc-sdk-11.10.1-sources.jar",
            "status": "approved"
        }
    ]
}