{
    "id": "npm/npmjs/@mui/utils/5.9.3",
    "license": "MIT",
    "licenses-discovered": [
        "MIT"
    ],
    "copyrights": [
        "Copyright (c) Call-Em-All"
    ],
    "file-count": 213,
    "scancode-version": "30.1.0",
    "authority": "https://gitlab.eclipse.org/eclipsefdn/emo-team/iplab/-/issues/3749",
    "source": "https://registry.npmjs.org/@mui/utils/-/utils-5.9.3.tgz",
    "status": "approved"
}