{
    "id": "npm/npmjs/@azure/msal-common/15.1.1",
    "license": "MIT AND (BSD-3-Clause AND MIT) AND ISC",
    "authority": "https://gitlab.eclipse.org/eclipsefdn/emo-team/iplab/-/issues/19324",
    "source": "https://github.com/AzureAD/microsoft-authentication-library-for-js/archive/refs/tags/msal-common-v15.1.1.zip",
    "status": "approved",
    "scans": [
        {
            "date": "February 5, 2025 at 10:47:08 p.m. GMT",
            "authority": "https://gitlab.eclipse.org/eclipsefdn/emo-team/iplab/-/issues/19324",
            "scancode-version": "31.2.1",
            "licenses-discovered": [
                "MIT",
                "BSD-3-Clause AND MIT",
                "ISC"
            ],
            "copyrights": [
                "Copyright (c) 2012-2014, Bram Stein",
                "Copyright (c) 2014-2017, Jon Schlinkert",
                "Copyright (c) 2020 Microsoft",
                "Copyright (c) Microsoft",
                "Copyright (c) Microsoft Corporation"
            ],
            "file-count": 1579,
            "sha256": "1ca878b33e9e563acf6a214c1f19a3e841dc3119a3962cea1f79cb3763c390b4",
            "source": "https://github.com/AzureAD/microsoft-authentication-library-for-js/archive/refs/tags/msal-common-v15.1.1.zip",
            "status": "approved"
        }
    ]
}