{
    "id": "p2/orbit/p2.eclipse.plugin/org.apache.lucene.queries/10.1.0.v20241221-1000",
    "license": "Apache-2.0",
    "authority": "https://gitlab.eclipse.org/eclipsefdn/emo-team/iplab/-/issues/17996",
    "source": "https://repo1.maven.org/maven2/org/apache/lucene/lucene-queries/10.1.0/lucene-queries-10.1.0-sources.jar",
    "status": "approved",
    "scans": [
        {
            "date": "December 21, 2024 at 11:56:05 p.m. GMT",
            "authority": "https://gitlab.eclipse.org/eclipsefdn/emo-team/iplab/-/issues/17996",
            "scancode-version": "31.2.1",
            "licenses-discovered": [
                "Apache-2.0"
            ],
            "copyrights": [
            ],
            "file-count": 166,
            "sha256": "928e82fcd03282e7693cbbe97901ba77addd3b1f6e003897d6c305ecc135315a",
            "source": "https://repo1.maven.org/maven2/org/apache/lucene/lucene-queries/10.1.0/lucene-queries-10.1.0-sources.jar",
            "status": "approved"
        }
    ]
}