{
    "id": "npm/npmjs/-/css-to-react-native/3.0.0",
    "license": "MIT",
    "licenses-discovered": [
        "MIT"
    ],
    "copyrights": [
        "Copyright (c) Jacob Parker and Maximilian Stoiber",
        "Copyright (c) Krister Kari, Jacob Parker, and Maximilian Stoiber"
    ],
    "file-count": 45,
    "scancode-version": "30.1.0",
    "authority": "https://gitlab.eclipse.org/eclipsefdn/emo-team/iplab/-/issues/2954",
    "source": "https://github.com/styled-components/css-to-react-native/archive/v3.0.0.zip",
    "status": "approved"
}