{
    "id": "project/automotive.tractusx/-/knowledge-agents-edc/1.12.19-SNAPSHOT",
    "license": "Apache-2.0",
    "authority": "https://gitlab.eclipse.org/eclipsefdn/emo-team/iplab/-/issues/14721",
    "source": "https://github.com/eclipse-tractusx/knowledge-agents/pull/120.patch",
    "status": "approved",
    "scans": [
        {
            "date": "May 15, 2024 at 9:13:25 a.m. GMT",
            "authority": "https://gitlab.eclipse.org/eclipsefdn/emo-team/iplab/-/issues/14721",
            "scancode-version": "31.2.1",
            "licenses-discovered": [
                "Apache-2.0"
            ],
            "copyrights": [
                "Copyright (c) 2021, 2023 Contributors",
                "Copyright (c) 2022 Bayerische Motoren Werke Aktiengesellschaft",
                "Copyright (c) 2022,2024 Contributors",
                "Copyright (c) 2023 Bayerische Motoren Werke Aktiengesellschaft",
                "Copyright (c) 2023 Mercedes-Benz Tech Innovation GmbH",
                "Copyright (c) 2023 ZF Friedrichshafen AG",
                "Copyright (c) 2023, 2024 T-Systems International GmbH",
                "Copyright (c) 2024 T-Systems International GmbH"
            ],
            "file-count": 1,
            "sha256": "d4398eb04836b42bbc502257d9cf37bc537b4bb70530c3c6c4e8847d320839a8",
            "source": "https://github.com/eclipse-tractusx/knowledge-agents/pull/120.patch",
            "status": "restricted"
        }
    ]
}