{
    "id": "maven/mavencentral/org.apache.hadoop/hadoop-mapreduce-client-core/3.4.0",
    "license": "Apache-2.0 AND (Apache-2.0 AND BSD-2-Clause AND BSD-3-Clause AND MIT)",
    "authority": "https://gitlab.eclipse.org/eclipsefdn/emo-team/iplab/-/issues/14126",
    "source": "https://repo1.maven.org/maven2/org/apache/hadoop/hadoop-mapreduce-client-core/3.4.0/hadoop-mapreduce-client-core-3.4.0-sources.jar",
    "status": "approved",
    "scans": [
        {
            "date": "March 26, 2024 at 2:06:46 p.m. GMT",
            "authority": "https://gitlab.eclipse.org/eclipsefdn/emo-team/iplab/-/issues/14126",
            "scancode-version": "31.2.1",
            "licenses-discovered": [
                "Apache-2.0",
                "Apache-2.0 AND BSD-2-Clause AND BSD-3-Clause AND MIT"
            ],
            "copyrights": [
                "Copyright (c) 2009-2017 Dave Gamble and cJSON contributors"
            ],
            "file-count": 577,
            "sha256": "216affd43421d30b62d764d30943b4937e7215e7d2370e550063adfa31e53383",
            "source": "https://repo1.maven.org/maven2/org/apache/hadoop/hadoop-mapreduce-client-core/3.4.0/hadoop-mapreduce-client-core-3.4.0-sources.jar",
            "status": "approved"
        }
    ]
}