{
    "id": "maven/mavencentral/org.apache.kerby/kerb-common/2.0.3",
    "license": "Apache-2.0",
    "authority": "https://gitlab.eclipse.org/eclipsefdn/emo-team/iplab/-/issues/14135",
    "source": "https://repo1.maven.org/maven2/org/apache/kerby/kerb-common/2.0.3/kerb-common-2.0.3-sources.jar",
    "status": "approved",
    "scans": [
        {
            "date": "March 26, 2024 at 2:25:28 p.m. GMT",
            "authority": "https://gitlab.eclipse.org/eclipsefdn/emo-team/iplab/-/issues/14135",
            "scancode-version": "31.2.1",
            "licenses-discovered": [
                "Apache-2.0"
            ],
            "copyrights": [
            ],
            "file-count": 45,
            "sha256": "373b0e9d4f8b62129dc983c4984497a927b0f6fd2b30adca08fc06fe7c6a5053",
            "source": "https://repo1.maven.org/maven2/org/apache/kerby/kerb-common/2.0.3/kerb-common-2.0.3-sources.jar",
            "status": "approved"
        }
    ]
}