{
    "id": "go/golang/google.golang.org/protobuf/v1.24.0",
    "license": "BSD-3-Clause",
    "authority": "https://gitlab.eclipse.org/eclipsefdn/emo-team/iplab/-/issues/5694",
    "source": "https://proxy.golang.org/google.golang.org/protobuf/@v/v1.24.0.zip",
    "status": "approved",
    "scans": [
        {
            "date": "December 12, 2022 at 11:36:33 p.m. GMT",
            "authority": "https://gitlab.eclipse.org/eclipsefdn/emo-team/iplab/-/issues/5694",
            "scancode-version": "31.2.1",
            "licenses-discovered": [
                "BSD-3-Clause"
            ],
            "copyrights": [
                "Copyright (c) 2018 The Go Authors",
                "Copyright 2008 Google Inc.",
                "Copyright 2018 The Go Authors",
                "Copyright 2019 The Go Authors",
                "Copyright 2020 The Go Authors",
                "Copyright d d d d Google Inc",
                "Copyright d d d d The Go Authors"
            ],
            "file-count": 417,
            "sha256": "981b55546a68b8bc23ea58e4dff55df4f79e2f4302fcf5c1b540d8011ef208da",
            "source": "https://proxy.golang.org/google.golang.org/protobuf/@v/v1.24.0.zip",
            "status": "approved"
        }
    ]
}