{
    "id": "npm/npmjs/-/vscode-markdown-languageservice/0.5.0-alpha.8",
    "license": "MIT",
    "authority": "https://gitlab.eclipse.org/eclipsefdn/emo-team/iplab/-/issues/17258",
    "source": "https://github.com/microsoft/vscode-markdown-languageservice/archive/refs/tags/v0.5.0-alpha.8.zip",
    "status": "approved",
    "scans": [
        {
            "date": "November 15, 2024, 2:16:09 p.m. GMT",
            "authority": "https://gitlab.eclipse.org/eclipsefdn/emo-team/iplab/-/issues/17258",
            "scancode-version": "31.2.1",
            "licenses-discovered": [
                "MIT"
            ],
            "copyrights": [
                "Copyright (c) Microsoft Corporation"
            ],
            "file-count": 88,
            "sha256": "f02b80d7941fb7049849bcc708471e0d2f99c008e69209c8507b5d59af329ad8",
            "source": "https://github.com/microsoft/vscode-markdown-languageservice/archive/refs/tags/v0.5.0-alpha.8.zip",
            "status": "approved"
        }
    ]
}