{
    "id": "go/golang/google.golang.org/grpc/v1.27.0",
    "license": "Apache-2.0",
    "authority": "https://gitlab.eclipse.org/eclipsefdn/emo-team/iplab/-/issues/6395",
    "source": "https://proxy.golang.org/google.golang.org/grpc/@v/v1.27.0.zip",
    "status": "approved",
    "scans": [
        {
            "date": "January 20, 2023 at 4:11:15 p.m. GMT",
            "authority": "https://gitlab.eclipse.org/eclipsefdn/emo-team/iplab/-/issues/6395",
            "scancode-version": "31.2.1",
            "licenses-discovered": [
                "Apache-2.0"
            ],
            "copyrights": [
                "Copyright 2014 gRPC",
                "Copyright 2015 gRPC",
                "Copyright 2015-2016 gRPC",
                "Copyright 2016 gRPC",
                "Copyright 2017 gRPC",
                "Copyright 2018 gRPC",
                "Copyright 2019 gRPC",
                "Copyright 2020 gRPC"
            ],
            "file-count": 478,
            "sha256": "25cc1b8e154b7f68bc51d5ab79cf52fd210bfecb71b71a856c2fe4b4213d40ca",
            "source": "https://proxy.golang.org/google.golang.org/grpc/@v/v1.27.0.zip",
            "status": "approved"
        }
    ]
}