{
    "id": "maven/mavencentral/io.quarkus/quarkus-smallrye-openapi/3.17.4",
    "license": "Apache-2.0",
    "authority": "https://gitlab.eclipse.org/eclipsefdn/emo-team/iplab/-/issues/17915",
    "source": "https://repo1.maven.org/maven2/io/quarkus/quarkus-smallrye-openapi/3.17.4/quarkus-smallrye-openapi-3.17.4-sources.jar",
    "status": "approved",
    "scans": [
        {
            "date": "December 13, 2024 at 1:54:19 p.m. GMT",
            "authority": "https://gitlab.eclipse.org/eclipsefdn/emo-team/iplab/-/issues/17914",
            "scancode-version": "31.2.1",
            "licenses-discovered": [
            ],
            "copyrights": [
            ],
            "file-count": 21,
            "sha256": "83ca695fcad9b6b86618f6c782fa9c763a66b7b1aad0f82f47f54438e7891fec",
            "source": "https://repo1.maven.org/maven2/io/quarkus/quarkus-smallrye-openapi/3.17.4/quarkus-smallrye-openapi-3.17.4-sources.jar",
            "status": "restricted"
        },
        {
            "date": "December 13, 2024 at 1:55:03 p.m. GMT",
            "authority": "https://gitlab.eclipse.org/eclipsefdn/emo-team/iplab/-/issues/17915",
            "scancode-version": "31.2.1",
            "licenses-discovered": [
            ],
            "copyrights": [
            ],
            "file-count": 21,
            "sha256": "83ca695fcad9b6b86618f6c782fa9c763a66b7b1aad0f82f47f54438e7891fec",
            "source": "https://repo1.maven.org/maven2/io/quarkus/quarkus-smallrye-openapi/3.17.4/quarkus-smallrye-openapi-3.17.4-sources.jar",
            "status": "restricted"
        }
    ]
}