{
    "id": "project/oniro/oniro-blueprints/meta-oniro-blueprints-core/0.0",
    "license": "Apache-2.0",
    "licenses-discovered": [
        "CC-BY-4.0 AND Apache-2.0",
        "Apache-2.0",
        "CC-BY-4.0",
        "MIT"
    ],
    "file-count": 16,
    "scancode-version": "30.1.0",
    "authority": "https://gitlab.eclipse.org/eclipsefdn/emo-team/iplab/-/issues/2679",
    "source": "https://gitlab.eclipse.org/eclipse/oniro-blueprints/meta-oniro-blueprints-core/-/archive/master/meta-oniro-blueprints-core-master.zip",
    "status": "approved"
}
