{
    "id": "maven/mavencentral/org.apache.camel.springboot/camel-stub-starter/3.22.2",
    "license": "Apache-2.0",
    "authority": "https://gitlab.eclipse.org/eclipsefdn/emo-team/iplab/-/issues/14937",
    "source": "https://repo1.maven.org/maven2/org/apache/camel/springboot/camel-stub-starter/3.22.2/camel-stub-starter-3.22.2-sources.jar",
    "status": "approved",
    "scans": [
        {
            "date": "May 29, 2024 at 10:21:30 a.m. GMT",
            "authority": "https://gitlab.eclipse.org/eclipsefdn/emo-team/iplab/-/issues/14937",
            "scancode-version": "31.2.1",
            "licenses-discovered": [
                "Apache-2.0"
            ],
            "copyrights": [
            ],
            "file-count": 9,
            "sha256": "6d23f0251137298531710801ab2d8eb738dee8d9ae75ad50bc9827ab20ba3345",
            "source": "https://repo1.maven.org/maven2/org/apache/camel/springboot/camel-stub-starter/3.22.2/camel-stub-starter-3.22.2-sources.jar",
            "status": "approved"
        }
    ]
}