{
    "id": "maven/mavencentral/org.eclipse.dataspaceconnector/auth-tokenbased/0.0.1-20220922.4-20230220.143048-1",
    "license": "Apache-2.0",
    "authority": "https://gitlab.eclipse.org/eclipsefdn/emo-team/iplab/-/issues/7681",
    "source": "https://search.maven.org/remotecontent?filepath=org/eclipse/dataspaceconnector/auth-tokenbased/0.0.1-milestone-6/auth-tokenbased-0.0.1-milestone-6-sources.jar",
    "status": "approved",
    "scans": [
        {
            "date": "March 28, 2023 at 9:30:55 p.m. GMT",
            "authority": "https://gitlab.eclipse.org/eclipsefdn/emo-team/iplab/-/issues/7681",
            "scancode-version": "31.2.1",
            "licenses-discovered": [
                "Apache-2.0"
            ],
            "copyrights": [
                "Copyright (c) 2020 - 2022 Microsoft Corporation"
            ],
            "file-count": 4,
            "sha256": "1fce153942b5681afd588fa39a246e75d768b603de7a9a3bf385f86285c6da98",
            "source": "https://search.maven.org/remotecontent?filepath=org/eclipse/dataspaceconnector/auth-tokenbased/0.0.1-milestone-6/auth-tokenbased-0.0.1-milestone-6-sources.jar",
            "status": "approved"
        }
    ]
}