{
    "id": "maven/mavencentral/org.apache.camel/camel-timer/3.21.0",
    "license": "Apache-2.0",
    "authority": "https://gitlab.eclipse.org/eclipsefdn/emo-team/iplab/-/issues/10300",
    "source": "https://repo.maven.apache.org/maven2/org/apache/camel/camel-timer/3.21.0/camel-timer-3.21.0-sources.jar",
    "status": "approved",
    "scans": [
        {
            "date": "September 6, 2023 at 11:11:07 a.m. GMT",
            "authority": "https://gitlab.eclipse.org/eclipsefdn/emo-team/iplab/-/issues/10300",
            "scancode-version": "31.2.1",
            "licenses-discovered": [
                "Apache-2.0"
            ],
            "copyrights": [
            ],
            "file-count": 17,
            "sha256": "a001c5b2fe1e63a89fc041329a6219765708bcc1e5c54bb49616a4511bff5d51",
            "source": "https://repo.maven.apache.org/maven2/org/apache/camel/camel-timer/3.21.0/camel-timer-3.21.0-sources.jar",
            "status": "approved"
        }
    ]
}