{
    "id": "npm/npmjs/-/check-error/1.0.3",
    "license": "MIT",
    "authority": "https://gitlab.eclipse.org/eclipsefdn/emo-team/iplab/-/issues/10725",
    "source": "https://registry.yarnpkg.com/check-error/-/check-error-1.0.3.tgz",
    "status": "approved",
    "scans": [
        {
            "date": "September 28, 2023 at 7:41:48 p.m. GMT",
            "authority": "https://gitlab.eclipse.org/eclipsefdn/emo-team/iplab/-/issues/10724",
            "scancode-version": "31.2.1",
            "licenses-discovered": [
                "MIT"
            ],
            "copyrights": [
                "Copyright (c) 2012-2016 Jake Luer <jake@alogicalparadox.com>",
                "Copyright (c) 2013 Jake Luer <jake@alogicalparadox.com> (http://alogicalparadox.com)"
            ],
            "file-count": 5,
            "sha256": "5aaaaddcc1643c82359402fdafcf0ed94ad6f15154a069a6339cc660d11eb96e",
            "source": "https://registry.yarnpkg.com/check-error/-/check-error-1.0.3.tgz",
            "status": "approved"
        },
        {
            "date": "September 28, 2023 at 7:57:23 p.m. GMT",
            "authority": "https://gitlab.eclipse.org/eclipsefdn/emo-team/iplab/-/issues/10725",
            "scancode-version": "31.2.1",
            "licenses-discovered": [
                "MIT"
            ],
            "copyrights": [
                "Copyright (c) 2012-2016 Jake Luer <jake@alogicalparadox.com>",
                "Copyright (c) 2013 Jake Luer <jake@alogicalparadox.com> (http://alogicalparadox.com)"
            ],
            "file-count": 5,
            "sha256": "5aaaaddcc1643c82359402fdafcf0ed94ad6f15154a069a6339cc660d11eb96e",
            "source": "https://registry.yarnpkg.com/check-error/-/check-error-1.0.3.tgz",
            "status": "approved"
        }
    ]
}