{
    "id": "maven/mavencentral/com.github.dasniko/testcontainers-keycloak/2.5.0",
    "license": "Apache-2.0",
    "authority": "https://gitlab.eclipse.org/eclipsefdn/emo-team/iplab/-/issues/9175",
    "source": "https://repo.maven.apache.org/maven2/com/github/dasniko/testcontainers-keycloak/2.5.0/testcontainers-keycloak-2.5.0-sources.jar",
    "status": "approved",
    "scans": [
        {
            "date": "June 23, 2023 at 10:54:57 a.m. GMT",
            "authority": "https://gitlab.eclipse.org/eclipsefdn/emo-team/iplab/-/issues/9175",
            "scancode-version": "31.2.1",
            "licenses-discovered": [
                "Apache-2.0"
            ],
            "copyrights": [
                "Copyright (c) 2021 Niko Kobler"
            ],
            "file-count": 10,
            "sha256": "0a1dbb1f0ed2d795dfc24ec570edf481507eae0d1de017e77d319a43d990f2c6",
            "source": "https://repo.maven.apache.org/maven2/com/github/dasniko/testcontainers-keycloak/2.5.0/testcontainers-keycloak-2.5.0-sources.jar",
            "status": "approved"
        }
    ]
}