{
    "id": "crate/cratesio/-/wasm-bindgen/0.2.87",
    "license": "Apache-2.0 AND MIT AND Apache-2.0 AND MIT",
    "authority": "https://gitlab.eclipse.org/eclipsefdn/emo-team/iplab/-/issues/10132",
    "source": "https://crates.io/api/v1/crates/wasm-bindgen/0.2.87/download",
    "status": "approved",
    "scans": [
        {
            "date": "August 21, 2023 at 3:35:07 p.m. GMT",
            "authority": "https://gitlab.eclipse.org/eclipsefdn/emo-team/iplab/-/issues/10132",
            "scancode-version": "31.2.1",
            "licenses-discovered": [
                "Apache-2.0 AND MIT",
                "Apache-2.0",
                "MIT"
            ],
            "copyrights": [
                "Copyright (c) 2014 Alex Crichton"
            ],
            "file-count": 257,
            "sha256": "7706a72ab36d8cb1f80ffbf0e071533974a60d0a308d01a5d0375bf60499a342",
            "source": "https://crates.io/api/v1/crates/wasm-bindgen/0.2.87/download",
            "status": "approved"
        }
    ]
}