{
    "id": "maven/mavencentral/org.activiti/activiti-spring-app-process/8.0.0",
    "license": "Apache-2.0",
    "authority": "https://gitlab.eclipse.org/eclipsefdn/emo-team/iplab/-/issues/12496",
    "source": "https://maven.alfresco.com/nexus/service/local/repositories/activiti-releases/content//org/activiti/activiti-spring-app-process/8.0.0/activiti-spring-app-process-8.0.0-sources.jar",
    "status": "approved",
    "scans": [
        {
            "date": "December 26, 2023 at 8:04:27 p.m. GMT",
            "authority": "https://gitlab.eclipse.org/eclipsefdn/emo-team/iplab/-/issues/12496",
            "scancode-version": "31.2.1",
            "licenses-discovered": [
                "Apache-2.0"
            ],
            "copyrights": [
                "Copyright 2010-2020 Alfresco Software, Ltd."
            ],
            "file-count": 7,
            "sha256": "eed21a497b9378715f63840d45ec26a9f4d3e047d01b72fd0c9825e2b9aa0e9d",
            "source": "https://maven.alfresco.com/nexus/service/local/repositories/activiti-releases/content//org/activiti/activiti-spring-app-process/8.0.0/activiti-spring-app-process-8.0.0-sources.jar",
            "status": "approved"
        }
    ]
}