{
    "id": "npm/npmjs/-/ovsx/0.8.3",
    "license": "EPL-2.0 AND (EPL-2.0 OR MIT)",
    "authority": "https://gitlab.eclipse.org/eclipsefdn/emo-team/iplab/-/issues/13021",
    "source": "https://github.com/eclipse/openvsx/pull/0.8.3.patch",
    "status": "approved",
    "scans": [
        {
            "date": "January 30, 2024 at 3:34:16 p.m. GMT",
            "authority": "https://gitlab.eclipse.org/eclipsefdn/emo-team/iplab/-/issues/13021",
            "scancode-version": "31.2.1",
            "licenses-discovered": [
            ],
            "copyrights": [
            ],
            "file-count": 1,
            "sha256": "a84c4a7d1eaae36db7c059c8ff5cf21e0375883d7da5bd28f6fd9ca74b7b334d",
            "source": "https://github.com/eclipse/openvsx/pull/0.8.3.patch",
            "status": "restricted"
        }
    ]
}
