{
    "id": "p2/orbit/p2.eclipse.plugin/org.apache.batik.constants/1.16.0.v20221027-0840",
    "license": "Apache-2.0",
    "licenses-discovered": [
        "Apache-2.0"
    ],
    "copyrights": [
    ],
    "file-count": 4,
    "scancode-version": "31.2.1",
    "authority": "https://gitlab.eclipse.org/eclipsefdn/emo-team/iplab/-/issues/4851",
    "source": "https://search.maven.org/remotecontent?filepath=org/apache/xmlgraphics/batik-constants/1.16/batik-constants-1.16-sources.jar",
    "status": "approved"
}