{
    "id": "maven/mavencentral/org.jline/jline-terminal/3.26.3",
    "license": "BSD-3-Clause AND Apache-2.0 AND (BSD-3-Clause AND Classpath-exception-2.0)",
    "authority": "https://gitlab.eclipse.org/eclipsefdn/emo-team/iplab/-/issues/19811",
    "source": "https://repo1.maven.org/maven2/org/jline/jline-terminal/3.26.3/jline-terminal-3.26.3-sources.jar",
    "status": "restricted",
    "scans": [
        {
            "date": "March 1, 2025 at 3:34:55 a.m. GMT",
            "authority": "https://gitlab.eclipse.org/eclipsefdn/emo-team/iplab/-/issues/19811",
            "scancode-version": "31.2.1",
            "licenses-discovered": [
                "BSD-3-Clause",
                "Apache-2.0",
                "BSD-3-Clause AND Classpath-exception-2.0"
            ],
            "copyrights": [
                "Copyright (c) 2002-2016, the original",
                "Copyright (c) 2002-2016, the original author or authors",
                "Copyright (c) 2002-2017, the original",
                "Copyright (c) 2002-2018, the original",
                "Copyright (c) 2002-2018, the original author or authors",
                "Copyright (c) 2002-2019, the original",
                "Copyright (c) 2002-2020, the original",
                "Copyright (c) 2002-2020, the original author or authors",
                "Copyright (c) 2002-2021, the original",
                "Copyright (c) 2002-2023, the original",
                "Copyright (c) 2009-2018, the original",
                "Copyright (c) 2009-2023, the original",
                "Copyright (c) 2022 the original",
                "Copyright (c) 2022, the original",
                "Copyright (c) 2023, the original"
            ],
            "file-count": 86,
            "sha256": "8701f9849f0b46655b5f366449cbfff078bb76c844e5e83782da7881ed040808",
            "source": "https://repo1.maven.org/maven2/org/jline/jline-terminal/3.26.3/jline-terminal-3.26.3-sources.jar",
            "status": "restricted"
        }
    ]
}