{
    "id": "project/technology.xfsc/eclipse-xfsc-tsa/workspace/b852f72576fc66d99fff5aa7613b9457620a6039",
    "license": "Apache-2.0",
    "authority": "https://gitlab.eclipse.org/eclipsefdn/emo-team/iplab/-/issues/9582",
    "source": "https://gitlab.eclipse.org/api/v4/projects/eclipse%2Fxfsc%2Ftsa%2Fworkspace/repository/archive.zip?sha=b852f72576fc66d99fff5aa7613b9457620a6039",
    "status": "approved",
    "scans": [
        {
            "date": "July 18, 2023 at 7:58:37 a.m. GMT",
            "authority": "https://gitlab.eclipse.org/eclipsefdn/emo-team/iplab/-/issues/9582",
            "scancode-version": "31.2.1",
            "licenses-discovered": [
                "Apache-2.0"
            ],
            "copyrights": [
                "Copyright 2022 Vereign AG"
            ],
            "file-count": 19,
            "sha256": "2660196c3db94d73a53a602092425acef53fc3ba1da3bc338023c2bc3d6f2d74",
            "source": "https://gitlab.eclipse.org/api/v4/projects/eclipse%2Fxfsc%2Ftsa%2Fworkspace/repository/archive.zip?sha=b852f72576fc66d99fff5aa7613b9457620a6039",
            "status": "restricted"
        }
    ]
}
