{
    "id": "maven/mavencentral/org.webjars/webjars-locator-core/0.54",
    "license": "MIT",
    "authority": "https://gitlab.eclipse.org/eclipsefdn/emo-team/iplab/-/issues/11366",
    "source": "https://repo1.maven.org/maven2/org/webjars/webjars-locator-core/0.54/webjars-locator-core-0.54-sources.jar",
    "status": "approved",
    "scans": [
        {
            "date": "October 31, 2023 at 8:51:13 p.m. GMT",
            "authority": "https://gitlab.eclipse.org/eclipsefdn/emo-team/iplab/-/issues/11366",
            "scancode-version": "31.2.1",
            "licenses-discovered": [
                "MIT"
            ],
            "copyrights": [
                "Copyright (c) 2013 James Ward"
            ],
            "file-count": 9,
            "sha256": "d19856570402786e846036ae5eaa0fcdd336f9e0d1e2818a48b083f8477fe92b",
            "source": "https://repo1.maven.org/maven2/org/webjars/webjars-locator-core/0.54/webjars-locator-core-0.54-sources.jar",
            "status": "approved"
        }
    ]
}