{
    "id": "npm/npmjs/-/stylelint-config-recommended-scss/11.0.0",
    "license": "MIT",
    "authority": "https://gitlab.eclipse.org/eclipsefdn/emo-team/iplab/-/issues/8068",
    "source": "https://github.com/stylelint-scss/stylelint-config-recommended-scss/archive/v11.0.0.zip",
    "status": "approved",
    "scans": [
        {
            "date": "April 28, 2023 at 2:06:40 p.m. GMT",
            "authority": "https://gitlab.eclipse.org/eclipsefdn/emo-team/iplab/-/issues/8068",
            "scancode-version": "31.2.1",
            "licenses-discovered": [
                "MIT"
            ],
            "copyrights": [
                "Copyright (c) 2016 Krister Kari"
            ],
            "file-count": 11,
            "sha256": "0e949d6d02f5408b1345aec6bdfe0daf084e49963143623986673244d7186465",
            "source": "https://github.com/stylelint-scss/stylelint-config-recommended-scss/archive/v11.0.0.zip",
            "status": "approved"
        }
    ]
}