{
    "id": "go/golang/github.com%2FBurntSushi/toml/v0.4.1",
    "license": "MIT AND BSD-3-Clause",
    "authority": "https://gitlab.eclipse.org/eclipsefdn/emo-team/iplab/-/issues/12221",
    "source": "https://github.com/BurntSushi/toml/archive/refs/tags/v0.4.1.zip",
    "status": "approved",
    "scans": [
        {
            "date": "December 21, 2023 at 3:48:11 p.m. GMT",
            "authority": "https://gitlab.eclipse.org/eclipsefdn/emo-team/iplab/-/issues/12221",
            "scancode-version": "31.2.1",
            "licenses-discovered": [
                "MIT",
                "BSD-3-Clause"
            ],
            "copyrights": [
                "Copyright (c) 2013 TOML authors",
                "Copyright (c) 2018 TOML authors",
                "Copyright 2010 The Go Authors"
            ],
            "file-count": 432,
            "sha256": "9829a7c0dba215e96e01adf4c4eff18cebb5816e89881e0406eb5230db2fdc4e",
            "source": "https://github.com/BurntSushi/toml/archive/refs/tags/v0.4.1.zip",
            "status": "approved"
        }
    ]
}