{
    "id": "project/iot.threadx/eclipse-threadx/samples/650582d1c78f0b7b1e80b9da7be46123dcaffa48",
    "license": "MIT",
    "authority": "https://gitlab.eclipse.org/eclipsefdn/emo-team/iplab/-/issues/12867",
    "source": "https://github.com/eclipse-threadx/samples/archive/650582d1c78f0b7b1e80b9da7be46123dcaffa48.zip",
    "status": "approved",
    "scans": [
        {
            "date": "January 23, 2024 at 6:46:59 p.m. GMT",
            "authority": "https://gitlab.eclipse.org/eclipsefdn/emo-team/iplab/-/issues/12867",
            "scancode-version": "31.2.1",
            "licenses-discovered": [
            ],
            "copyrights": [
            ],
            "file-count": 2,
            "sha256": "62d3a25daed8706589407ec80852c80bb7efc78453e28d4c53243debc9ed1084",
            "source": "https://github.com/eclipse-threadx/samples/archive/650582d1c78f0b7b1e80b9da7be46123dcaffa48.zip",
            "status": "restricted"
        }
    ]
}
