{
    "license": "(AFL-2.1 OR BSD-3-Clause) AND MIT",
    "file-count": 31,
    "authority": "https://gitlab.eclipse.org/eclipsefdn/emo-team/iplab/-/issues/1046",
    "scancode-version": "21.3.31",
    "licenses-discovered": [
    ],
    "id": "npm/npmjs/-/json-schema/0.2.3",
    "source": "https://github.com/kriszyp/json-schema/archive/v0.2.3.zip",
    "status": "approved"
}
