{
    "id": "maven/mavencentral/com.apicatalog/titanium-json-ld/1.5.0",
    "license": "Apache-2.0",
    "authority": "https://gitlab.eclipse.org/eclipsefdn/emo-team/iplab/-/issues/19372",
    "source": "https://repo1.maven.org/maven2/com/apicatalog/titanium-json-ld/1.5.0/titanium-json-ld-1.5.0-sources.jar",
    "status": "approved",
    "scans": [
        {
            "date": "February 11, 2025 at 12:46:46 a.m. GMT",
            "authority": "https://gitlab.eclipse.org/eclipsefdn/emo-team/iplab/-/issues/19372",
            "scancode-version": "31.2.1",
            "licenses-discovered": [
                "Apache-2.0"
            ],
            "copyrights": [
                "Copyright 2020 the original author or authors"
            ],
            "file-count": 146,
            "sha256": "60c065b7627b2cf62e0c4a45330130ea554b7a1b2320d6060e9098c3e1f9c7d1",
            "source": "https://repo1.maven.org/maven2/com/apicatalog/titanium-json-ld/1.5.0/titanium-json-ld-1.5.0-sources.jar",
            "status": "approved"
        }
    ]
}