{
    "id": "go/golang/github.com%2Fcontainerd/containerd/v1.4.0-beta.2.0.20200729163537-40b22ef07410",
    "license": "Apache-2.0 AND BSD-2-Clause",
    "authority": "https://gitlab.eclipse.org/eclipsefdn/emo-team/iplab/-/issues/12272",
    "source": "https://proxy.golang.org/github.com%2Fcontainerd/containerd/@v/v1.4.0-beta.2.0.20200729163537-40b22ef07410.zip",
    "status": "approved",
    "scans": [
        {
            "date": "December 21, 2023 at 5:45:55 a.m. GMT",
            "authority": "https://gitlab.eclipse.org/eclipsefdn/emo-team/iplab/-/issues/12272",
            "scancode-version": "31.2.1",
            "licenses-discovered": [
                "Apache-2.0",
                "BSD-2-Clause"
            ],
            "copyrights": [
                "Copyright (c) 1999-2008 Novell Inc.",
                "Copyright (c) 2013, The GoGo Authors",
                "Copyright 2009-2012 Canonical Ltd."
            ],
            "file-count": 722,
            "sha256": "2940440dcb67f85e1ab618a4606008fb1ac4eee53d2ce1a07ca6561897eca58a",
            "source": "https://proxy.golang.org/github.com%2Fcontainerd/containerd/@v/v1.4.0-beta.2.0.20200729163537-40b22ef07410.zip",
            "status": "approved"
        }
    ]
}