{
    "id": "go/golang/github.com%2Fstyrainc/regal/v0.24.0",
    "license": "Apache-2.0 AND MIT AND BSD-3-Clause",
    "authority": "https://gitlab.eclipse.org/eclipsefdn/emo-team/iplab/-/issues/15885",
    "source": "https://proxy.golang.org/github.com%2Fstyrainc/regal/@v/v0.24.0.zip",
    "status": "approved",
    "scans": [
        {
            "date": "August 14, 2024 at 1:56:15 p.m. GMT",
            "authority": "https://gitlab.eclipse.org/eclipsefdn/emo-team/iplab/-/issues/15885",
            "scancode-version": "31.2.1",
            "licenses-discovered": [
                "Apache-2.0",
                "MIT",
                "BSD-3-Clause"
            ],
            "copyrights": [
                "Copyright (c) 2016 Sourcegraph Inc",
                "Copyright (c) 2023 Ryo Kitagawa",
                "Copyright 2017 The OPA Authors",
                "Copyright 2018 The OPA Authors",
                "Copyright 2019 The Go Authors",
                "Copyright 2020 The OPA Authors"
            ],
            "file-count": 497,
            "sha256": "2764c901be8a49b81f8ed05666aedb725c0fbd3f737dc5e46ff60520dde20208",
            "source": "https://proxy.golang.org/github.com%2Fstyrainc/regal/@v/v0.24.0.zip",
            "status": "approved"
        }
    ]
}