{
    "id": "npm/npmjs/@typescript-eslint/utils/7.16.0",
    "license": "BSD-2-Clause AND MIT AND (BSD-2-Clause AND ISC AND MIT)",
    "authority": "https://gitlab.eclipse.org/eclipsefdn/emo-team/iplab/-/issues/15679",
    "source": "https://github.com/typescript-eslint/typescript-eslint/archive/refs/tags/v7.16.0.zip",
    "status": "approved",
    "scans": [
        {
            "date": "July 10, 2024 at 8:09:37 a.m. GMT",
            "authority": "https://gitlab.eclipse.org/eclipsefdn/emo-team/iplab/-/issues/15679",
            "scancode-version": "31.2.1",
            "licenses-discovered": [
                "BSD-2-Clause",
                "MIT",
                "BSD-2-Clause AND ISC AND MIT"
            ],
            "copyrights": [
                "Copyright (c) 2016 unional",
                "Copyright (c) 2019 typescript-eslint and other contributors",
                "Copyright (c) 2021 typescript-eslint and other contributors",
                "Copyright (c) 2023 typescript-eslint and other contributors",
                "Copyright JS Foundation and other contributors, https://js.foundation",
                "Copyright Joyent, Inc. and other Node contributors",
                "Pp (c) Ac",
                "Tv (c) Gn"
            ],
            "file-count": 7190,
            "sha256": "3dc0563e41d79d6a3234a1ce2d31d4b6122881802b9bbc5eced4e827a1985cb7",
            "source": "https://github.com/typescript-eslint/typescript-eslint/archive/refs/tags/v7.16.0.zip",
            "status": "approved"
        }
    ]
}