{
    "id": "npm/npmjs/@rollup/rollup-android-arm-eabi/4.14.1",
    "license": "MIT AND (ISC AND MIT)",
    "authority": "https://gitlab.eclipse.org/eclipsefdn/emo-team/iplab/-/issues/14395",
    "source": "https://github.com/rollup/rollup/archive/refs/tags/v4.14.1.zip",
    "status": "approved",
    "scans": [
        {
            "date": "April 16, 2024 at 12:19:55 p.m. GMT",
            "authority": "https://gitlab.eclipse.org/eclipsefdn/emo-team/iplab/-/issues/14395",
            "scancode-version": "31.2.1",
            "licenses-discovered": [
                "MIT",
                "ISC AND MIT"
            ],
            "copyrights": [
                "Copyright (c) 2012-2019 Paul Miller (https://paulmillr.com), Elan Shanker",
                "Copyright (c) 2012-2019 Thorsten Lorenz, Paul Miller (https://paulmillr.com)",
                "Copyright (c) 2014-2016, Jon Schlinkert",
                "Copyright (c) 2014-2017, Jon Schlinkert",
                "Copyright (c) 2014-2018, Jon Schlinkert",
                "Copyright (c) 2014-present, Jon Schlinkert",
                "Copyright (c) 2015 Rich Harris",
                "Copyright (c) 2015, 2019 Elan Shanker",
                "Copyright (c) 2015-2023 Benjamin Coe, Isaac Z. Schlueter, and Contributors",
                "Copyright (c) 2015-present Rollup",
                "Copyright (c) 2015-present, Jon Schlinkert",
                "Copyright (c) 2016, Contributors",
                "Copyright (c) 2017 these people (https://github.com/rollup/rollup/graphs/contributors)",
                "Copyright (c) 2017-present, Jon Schlinkert",
                "Copyright (c) 2019 Elan Shanker, Paul Miller (https://paulmillr.com)",
                "Copyright (c) 2019 RollupJS",
                "Copyright (c) 2019 Sindre Sorhus <sindresorhus@gmail.com> (https://sindresorhus.com), Paul Miller (https://paulmillr.com)",
                "Copyright (c) 2019 by original authors",
                "Copyright (c) 2019 by original authors fontello.com",
                "Copyright (c) Jorge Bucaran <https://jorgebucaran.com>",
                "Copyright (c) Luke Edwards <luke.edwards05@gmail.com> (lukeed.com)",
                "Copyright (c) Paul Miller (https://paulmillr.com)",
                "Copyright (c) Sindre Sorhus <sindresorhus@gmail.com> (https://sindresorhus.com)",
                "Copyright 2009-2020",
                "Copyright 2013-2016 by Paul Miller (http://paulmillr.com) and contributors",
                "Copyright 2018 Rich Harris",
                "copyright (c) 2014-2024 Denis Pushkarev"
            ],
            "file-count": 11853,
            "sha256": "f41aeb2fb1fd8d4b86b2d48d3a6d85f1a564cd83791fe5b0cb103709334c6460",
            "source": "https://github.com/rollup/rollup/archive/refs/tags/v4.14.1.zip",
            "status": "approved"
        }
    ]
}