{
    "id": "npm/npmjs/@inversifyjs/core/1.3.4",
    "license": "MIT",
    "authority": "https://gitlab.eclipse.org/eclipsefdn/emo-team/iplab/-/issues/17399",
    "source": "https://github.com/inversify/monorepo/archive/refs/tags/@inversifyjs/core@1.3.4.zip",
    "status": "approved",
    "scans": [
        {
            "date": "November 22, 2024, 1:04:37 p.m. GMT",
            "authority": "https://gitlab.eclipse.org/eclipsefdn/emo-team/iplab/-/issues/17399",
            "scancode-version": "31.2.1",
            "licenses-discovered": [
                "MIT"
            ],
            "copyrights": [
                "Copyright (c) 2024 inversify"
            ],
            "file-count": 199,
            "sha256": "51b674937fba7d6b39f81c17371d60dbd065017c45c6de91f162ce469d0d2290",
            "source": "https://github.com/inversify/monorepo/archive/refs/tags/@inversifyjs/core@1.3.4.zip",
            "status": "approved"
        }
    ]
}