{
    "id": "maven/mavencentral/io.confluent/logredactor-metrics/1.0.12",
    "license": "Apache-2.0",
    "authority": "https://gitlab.eclipse.org/eclipsefdn/emo-team/iplab/-/issues/13619",
    "source": "https://repo1.maven.org/maven2/io/confluent/logredactor-metrics/1.0.12/logredactor-metrics-1.0.12-sources.jar",
    "status": "approved",
    "scans": [
        {
            "date": "March 8, 2024 at 2:01:32 a.m. GMT",
            "authority": "https://gitlab.eclipse.org/eclipsefdn/emo-team/iplab/-/issues/13619",
            "scancode-version": "31.2.1",
            "licenses-discovered": [
                "Apache-2.0"
            ],
            "copyrights": [
                "Copyright (c) 2015, Cloudera, Inc.",
                "Copyright (c) 2021, Confluent, Inc."
            ],
            "file-count": 4,
            "sha256": "71c89d84b536a7da9b3a8f70fd823610a25d8fa70dd5c97e385e902fd82e67e1",
            "source": "https://repo1.maven.org/maven2/io/confluent/logredactor-metrics/1.0.12/logredactor-metrics-1.0.12-sources.jar",
            "status": "approved"
        }
    ]
}