{
    "id": "maven/mavencentral/io.gatling/gatling-redis-java/3.10.5",
    "license": "Apache-2.0",
    "authority": "https://gitlab.eclipse.org/eclipsefdn/emo-team/iplab/-/issues/14473",
    "source": "https://repo1.maven.org/maven2/io/gatling/gatling-redis-java/3.10.5/gatling-redis-java-3.10.5-sources.jar",
    "status": "approved",
    "scans": [
        {
            "date": "April 19, 2024 at 1:50:06 p.m. GMT",
            "authority": "https://gitlab.eclipse.org/eclipsefdn/emo-team/iplab/-/issues/14473",
            "scancode-version": "31.2.1",
            "licenses-discovered": [
                "Apache-2.0"
            ],
            "copyrights": [
                "Copyright 2011-2024 GatlingCorp (https://gatling.io)"
            ],
            "file-count": 4,
            "sha256": "8494915493063e1cf6c48ab40984f591c86eaf40209e39f89452d933f4f355c1",
            "source": "https://repo1.maven.org/maven2/io/gatling/gatling-redis-java/3.10.5/gatling-redis-java-3.10.5-sources.jar",
            "status": "approved"
        }
    ]
}