{
    "id": "npm/npmjs/-/css-loader/6.10.0",
    "license": "MIT AND Apache-2.0",
    "authority": "https://gitlab.eclipse.org/eclipsefdn/emo-team/iplab/-/issues/13035",
    "source": "https://github.com/webpack-contrib/css-loader/archive/refs/tags/v6.10.0.zip",
    "status": "approved",
    "scans": [
        {
            "date": "January 31, 2024 at 11:52:50 a.m. GMT",
            "authority": "https://gitlab.eclipse.org/eclipsefdn/emo-team/iplab/-/issues/13035",
            "scancode-version": "31.2.1",
            "licenses-discovered": [
                "MIT",
                "Apache-2.0"
            ],
            "copyrights": [
                "Copyright 2011 Google Inc.",
                "Copyright JS Foundation and other contributors"
            ],
            "file-count": 528,
            "sha256": "a80cf4efbe713258cb93efaacee033ad59d380102065e4ef76b04ee8f0035e91",
            "source": "https://github.com/webpack-contrib/css-loader/archive/refs/tags/v6.10.0.zip",
            "status": "approved"
        }
    ]
}