{
    "id": "maven/mavencentral/org.apache.activemq/activemq-web/5.16.7",
    "license": "Apache-2.0 AND BSD-3-Clause AND MIT-0 AND Apache-2.0 AND BSD-3-Clause AND MIT",
    "authority": "https://gitlab.eclipse.org/eclipsefdn/emo-team/iplab/-/issues/11502",
    "source": "https://repo1.maven.org/maven2/org/apache/activemq/activemq-web/5.16.7/activemq-web-5.16.7-sources.jar",
    "status": "approved",
    "scans": [
        {
            "date": "November 10, 2023 at 3:47:55 p.m. GMT",
            "authority": "https://gitlab.eclipse.org/eclipsefdn/emo-team/iplab/-/issues/11502",
            "scancode-version": "31.2.1",
            "licenses-discovered": [
                "Apache-2.0 AND BSD-3-Clause AND MIT-0",
                "Apache-2.0",
                "BSD-3-Clause",
                "MIT"
            ],
            "copyrights": [
                "(c) 2005-2010 Sam Stephenson",
                "Copyright (c) 2005 Sam Stephenson",
                "Copyright (c) 2005, Ben Nolan",
                "Copyright (c) Simon Willison 2004",
                "Copyright 2006 Mort Bay Consulting Pty. Ltd.",
                "Copyright 2013 jQuery Foundation, Inc. and other contributors"
            ],
            "file-count": 56,
            "sha256": "1f654e44c9b734e1c62d366a9fe44d8a4b2f751c5a435400eae12e8e8bb226a6",
            "source": "https://repo1.maven.org/maven2/org/apache/activemq/activemq-web/5.16.7/activemq-web-5.16.7-sources.jar",
            "status": "approved"
        }
    ]
}