{
    "id": "maven/mavencentral/org.elasticsearch.client/elasticsearch-rest-high-level-client/7.15.2",
    "license": "Elastic-2.0 OR SSPL-1.0",
    "authority": "https://gitlab.eclipse.org/eclipsefdn/emo-team/iplab/-/issues/7318",
    "source": "https://search.maven.org/remotecontent?filepath=org/elasticsearch/client/elasticsearch-rest-high-level-client/7.15.2/elasticsearch-rest-high-level-client-7.15.2-sources.jar",
    "status": "approved",
    "scans": [
        {
            "date": "March 3, 2023 at 10:00:53 p.m. GMT",
            "authority": "https://gitlab.eclipse.org/eclipsefdn/emo-team/iplab/-/issues/7318",
            "scancode-version": "31.2.1",
            "licenses-discovered": [
                "Elastic-2.0 AND SSPL-1.0",
                "Elastic-2.0 AND JSON AND SSPL-1.0"
            ],
            "copyrights": [
                "Copyright (c) 2018 MongoDB, Inc.",
                "Copyright Elasticsearch B.V."
            ],
            "file-count": 704,
            "sha256": "ece8f3e85072a4903f3e821c7d9ef46fa384933e47c140e363b75ff707adff41",
            "source": "https://search.maven.org/remotecontent?filepath=org/elasticsearch/client/elasticsearch-rest-high-level-client/7.15.2/elasticsearch-rest-high-level-client-7.15.2-sources.jar",
            "status": "restricted"
        }
    ]
}
