{
    "id": "maven/mavencentral/org.flywaydb/flyway-core/6.4.4",
    "license": "Apache-2.0",
    "authority": "https://gitlab.eclipse.org/eclipsefdn/emo-team/iplab/-/issues/6264",
    "source": "https://search.maven.org/remotecontent?filepath=org/flywaydb/flyway-core/6.4.4/flyway-core-6.4.4-sources.jar",
    "status": "approved",
    "scans": [
        {
            "date": "January 10, 2023 at 4:55:29 p.m. GMT",
            "authority": "https://gitlab.eclipse.org/eclipsefdn/emo-team/iplab/-/issues/6264",
            "scancode-version": "31.2.1",
            "licenses-discovered": [
                "Apache-2.0"
            ],
            "copyrights": [
                "Copyright 2010-2020 Redgate Software Ltd"
            ],
            "file-count": 340,
            "sha256": "475828e454b8a9190bbc8a4eca6e094f739a9e4eecbb6ac618104378e0d68d03",
            "source": "https://search.maven.org/remotecontent?filepath=org/flywaydb/flyway-core/6.4.4/flyway-core-6.4.4-sources.jar",
            "status": "approved"
        }
    ]
}