{
    "id": "maven/mavencentral/org.apache.arrow/arrow-memory-core/18.2.0",
    "license": "Apache-2.0",
    "authority": "https://gitlab.eclipse.org/eclipsefdn/emo-team/iplab/-/issues/19496",
    "source": "https://repo1.maven.org/maven2/org/apache/arrow/arrow-memory-core/18.2.0/arrow-memory-core-18.2.0-sources.jar",
    "status": "approved",
    "scans": [
        {
            "date": "February 20, 2025 at 4:50:38 p.m. GMT",
            "authority": "https://gitlab.eclipse.org/eclipsefdn/emo-team/iplab/-/issues/19496",
            "scancode-version": "31.2.1",
            "licenses-discovered": [
                "Apache-2.0"
            ],
            "copyrights": [
                "Copyright (c) 2007 The Guava Authors"
            ],
            "file-count": 53,
            "sha256": "badccb602f0184e27e55f58f1c4c5cd8a4eb5f5a257ae4d21a444ce57091ce38",
            "source": "https://repo1.maven.org/maven2/org/apache/arrow/arrow-memory-core/18.2.0/arrow-memory-core-18.2.0-sources.jar",
            "status": "approved"
        }
    ]
}