{
    "id": "maven/mavencentral/org.testcontainers/vault/1.20.2",
    "license": "MIT",
    "authority": "https://gitlab.eclipse.org/eclipsefdn/emo-team/iplab/-/issues/16686",
    "source": "https://repo1.maven.org/maven2/org/testcontainers/vault/1.20.2/vault-1.20.2-sources.jar",
    "status": "approved",
    "scans": [
        {
            "date": "October 15, 2024, 10:18:55 a.m. GMT",
            "authority": "https://gitlab.eclipse.org/eclipsefdn/emo-team/iplab/-/issues/16686",
            "scancode-version": "31.2.1",
            "licenses-discovered": [
            ],
            "copyrights": [
            ],
            "file-count": 3,
            "sha256": "918441d290db82f1d9c74534fbeaabe5fc7c34603b28f8ab74a8d34c4202b9cd",
            "source": "https://repo1.maven.org/maven2/org/testcontainers/vault/1.20.2/vault-1.20.2-sources.jar",
            "status": "restricted"
        }
    ]
}