{
    "id": "maven/mavencentral/software.amazon.awssdk/http-auth-spi/2.30.33",
    "license": "Apache-2.0",
    "authority": "https://gitlab.eclipse.org/eclipsefdn/emo-team/iplab/-/issues/19921",
    "source": "https://repo1.maven.org/maven2/software/amazon/awssdk/http-auth-spi/2.30.33/http-auth-spi-2.30.33-sources.jar",
    "status": "approved",
    "scans": [
        {
            "date": "March 6, 2025 at 8:22:36 a.m. GMT",
            "authority": "https://gitlab.eclipse.org/eclipsefdn/emo-team/iplab/-/issues/19921",
            "scancode-version": "31.2.1",
            "licenses-discovered": [
                "Apache-2.0"
            ],
            "copyrights": [
                "Copyright Amazon.com, Inc. or its affiliates"
            ],
            "file-count": 23,
            "sha256": "428be6e57f82cd572e85b51d7745ddb672c7ac509a7ca114e8f57be850558713",
            "source": "https://repo1.maven.org/maven2/software/amazon/awssdk/http-auth-spi/2.30.33/http-auth-spi-2.30.33-sources.jar",
            "status": "approved"
        }
    ]
}