{
    "id": "maven/mavencentral/androidx.compose.runtime/runtime/1.5.0",
    "license": "Apache-2.0",
    "authority": "https://gitlab.eclipse.org/eclipsefdn/emo-team/iplab/-/issues/10387",
    "source": "https://dl.google.com/android/maven2/androidx/compose/runtime/runtime/1.5.0/runtime-1.5.0-sources.jar",
    "status": "approved",
    "scans": [
        {
            "date": "September 11, 2023 at 9:39:21 p.m. GMT",
            "authority": "https://gitlab.eclipse.org/eclipsefdn/emo-team/iplab/-/issues/10387",
            "scancode-version": "31.2.1",
            "licenses-discovered": [
                "Apache-2.0"
            ],
            "copyrights": [
                "Copyright 2016-2019 JetBrains s.r.o.",
                "Copyright 2016-2020 JetBrains s.r.o.",
                "Copyright 2019 The Android Open Source Project",
                "Copyright 2020 The Android Open Source Project",
                "Copyright 2021 The Android Open Source Project",
                "Copyright 2022 The Android Open Source Project",
                "Copyright 2023 The Android Open Source Project"
            ],
            "file-count": 127,
            "sha256": "f3f37eeb3a5f874984a854b65c70e7bf75373c95df62d9eba93f244768d91e46",
            "source": "https://dl.google.com/android/maven2/androidx/compose/runtime/runtime/1.5.0/runtime-1.5.0-sources.jar",
            "status": "approved"
        }
    ]
}