{
    "id": "npm/npmjs/@typescript-eslint/eslint-plugin/5.33.0",
    "license": "MIT",
    "licenses-discovered": [
        "MIT"
    ],
    "copyrights": [
        "Copyright (c) TypeScript ESLint and other contributors"
    ],
    "file-count": 460,
    "scancode-version": "30.1.0",
    "authority": "https://gitlab.eclipse.org/eclipsefdn/emo-team/iplab/-/issues/3359",
    "source": "https://registry.npmjs.org/@typescript-eslint/eslint-plugin/-/eslint-plugin-5.33.0.tgz",
    "status": "approved"
}