{
    "id": "maven/mavencentral/org.awaitility/awaitility/3.0.0",
    "license": "Apache-2.0",
    "authority": "https://gitlab.eclipse.org/eclipsefdn/emo-team/iplab/-/issues/11042",
    "source": "https://repo.maven.apache.org/maven2/org/awaitility/awaitility/3.0.0/awaitility-3.0.0-sources.jar",
    "status": "approved",
    "scans": [
        {
            "date": "October 11, 2023 at 11:34:43 a.m. GMT",
            "authority": "https://gitlab.eclipse.org/eclipsefdn/emo-team/iplab/-/issues/11042",
            "scancode-version": "31.2.1",
            "licenses-discovered": [
                "Apache-2.0"
            ],
            "copyrights": [
                "Copyright (c) 2007 Google Inc.",
                "Copyright 2008 the original author or authors",
                "Copyright 2009 the original author or authors",
                "Copyright 2010 PowerMock",
                "Copyright 2010 the original author or authors",
                "Copyright 2014 the original author or authors",
                "Copyright 2015 the original author or authors",
                "Copyright 2016 the original author or authors",
                "Copyright 2017 the original author or authors"
            ],
            "file-count": 51,
            "sha256": "92d5e001f144ec7edd2e84066332280a18af686087af0067dc875e845fd75953",
            "source": "https://repo.maven.apache.org/maven2/org/awaitility/awaitility/3.0.0/awaitility-3.0.0-sources.jar",
            "status": "approved"
        }
    ]
}