{
    "id": "maven/mavencentral/org.tuckey/urlrewritefilter/4.0.4",
    "license": "BSD-3-Clause",
    "authority": "https://gitlab.eclipse.org/eclipsefdn/emo-team/iplab/-/issues/15467",
    "source": "https://repo1.maven.org/maven2/org/tuckey/urlrewritefilter/4.0.4/urlrewritefilter-4.0.4-sources.jar",
    "status": "approved",
    "scans": [
        {
            "date": "June 20, 2024 at 7:00:39 p.m. GMT",
            "authority": "https://gitlab.eclipse.org/eclipsefdn/emo-team/iplab/-/issues/15467",
            "scancode-version": "31.2.1",
            "licenses-discovered": [
                "BSD-3-Clause",
                "Apache-2.0",
                "Apache-2.0 AND GPL-1.0-or-later AND LGPL-2.0-or-later"
            ],
            "copyrights": [
                "Copyright (c) 2005-2007, Paul Tuckey",
                "Copyright (c) 2005-2012, Paul Tuckey",
                "Copyright (c) 2008, Paul Tuckey",
                "Copyright 2003-2004 The Apache Software Foundation",
                "Copyright 2003-2009 Terracotta, Inc."
            ],
            "file-count": 84,
            "sha256": "942633b04fe5350f50c4fcd59a6768f9ad68b3af9ea5229ec6763ba3b9fd006e",
            "source": "https://repo1.maven.org/maven2/org/tuckey/urlrewritefilter/4.0.4/urlrewritefilter-4.0.4-sources.jar",
            "status": "restricted"
        }
    ]
}