{
    "id": "crate/cratesio/-/prost-types/0.11.8",
    "license": "Apache-2.0 AND BSD-2-Clause",
    "authority": "https://gitlab.eclipse.org/eclipsefdn/emo-team/iplab/-/issues/7714",
    "source": "https://crates.io/api/v1/crates/prost-types/0.11.8/download",
    "status": "approved",
    "scans": [
        {
            "date": "March 31, 2023 at 9:23:51 a.m. GMT",
            "authority": "https://gitlab.eclipse.org/eclipsefdn/emo-team/iplab/-/issues/7714",
            "scancode-version": "31.2.1",
            "licenses-discovered": [
                "Apache-2.0",
                "Apache-2.0 AND BSD-2-Clause AND LicenseRef-scancode-protobuf"
            ],
            "copyrights": [
                "Copyright 2017 Dan Burkert"
            ],
            "file-count": 9,
            "sha256": "379119666929a1afd7a043aa6cf96fa67a6dce9af60c88095a4686dbce4c9c88",
            "source": "https://crates.io/api/v1/crates/prost-types/0.11.8/download",
            "status": "restricted"
        }
    ]
}
