{
    "id": "maven/mavencentral/org.apache.curator/curator-framework/2.13.0",
    "license": "Apache-2.0",
    "authority": "https://gitlab.eclipse.org/eclipsefdn/emo-team/iplab/-/issues/6162",
    "source": "https://search.maven.org/remotecontent?filepath=org/apache/curator/curator-framework/2.13.0/curator-framework-2.13.0-sources.jar",
    "status": "approved",
    "scans": [
        {
            "date": "January 9, 2023 at 2:21:55 p.m. GMT",
            "authority": "https://gitlab.eclipse.org/eclipsefdn/emo-team/iplab/-/issues/6162",
            "scancode-version": "31.2.1",
            "licenses-discovered": [
                "Apache-2.0"
            ],
            "copyrights": [
            ],
            "file-count": 105,
            "sha256": "c5a9ef3e780e399fda13e614dab049b2465bdf2dada0c18188b36172e0dd0296",
            "source": "https://search.maven.org/remotecontent?filepath=org/apache/curator/curator-framework/2.13.0/curator-framework-2.13.0-sources.jar",
            "status": "approved"
        }
    ]
}