{
    "id": "npm/npmjs/@vitest/utils/2.1.1",
    "license": "MIT AND Apache-2.0 AND (Apache-2.0 AND BSD-3-Clause AND ISC AND MIT)",
    "authority": "https://gitlab.eclipse.org/eclipsefdn/emo-team/iplab/-/issues/16434",
    "source": "https://github.com/vitest-dev/vitest/archive/refs/tags/v2.1.1.zip",
    "status": "approved",
    "scans": [
        {
            "date": "September 30, 2024, 8:17:25 p.m. GMT",
            "authority": "https://gitlab.eclipse.org/eclipsefdn/emo-team/iplab/-/issues/16434",
            "scancode-version": "31.2.1",
            "licenses-discovered": [
                "MIT",
                "Apache-2.0",
                "Apache-2.0 AND BSD-3-Clause AND ISC AND MIT"
            ],
            "copyrights": [
                "(c) 2021 Anthony Fu (https://github.com/antfu)",
                "(c) 2021-Present Anthony Fu (https://github.com/antfu), Matias Capeletto (https://github.com/patak-dev)",
                "Copyright (c) 2008-2016 Pivotal Labs",
                "Copyright (c) 2010-2014, Christian Johansen, christian@cjohansen.no",
                "Copyright (c) 2011 Einar Otto Stangvik <einaros@gmail.com>",
                "Copyright (c) 2012-2020 by various contributors",
                "Copyright (c) 2013 Arnout Kazemier and contributors",
                "Copyright (c) 2013 Jake Luer <jake@alogicalparadox.com> (http://alogicalparadox.com)",
                "Copyright (c) 2014 Bob Lauer",
                "Copyright (c) 2014 Permission",
                "Copyright (c) 2014, 2015, 2016, 2017, 2018, 2019, 2020, 2021, 2022, 2023, 2024 Simon Lydell",
                "Copyright (c) 2014-present, Jon Schlinkert",
                "Copyright (c) 2015, Contributors",
                "Copyright (c) 2015-present, Jon Schlinkert",
                "Copyright (c) 2016 Luigi Pinca and contributors",
                "Copyright (c) 2017-present, Jon Schlinkert",
                "Copyright (c) 2018 Terkel Gjervig Nielsen",
                "Copyright (c) 2018, Sinon.JS",
                "Copyright (c) 2018-2020, Andrea Giammarchi",
                "Copyright (c) 2020-PRESENT Anthony Fu <https://github.com/antfu>",
                "Copyright (c) 2021 Anthony Fu <https://github.com/antfu>",
                "Copyright (c) 2021-PRESENT Anthony Fu, Matias Capeletto and Vitest",
                "Copyright (c) 2021-Present Vitest Team",
                "Copyright (c) 2022 Anthony Fu <https://github.com/antfu>",
                "Copyright (c) 2024 Madeline Gurriaran",
                "Copyright (c) DC",
                "Copyright (c) EGOIST",
                "Copyright (c) Facebook, Inc. and its affiliates",
                "Copyright (c) Hiroki Osame <hiroki.osame@gmail.com>",
                "Copyright (c) Luke Edwards <luke.edwards05@gmail.com> (lukeed.com)",
                "Copyright (c) Meta Platforms, Inc. and affiliates",
                "Copyright (c) Pooya Parsa <pooya@pi0.io>",
                "Copyright (c) Sindre Sorhus <sindresorhus@gmail.com> (https://sindresorhus.com)",
                "Copyright (c) Sindre Sorhus <sindresorhus@gmail.com> (sindresorhus.com)",
                "Copyright 2018 The diff-match-patch",
                "Copyright 2023 Abdullah Atta",
                "Copyright Mathias Bynens <https://mathiasbynens.be/>"
            ],
            "file-count": 1908,
            "sha256": "ec39c5a7c5da73900f4957da9e282b77db1bb8e8d3e16327bd7a886ed7476aa0",
            "source": "https://github.com/vitest-dev/vitest/archive/refs/tags/v2.1.1.zip",
            "status": "approved"
        }
    ]
}