{
    "id": "maven/mavencentral/org.bouncycastle/bcprov-jdk18on/1.77",
    "license": "MIT AND CC0-1.0",
    "authority": "https://gitlab.eclipse.org/eclipsefdn/emo-team/iplab/-/issues/11595",
    "source": "https://repo1.maven.org/maven2/org/bouncycastle/bcprov-jdk18on/1.77/bcprov-jdk18on-1.77-sources.jar",
    "status": "approved",
    "scans": [
        {
            "date": "November 15, 2023 at 1:08:56 p.m. GMT",
            "authority": "https://gitlab.eclipse.org/eclipsefdn/emo-team/iplab/-/issues/11595",
            "scancode-version": "31.2.1",
            "licenses-discovered": [
                "MIT",
                "CC0-1.0"
            ],
            "copyrights": [
                "(c) ECFieldElement A1",
                "(c) Nat224.isOne",
                "Copyright (c) 2000-2023 The Legion Of The Bouncy Castle Inc. (https://www.bouncycastle.org)",
                "Copyright (c) 2000-2023 The Legion of the Bouncy Castle Inc. (https://www.bouncycastle.org)",
                "Copyright Dr B. R Gladman (gladman@seven77.demon.co.uk) and Sam Simpson (s.simpson@mia.co.uk)"
            ],
            "file-count": 2417,
            "sha256": "60606097d1f0f8d161fd1dfe7da28965d2802144373ed6857dc41951ce61e25b",
            "source": "https://repo1.maven.org/maven2/org/bouncycastle/bcprov-jdk18on/1.77/bcprov-jdk18on-1.77-sources.jar",
            "status": "approved"
        }
    ]
}