{
    "license": "Apache-2.0 AND EPL-1.0",
    "file-count": 234,
    "authority": "https://gitlab.eclipse.org/eclipsefdn/emo-team/iplab/-/issues/1059",
    "scancode-version": "21.3.31",
    "licenses-discovered": [
        "Apache-2.0",
        "EPL-1.0"
    ],
    "id": "maven/mavencentral/io.moquette/moquette-broker/0.8.1",
    "source": "https://github.com/andsel/moquette/archive/refs/tags/v0.8.1.zip",
    "status": "approved"
}