{
    "license": "MIT",
    "file-count": 9,
    "authority": "https://gitlab.eclipse.org/eclipsefdn/emo-team/iplab/-/issues/1210",
    "scancode-version": "21.3.31",
    "licenses-discovered": [
        "MIT"
    ],
    "id": "npm/npmjs/@types/react/17.0.26",
    "source": "https://registry.npmjs.org/@types/react/-/react-17.0.26.tgz",
    "status": "approved"
}