{
    "id": "maven/mavencentral/com.vaadin/flow-server-compatibility-mode/2.7.15",
    "license": "Apache-2.0",
    "authority": "https://gitlab.eclipse.org/eclipsefdn/emo-team/iplab/-/issues/11202",
    "source": "https://repo.maven.apache.org/maven2/com/vaadin/flow-server-compatibility-mode/2.7.15/flow-server-compatibility-mode-2.7.15-sources.jar",
    "status": "approved",
    "scans": [
        {
            "date": "October 25, 2023 at 10:01:04 p.m. GMT",
            "authority": "https://gitlab.eclipse.org/eclipsefdn/emo-team/iplab/-/issues/11202",
            "scancode-version": "31.2.1",
            "licenses-discovered": [
                "Apache-2.0"
            ],
            "copyrights": [
            ],
            "file-count": 4,
            "sha256": "0434fa0b5ef20c2b5f759d9eecbb82949435489f117be6b318454adc38dae751",
            "source": "https://repo.maven.apache.org/maven2/com/vaadin/flow-server-compatibility-mode/2.7.15/flow-server-compatibility-mode-2.7.15-sources.jar",
            "status": "approved"
        }
    ]
}