{
    "id": "maven/mavencentral/org.scodec/scodec-bits_2.12/1.1.30",
    "license": "BSD-3-Clause",
    "authority": "https://gitlab.eclipse.org/eclipsefdn/emo-team/iplab/-/issues/8862",
    "source": "https://repo.maven.apache.org/maven2/org/scodec/scodec-bits_2.12/1.1.30/scodec-bits_2.12-1.1.30-sources.jar",
    "status": "approved",
    "scans": [
        {
            "date": "June 14, 2023 at 7:18:33 p.m. GMT",
            "authority": "https://gitlab.eclipse.org/eclipsefdn/emo-team/iplab/-/issues/8862",
            "scancode-version": "31.2.1",
            "licenses-discovered": [
                "BSD-3-Clause"
            ],
            "copyrights": [
                "Copyright (c) 2013, Scodec"
            ],
            "file-count": 16,
            "sha256": "7c399fb7821695346db08cb5d25163d42bd70ff67369065fceef45484bce78d4",
            "source": "https://repo.maven.apache.org/maven2/org/scodec/scodec-bits_2.12/1.1.30/scodec-bits_2.12-1.1.30-sources.jar",
            "status": "approved"
        }
    ]
}