{
    "id": "maven/mavencentral/com.github.oshi/oshi-core/6.5.0",
    "license": "MIT",
    "authority": "https://gitlab.eclipse.org/eclipsefdn/emo-team/iplab/-/issues/13639",
    "source": "https://repo1.maven.org/maven2/com/github/oshi/oshi-core/6.5.0/oshi-core-6.5.0-sources.jar",
    "status": "approved",
    "scans": [
        {
            "date": "March 11, 2024 at 8:44:09 a.m. GMT",
            "authority": "https://gitlab.eclipse.org/eclipsefdn/emo-team/iplab/-/issues/13639",
            "scancode-version": "31.2.1",
            "licenses-discovered": [
                "MIT"
            ],
            "copyrights": [
                "Copyright (c) 2016-2022 The OSHI Project",
                "Copyright (c) 2020-2022 The OSHI Project",
                "Copyright (c) 2021 The OSHI Project",
                "Copyright (c) 2021-2022 The OSHI Project",
                "Copyright (c) 2022 The OSHI Project",
                "Copyright 2010 - 2022 Eclipse-SourceBundle",
                "Copyright 2016-2022 The OSHI Project",
                "Copyright 2016-2023 The OSHI Project",
                "Copyright 2016-2024 The OSHI Project",
                "Copyright 2017-2022 The OSHI Project",
                "Copyright 2017-2023 The OSHI Project",
                "Copyright 2018-2022 The OSHI Project",
                "Copyright 2018-2023 The OSHI Project",
                "Copyright 2019-2022 The OSHI Project",
                "Copyright 2019-2023 The OSHI Project",
                "Copyright 2019-2024 The OSHI Project",
                "Copyright 2020-2022 The OSHI Project",
                "Copyright 2020-2023 The OSHI Project",
                "Copyright 2020-2024 The OSHI Project",
                "Copyright 2021-2022 The OSHI Project",
                "Copyright 2021-2023 The OSHI Project",
                "Copyright 2021-2024 The OSHI Project",
                "Copyright 2022 The OSHI Project",
                "Copyright 2022-2023 The OSHI Project"
            ],
            "file-count": 400,
            "sha256": "254d81b5da3b539c85dba8f6409fbe5688dbbc726c7aa037e3c4f959b33bc0d2",
            "source": "https://repo1.maven.org/maven2/com/github/oshi/oshi-core/6.5.0/oshi-core-6.5.0-sources.jar",
            "status": "approved"
        }
    ]
}