{
    "license": "MIT",
    "file-count": 30,
    "authority": "https://gitlab.eclipse.org/eclipsefdn/emo-team/iplab/-/issues/1284",
    "scancode-version": "21.3.31",
    "licenses-discovered": [
        "MIT"
    ],
    "id": "npm/npmjs/-/vue-loader-v16/16.1.2",
    "source": "https://registry.yarnpkg.com/vue-loader/-/vue-loader-16.1.2.tgz",
    "status": "approved"
}