{
    "id": "p2/orbit/p2.eclipse-plugin/com.github.librepdf.openpdf/1.3.26",
    "license": "LGPL-2.0-or-later OR MPL-1.1",
    "licenses-discovered": [
        "Apache-2.0",
        "LGPL-2.0-only",
        "MPL-1.1",
        "LGPL-2.0-or-later",
        "LicenseRef-scancode-adobe-acrobat-reader-eula",
        "LicenseRef-scancode-adobe-postscript",
        "LicenseRef-scancode-paulo-soares",
        "LicenseRef-scancode-unknown-license-reference",
        "OFL-1.1"
    ],
    "file-count": 556,
    "scancode-version": "30.1.0",
    "authority": "https://gitlab.eclipse.org/eclipsefdn/emo-team/iplab/-/issues/2078",
    "source": "https://search.maven.org/remotecontent?filepath=com/github/librepdf/openpdf/1.3.26/openpdf-1.3.26-sources.jar",
    "status": "approved"
}
