{
    "id": "git/github/gabime/spdlog/v1.6.0",
    "license": "MIT AND BSL-1.0",
    "licenses-discovered": [
        "MIT",
        "BSL-1.0"
    ],
    "copyrights": [
        "Copyright (c) - Victor Zverovich",
        "Copyright (c) - present, Remotion (Igor Schulz)",
        "Copyright (c) - present, Victor Zverovich",
        "Copyright (c) - present, Victor Zverovich and fmt contributors",
        "Copyright (c) Alexander Dalshov",
        "Copyright (c) Gabi Melman",
        "Copyright (c) Gabi Melman & spdlog contributors",
        "Copyright (c) Two Blue Cubes Ltd.",
        "Copyright (c) ZVYAGIN.Alexander@gmail.com",
        "Copyright (c) spdlog authors",
        "Copyright Paul Dreik"
    ],
    "file-count": 148,
    "scancode-version": "30.1.0",
    "authority": "https://gitlab.eclipse.org/eclipsefdn/emo-team/iplab/-/issues/3145",
    "source": "https://github.com/gabime/spdlog/archive/refs/tags/v1.6.0.zip",
    "status": "approved"
}