{
    "id": "maven/mavencentral/org.jboss.forge.roaster/roaster-jdt/2.28.0.Final",
    "license": "EPL-2.0 AND Apache-2.0 AND (EPL-2.0 OR Apache-2.0 OR GPL-2.0-only WITH Classpath-exception-2.0 OR GPL-2.0-only WITH OpenJDK-assembly-exception-1.0)",
    "authority": "https://gitlab.eclipse.org/eclipsefdn/emo-team/iplab/-/issues/9790",
    "source": "https://repo.maven.apache.org/maven2/org/jboss/forge/roaster/roaster-jdt/2.28.0.Final/roaster-jdt-2.28.0.Final-sources.jar",
    "status": "approved",
    "scans": [
        {
            "date": "July 26, 2023 at 12:01:44 p.m. GMT",
            "authority": "https://gitlab.eclipse.org/eclipsefdn/emo-team/iplab/-/issues/9790",
            "scancode-version": "31.2.1",
            "licenses-discovered": [
                "EPL-1.0 AND EPL-2.0",
                "Apache-2.0",
                "EPL-2.0",
                "EPL-1.0",
                "EPL-2.0 OR Apache-2.0 OR GPL-2.0-only WITH Classpath-exception-2.0 OR GPL-2.0-only WITH LicenseRef-scancode-openjdk-exception"
            ],
            "copyrights": [
                "(c) Copyright IBM Corp. 2000, 2001. + //$NON-NLS-1$",
                "Copyright (c) 2000, 2004 IBM Corporation and others",
                "Copyright (c) 2000, 2005 IBM Corporation and others",
                "Copyright (c) 2000, 2006 IBM Corporation and others",
                "Copyright (c) 2000, 2007 IBM Corporation and others",
                "Copyright (c) 2000, 2008 IBM Corporation and others",
                "Copyright (c) 2000, 2009 IBM Corporation and others",
                "Copyright (c) 2000, 2010 IBM Corporation and others",
                "Copyright (c) 2000, 2011 IBM Corporation and others",
                "Copyright (c) 2000, 2012 IBM Corporation and others",
                "Copyright (c) 2000, 2013 IBM Corporation and others",
                "Copyright (c) 2000, 2013, 2014, 2015 IBM Corporation and others",
                "Copyright (c) 2000, 2014 IBM Corporation and others",
                "Copyright (c) 2000, 2015 IBM Corporation and others",
                "Copyright (c) 2000, 2016 IBM Corporation and others",
                "Copyright (c) 2000, 2017 IBM Corporation and others",
                "Copyright (c) 2000, 2018 IBM Corporation and others",
                "Copyright (c) 2000, 2019 IBM Corporation and others",
                "Copyright (c) 2000, 2020 IBM Corporation and others",
                "Copyright (c) 2000, 2021 IBM Corporation and others",
                "Copyright (c) 2000, 2022 IBM Corporation and others",
                "Copyright (c) 2002, 2005 IBM Corporation and others",
                "Copyright (c) 2002, 2007 IBM Corporation and others",
                "Copyright (c) 2002, 2008 IBM Corporation and others",
                "Copyright (c) 2002, 2009 IBM Corporation and others",
                "Copyright (c) 2002, 2010 IBM Corporation and others",
                "Copyright (c) 2002, 2016 IBM Corporation and others",
                "Copyright (c) 2002, 2021 IBM Corporation and others",
                "Copyright (c) 2003, 2005 IBM Corporation and others",
                "Copyright (c) 2003, 2006 IBM Corporation and others",
                "Copyright (c) 2003, 2008 IBM Corporation and others",
                "Copyright (c) 2003, 2009 IBM Corporation and others",
                "Copyright (c) 2003, 2010 IBM Corporation and others",
                "Copyright (c) 2003, 2011 IBM Corporation and others",
                "Copyright (c) 2003, 2012 IBM Corporation and others",
                "Copyright (c) 2003, 2013 IBM Corporation and others",
                "Copyright (c) 2003, 2014 IBM Corporation and others",
                "Copyright (c) 2003, 2015 IBM Corporation and others",
                "Copyright (c) 2003, 2016 IBM Corporation and others",
                "Copyright (c) 2003, 2017 IBM Corporation and others",
                "Copyright (c) 2003, 2018 IBM Corporation and others",
                "Copyright (c) 2003, 2019 IBM Corporation and others",
                "Copyright (c) 2003, 2020 IBM Corporation and others",
                "Copyright (c) 2003, 2021 IBM Corporation and others",
                "Copyright (c) 2003, 2022 IBM Corporation and others",
                "Copyright (c) 2004, 2005 IBM Corporation and others",
                "Copyright (c) 2004, 2006 IBM Corporation and others",
                "Copyright (c) 2004, 2007 IBM Corporation and others",
                "Copyright (c) 2004, 2008 IBM Corporation and others",
                "Copyright (c) 2004, 2009 IBM Corporation and others",
                "Copyright (c) 2004, 2010 IBM Corporation and others",
                "Copyright (c) 2004, 2011 IBM Corporation and others",
                "Copyright (c) 2004, 2012 IBM Corporation and others",
                "Copyright (c) 2004, 2013 IBM Corporation and others",
                "Copyright (c) 2004, 2014 IBM Corporation and others",
                "Copyright (c) 2004, 2014 Red Hat Incorporated and others",
                "Copyright (c) 2004, 2015 IBM Corporation and others",
                "Copyright (c) 2004, 2016 IBM Corporation and others",
                "Copyright (c) 2004, 2017 IBM Corporation and others",
                "Copyright (c) 2004, 2018 IBM Corporation and others",
                "Copyright (c) 2004, 2019 IBM Corporation and others",
                "Copyright (c) 2004, 2020 IBM Corporation and others",
                "Copyright (c) 2004, 2021 IBM Corporation and others",
                "Copyright (c) 2004, 2022 IBM Corporation and others",
                "Copyright (c) 2005 IBM Corporation and others",
                "Copyright (c) 2005, 2006 IBM Corporation and others",
                "Copyright (c) 2005, 2008 BEA Systems, Inc.",
                "Copyright (c) 2005, 2008 IBM Corporation and others",
                "Copyright (c) 2005, 2009 BEA Systems, Inc.",
                "Copyright (c) 2005, 2009 IBM Corporation and others",
                "Copyright (c) 2005, 2010 BEA Systems, Inc.",
                "Copyright (c) 2005, 2010 IBM Corporation and others",
                "Copyright (c) 2005, 2011 IBM Corporation and others",
                "Copyright (c) 2005, 2012 IBM Corporation and others",
                "Copyright (c) 2005, 2013 BEA Systems, Inc.",
                "Copyright (c) 2005, 2013 IBM Corporation and others",
                "Copyright (c) 2005, 2014 IBM Corporation and others",
                "Copyright (c) 2005, 2015 IBM Corporation and others",
                "Copyright (c) 2005, 2016 BEA Systems, Inc.",
                "Copyright (c) 2005, 2016 IBM Corporation and others",
                "Copyright (c) 2005, 2017 BEA Systems, Inc, IBM Corporation and others",
                "Copyright (c) 2005, 2017 IBM Corporation and others",
                "Copyright (c) 2005, 2018 BEA Systems, Inc and others",
                "Copyright (c) 2005, 2018 IBM Corporation and others",
                "Copyright (c) 2005, 2019 IBM Corporation and others",
                "Copyright (c) 2005, 2020 IBM Corporation and others",
                "Copyright (c) 2005, 2021 BEA Systems, Inc.",
                "Copyright (c) 2005, 2021 IBM Corporation and others",
                "Copyright (c) 2005, 2022 IBM Corporation and others",
                "Copyright (c) 2006 BEA Systems, Inc and others",
                "Copyright (c) 2006 IBM Corporation and others",
                "Copyright (c) 2006, 2008 IBM Corporation and others",
                "Copyright (c) 2006, 2009 IBM Corporation and others",
                "Copyright (c) 2006, 2011 Ben Konrath <ben@bagu.org>",
                "Copyright (c) 2006, 2011 IBM Corporation and others",
                "Copyright (c) 2006, 2012 Cognos Incorporated, IBM Corporation and others",
                "Copyright (c) 2006, 2012 IBM Corporation and others",
                "Copyright (c) 2006, 2013 IBM Corporation and others",
                "Copyright (c) 2006, 2014 IBM Corporation and others",
                "Copyright (c) 2006, 2015 IBM Corporation and others",
                "Copyright (c) 2006, 2016 Cognos Incorporated, IBM Corporation and others",
                "Copyright (c) 2006, 2016 IBM Corporation and others",
                "Copyright (c) 2006, 2017 IBM Corporation and others",
                "Copyright (c) 2006, 2018 IBM Corp. and others",
                "Copyright (c) 2006, 2018 IBM Corporation and others",
                "Copyright (c) 2006, 2019 IBM Corporation and others",
                "Copyright (c) 2006, 2020 Cognos Incorporated, IBM Corporation and others",
                "Copyright (c) 2006, 2020 IBM Corporation and others",
                "Copyright (c) 2006, 2021 Cognos Incorporated, IBM Corporation and others",
                "Copyright (c) 2006, 2022 IBM Corporation and others",
                "Copyright (c) 2007 BEA Systems, Inc and others",
                "Copyright (c) 2007 IBM Corporation and others",
                "Copyright (c) 2007 Wind River Systems, Inc. and others",
                "Copyright (c) 2007, 2008 IBM Corporation and others",
                "Copyright (c) 2007, 2009 BEA Systems, Inc.",
                "Copyright (c) 2007, 2009 IBM Corporation and others",
                "Copyright (c) 2007, 2010 IBM Corporation and others",
                "Copyright (c) 2007, 2012 IBM Corporation and others",
                "Copyright (c) 2007, 2013 IBM Corporation and others",
                "Copyright (c) 2007, 2014 IBM Corporation and others",
                "Copyright (c) 2007, 2015 IBM Corporation and others",
                "Copyright (c) 2007, 2016 IBM Corporation and others",
                "Copyright (c) 2007, 2017 IBM Corporation and others",
                "Copyright (c) 2007, 2021 IBM Corporation",
                "Copyright (c) 2008 IBM Corporation and others",
                "Copyright (c) 2008, 2009 Freescale Semiconductor and others",
                "Copyright (c) 2008, 2009 IBM Corporation and others",
                "Copyright (c) 2008, 2010 Freescale Semiconductor and others",
                "Copyright (c) 2008, 2010 IBM Corporation and others",
                "Copyright (c) 2008, 2011 IBM Corporation and others",
                "Copyright (c) 2008, 2012 IBM Corporation and others",
                "Copyright (c) 2008, 2013 IBM Corporation and others",
                "Copyright (c) 2008, 2014 Freescale Semiconductor and others",
                "Copyright (c) 2008, 2014 IBM Corporation and others",
                "Copyright (c) 2008, 2014 Technical",
                "Copyright (c) 2008, 2015 Freescale Semiconductor and others",
                "Copyright (c) 2008, 2015 IBM Corporation and others",
                "Copyright (c) 2008, 2016 Freescale Semiconductor and others",
                "Copyright (c) 2008, 2016 IBM Corporation and others",
                "Copyright (c) 2008, 2019 IBM Corporation and others",
                "Copyright (c) 2008, 2020 IBM Corporation and others",
                "Copyright (c) 2008, 2021 IBM Corporation and others",
                "Copyright (c) 2008, 2022 IBM Corporation and others",
                "Copyright (c) 2009 Freescale Semiconductor and others",
                "Copyright (c) 2009 IBM Corporation and others",
                "Copyright (c) 2009, 2010 IBM Corporation and others",
                "Copyright (c) 2009, 2011 IBM Corporation and others",
                "Copyright (c) 2009, 2012 IBM Corporation and others",
                "Copyright (c) 2009, 2013 IBM Corporation and others",
                "Copyright (c) 2009, 2014 IBM Corporation and others",
                "Copyright (c) 2009, 2015 IBM Corporation and others",
                "Copyright (c) 2009, 2017 IBM Corporation and others",
                "Copyright (c) 2009, 2020 IBM Corporation and others",
                "Copyright (c) 2009, 2021 IBM Corporation and others",
                "Copyright (c) 2010 IBM Corporation and others",
                "Copyright (c) 2010, 2011 Broadcom Corporation and others",
                "Copyright (c) 2010, 2015 Broadcom Corporation and others",
                "Copyright (c) 2010, 2016 IBM Corporation and others",
                "Copyright (c) 2010, 2017 IBM Corporation and others",
                "Copyright (c) 2010, 2020 IBM Corporation and others",
                "Copyright (c) 2010, 2021 IBM Corporation and others",
                "Copyright (c) 2011 IBM Corporation and others",
                "Copyright (c) 2011, 2012 IBM Corporation and others",
                "Copyright (c) 2011, 2013 IBM Corporation and others",
                "Copyright (c) 2011, 2014 IBM Corporation and others",
                "Copyright (c) 2011, 2015 IBM Corporation and others",
                "Copyright (c) 2011, 2018 IBM Corporation and others",
                "Copyright (c) 2011, 2020 GK Software AG and others",
                "Copyright (c) 2011, 2022 IBM Corporation and others",
                "Copyright (c) 2012 IBM Corporation and others",
                "Copyright (c) 2012, 2013 IBM Corporation and others",
                "Copyright (c) 2012, 2014 IBM Corporation and others",
                "Copyright (c) 2012, 2016 IBM Corporation and others",
                "Copyright (c) 2012, 2017 IBM Corporation and others",
                "Copyright (c) 2012, 2019 IBM Corporation and others",
                "Copyright (c) 2012, 2020 GK Software SE, IBM Corporation and others",
                "Copyright (c) 2012, 2020 IBM Corporation and others",
                "Copyright (c) 2012, 2021 IBM Corporation and others",
                "Copyright (c) 2013 GK Software AG.",
                "Copyright (c) 2013 GoPivotal, Inc.",
                "Copyright (c) 2013 IBM Corporation and others",
                "Copyright (c) 2013 Jesper S Moller and others",
                "Copyright (c) 2013 Jesper Steen Moeller and others",
                "Copyright (c) 2013, 2014 GK Software AG.",
                "Copyright (c) 2013, 2014 IBM Corporation and others",
                "Copyright (c) 2013, 2015 GK Software AG.",
                "Copyright (c) 2013, 2015 IBM Corporation and others",
                "Copyright (c) 2013, 2016 IBM Corporation and others",
                "Copyright (c) 2013, 2017 GK Software AG and others",
                "Copyright (c) 2013, 2017 GK Software AG.",
                "Copyright (c) 2013, 2017 IBM Corporation and others",
                "Copyright (c) 2013, 2018 GK Software AG and others",
                "Copyright (c) 2013, 2018 GK Software AG, and others",
                "Copyright (c) 2013, 2018 IBM Corporation and others",
                "Copyright (c) 2013, 2019 GK Software AG, and others",
                "Copyright (c) 2013, 2019 GK Software AG.",
                "Copyright (c) 2013, 2019 IBM Corporation and others",
                "Copyright (c) 2013, 2020 GK Software AG and others",
                "Copyright (c) 2013, 2020 GK Software AG.",
                "Copyright (c) 2013, 2021 IBM Corporation and others",
                "Copyright (c) 2013, 2022 IBM Corporation and others",
                "Copyright (c) 2014 Google Inc and others",
                "Copyright (c) 2014 Google Inc. and others",
                "Copyright (c) 2014 IBM Corporation and others",
                "Copyright (c) 2014, 2015 Google Inc and others",
                "Copyright (c) 2014, 2015 IBM Corporation and others",
                "Copyright (c) 2014, 2015 Mateusz Matela and others",
                "Copyright (c) 2014, 2017 GK Software AG.",
                "Copyright (c) 2014, 2017 IBM Corporation and others",
                "Copyright (c) 2014, 2018 GK Software AG.",
                "Copyright (c) 2014, 2018 Mateusz Matela and others",
                "Copyright (c) 2014, 2020 Mateusz Matela and others",
                "Copyright (c) 2014, 2021 IBM Corporation and others",
                "Copyright (c) 2014, 2021 Mateusz Matela and others",
                "Copyright (c) 2014, 2022 Mateusz Matela and others",
                "Copyright (c) 2015 Google Inc and others",
                "Copyright (c) 2015 IBM Corporation and others",
                "Copyright (c) 2015, 2016 GK Software AG.",
                "Copyright (c) 2015, 2016 Google, Inc and others",
                "Copyright (c) 2015, 2017 GK Software AG and others",
                "Copyright (c) 2015, 2017 GK Software AG.",
                "Copyright (c) 2015, 2018 Google, Inc and others",
                "Copyright (c) 2015, 2019 GK Software AG.",
                "Copyright (c) 2015, 2019 IBM Corporation and others",
                "Copyright (c) 2015, 2021 IBM Corporation and others",
                "Copyright (c) 2015, 2022 IBM Corporation",
                "Copyright (c) 2016 Alex Blewitt and others",
                "Copyright (c) 2016 Eclipse Foundation and others",
                "Copyright (c) 2016 GoPivotal, Inc.",
                "Copyright (c) 2016 Google, Inc and others",
                "Copyright (c) 2016 IBM Corporation",
                "Copyright (c) 2016 IBM Corporation and others",
                "Copyright (c) 2016 Till Brychcy and others",
                "Copyright (c) 2016, 2017 GK Software AG.",
                "Copyright (c) 2016, 2017 IBM Corporation",
                "Copyright (c) 2016, 2017 IBM Corporation and others",
                "Copyright (c) 2016, 2018 IBM Corporation",
                "Copyright (c) 2016, 2018 IBM Corporation and others",
                "Copyright (c) 2016, 2019 IBM Corporation and others",
                "Copyright (c) 2016, 2020 Google, Inc. and others",
                "Copyright (c) 2016, 2020 IBM Corporation",
                "Copyright (c) 2016, 2021 IBM Corporation and others",
                "Copyright (c) 2016, 2022 IBM Corporation and others",
                "Copyright (c) 2016-2022 Red Hat Inc. and others",
                "Copyright (c) 2017 GK Software AG, and others",
                "Copyright (c) 2017 Google, Inc and others",
                "Copyright (c) 2017 IBM Corporation",
                "Copyright (c) 2017 IBM Corporation and others",
                "Copyright (c) 2017 Till Brychcy and others",
                "Copyright (c) 2017, 2018 GK Software AG, and others",
                "Copyright (c) 2017, 2018 IBM Corporation and others",
                "Copyright (c) 2017, 2019 GK Software AG, and others",
                "Copyright (c) 2017, 2019 GK Software SE, and others",
                "Copyright (c) 2017, 2019 IBM Corporation",
                "Copyright (c) 2017, 2019 IBM Corporation and others",
                "Copyright (c) 2017, 2021 IBM Corporation and others",
                "Copyright (c) 2018 Connexta, LLC and others",
                "Copyright (c) 2018 IBM Corporation and others",
                "Copyright (c) 2018 Red Hat Inc. and others",
                "Copyright (c) 2018 Till Brychcy and others",
                "Copyright (c) 2018, 2020 IBM Corporation and others",
                "Copyright (c) 2018, 2022 IBM Corporation",
                "Copyright (c) 2018, 2022 Mateusz Matela and others",
                "Copyright (c) 2019 GK Software SE, and others",
                "Copyright (c) 2019 IBM Corporation and others",
                "Copyright (c) 2019 Paul Pazderski, Thomas Wolf, and others",
                "Copyright (c) 2019 Red Hat Inc. and others",
                "Copyright (c) 2019 Sebastian Zarnekow and others",
                "Copyright (c) 2019 Simeon Andreev and others",
                "Copyright (c) 2019, 2020 IBM Corporation and others",
                "Copyright (c) 2019, 2020 SAP SE and others",
                "Copyright (c) 2019, 2021 IBM Corporation and others",
                "Copyright (c) 2019, 2022 IBM Corporation",
                "Copyright (c) 2019, 2022 IBM Corporation and others",
                "Copyright (c) 2020 Alex Blewitt and others",
                "Copyright (c) 2020 ArSysOp and others",
                "Copyright (c) 2020 Christoph Laeubrich and others",
                "Copyright (c) 2020 Gayan Perera and others",
                "Copyright (c) 2020 IBM Corporation and others",
                "Copyright (c) 2020 Julian Honnen",
                "Copyright (c) 2020 Marcus Hoepfner and others",
                "Copyright (c) 2020, 2021 Andrey Loskutov and others",
                "Copyright (c) 2020, 2021 IBM Corporation and others",
                "Copyright (c) 2020, 2022 IBM Corporation and others",
                "Copyright (c) 2021 GK Software SE and others",
                "Copyright (c) 2021 Gayan Perera and others",
                "Copyright (c) 2021 IBM Corporation and others",
                "Copyright (c) 2021 jkubitz and others",
                "Copyright (c) 2021, 2022 IBM Corporation and others",
                "Copyright (c) 2022 Christoph Laubrich and others",
                "Copyright (c) 2022 IBM Corporation and others",
                "Copyright (c) 2022 Joerg Kubitz",
                "Copyright (c) 2022 Simeon Andreev and others",
                "Copyright (c) OSGi Alliance (2000, 2013)",
                "Copyright (c) OSGi Alliance (2000, 2014)",
                "Copyright (c) OSGi Alliance (2000, 2015)",
                "Copyright (c) OSGi Alliance (2000, 2016)",
                "Copyright (c) OSGi Alliance (2000, 2017)",
                "Copyright (c) OSGi Alliance (2000, 2018)",
                "Copyright (c) OSGi Alliance (2000, 2019)",
                "Copyright (c) OSGi Alliance (2000, 2020)",
                "Copyright (c) OSGi Alliance (2001, 2013)",
                "Copyright (c) OSGi Alliance (2001, 2014)",
                "Copyright (c) OSGi Alliance (2001, 2015)",
                "Copyright (c) OSGi Alliance (2001, 2016)",
                "Copyright (c) OSGi Alliance (2002, 2013)",
                "Copyright (c) OSGi Alliance (2002, 2015)",
                "Copyright (c) OSGi Alliance (2004, 2013)",
                "Copyright (c) OSGi Alliance (2004, 2015)",
                "Copyright (c) OSGi Alliance (2004, 2016)",
                "Copyright (c) OSGi Alliance (2004, 2019)",
                "Copyright (c) OSGi Alliance (2004, 2020)",
                "Copyright (c) OSGi Alliance (2005, 2013)",
                "Copyright (c) OSGi Alliance (2005, 2014)",
                "Copyright (c) OSGi Alliance (2005, 2015)",
                "Copyright (c) OSGi Alliance (2005, 2020)",
                "Copyright (c) OSGi Alliance (2006, 2019)",
                "Copyright (c) OSGi Alliance (2007, 2013)",
                "Copyright (c) OSGi Alliance (2007, 2014)",
                "Copyright (c) OSGi Alliance (2007, 2017)",
                "Copyright (c) OSGi Alliance (2008, 2013)",
                "Copyright (c) OSGi Alliance (2008, 2018)",
                "Copyright (c) OSGi Alliance (2008, 2020)",
                "Copyright (c) OSGi Alliance (2009, 2013)",
                "Copyright (c) OSGi Alliance (2009, 2019)",
                "Copyright (c) OSGi Alliance (2010, 2013)",
                "Copyright (c) OSGi Alliance (2010, 2015)",
                "Copyright (c) OSGi Alliance (2010, 2016)",
                "Copyright (c) OSGi Alliance (2010, 2017)",
                "Copyright (c) OSGi Alliance (2010, 2018)",
                "Copyright (c) OSGi Alliance (2010, 2019)",
                "Copyright (c) OSGi Alliance (2010, 2020)",
                "Copyright (c) OSGi Alliance (2011, 2013)",
                "Copyright (c) OSGi Alliance (2011, 2015)",
                "Copyright (c) OSGi Alliance (2011, 2016)",
                "Copyright (c) OSGi Alliance (2011, 2017)",
                "Copyright (c) OSGi Alliance (2011, 2020)",
                "Copyright (c) OSGi Alliance (2012)",
                "Copyright (c) OSGi Alliance (2012, 2013)",
                "Copyright (c) OSGi Alliance (2012, 2014)",
                "Copyright (c) OSGi Alliance (2012, 2015)",
                "Copyright (c) OSGi Alliance (2012, 2016)",
                "Copyright (c) OSGi Alliance (2012, 2019)",
                "Copyright (c) OSGi Alliance (2012, 2020)",
                "Copyright (c) OSGi Alliance (2014)",
                "Copyright (c) OSGi Alliance (2016)",
                "Copyright (c) OSGi Alliance (2016, 2017)",
                "Copyright (c) OSGi Alliance (2016, 2018)",
                "Copyright (c) OSGi Alliance (2017)",
                "Copyright (c) OSGi Alliance (2019, 2020)",
                "Copyright (c) OSGi Alliance (2020)",
                "Copyright 2012 Red Hat, Inc. and/or its affiliates",
                "Copyright 2012-2013 Red Hat, Inc. and/or its affiliates",
                "Copyright 2012-2014 Red Hat, Inc. and/or its affiliates",
                "Copyright 2013 Red Hat, Inc. and/or its affiliates",
                "Copyright 2014 Red Hat, Inc. and/or its affiliates",
                "Copyright 2015 Red Hat, Inc. and/or its affiliates",
                "Copyright 2016 Red Hat, Inc. and/or its affiliates",
                "Copyright 2018 Red Hat, Inc. and/or its affiliates",
                "Copyright IBM Corp 2000, 2020"
            ],
            "file-count": 2857,
            "sha256": "ca46483d1cb7c1ddd9a9af34244c0dc3b79e31f40948b15f73b44f0c47eb837c",
            "source": "https://repo.maven.apache.org/maven2/org/jboss/forge/roaster/roaster-jdt/2.28.0.Final/roaster-jdt-2.28.0.Final-sources.jar",
            "status": "approved"
        }
    ]
}
