{
    "id": "npm/npmjs/@sigstore/protobuf-specs/0.1.0",
    "license": "Apache-2.0",
    "authority": "https://gitlab.eclipse.org/eclipsefdn/emo-team/iplab/-/issues/7587",
    "source": "https://github.com/sigstore/protobuf-specs/archive/v0.1.0.zip",
    "status": "approved",
    "scans": [
        {
            "date": "March 27, 2023 at 4:57:52 p.m. GMT",
            "authority": "https://gitlab.eclipse.org/eclipsefdn/emo-team/iplab/-/issues/7587",
            "scancode-version": "31.2.1",
            "licenses-discovered": [
                "Apache-2.0"
            ],
            "copyrights": [
                "Copyright (c) 2015-2021 the original",
                "Copyright 2015 the original author or authors",
                "Copyright 2022 The Sigstore Authors"
            ],
            "file-count": 105,
            "sha256": "4f460569c1e3be987edc44938e9a26f706ead73a67d4f4440eaf4f991278f0d1",
            "source": "https://github.com/sigstore/protobuf-specs/archive/v0.1.0.zip",
            "status": "approved"
        }
    ]
}