{
    "id": "maven/mavencentral/software.amazon.awssdk/http-client-spi/2.21.5",
    "license": "Apache-2.0",
    "authority": "https://gitlab.eclipse.org/eclipsefdn/emo-team/iplab/-/issues/11132",
    "source": "https://repo.maven.apache.org/maven2/software/amazon/awssdk/http-client-spi/2.21.5/http-client-spi-2.21.5-sources.jar",
    "status": "approved",
    "scans": [
        {
            "date": "October 24, 2023 at 11:05:24 a.m. GMT",
            "authority": "https://gitlab.eclipse.org/eclipsefdn/emo-team/iplab/-/issues/11132",
            "scancode-version": "31.2.1",
            "licenses-discovered": [
                "Apache-2.0"
            ],
            "copyrights": [
                "Copyright Amazon.com, Inc. or its affiliates"
            ],
            "file-count": 45,
            "sha256": "796cb68e40609a56782e252fc9f173d52d5c574b6ca65a8ce4bad78e9a61e543",
            "source": "https://repo.maven.apache.org/maven2/software/amazon/awssdk/http-client-spi/2.21.5/http-client-spi-2.21.5-sources.jar",
            "status": "approved"
        }
    ]
}