{
    "id": "maven/mavencentral/org.javassist/javassist/3.27.0-GA",
    "license": "Apache-2.0 OR LGPL-2.1-or-later OR MPL-1.1",
    "licenses-discovered": [
        "Apache-2.0 AND LGPL-2.1-or-later AND MPL-1.1"
    ],
    "copyrights": [
        "Copyright (c) Bill Burke",
        "Copyright (c) Shigeru Chiba"
    ],
    "file-count": 235,
    "scancode-version": "30.1.0",
    "authority": "https://gitlab.eclipse.org/eclipsefdn/emo-team/iplab/-/issues/2737",
    "source": "https://search.maven.org/remotecontent?filepath=org/javassist/javassist/3.27.0-GA/javassist-3.27.0-GA-sources.jar",
    "status": "approved"
}
