{
    "id": "maven/mavencentral/com.vaadin/vaadin-split-layout-flow/24.3.7",
    "license": "Apache-2.0",
    "authority": "https://gitlab.eclipse.org/eclipsefdn/emo-team/iplab/-/issues/13733",
    "source": "https://repo1.maven.org/maven2/com/vaadin/vaadin-split-layout-flow/24.3.7/vaadin-split-layout-flow-24.3.7-sources.jar",
    "status": "approved",
    "scans": [
        {
            "date": "March 15, 2024 at 2:17:07 p.m. GMT",
            "authority": "https://gitlab.eclipse.org/eclipsefdn/emo-team/iplab/-/issues/13733",
            "scancode-version": "31.2.1",
            "licenses-discovered": [
                "Apache-2.0"
            ],
            "copyrights": [
                "Copyright 2000-2023 Vaadin Ltd."
            ],
            "file-count": 5,
            "sha256": "51bdf4011536c071f0a371dfd201e1d5b5a1749fd8e6c65653a1c195c4bcd095",
            "source": "https://repo1.maven.org/maven2/com/vaadin/vaadin-split-layout-flow/24.3.7/vaadin-split-layout-flow-24.3.7-sources.jar",
            "status": "approved"
        }
    ]
}