{
    "id": "maven/mavencentral/org.postgresql/postgresql/42.6.1",
    "license": "BSD-2-Clause AND Apache-2.0",
    "authority": "https://gitlab.eclipse.org/eclipsefdn/emo-team/iplab/-/issues/15238",
    "source": "https://repo1.maven.org/maven2/org/postgresql/postgresql/42.6.1/postgresql-42.6.1-sources.jar",
    "status": "approved",
    "scans": [
        {
            "date": "June 14, 2024 at 11:11:09 a.m. GMT",
            "authority": "https://gitlab.eclipse.org/eclipsefdn/emo-team/iplab/-/issues/15238",
            "scancode-version": "31.2.1",
            "licenses-discovered": [
                "BSD-2-Clause",
                "LicenseRef-scancode-free-unknown",
                "Apache-2.0"
            ],
            "copyrights": [
                "(c) 2003-2004 Serguei A. Mokhov, <mokhov@cs.concordia.ca>",
                "Bojan Skaljac <skaljac@gmail.com> 2006",
                "Copyright (c) 1997, PostgreSQL Global Development Group",
                "Copyright (c) 2003, PostgreSQL Global Development Group",
                "Copyright (c) 2004, Open Cloud Limited",
                "Copyright (c) 2004, PostgreSQL Global Development Group",
                "Copyright (c) 2005",
                "Copyright (c) 2005, PostgreSQL Global Development Group",
                "Copyright (c) 2006, PostgreSQL Global Development Group",
                "Copyright (c) 2007, PostgreSQL Global Development Group",
                "Copyright (c) 2008, PostgreSQL Global Development Group",
                "Copyright (c) 2009, PostgreSQL Global Development Group",
                "Copyright (c) 2011, PostgreSQL Global Development Group",
                "Copyright (c) 2012, PostgreSQL Global Development Group",
                "Copyright (c) 2014, PostgreSQL Global Development Group",
                "Copyright (c) 2015, PostgreSQL Global Development Group",
                "Copyright (c) 2016, PostgreSQL Global Development Group",
                "Copyright (c) 2017, PostgreSQL Global Development Group",
                "Copyright (c) 2018, PostgreSQL Global Development Group",
                "Copyright (c) 2019, PostgreSQL Global Development Group",
                "Copyright (c) 2020, PostgreSQL Global Development Group",
                "Copyright (c) 2021, PostgreSQL Global Development Group",
                "Copyright (c) 2023, PostgreSQL Global Development Group",
                "Copyright 2022 Juan Lopes"
            ],
            "file-count": 292,
            "sha256": "272c923f32818361b5ad70f00886f728892c8e15035b7d41b5a6af4cebfd229c",
            "source": "https://repo1.maven.org/maven2/org/postgresql/postgresql/42.6.1/postgresql-42.6.1-sources.jar",
            "status": "restricted"
        }
    ]
}