{
    "id": "npm/npmjs/-/react-resize-detector/8.1.0",
    "license": "MIT",
    "authority": "https://gitlab.eclipse.org/eclipsefdn/emo-team/iplab/-/issues/13092",
    "source": "https://github.com/maslianok/react-resize-detector/archive/refs/tags/v8.0.0.tar.gz",
    "status": "approved",
    "scans": [
        {
            "date": "February 2, 2024 at 7:51:27 a.m. GMT",
            "authority": "https://gitlab.eclipse.org/eclipsefdn/emo-team/iplab/-/issues/13092",
            "scancode-version": "31.2.1",
            "licenses-discovered": [
            ],
            "copyrights": [
            ],
            "file-count": 1,
            "sha256": "21eac471bc70b73a34d489afeb0f3c74602e016b09e4432a0d26b72143d0a190",
            "source": "https://github.com/maslianok/react-resize-detector/pull/8.1.0.patch",
            "status": "restricted"
        },
        {
            "date": "March 7, 2024 at 5:21:51 a.m. GMT",
            "authority": "https://gitlab.eclipse.org/eclipsefdn/emo-team/iplab/-/issues/13092",
            "scancode-version": "31.2.1",
            "licenses-discovered": [
                "MIT"
            ],
            "copyrights": [
                "Copyright (c) 2023 Vitalii Maslianok"
            ],
            "file-count": 30,
            "sha256": "e5f4232f86b4483d87e21b25ccb861554f085d4f59ad9696f65178f982963f88",
            "source": "https://github.com/maslianok/react-resize-detector/archive/refs/tags/v8.0.0.tar.gz",
            "status": "approved"
        }
    ]
}