{
    "id": "maven/mavencentral/com.fasterxml.jackson.dataformat/jackson-dataformat-toml/2.15.4",
    "license": "Apache-2.0",
    "authority": "https://gitlab.eclipse.org/eclipsefdn/emo-team/iplab/-/issues/15242",
    "source": "https://repo1.maven.org/maven2/com/fasterxml/jackson/dataformat/jackson-dataformat-toml/2.15.4/jackson-dataformat-toml-2.15.4-sources.jar",
    "status": "approved",
    "scans": [
        {
            "date": "June 14, 2024 at 11:14:33 a.m. GMT",
            "authority": "https://gitlab.eclipse.org/eclipsefdn/emo-team/iplab/-/issues/15242",
            "scancode-version": "31.2.1",
            "licenses-discovered": [
                "Apache-2.0"
            ],
            "copyrights": [
            ],
            "file-count": 20,
            "sha256": "0c051766fd89e6a77145e4faf944d971e89ffd0d3e3766fac4d2c946d44afd39",
            "source": "https://repo1.maven.org/maven2/com/fasterxml/jackson/dataformat/jackson-dataformat-toml/2.15.4/jackson-dataformat-toml-2.15.4-sources.jar",
            "status": "approved"
        }
    ]
}