{
    "id": "maven/mavencentral/androidx.navigation/navigation-common/2.7.4",
    "license": "Apache-2.0",
    "authority": "https://gitlab.eclipse.org/eclipsefdn/emo-team/iplab/-/issues/11179",
    "source": "https://dl.google.com/android/maven2/androidx/navigation/navigation-common/2.7.4/navigation-common-2.7.4-sources.jar",
    "status": "approved",
    "scans": [
        {
            "date": "October 25, 2023 at 9:29:50 a.m. GMT",
            "authority": "https://gitlab.eclipse.org/eclipsefdn/emo-team/iplab/-/issues/11179",
            "scancode-version": "31.2.1",
            "licenses-discovered": [
                "Apache-2.0"
            ],
            "copyrights": [
                "Copyright (c) 2017 The Android Open Source Project",
                "Copyright 2017 The Android Open Source Project",
                "Copyright 2018 The Android Open Source Project",
                "Copyright 2019 The Android Open Source Project",
                "Copyright 2020 The Android Open Source Project",
                "Copyright 2021 The Android Open Source Project"
            ],
            "file-count": 26,
            "sha256": "9d10a4050f8572f36ea97e436582c9b9760a12d24febe3bf5a9aa4d0ad2b7903",
            "source": "https://dl.google.com/android/maven2/androidx/navigation/navigation-common/2.7.4/navigation-common-2.7.4-sources.jar",
            "status": "approved"
        }
    ]
}