{
    "id": "maven/mavencentral/org.apache.curator/curator-client/5.6.0",
    "license": "Apache-2.0",
    "authority": "https://gitlab.eclipse.org/eclipsefdn/emo-team/iplab/-/issues/12741",
    "source": "https://repo1.maven.org/maven2/org/apache/curator/curator-client/5.6.0/curator-client-5.6.0-sources.jar",
    "status": "approved",
    "scans": [
        {
            "date": "January 10, 2024 at 11:28:15 p.m. GMT",
            "authority": "https://gitlab.eclipse.org/eclipsefdn/emo-team/iplab/-/issues/12741",
            "scancode-version": "31.2.1",
            "licenses-discovered": [
                "Apache-2.0"
            ],
            "copyrights": [
            ],
            "file-count": 46,
            "sha256": "1591ace1db5519c19aa1bf8b761071914b64ccb4c86d087a128a9cb3eb06f2d1",
            "source": "https://repo1.maven.org/maven2/org/apache/curator/curator-client/5.6.0/curator-client-5.6.0-sources.jar",
            "status": "approved"
        }
    ]
}