{
    "id": "maven/mavencentral/com.bucket4j/bucket4j-jcache/8.1.0",
    "license": "Apache-2.0",
    "authority": "https://gitlab.eclipse.org/eclipsefdn/emo-team/iplab/-/issues/9639",
    "source": "https://repo.maven.apache.org/maven2/com/bucket4j/bucket4j-jcache/8.1.0/bucket4j-jcache-8.1.0-sources.jar",
    "status": "approved",
    "scans": [
        {
            "date": "July 19, 2023 at 12:26:12 p.m. GMT",
            "authority": "https://gitlab.eclipse.org/eclipsefdn/emo-team/iplab/-/issues/9639",
            "scancode-version": "31.2.1",
            "licenses-discovered": [
                "Apache-2.0"
            ],
            "copyrights": [
                "Copyright (c) 2015 - 2020 Vladimir Bukhtoyarov",
                "Copyright 2015-2018 Vladimir Bukhtoyarov"
            ],
            "file-count": 5,
            "sha256": "3d1714fdacba728620168a86e25ff9a948b01782bcf1e8d7d330e7746ac67685",
            "source": "https://repo.maven.apache.org/maven2/com/bucket4j/bucket4j-jcache/8.1.0/bucket4j-jcache-8.1.0-sources.jar",
            "status": "approved"
        }
    ]
}