{
    "license": "MIT",
    "file-count": 113,
    "authority": "https://gitlab.eclipse.org/eclipsefdn/emo-team/iplab/-/issues/1197",
    "scancode-version": "21.3.31",
    "licenses-discovered": [
        "MIT"
    ],
    "id": "npm/npmjs/@octokit/rest/18.11.4",
    "source": "https://github.com/octokit/rest.js/archive/v18.11.4.zip",
    "status": "approved"
}