{
    "id": "npm/npmjs/@opentelemetry/resources/1.15.2",
    "license": "Apache-2.0 AND MIT",
    "authority": "https://gitlab.eclipse.org/eclipsefdn/emo-team/iplab/-/issues/11763",
    "source": "https://github.com/open-telemetry/opentelemetry-js/archive/refs/tags/v1.15.2.zip",
    "status": "approved",
    "scans": [
        {
            "date": "November 30, 2023 at 6:30:16 p.m. GMT",
            "authority": "https://gitlab.eclipse.org/eclipsefdn/emo-team/iplab/-/issues/11763",
            "scancode-version": "31.2.1",
            "licenses-discovered": [
                "Apache-2.0",
                "Apache-2.0 AND DOC",
                "Apache-2.0 AND MIT",
                "ISC"
            ],
            "copyrights": [
                "Copyright 2015 gRPC",
                "Copyright 2020 OpenTelemetry",
                "Copyright 2020 The OpenTelemetry Authors",
                "Copyright 2020 name",
                "Copyright 2020, OpenTelemetry",
                "Copyright 2021 Datadog, Inc."
            ],
            "file-count": 1405,
            "sha256": "0e3da176bddb858c5a78aae4ada337402f60f148f0c02f907ac378a86a78e5c3",
            "source": "https://github.com/open-telemetry/opentelemetry-js/archive/refs/tags/v1.15.2.zip",
            "status": "restricted"
        }
    ]
}
