{
    "id": "npm/npmjs/-/eslint-plugin-react/7.33.1",
    "license": "MIT",
    "authority": "https://gitlab.eclipse.org/eclipsefdn/emo-team/iplab/-/issues/9877",
    "source": "https://registry.yarnpkg.com/eslint-plugin-react/-/eslint-plugin-react-7.33.1.tgz",
    "status": "approved",
    "scans": [
        {
            "date": "August 11, 2023 at 11:08:06 a.m. GMT",
            "authority": "https://gitlab.eclipse.org/eclipsefdn/emo-team/iplab/-/issues/9877",
            "scancode-version": "31.2.1",
            "licenses-discovered": [
                "MIT"
            ],
            "copyrights": [
                "Copyright (c) 2014 Yannick Croissant",
                "Copyright (c) 2014 by Vitaly Puzrin",
                "copyright 2015 Alberto Rodriguez",
                "copyright 2015 Gyandeep Singh",
                "copyright 2015 Vitaly Puzrin"
            ],
            "file-count": 136,
            "sha256": "d7076f244648f35a6b87212baf2d6a526cddc74172b4ccb231604db24678b05a",
            "source": "https://registry.yarnpkg.com/eslint-plugin-react/-/eslint-plugin-react-7.33.1.tgz",
            "status": "approved"
        }
    ]
}