{
    "id": "maven/mavencentral/org.apache.activemq/activemq-pool/5.16.7",
    "license": "Apache-2.0",
    "authority": "https://gitlab.eclipse.org/eclipsefdn/emo-team/iplab/-/issues/11507",
    "source": "https://repo1.maven.org/maven2/org/apache/activemq/activemq-pool/5.16.7/activemq-pool-5.16.7-sources.jar",
    "status": "approved",
    "scans": [
        {
            "date": "November 10, 2023 at 3:34:12 p.m. GMT",
            "authority": "https://gitlab.eclipse.org/eclipsefdn/emo-team/iplab/-/issues/11507",
            "scancode-version": "31.2.1",
            "licenses-discovered": [
                "Apache-2.0"
            ],
            "copyrights": [
                "Copyright 2006 the original author or authors"
            ],
            "file-count": 9,
            "sha256": "cdf3c059528d4ed14fa3f0d3cd2dcfcb9fd2205697d7bfa9905bb8a0241d4200",
            "source": "https://repo1.maven.org/maven2/org/apache/activemq/activemq-pool/5.16.7/activemq-pool-5.16.7-sources.jar",
            "status": "approved"
        }
    ]
}