{
    "id": "npm/npmjs/-/mocha/10.3.0",
    "license": "MIT AND CC-BY-4.0 AND CC-BY-SA-3.0 AND CC-BY-SA-4.0 AND (GPL-2.0-only OR MIT)",
    "authority": "https://gitlab.eclipse.org/eclipsefdn/emo-team/iplab/-/issues/13230",
    "source": "https://github.com/mochajs/mocha/archive/refs/tags/v10.3.0.zip",
    "status": "approved",
    "scans": [
        {
            "date": "February 13, 2024 at 7:10:06 p.m. GMT",
            "authority": "https://gitlab.eclipse.org/eclipsefdn/emo-team/iplab/-/issues/13230",
            "scancode-version": "31.2.1",
            "licenses-discovered": [
                "MIT",
                "CC-BY-4.0 AND MIT",
                "CC-BY-3.0 AND CC-BY-SA-3.0 AND CC-BY-SA-4.0 AND LicenseRef-scancode-other-copyleft",
                "CC-BY-4.0",
                "GPL-2.0-only AND MIT",
                "CC0-1.0"
            ],
            "copyrights": [
                "Copyright (c) 2011 TJ Holowaychuk <tj@vision-media.ca>",
                "Copyright (c) 2011-2022 OpenJS Foundation and contributors, https://openjsf.org",
                "Copyright 2011-2022 OpenJS Foundation and contributors",
                "Copyright https://openjsf.org rel external noopener OpenJS Foundation",
                "copyright 2016-2018 JS Foundation (https://js.foundation) and contributors"
            ],
            "file-count": 530,
            "sha256": "c90dc40fa30802616313c71e976310907a8c390d370734d16a28ddf626311162",
            "source": "https://github.com/mochajs/mocha/archive/refs/tags/v10.3.0.zip",
            "status": "restricted"
        }
    ]
}
