{
    "id": "npm/npmjs/-/typescript-plugin-css-modules/5.0.0",
    "license": "MIT",
    "authority": "https://gitlab.eclipse.org/eclipsefdn/emo-team/iplab/-/issues/7496",
    "source": "https://github.com/mrmckeb/typescript-plugin-css-modules/archive/v5.0.0.zip",
    "status": "approved",
    "scans": [
        {
            "date": "March 22, 2023 at 12:19:13 a.m. GMT",
            "authority": "https://gitlab.eclipse.org/eclipsefdn/emo-team/iplab/-/issues/7496",
            "scancode-version": "31.2.1",
            "licenses-discovered": [
                "MIT"
            ],
            "copyrights": [
                "Copyright (c) 2018 Brody McKee"
            ],
            "file-count": 64,
            "sha256": "34df121c1fe0bf590eb3134a5c48e4cd8a6e8ebb6faa1dbf39e2f1fa6c79b8b5",
            "source": "https://github.com/mrmckeb/typescript-plugin-css-modules/archive/v5.0.0.zip",
            "status": "approved"
        }
    ]
}