{
    "id": "maven/mavencentral/androidx.lifecycle/lifecycle-livedata-core/2.7.0",
    "license": "Apache-2.0",
    "authority": "https://gitlab.eclipse.org/eclipsefdn/emo-team/iplab/-/issues/12880",
    "source": "https://dl.google.com/android/maven2/androidx/lifecycle/lifecycle-livedata-core/2.7.0/lifecycle-livedata-core-2.7.0-sources.jar",
    "status": "approved",
    "scans": [
        {
            "date": "January 24, 2024 at 1:59:08 p.m. GMT",
            "authority": "https://gitlab.eclipse.org/eclipsefdn/emo-team/iplab/-/issues/12880",
            "scancode-version": "31.2.1",
            "licenses-discovered": [
                "Apache-2.0"
            ],
            "copyrights": [
                "Copyright (c) 2017 The Android Open Source Project"
            ],
            "file-count": 4,
            "sha256": "5ed0b2f1e01bed494c9d70558a6b1fca295c32f47e5d9e652b316e8989d9689c",
            "source": "https://dl.google.com/android/maven2/androidx/lifecycle/lifecycle-livedata-core/2.7.0/lifecycle-livedata-core-2.7.0-sources.jar",
            "status": "approved"
        }
    ]
}