{
    "id": "go/golang/golang.org%2Fx/mod/v0.0.0-20190513183733-4bf6d317e70e",
    "license": "BSD-3-Clause",
    "authority": "https://gitlab.eclipse.org/eclipsefdn/emo-team/iplab/-/issues/6070",
    "source": "https://proxy.golang.org/golang.org%2Fx/mod/@v/v0.0.0-20190513183733-4bf6d317e70e.zip",
    "status": "approved",
    "scans": [
        {
            "date": "January 6, 2023 at 2:19:42 p.m. GMT",
            "authority": "https://gitlab.eclipse.org/eclipsefdn/emo-team/iplab/-/issues/6070",
            "scancode-version": "31.2.1",
            "licenses-discovered": [
                "BSD-3-Clause"
            ],
            "copyrights": [
                "Copyright (c) 2009 The Go Authors",
                "Copyright 2018 The Go Authors",
                "Copyright 2019 The Go Authors"
            ],
            "file-count": 25,
            "sha256": "abeed3d816b0ce5834ae9ba8f3db2ef380fe8e5daad87798a0a9adc0956d8c2c",
            "source": "https://proxy.golang.org/golang.org%2Fx/mod/@v/v0.0.0-20190513183733-4bf6d317e70e.zip",
            "status": "approved"
        }
    ]
}