{
    "id": "maven/mavencentral/io.quarkus/quarkus-netty/3.17.4",
    "license": "Apache-2.0",
    "authority": "https://gitlab.eclipse.org/eclipsefdn/emo-team/iplab/-/issues/17905",
    "source": "https://repo1.maven.org/maven2/io/quarkus/quarkus-netty/3.17.4/quarkus-netty-3.17.4-sources.jar",
    "status": "approved",
    "scans": [
        {
            "date": "December 13, 2024 at 1:48:17 p.m. GMT",
            "authority": "https://gitlab.eclipse.org/eclipsefdn/emo-team/iplab/-/issues/17905",
            "scancode-version": "31.2.1",
            "licenses-discovered": [
                "Apache-2.0"
            ],
            "copyrights": [
                "Copyright 2012 The Netty Project"
            ],
            "file-count": 18,
            "sha256": "931455c315c8156d14ed053751e7e63060df8265c3fb31c9a8f5dd4fa0a1341c",
            "source": "https://repo1.maven.org/maven2/io/quarkus/quarkus-netty/3.17.4/quarkus-netty-3.17.4-sources.jar",
            "status": "approved"
        }
    ]
}