{
    "id": "maven/mavencentral/com.fasterxml.jackson.core/jackson-databind/2.15.0",
    "license": "Apache-2.0",
    "authority": "https://gitlab.eclipse.org/eclipsefdn/emo-team/iplab/-/issues/7934",
    "source": "https://search.maven.org/remotecontent?filepath=com/fasterxml/jackson/core/jackson-databind/2.15.0/jackson-databind-2.15.0-sources.jar",
    "status": "approved",
    "scans": [
        {
            "date": "April 25, 2023 at 3:04:09 p.m. GMT",
            "authority": "https://gitlab.eclipse.org/eclipsefdn/emo-team/iplab/-/issues/7934",
            "scancode-version": "31.2.1",
            "licenses-discovered": [
                "Apache-2.0"
            ],
            "copyrights": [
                "Copyright 2010 Google Inc.",
                "Copyright 2011 Google Inc."
            ],
            "file-count": 477,
            "sha256": "dbf33fec80c5f81529582bb1e3e77d743a16d97fca88bddbff1fd2c40ee044a1",
            "source": "https://search.maven.org/remotecontent?filepath=com/fasterxml/jackson/core/jackson-databind/2.15.0/jackson-databind-2.15.0-sources.jar",
            "status": "approved"
        }
    ]
}