{
    "id": "maven/mavencentral/joda-time/joda-time/2.12.6",
    "license": "Apache-2.0",
    "authority": "https://gitlab.eclipse.org/eclipsefdn/emo-team/iplab/-/issues/12739",
    "source": "https://repo1.maven.org/maven2/joda-time/joda-time/2.12.6/joda-time-2.12.6-sources.jar",
    "status": "approved",
    "scans": [
        {
            "date": "January 10, 2024 at 11:37:07 p.m. GMT",
            "authority": "https://gitlab.eclipse.org/eclipsefdn/emo-team/iplab/-/issues/12739",
            "scancode-version": "31.2.1",
            "licenses-discovered": [
                "Apache-2.0"
            ],
            "copyrights": [
                "Copyright 2001-2005 Stephen Colebourne",
                "Copyright 2001-2006 Stephen Colebourne",
                "Copyright 2001-2007 Stephen Colebourne",
                "Copyright 2001-2009 Stephen Colebourne",
                "Copyright 2001-2010 Stephen Colebourne",
                "Copyright 2001-2011 Stephen Colebourne",
                "Copyright 2001-2012 Stephen Colebourne",
                "Copyright 2001-2013 Stephen Colebourne",
                "Copyright 2001-2014 Stephen Colebourne",
                "Copyright 2001-2015 Stephen Colebourne",
                "Copyright 2001-2016 Stephen Colebourne"
            ],
            "file-count": 188,
            "sha256": "eadc15eb312fd5ab2a4ece53bdc037f19f588d50d45441fd3b18bb3d493e6a55",
            "source": "https://repo1.maven.org/maven2/joda-time/joda-time/2.12.6/joda-time-2.12.6-sources.jar",
            "status": "approved"
        }
    ]
}