{
    "id": "maven/mavencentral/org.eclipse.dataspaceconnector/core-micrometer/0.0.1-20220922.4-20230220.143048-1",
    "license": "Apache-2.0",
    "authority": "https://gitlab.eclipse.org/eclipsefdn/emo-team/iplab/-/issues/7692",
    "source": "https://search.maven.org/remotecontent?filepath=org/eclipse/dataspaceconnector/core-micrometer/0.0.1-milestone-6/core-micrometer-0.0.1-milestone-6-sources.jar",
    "status": "approved",
    "scans": [
        {
            "date": "March 28, 2023 at 9:24:31 p.m. GMT",
            "authority": "https://gitlab.eclipse.org/eclipsefdn/emo-team/iplab/-/issues/7692",
            "scancode-version": "31.2.1",
            "licenses-discovered": [
                "Apache-2.0"
            ],
            "copyrights": [
                "Copyright (c) 2022 Microsoft Corporation"
            ],
            "file-count": 4,
            "sha256": "69c79a31fe96c4e0a170558b278b76d145037f5dd1480522411317bea62da320",
            "source": "https://search.maven.org/remotecontent?filepath=org/eclipse/dataspaceconnector/core-micrometer/0.0.1-milestone-6/core-micrometer-0.0.1-milestone-6-sources.jar",
            "status": "approved"
        }
    ]
}