{
    "id": "pypi/pypi/-/platformdirs/4.2.0",
    "license": "MIT",
    "authority": "https://gitlab.eclipse.org/eclipsefdn/emo-team/iplab/-/issues/13087",
    "source": "https://files.pythonhosted.org/packages/96/dc/c1d911bf5bb0fdc58cc05010e9f3efe3b67970cef779ba7fbc3183b987a8/platformdirs-4.2.0.tar.gz",
    "status": "approved",
    "scans": [
        {
            "date": "February 1, 2024 at 8:24:46 p.m. GMT",
            "authority": "https://gitlab.eclipse.org/eclipsefdn/emo-team/iplab/-/issues/13087",
            "scancode-version": "31.2.1",
            "licenses-discovered": [
                "MIT"
            ],
            "copyrights": [
                "Copyright (c) 2010-202x The platformdirs"
            ],
            "file-count": 21,
            "sha256": "ef0cc731df711022c174543cb70a9b5bd22e5a9337c8624ef2c2ceb8ddad8768",
            "source": "https://files.pythonhosted.org/packages/96/dc/c1d911bf5bb0fdc58cc05010e9f3efe3b67970cef779ba7fbc3183b987a8/platformdirs-4.2.0.tar.gz",
            "status": "approved"
        }
    ]
}