{
    "id": "maven/mavencentral/io.vertx/vertx-grpc/4.4.4",
    "license": "Apache-2.0 AND EPL-1.0 AND Apache-2.0",
    "authority": "https://gitlab.eclipse.org/eclipsefdn/emo-team/iplab/-/issues/10885",
    "source": "https://repo.maven.apache.org/maven2/io/vertx/vertx-grpc/4.4.4/vertx-grpc-4.4.4-sources.jar",
    "status": "approved",
    "scans": [
        {
            "date": "October 4, 2023 at 7:28:32 p.m. GMT",
            "authority": "https://gitlab.eclipse.org/eclipsefdn/emo-team/iplab/-/issues/10885",
            "scancode-version": "31.2.1",
            "licenses-discovered": [
                "Apache-2.0 AND EPL-1.0",
                "Apache-2.0"
            ],
            "copyrights": [
                "Copyright (c) 2011-2013 The original author or authors",
                "Copyright (c) 2011-2015 The original author or authors",
                "Copyright 2019 Eclipse"
            ],
            "file-count": 20,
            "sha256": "92b40734bc191687c627157afadfeceac7f15b41cfcb46eafb42f79e1e141827",
            "source": "https://repo.maven.apache.org/maven2/io/vertx/vertx-grpc/4.4.4/vertx-grpc-4.4.4-sources.jar",
            "status": "approved"
        }
    ]
}