{
    "id": "pypi/pypi/-/PyICU/2.4.2",
    "license": "MIT AND (LicenseRef-scancode-free-unknown AND MIT) AND (Font-exception-2.0 AND GPL-2.0-only)",
    "authority": "https://gitlab.eclipse.org/eclipsefdn/emo-team/iplab/-/issues/6334",
    "source": "https://files.pythonhosted.org/packages/95/0c/0fb09019efb65a29789ec5538f8e521b8f548da6935a3a474e19fbf2ea4d/PyICU-2.4.2.tar.gz",
    "status": "restricted",
    "scans": [
        {
            "date": "January 12, 2023 at 5:06:23 p.m. GMT",
            "authority": "https://gitlab.eclipse.org/eclipsefdn/emo-team/iplab/-/issues/6334",
            "scancode-version": "31.2.1",
            "licenses-discovered": [
                "MIT",
                "LicenseRef-scancode-free-unknown AND MIT",
                "Font-exception-2.0 AND GPL-2.0-only"
            ],
            "copyrights": [
                "Copyright (c) 2003, Automatic Control Equipments, Pune",
                "Copyright (c) 2004-2010 Open Source Applications Foundation",
                "Copyright (c) 2004-2013 Open Source Applications Foundation",
                "Copyright (c) 2004-2015 Open Source Applications Foundation",
                "Copyright (c) 2004-2017 Open Source Applications Foundation",
                "Copyright (c) 2004-2018 Open Source Applications Foundation",
                "Copyright (c) 2004-2019 Open Source Applications Foundation",
                "Copyright (c) 2005 Open Source Applications Foundation",
                "Copyright (c) 2005-2010 Open Source Applications Foundation",
                "Copyright (c) 2005-2018 Open Source Applications Foundation",
                "Copyright (c) 2005-2019 Open Source Applications Foundation",
                "Copyright (c) 2006-2010 Open Source Applications Foundation",
                "Copyright (c) 2007-2010 Open Source Applications Foundation",
                "Copyright (c) 2007-2013 Open Source Applications Foundation",
                "Copyright (c) 2007-2014 Open Source Applications Foundation",
                "Copyright (c) 2009-2010 Open Source Applications Foundation",
                "Copyright (c) 2009-2015 Open Source Applications Foundation",
                "Copyright (c) 2009-2019 Open Source Applications Foundation",
                "Copyright (c) 2010-2010 Open Source Applications Foundation",
                "Copyright (c) 2010-2019 Open Source Applications Foundation",
                "Copyright (c) 2011-2011 Open Source Applications Foundation",
                "Copyright (c) 2014 Open Source Applications Foundation",
                "Copyright (c) 2014-2014 Open Source Applications Foundation",
                "Copyright (c) 2016-2016 Open Source Applications Foundation",
                "Copyright (c) 2016-2019 Open Source Applications Foundation",
                "Copyright (c) 2018 Open Source Applications Foundation",
                "Copyright (c) 2019 Open Source Applications Foundation",
                "Copyright 2006 Modular Infotech Pvt Ltd.",
                "Copyright 2009 Red Hat, Inc."
            ],
            "file-count": 96,
            "sha256": "48c43424b67090c4028d8743132d141d8477f390f93e26c2cb67c26485622c20",
            "source": "https://files.pythonhosted.org/packages/95/0c/0fb09019efb65a29789ec5538f8e521b8f548da6935a3a474e19fbf2ea4d/PyICU-2.4.2.tar.gz",
            "status": "restricted"
        }
    ]
}