{
    "id": "pypi/pypi/-/protobuf/4.22.1",
    "license": "BSD-3-Clause",
    "authority": "https://gitlab.eclipse.org/eclipsefdn/emo-team/iplab/-/issues/7720",
    "source": "https://files.pythonhosted.org/packages/4a/e0/9da6a25f4ac72455f5da9d4af8d75144d15e29d415220773850e0ec23d3e/protobuf-4.22.1.tar.gz",
    "status": "approved",
    "scans": [
        {
            "date": "March 31, 2023 at 9:42:29 a.m. GMT",
            "authority": "https://gitlab.eclipse.org/eclipsefdn/emo-team/iplab/-/issues/7720",
            "scancode-version": "31.2.1",
            "licenses-discovered": [
                "BSD-3-Clause"
            ],
            "copyrights": [
                "Copyright (c) 2009-2021, Google LLC",
                "Copyright (c) 2009-2022, Google LLC",
                "Copyright 2007 Google Inc.",
                "Copyright 2008 Google Inc."
            ],
            "file-count": 237,
            "sha256": "dce7a55d501c31ecf688adb2f6c3f763cf11bc0be815d1946a84d74772ab07a7",
            "source": "https://files.pythonhosted.org/packages/4a/e0/9da6a25f4ac72455f5da9d4af8d75144d15e29d415220773850e0ec23d3e/protobuf-4.22.1.tar.gz",
            "status": "approved"
        }
    ]
}