{
    "id": "p2/orbit/p2.eclipse-plugin/junit-platform-suite-api.source/1.9.1",
    "license": "EPL-2.0",
    "authority": "https://gitlab.eclipse.org/eclipsefdn/emo-team/iplab/-/issues/5369",
    "source": "https://repo1.maven.org/maven2/org/junit/platform/junit-platform-suite-api/1.9.1/junit-platform-suite-api-1.9.1.jar",
    "status": "approved",
    "scans": [
        {
            "date": "December 5, 2022 at 3:11:48 p.m. GMT",
            "authority": "https://gitlab.eclipse.org/eclipsefdn/emo-team/iplab/-/issues/5369",
            "scancode-version": "31.2.1",
            "licenses-discovered": [
                "EPL-2.0"
            ],
            "copyrights": [
            ],
            "file-count": 27,
            "sha256": "f49e2a8983a52e2e5566a16828d634a02592ab8bf51d23c5c091214bc15e57b4",
            "source": "https://repo1.maven.org/maven2/org/junit/platform/junit-platform-suite-api/1.9.1/junit-platform-suite-api-1.9.1.jar",
            "status": "approved"
        }
    ]
}