{
    "id": "npm/npmjs/@ampproject/remapping/2.1.0",
    "license": "Apache-2.0",
    "licenses-discovered": [
        "Apache-2.0"
    ],
    "file-count": 76,
    "scancode-version": "30.1.0",
    "authority": "https://gitlab.eclipse.org/eclipsefdn/emo-team/iplab/-/issues/1935",
    "source": "https://github.com/ampproject/remapping/archive/v2.1.0.zip",
    "status": "approved"
}