{
    "id": "npm/npmjs/@catena-x/portal-shared-components/2.0.2",
    "license": "Apache-2.0 AND (BSD-3-Clause AND MIT)",
    "authority": "https://gitlab.eclipse.org/eclipsefdn/emo-team/iplab/-/issues/9187",
    "source": "https://registry.npmjs.org/@catena-x/portal-shared-components/-/portal-shared-components-2.0.2.tgz",
    "status": "approved",
    "scans": [
        {
            "date": "June 26, 2023 at 3:19:51 p.m. GMT",
            "authority": "https://gitlab.eclipse.org/eclipsefdn/emo-team/iplab/-/issues/9187",
            "scancode-version": "31.2.1",
            "licenses-discovered": [
            ],
            "copyrights": [
            ],
            "file-count": 1,
            "sha256": "b75a88dbbd4ba137e1bb20ea2c29fcd05f025c1e559aa09702a7dd9c11a91f38",
            "source": "https://registry.npmjs.org/@catena-x/portal-shared-components/-/portal-shared-components-2.0.2.tgz",
            "status": "restricted"
        },
        {
            "date": "June 26, 2023 at 7:16:32 p.m. GMT",
            "authority": "https://gitlab.eclipse.org/eclipsefdn/emo-team/iplab/-/issues/9187",
            "scancode-version": "31.2.1",
            "licenses-discovered": [
                "Apache-2.0",
                "BSD-3-Clause AND JSON AND MIT"
            ],
            "copyrights": [
                "(c) Sindre Sorhus",
                "Copyright (c) 2013-present, Facebook, Inc.",
                "Copyright (c) 2017 Evgeny Poberezkin",
                "Copyright (c) 2018 Jed Watson",
                "Copyright (c) 2021, 2023 BMW Group AG",
                "Copyright (c) 2021, 2023 Contributors",
                "Copyright (c) 2021, 2023 Mercedes-Benz Group AG and BMW Group AG",
                "Copyright (c) Facebook, Inc. and its affiliates",
                "Copyright 2015, Yahoo! Inc.",
                "Copyright Jeremy Ashkenas, DocumentCloud and Investigative Reporters & Editors",
                "Copyright jQuery Foundation and other contributors <https://jquery.org/>"
            ],
            "file-count": 271,
            "sha256": "b75a88dbbd4ba137e1bb20ea2c29fcd05f025c1e559aa09702a7dd9c11a91f38",
            "source": "https://registry.npmjs.org/@catena-x/portal-shared-components/-/portal-shared-components-2.0.2.tgz",
            "status": "restricted"
        }
    ]
}
