{
    "id": "maven/mavencentral/org.apache.lucene/lucene-sandbox/10.0.0",
    "license": "Apache-2.0",
    "authority": "https://gitlab.eclipse.org/eclipsefdn/emo-team/iplab/-/issues/17854",
    "source": "https://repo1.maven.org/maven2/org/apache/lucene/lucene-sandbox/10.0.0/lucene-sandbox-10.0.0-sources.jar",
    "status": "approved",
    "scans": [
        {
            "date": "December 13, 2024 at 12:48:59 p.m. GMT",
            "authority": "https://gitlab.eclipse.org/eclipsefdn/emo-team/iplab/-/issues/17854",
            "scancode-version": "31.2.1",
            "licenses-discovered": [
                "Apache-2.0"
            ],
            "copyrights": [
            ],
            "file-count": 91,
            "sha256": "78848c271f3b64bfa2ab797db086b774910e2e7877700ea2bba0c8864d082327",
            "source": "https://repo1.maven.org/maven2/org/apache/lucene/lucene-sandbox/10.0.0/lucene-sandbox-10.0.0-sources.jar",
            "status": "approved"
        }
    ]
}