{
    "id": "maven/mavencentral/com.azure.resourcemanager/azure-resourcemanager-privatedns/2.44.0",
    "license": "MIT",
    "authority": "https://gitlab.eclipse.org/eclipsefdn/emo-team/iplab/-/issues/16929",
    "source": "https://repo1.maven.org/maven2/com/azure/resourcemanager/azure-resourcemanager-privatedns/2.44.0/azure-resourcemanager-privatedns-2.44.0-sources.jar",
    "status": "approved",
    "scans": [
        {
            "date": "October 29, 2024, 3:54:39 a.m. GMT",
            "authority": "https://gitlab.eclipse.org/eclipsefdn/emo-team/iplab/-/issues/16929",
            "scancode-version": "31.2.1",
            "licenses-discovered": [
                "MIT"
            ],
            "copyrights": [
                "Copyright (c) Microsoft Corporation"
            ],
            "file-count": 86,
            "sha256": "416828908d4a71289441d874f6b6ce02b79aff2654bc781d81047a857858174b",
            "source": "https://repo1.maven.org/maven2/com/azure/resourcemanager/azure-resourcemanager-privatedns/2.44.0/azure-resourcemanager-privatedns-2.44.0-sources.jar",
            "status": "approved"
        }
    ]
}