{
    "id": "maven/mavencentral/org.geotools/gt-geometry/22.1",
    "license": "LGPL-2.0-or-later AND LGPL-2.1-only AND LGPL-2.1-only",
    "authority": "https://gitlab.eclipse.org/eclipsefdn/emo-team/iplab/-/issues/4940",
    "source": "https://repo.osgeo.org/repository/geotools-releases/org/geotools/gt-geometry/22.1/gt-geometry-22.1-sources.jar",
    "status": "approved",
    "scans": [
        {
            "date": "November 15, 2022 at 11:27:42 p.m. GMT",
            "authority": "https://gitlab.eclipse.org/eclipsefdn/emo-team/iplab/-/issues/4940",
            "scancode-version": "31.2.1",
            "licenses-discovered": [
                "LGPL-2.0-or-later AND LGPL-2.1-only",
                "LGPL-2.1-only"
            ],
            "copyrights": [
                "(c) 2001-2006 Vivid Solutions",
                "(c) 2001-2008, Open Source Geospatial Foundation",
                "(c) 2005-2008, Open Source Geospatial Foundation",
                "(c) 2006-2008, Open Source Geospatial Foundation",
                "Copyright (c) 1995 by INRIA Prisme Project BP 93 06902 Sophia Antipolis Cedex, France"
            ],
            "file-count": 203,
            "sha256": "328b0266ee8f4d87c2fad4d8eba1cdbd5cf6855866c334bb3fc1fcbd8096ff73",
            "source": "https://repo.osgeo.org/repository/geotools-releases/org/geotools/gt-geometry/22.1/gt-geometry-22.1-sources.jar",
            "status": "restricted"
        },
        {
            "date": "November 16, 2022 at 1:02:07 a.m. GMT",
            "authority": "https://gitlab.eclipse.org/eclipsefdn/emo-team/iplab/-/issues/4940",
            "scancode-version": "31.2.1",
            "licenses-discovered": [
                "LGPL-2.0-or-later AND LGPL-2.1-only",
                "LGPL-2.1-only"
            ],
            "copyrights": [
                "(c) 2001-2006 Vivid Solutions",
                "(c) 2001-2008, Open Source Geospatial Foundation",
                "(c) 2005-2008, Open Source Geospatial Foundation",
                "(c) 2006-2008, Open Source Geospatial Foundation",
                "Copyright (c) 1995 by INRIA Prisme Project BP 93 06902 Sophia Antipolis Cedex, France"
            ],
            "file-count": 203,
            "sha256": "328b0266ee8f4d87c2fad4d8eba1cdbd5cf6855866c334bb3fc1fcbd8096ff73",
            "source": "https://repo.osgeo.org/repository/geotools-releases/org/geotools/gt-geometry/22.1/gt-geometry-22.1-sources.jar",
            "status": "approved"
        }
    ]
}