{
    "id": "maven/mavencentral/org.apache.shiro/shiro-config-ogdl/1.10.0",
    "license": "Apache-2.0",
    "licenses-discovered": [
        "Apache-2.0"
    ],
    "copyrights": [
    ],
    "file-count": 15,
    "scancode-version": "31.2.1",
    "authority": "https://gitlab.eclipse.org/eclipsefdn/emo-team/iplab/-/issues/3802",
    "source": "https://search.maven.org/remotecontent?filepath=org/apache/shiro/shiro-config-ogdl/1.10.0/shiro-config-ogdl-1.10.0-sources.jar",
    "status": "approved"
}