{
    "id": "npm/npmjs/-/globby/13.1.3",
    "license": "MIT",
    "authority": "https://gitlab.eclipse.org/eclipsefdn/emo-team/iplab/-/issues/5753",
    "source": "https://registry.npmjs.org/globby/-/globby-13.1.3.tgz",
    "status": "approved",
    "scans": [
        {
            "date": "December 14, 2022 at 1:57:00 a.m. GMT",
            "authority": "https://gitlab.eclipse.org/eclipsefdn/emo-team/iplab/-/issues/5753",
            "scancode-version": "31.2.1",
            "licenses-discovered": [
                "MIT"
            ],
            "copyrights": [
                "Copyright (c) Sindre Sorhus <sindresorhus@gmail.com> (https://sindresorhus.com)"
            ],
            "file-count": 7,
            "sha256": "d2ae8e8029830ee721284bc79d2697bec08ac8095dca865e3446c14574d93960",
            "source": "https://registry.npmjs.org/globby/-/globby-13.1.3.tgz",
            "status": "approved"
        }
    ]
}