{
    "id": "pypi/pypi/-/bottle/0.12.25",
    "license": "MIT",
    "authority": "https://gitlab.eclipse.org/eclipsefdn/emo-team/iplab/-/issues/8011",
    "source": "https://files.pythonhosted.org/packages/fd/04/1c09ab851a52fe6bc063fd0df758504edede5cc741bd2e807bf434a09215/bottle-0.12.25.tar.gz",
    "status": "approved",
    "scans": [
        {
            "date": "April 27, 2023 at 12:37:20 p.m. GMT",
            "authority": "https://gitlab.eclipse.org/eclipsefdn/emo-team/iplab/-/issues/8011",
            "scancode-version": "31.2.1",
            "licenses-discovered": [
                "MIT"
            ],
            "copyrights": [
                "Copyright (c) 2012, Marcel Hellkamp",
                "Copyright (c) 2016, Marcel Hellkamp"
            ],
            "file-count": 51,
            "sha256": "e1a9c94970ae6d710b3fb4526294dfeb86f2cb4a81eff3a4b98dc40fb0e5e021",
            "source": "https://files.pythonhosted.org/packages/fd/04/1c09ab851a52fe6bc063fd0df758504edede5cc741bd2e807bf434a09215/bottle-0.12.25.tar.gz",
            "status": "approved"
        }
    ]
}