{
    "id": "npm/npmjs/-/dotenv-cli/7.4.4",
    "license": "MIT",
    "authority": "https://gitlab.eclipse.org/eclipsefdn/emo-team/iplab/-/issues/17506",
    "source": "https://github.com/entropitor/dotenv-cli/archive/refs/tags/v7.4.4.zip",
    "status": "approved",
    "scans": [
        {
            "date": "November 27, 2024 at 3:43:16 p.m. GMT",
            "authority": "https://gitlab.eclipse.org/eclipsefdn/emo-team/iplab/-/issues/17506",
            "scancode-version": "31.2.1",
            "licenses-discovered": [
                "MIT"
            ],
            "copyrights": [
            ],
            "file-count": 5,
            "sha256": "61a2b89a8cb688dd9fcfe89929db7530ba0351e648d4710a0c66fa15d0604b26",
            "source": "https://github.com/entropitor/dotenv-cli/archive/refs/tags/v7.4.4.zip",
            "status": "approved"
        }
    ]
}