{
    "id": "npm/npmjs/-/vscode-html-languageservice/5.1.0",
    "license": "MIT AND (CC-BY-4.0 AND MIT)",
    "authority": "https://gitlab.eclipse.org/eclipsefdn/emo-team/iplab/-/issues/10467",
    "source": "https://github.com/microsoft/vscode-html-languageservice/archive/refs/tags/v5.1.0.zip",
    "status": "approved",
    "scans": [
        {
            "date": "September 11, 2023 at 6:08:26 p.m. GMT",
            "authority": "https://gitlab.eclipse.org/eclipsefdn/emo-team/iplab/-/issues/10467",
            "scancode-version": "31.2.1",
            "licenses-discovered": [
                "MIT",
                "CC-BY-4.0 AND MIT"
            ],
            "copyrights": [
                "Copyright (c) 2007-2017 Einar Lielmanis, Liam Newman, and contributors",
                "Copyright (c) 2007-2018 Einar Lielmanis, Liam Newman, and contributors",
                "Copyright (c) 2015 W3C(r) MIT, ERCIM, Keio",
                "Copyright (c) Microsoft",
                "Copyright (c) Microsoft Corporation",
                "Copyright 2016-2023, Microsoft"
            ],
            "file-count": 86,
            "sha256": "5fac24316f203fe4c01fa2fb323357065375b3d3008fb563b204d6af7c3f0bdf",
            "source": "https://github.com/microsoft/vscode-html-languageservice/archive/refs/tags/v5.1.0.zip",
            "status": "approved"
        }
    ]
}