{
    "id": "maven/mavencentral/org.jacoco/jacoco-maven-plugin/0.8.10",
    "license": "EPL-2.0",
    "authority": "https://gitlab.eclipse.org/eclipsefdn/emo-team/iplab/-/issues/9250",
    "source": "https://repo.maven.apache.org/maven2/org/jacoco/jacoco-maven-plugin/0.8.10/jacoco-maven-plugin-0.8.10-sources.jar",
    "status": "approved",
    "scans": [
        {
            "date": "July 4, 2023 at 12:06:19 p.m. GMT",
            "authority": "https://gitlab.eclipse.org/eclipsefdn/emo-team/iplab/-/issues/9250",
            "scancode-version": "31.2.1",
            "licenses-discovered": [
                "EPL-2.0"
            ],
            "copyrights": [
                "Copyright (c) 2009, 2023 Mountainminds GmbH & Co. KG and Contributors"
            ],
            "file-count": 20,
            "sha256": "1308f27b71ab49ea2bf0085cb1f751072176b09450307eaa6accebccb03b3e08",
            "source": "https://repo.maven.apache.org/maven2/org/jacoco/jacoco-maven-plugin/0.8.10/jacoco-maven-plugin-0.8.10-sources.jar",
            "status": "approved"
        }
    ]
}