{
    "id": "maven/mavencentral/org.apache.arrow/arrow-memory-netty/14.0.2",
    "license": "Apache-2.0",
    "authority": "https://gitlab.eclipse.org/eclipsefdn/emo-team/iplab/-/issues/12695",
    "source": "https://repo1.maven.org/maven2/org/apache/arrow/arrow-memory-netty/14.0.2/arrow-memory-netty-14.0.2-sources.jar",
    "status": "approved",
    "scans": [
        {
            "date": "January 11, 2024 at 1:51:57 a.m. GMT",
            "authority": "https://gitlab.eclipse.org/eclipsefdn/emo-team/iplab/-/issues/12695",
            "scancode-version": "31.2.1",
            "licenses-discovered": [
                "Apache-2.0"
            ],
            "copyrights": [
            ],
            "file-count": 13,
            "sha256": "fe42df1f255bf4f97ac2be2c4a1b23c40d7250706fe743fee900ebe7a1c6ee73",
            "source": "https://repo1.maven.org/maven2/org/apache/arrow/arrow-memory-netty/14.0.2/arrow-memory-netty-14.0.2-sources.jar",
            "status": "approved"
        }
    ]
}