{
    "id": "go/golang/github.com%2Faws%2Faws-sdk-go-v2%2Fservice%2Finternal/presigned-url/v1.2.0",
    "license": "Apache-2.0",
    "authority": "https://gitlab.eclipse.org/eclipsefdn/emo-team/iplab/-/issues/12336",
    "source": "https://proxy.golang.org/github.com%2Faws%2Faws-sdk-go-v2%2Fservice%2Finternal/presigned-url/@v/v1.2.0.zip",
    "status": "approved",
    "scans": [
        {
            "date": "December 20, 2023 at 6:28:55 p.m. GMT",
            "authority": "https://gitlab.eclipse.org/eclipsefdn/emo-team/iplab/-/issues/12336",
            "scancode-version": "31.2.1",
            "licenses-discovered": [
                "Apache-2.0"
            ],
            "copyrights": [
            ],
            "file-count": 8,
            "sha256": "91a0746725851127d25228436ab79da30b2e7aad0c23c6e497f00f7cba2f54dc",
            "source": "https://proxy.golang.org/github.com%2Faws%2Faws-sdk-go-v2%2Fservice%2Finternal/presigned-url/@v/v1.2.0.zip",
            "status": "approved"
        }
    ]
}