{
    "id": "npm/npmjs/-/cacache/17.0.5",
    "license": "ISC",
    "authority": "https://gitlab.eclipse.org/eclipsefdn/emo-team/iplab/-/issues/7610",
    "source": "https://github.com/npm/cacache/archive/v17.0.5.zip",
    "status": "approved",
    "scans": [
        {
            "date": "March 27, 2023 at 5:47:56 p.m. GMT",
            "authority": "https://gitlab.eclipse.org/eclipsefdn/emo-team/iplab/-/issues/7557",
            "scancode-version": "31.2.1",
            "licenses-discovered": [
                "ISC"
            ],
            "copyrights": [
                "Copyright (c) npm, Inc."
            ],
            "file-count": 55,
            "sha256": "03990c444ea1f7f8646e26f01d35b19a409e389402a6e7c1a205b1dd6d126533",
            "source": "https://github.com/npm/cacache/archive/v17.0.5.zip",
            "status": "approved"
        },
        {
            "date": "March 28, 2023 at 12:46:47 p.m. GMT",
            "authority": "https://gitlab.eclipse.org/eclipsefdn/emo-team/iplab/-/issues/7610",
            "scancode-version": "31.2.1",
            "licenses-discovered": [
                "ISC"
            ],
            "copyrights": [
                "Copyright (c) npm, Inc."
            ],
            "file-count": 55,
            "sha256": "03990c444ea1f7f8646e26f01d35b19a409e389402a6e7c1a205b1dd6d126533",
            "source": "https://github.com/npm/cacache/archive/v17.0.5.zip",
            "status": "approved"
        }
    ]
}