{
    "id": "nuget/nuget/-/OPCFoundation.NetStandard.Opc.Ua/1.4.371",
    "license": "MIT AND (GPL-2.0-only AND MIT) AND RPL-1.5 AND GPL-2.0-only AND (GPL-2.0-only AND LicenseRef-scancode-philippe-de-muyter)",
    "authority": "https://gitlab.eclipse.org/eclipsefdn/emo-team/iplab/-/issues/14746",
    "source": "https://github.com/OPCFoundation/UA-.NETStandard/archive/refs/tags/1.4.371.86.zip",
    "status": "restricted",
    "scans": [
        {
            "date": "May 29, 2024 at 2:49:49 a.m. GMT",
            "authority": "https://gitlab.eclipse.org/eclipsefdn/emo-team/iplab/-/issues/14746",
            "scancode-version": "31.2.1",
            "licenses-discovered": [
                "MIT",
                "GPL-2.0-only AND MIT",
                "RPL-1.5",
                "GPL-2.0-only",
                "GPL-2.0-only AND LicenseRef-scancode-philippe-de-muyter"
            ],
            "copyrights": [
                "Copyright (c) 1989, 1991 Free Software Foundation, Inc.",
                "Copyright (c) 1996-2020 The OPC Foundation",
                "Copyright (c) 1996-2022 The OPC Foundation",
                "Copyright (c) 2004-2020 OPC Foundation, Inc",
                "Copyright (c) 2004-2022 OPC Foundation, Inc",
                "Copyright (c) 2004-2023 OPC Foundation, Inc OPC Foundation OPC Foundation NU5125",
                "Copyright (c) 2004-2023 OPC Foundation, Inc Quickstarts",
                "Copyright (c) 2005-2018 The OPC Foundation, Inc.",
                "Copyright (c) 2005-2019 The OPC Foundation, Inc.",
                "Copyright (c) 2005-2020 The OPC Foundation, Inc.",
                "Copyright (c) 2005-2021 The OPC Foundation, Inc.",
                "Copyright (c) 2005-2022 The OPC Foundation, Inc.",
                "Copyright (c) 2005-2023 The OPC Foundation, Inc.",
                "Copyright (c) 2008,2009 OPC Foundation, Inc.",
                "Copyright (c) 2008-2022 OPC Foundation, Inc.",
                "Copyright (c) 2020 OPC Foundation",
                "Copyright (c) OPC Foundation",
                "copyright (c) by OPC Foundation, Inc.",
                "copyrighted by the Free Software Foundation"
            ],
            "file-count": 1151,
            "sha256": "e6a63b9e73d12fb8d27f2f6c5a538f10918cb9aa3327e1a77e88cb969434eadd",
            "source": "https://github.com/OPCFoundation/UA-.NETStandard/archive/refs/tags/1.4.371.86.zip",
            "status": "restricted"
        }
    ]
}