{
    "id": "npm/npmjs/@vscode/vsce/2.23.0",
    "license": "MIT AND (ISC AND MIT) AND ISC",
    "authority": "https://gitlab.eclipse.org/eclipsefdn/emo-team/iplab/-/issues/13231",
    "source": "https://github.com/microsoft/vscode-vsce/archive/refs/tags/v2.23.0.zip",
    "status": "approved",
    "scans": [
        {
            "date": "February 13, 2024 at 7:05:43 p.m. GMT",
            "authority": "https://gitlab.eclipse.org/eclipsefdn/emo-team/iplab/-/issues/13231",
            "scancode-version": "31.2.1",
            "licenses-discovered": [
                "MIT",
                "ISC AND MIT",
                "ISC"
            ],
            "copyrights": [
                "Copyright (c) 2010 Benjamin Thomas, Robert Kieffer",
                "Copyright (c) 2011 TJ Holowaychuk <tj@vision-media.ca>",
                "Copyright (c) 2014 Jon Schlinkert",
                "Copyright (c) 2014 Josh Wolfe",
                "Copyright (c) 2014 KARASZI Istvan",
                "Copyright (c) 2014-2016. Permission",
                "Copyright (c) 2014-present, Jon Schlinkert",
                "Copyright (c) 2015 Microsoft",
                "Copyright (c) 2016, Jon Schlinkert (https://github.com/jonschlinkert)",
                "Copyright (c) 2018, Jon Schlinkert (https://github.com/jonschlinkert)",
                "Copyright (c) Isaac Z. Schlueter and Contributors",
                "Copyright (c) Microsoft Corporation",
                "Copyright (c) Sindre Sorhus <sindresorhus@gmail.com> (sindresorhus.com)",
                "Copyright 2012-2015 The Dojo Foundation <http://dojofoundation.org/>",
                "copyright 2009-2015 Jeremy Ashkenas, DocumentCloud and Investigative Reporters & Editors <http://underscorejs.org/>"
            ],
            "file-count": 138,
            "sha256": "56f19c1d38606d01992fb5a520376224b18ebd44e2b83d4217fdbc8c42e151f6",
            "source": "https://github.com/microsoft/vscode-vsce/archive/refs/tags/v2.23.0.zip",
            "status": "approved"
        }
    ]
}