{
    "id": "maven/mavencentral/software.amazon.awssdk/http-auth/2.25.1",
    "license": "Apache-2.0",
    "authority": "https://gitlab.eclipse.org/eclipsefdn/emo-team/iplab/-/issues/13682",
    "source": "https://repo1.maven.org/maven2/software/amazon/awssdk/http-auth/2.25.1/http-auth-2.25.1-sources.jar",
    "status": "approved",
    "scans": [
        {
            "date": "March 14, 2024 at 12:55:53 p.m. GMT",
            "authority": "https://gitlab.eclipse.org/eclipsefdn/emo-team/iplab/-/issues/13682",
            "scancode-version": "31.2.1",
            "licenses-discovered": [
                "Apache-2.0"
            ],
            "copyrights": [
                "Copyright Amazon.com, Inc. or its affiliates"
            ],
            "file-count": 10,
            "sha256": "2685d38795c00733fdfe7aa549800a5cda000e4fcd388697e093d1a099844c45",
            "source": "https://repo1.maven.org/maven2/software/amazon/awssdk/http-auth/2.25.1/http-auth-2.25.1-sources.jar",
            "status": "approved"
        }
    ]
}