{
    "id": "p2/orbit/p2.eclipse-plugin/com.ibm.icu.source/72.1.0",
    "license": "Unicode-TOU",
    "authority": "https://gitlab.eclipse.org/eclipsefdn/emo-team/iplab/-/issues/5356",
    "source": "http://download.eclipse.org/oomph/simrel-extras/release/1.0.1/plugins/com.ibm.icu_72.1.0.v20221115-2007.jar",
    "status": "approved",
    "scans": [
        {
            "date": "December 5, 2022 at 4:20:51 p.m. GMT",
            "authority": "https://gitlab.eclipse.org/eclipsefdn/emo-team/iplab/-/issues/5356",
            "scancode-version": "31.2.1",
            "licenses-discovered": [
                "BSD-3-Clause AND EPL-1.0 AND ICU AND MIT",
                "GPL-2.0-or-later AND GPL-3.0-or-later AND LicenseRef-scancode-autoconf-simple-exception AND LicenseRef-scancode-autoconf-simple-exception-2.0 AND LicenseRef-scancode-unicode AND LicenseRef-scancode-unicode-icu-58 AND NTP",
                "LicenseRef-scancode-unicode-icu-58",
                "LicenseRef-scancode-unicode",
                "NGPL",
                "ICU",
                "ICU AND LicenseRef-scancode-unicode"
            ],
            "copyrights": [
                "(c) 2008 VeriSign, Inc.",
                "(c) ThAa (c)",
                "Bundle-Copyright (c) 2016 and later Unicode, Inc. and others",
                "Copyright (c) 1991-2018 Unicode, Inc.",
                "Copyright (c) 1991-2022 Unicode, Inc.",
                "Copyright (c) 1995-2016 International Business Machines Corporation and others",
                "Copyright (c) 1999 Computer Systems and Communication Lab, Institute of Information Science, Academia Sinica",
                "Copyright (c) 1999 Pai-Hsiang Hsiao",
                "Copyright (c) 1999 TaBE Project",
                "Copyright (c) 2000-2004, International Business Machines Corporation and others",
                "Copyright (c) 2002, International Business Machines Corporation and others",
                "Copyright (c) 2004 Scott James Remnant <scott@netsplit.com>",
                "Copyright (c) 2006-2008, Google Inc.",
                "Copyright (c) 2007-2008 International Business Machines Corporation and others",
                "Copyright (c) 2008-2014, International Business Machines Corporation and others",
                "Copyright (c) 2012-2015 Dan Nicholson <dbn.lists@gmail.com>",
                "Copyright (c) 2013 Brian Eugene Wilson, Robert Martin Campbell",
                "Copyright (c) 2013 International Business Machines Corporation and others",
                "Copyright (c) 2013, LeRoy Benjamin Sharon",
                "Copyright (c) 2014 International Business Machines Corporation and others",
                "Copyright (c) 2015 International Business Machines Corporation and others",
                "Copyright (c) 2016 and later Unicode, Inc. and others",
                "Copyright (c) 2017 and later Unicode, Inc. and others",
                "Copyright (c) 2022 and later Unicode, Inc. and others",
                "Copyright 1991 by the Massachusetts Institute of Technology",
                "Copyright 1996 Chih-Hao Tsai Beckman Institute, University of Illinois c-tsai4@uiuc.edu http://casper.beckman.uiuc.edu/~c-tsai4",
                "Copyright 2000, 2001, 2002, 2003 Nara Institute of Science and Technology",
                "Copyright 2006-2011, the V8 project authors"
            ],
            "file-count": 5431,
            "sha256": "27cab479ce9e5c8c67e717a67acf183d42db4a9acf25969809c6404fde4e95e6",
            "source": "http://download.eclipse.org/oomph/simrel-extras/release/1.0.1/plugins/com.ibm.icu_72.1.0.v20221115-2007.jar",
            "status": "restricted"
        }
    ]
}
