{
    "id": "maven/mavencentral/org.apache.httpcomponents.client5/httpclient5/5.2",
    "license": "Apache-2.0",
    "authority": "https://gitlab.eclipse.org/eclipsefdn/emo-team/iplab/-/issues/5015",
    "source": "https://search.maven.org/remotecontent?filepath=org/apache/httpcomponents/client5/httpclient5/5.2/httpclient5-5.2-sources.jar",
    "status": "approved",
    "scans": [
        {
            "date": "November 21, 2022 at 10:46:15 a.m. GMT",
            "authority": "https://gitlab.eclipse.org/eclipsefdn/emo-team/iplab/-/issues/5015",
            "scancode-version": "31.2.1",
            "licenses-discovered": [
                "Apache-2.0"
            ],
            "copyrights": [
            ],
            "file-count": 364,
            "sha256": "7b857bec81087e40c89f18e7bfac643a45d17b19bdc20a1da474a1f262297881",
            "source": "https://search.maven.org/remotecontent?filepath=org/apache/httpcomponents/client5/httpclient5/5.2/httpclient5-5.2-sources.jar",
            "status": "approved"
        }
    ]
}