{
    "id": "go/golang/github.com%2Fopencontainers/selinux/v1.11.0",
    "license": "Apache-2.0",
    "authority": "https://gitlab.eclipse.org/eclipsefdn/emo-team/iplab/-/issues/13185",
    "source": "https://proxy.golang.org/github.com%2Fopencontainers/selinux/@v/v1.11.0.zip",
    "status": "approved",
    "scans": [
        {
            "date": "February 8, 2024 at 7:04:51 a.m. GMT",
            "authority": "https://gitlab.eclipse.org/eclipsefdn/emo-team/iplab/-/issues/13185",
            "scancode-version": "31.2.1",
            "licenses-discovered": [
                "Apache-2.0"
            ],
            "copyrights": [
                "Copyright (c) 2004, 2006 The Linux Foundation and its contributors"
            ],
            "file-count": 30,
            "sha256": "e6beb9eabe411afb832f81dff59d516dae2418483cb4d9a44421646ec2bfa90f",
            "source": "https://proxy.golang.org/github.com%2Fopencontainers/selinux/@v/v1.11.0.zip",
            "status": "approved"
        }
    ]
}