{
    "id": "npm/npmjs/-/ts-loader/8.4.0",
    "license": "MIT AND ISC",
    "authority": "https://gitlab.eclipse.org/eclipsefdn/emo-team/iplab/-/issues/12951",
    "source": "https://github.com/TypeStrong/ts-loader/archive/refs/tags/v8.4.0.zip",
    "status": "approved",
    "scans": [
        {
            "date": "January 29, 2024 at 7:54:45 p.m. GMT",
            "authority": "https://gitlab.eclipse.org/eclipsefdn/emo-team/iplab/-/issues/12951",
            "scancode-version": "31.2.1",
            "licenses-discovered": [
                "MIT",
                "ISC"
            ],
            "copyrights": [
                "Copyright (c) 2015 TypeStrong"
            ],
            "file-count": 6106,
            "sha256": "0948e0970a6de91b9c706eb0b698705745c4d8ba7fbe228b0a2f423aacfdd2b4",
            "source": "https://github.com/TypeStrong/ts-loader/archive/refs/tags/v8.4.0.zip",
            "status": "approved"
        }
    ]
}