{
    "id": "maven/mavencentral/com.vaadin/vaadin-server/8.20.0",
    "license": "Apache-2.0",
    "authority": "https://gitlab.eclipse.org/eclipsefdn/emo-team/iplab/-/issues/7520",
    "source": "https://search.maven.org/remotecontent?filepath=com/vaadin/vaadin-server/8.20.0/vaadin-server-8.20.0-sources.jar",
    "status": "approved",
    "scans": [
        {
            "date": "March 24, 2023 at 1:51:11 p.m. GMT",
            "authority": "https://gitlab.eclipse.org/eclipsefdn/emo-team/iplab/-/issues/7520",
            "scancode-version": "31.2.1",
            "licenses-discovered": [
                "Apache-2.0"
            ],
            "copyrights": [
                "Copyright (c) 2000-2023 Vaadin Ltd",
                "Copyright 2000-2017 Vaadin Ltd."
            ],
            "file-count": 548,
            "sha256": "f7278bcab65c5c7e14b9530c93f5d32cf082646985d97fec533c0212f213b1d7",
            "source": "https://search.maven.org/remotecontent?filepath=com/vaadin/vaadin-server/8.20.0/vaadin-server-8.20.0-sources.jar",
            "status": "approved"
        }
    ]
}