{
    "id": "p2/orbit/p2.eclipse-plugin/junit-platform-engine.source/1.9.1",
    "license": "EPL-2.0",
    "authority": "https://gitlab.eclipse.org/eclipsefdn/emo-team/iplab/-/issues/5328",
    "source": "https://search.maven.org/remotecontent?filepath=org/junit/platform/junit-platform-engine/1.9.1/junit-platform-engine-1.9.1-sources.jar",
    "status": "approved",
    "scans": [
        {
            "date": "December 5, 2022 at 6:16:11 p.m. GMT",
            "authority": "https://gitlab.eclipse.org/eclipsefdn/emo-team/iplab/-/issues/5328",
            "scancode-version": "31.2.1",
            "licenses-discovered": [
                "EPL-2.0"
            ],
            "copyrights": [
                "Copyright 2015-2021 the original author or authors",
                "Copyright 2015-2022 the original author or authors"
            ],
            "file-count": 98,
            "sha256": "1e6b32b1c01edbe23ce929f778b304296a698618bd53f04d9039167c0a63f8fb",
            "source": "https://search.maven.org/remotecontent?filepath=org/junit/platform/junit-platform-engine/1.9.1/junit-platform-engine-1.9.1-sources.jar",
            "status": "approved"
        }
    ]
}