{
    "id": "npm/npmjs/@vscode/vsce-sign-win32-arm64/2.0.2",
    "license": "LicenseRef-scancode-ms-xamarin-uitest3.2.0",
    "authority": "https://gitlab.eclipse.org/eclipsefdn/emo-team/iplab/-/issues/15975",
    "source": "https://registry.yarnpkg.com/@vscode/vsce-sign-win32-arm64/-/vsce-sign-win32-arm64-2.0.2.tgz",
    "status": "restricted",
    "board_exception": [
        {
            "rule": "project_all_future",
            "project": "ecd.cdt-cloud"
        },
        {
            "rule": "project_all_future",
            "project": "ecd.theia"
        }
    ],
    "scans": [
        {
            "date": "August 22, 2024 at 12:18:59 a.m. GMT",
            "authority": "https://gitlab.eclipse.org/eclipsefdn/emo-team/iplab/-/issues/15975",
            "scancode-version": "31.2.1",
            "licenses-discovered": [
                "LicenseRef-scancode-ms-xamarin-uitest3.2.0"
            ],
            "copyrights": [
                "Copyright 1995-2024 Jean-loup Gailly and Mark Adler",
                "Copyright 1995-2024 Mark Adler +3 CScs Unknown"
            ],
            "file-count": 3,
            "sha256": "eb4ab8b80b5e939d194609d35f618408e63deb2550a25350db75a8bb30b4c645",
            "source": "https://registry.yarnpkg.com/@vscode/vsce-sign-win32-arm64/-/vsce-sign-win32-arm64-2.0.2.tgz",
            "status": "restricted"
        }
    ]
}
