{
    "id": "npm/npmjs/-/nan/2.22.0",
    "license": "BSD-3-Clause AND MIT",
    "authority": "https://gitlab.eclipse.org/eclipsefdn/emo-team/iplab/-/issues/17985",
    "source": "https://github.com/nodejs/nan/archive/refs/tags/v2.22.0.zip",
    "status": "approved",
    "scans": [
        {
            "date": "December 20, 2024 at 11:34:52 a.m. GMT",
            "authority": "https://gitlab.eclipse.org/eclipsefdn/emo-team/iplab/-/issues/17985",
            "scancode-version": "31.2.1",
            "licenses-discovered": [
                "BSD-3-Clause",
                "MIT"
            ],
            "copyrights": [
                "Copyright (c) 2009 Google Inc.",
                "Copyright (c) 2018 NAN WG Members",
                "Copyright (c) 2018 NAN contributors",
                "Copyright (c) 2018 NAN contributors - Rod Vagg <https://github.com/rvagg>",
                "Copyright (c) 2019 NAN contributors",
                "Copyright (c) 2021 NAN contributors",
                "Copyright Joyent, Inc. and other Node contributors"
            ],
            "file-count": 164,
            "sha256": "fb97763c75b9416015d77776bfb7483f274036f5ef9691830bde72bcbb30aaa3",
            "source": "https://github.com/nodejs/nan/archive/refs/tags/v2.22.0.zip",
            "status": "approved"
        }
    ]
}