{
    "id": "maven/mavencentral/org.wildfly.security/wildfly-elytron-password-impl/2.2.1.Final",
    "license": "Apache-2.0",
    "authority": "https://gitlab.eclipse.org/eclipsefdn/emo-team/iplab/-/issues/9472",
    "source": "https://repo.maven.apache.org/maven2/org/wildfly/security/wildfly-elytron-password-impl/2.2.1.Final/wildfly-elytron-password-impl-2.2.1.Final-sources.jar",
    "status": "approved",
    "scans": [
        {
            "date": "July 17, 2023 at 8:45:52 a.m. GMT",
            "authority": "https://gitlab.eclipse.org/eclipsefdn/emo-team/iplab/-/issues/9472",
            "scancode-version": "31.2.1",
            "licenses-discovered": [
                "Apache-2.0"
            ],
            "copyrights": [
                "Copyright 2013 Red Hat, Inc., and individual contributors",
                "Copyright 2014 Red Hat, Inc., and individual contributors",
                "Copyright 2015 Red Hat, Inc. and/or its affiliates",
                "Copyright 2015 Red Hat, Inc., and individual contributors",
                "Copyright 2016 Red Hat, Inc., and individual contributors",
                "Copyright 2018 Red Hat, Inc., and individual contributors"
            ],
            "file-count": 30,
            "sha256": "cb49e4816b3f2d54f1b016c34d1a6e7bfedd43ff471fe27561ac811d6cb5d7d3",
            "source": "https://repo.maven.apache.org/maven2/org/wildfly/security/wildfly-elytron-password-impl/2.2.1.Final/wildfly-elytron-password-impl-2.2.1.Final-sources.jar",
            "status": "approved"
        }
    ]
}