{
    "id": "git/github/moby/sys/v0.5.0",
    "license": "Apache-2.0 AND BSD-3-Clause",
    "authority": "https://gitlab.eclipse.org/eclipsefdn/emo-team/iplab/-/issues/5468",
    "source": "https://github.com/moby/sys/archive/refs/tags/sequential/v0.5.0.zip",
    "status": "approved",
    "scans": [
        {
            "date": "December 8, 2022 at 8:02:46 p.m. GMT",
            "authority": "https://gitlab.eclipse.org/eclipsefdn/emo-team/iplab/-/issues/5468",
            "scancode-version": "31.2.1",
            "licenses-discovered": [
                "Apache-2.0",
                "BSD-3-Clause",
                "Apache-2.0 AND BSD-3-Clause"
            ],
            "copyrights": [
                "Copyright (c) 2014-2018 The Docker & Go Authors",
                "Copyright 2012 The Go Authors",
                "Copyright 2014-2018 Docker, Inc."
            ],
            "file-count": 65,
            "sha256": "f98e044d4354ad1590822533b76383b2c1406216a85f8cd934522ec145d13a6e",
            "source": "https://github.com/moby/sys/archive/refs/tags/sequential/v0.5.0.zip",
            "status": "approved"
        }
    ]
}