{
    "id": "maven/mavencentral/software.amazon.awssdk/sdk-core/2.26.17",
    "license": "Apache-2.0",
    "authority": "https://gitlab.eclipse.org/eclipsefdn/emo-team/iplab/-/issues/15695",
    "source": "https://repo1.maven.org/maven2/software/amazon/awssdk/sdk-core/2.26.17/sdk-core-2.26.17-sources.jar",
    "status": "approved",
    "scans": [
        {
            "date": "July 11, 2024 at 9:10:32 a.m. GMT",
            "authority": "https://gitlab.eclipse.org/eclipsefdn/emo-team/iplab/-/issues/15695",
            "scancode-version": "31.2.1",
            "licenses-discovered": [
                "Apache-2.0"
            ],
            "copyrights": [
                "Copyright Amazon.com, Inc. or its affiliates"
            ],
            "file-count": 358,
            "sha256": "c93a0a843d73037da99793f2f9e55539d3fb014c651541209cbf308fba4607a1",
            "source": "https://repo1.maven.org/maven2/software/amazon/awssdk/sdk-core/2.26.17/sdk-core-2.26.17-sources.jar",
            "status": "approved"
        }
    ]
}