{
    "id": "p2/orbit/p2.eclipse.plugin/org.tigris.subversion.subclipse.core/1.8.22",
    "license": "EPL-1.0 AND Apache-2.0 AND (GPL-1.0-or-later AND TMate) AND TMate AND CC-BY-4.0 AND (CPL-1.0 AND EPL-1.0) AND (Apache-2.0 AND EPL-1.0 AND TMate) AND (Apache-2.0 AND BSD-3-Clause AND EPL-1.0 AND TMate) AND (BSD-3-Clause AND MIT)",
    "authority": "https://gitlab.eclipse.org/eclipsefdn/emo-team/iplab/-/issues/6865",
    "source": "https://github.com/subclipse/subclipse/archive/refs/heads/master.zip",
    "status": "restricted",
    "scans": [
        {
            "date": "January 31, 2023 at 4:15:24 p.m. GMT",
            "authority": "https://gitlab.eclipse.org/eclipsefdn/emo-team/iplab/-/issues/6865",
            "scancode-version": "31.2.1",
            "licenses-discovered": [
                "EPL-1.0",
                "Apache-2.0",
                "GPL-1.0-or-later AND TMate",
                "TMate",
                "CC-BY-4.0",
                "CPL-1.0 AND EPL-1.0",
                "Apache-2.0 AND EPL-1.0 AND TMate",
                "Apache-2.0 AND BSD-3-Clause AND EPL-1.0 AND TMate",
                "BSD-3-Clause AND MIT"
            ],
            "copyrights": [
                "Copyright (c) 2000 - 2004 The Legion Of The Bouncy Castle (http://www.bouncycastle.org)",
                "Copyright (c) 2000, 2003 IBM Corporation and others",
                "Copyright (c) 2000, 2004 IBM Corporation and others",
                "Copyright (c) 2000, 2005 IBM Corporation and others",
                "Copyright (c) 2000, 2006 IBM Corporation and others",
                "Copyright (c) 2000, 2009 IBM Corporation and others",
                "Copyright (c) 2003, 2004 Subclipse project and others",
                "Copyright (c) 2003, 2006 Subclipse project and others",
                "Copyright (c) 2004, 2006 Subclipse project and others",
                "Copyright (c) 2004, 2010 Subclipse project and others",
                "Copyright (c) 2004, 2019 Subclipse project and others",
                "Copyright (c) 2004-2006 TMate Software",
                "Copyright (c) 2005 - 2006 Swiss Federal Institute of Technology (ETH Zurich), Department of Computer Science (http://www.inf.ethz.ch), Christian Plattner",
                "Copyright (c) 2005 Maik Schreiber",
                "Copyright (c) 2005, 2006 Subclipse project and others",
                "Copyright (c) 2005, 2006 svnClientAdapter project and others",
                "Copyright (c) 2006 Subclipse project and others",
                "Copyright (c) 2007 Subclipse project and others",
                "Copyright (c) 2008 Subclipse project and others",
                "Copyright (c) 2009 CollabNet",
                "Copyright (c) year Subclipse project and others",
                "Copyright (c) year Subclipse project and others.& 13"
            ],
            "file-count": 1437,
            "sha256": "f31032bb66ecb13fcb05a0f4c50f13333d817129dc57102ff62d4c19475e75d4",
            "source": "https://github.com/subclipse/subclipse/archive/refs/heads/master.zip",
            "status": "restricted"
        }
    ]
}