{
    "id": "npm/npmjs/-/internal-slot/1.1.0",
    "license": "MIT",
    "authority": "https://gitlab.eclipse.org/eclipsefdn/emo-team/iplab/-/issues/18357",
    "source": "https://github.com/ljharb/internal-slot/archive/refs/tags/v1.1.0.zip",
    "status": "approved",
    "scans": [
        {
            "date": "January 8, 2025 at 12:37:00 p.m. GMT",
            "authority": "https://gitlab.eclipse.org/eclipsefdn/emo-team/iplab/-/issues/18357",
            "scancode-version": "31.2.1",
            "licenses-discovered": [
                "MIT"
            ],
            "copyrights": [
                "Copyright (c) 2019 Jordan Harband"
            ],
            "file-count": 19,
            "sha256": "810daab853eaf05e4b579677c175671019b0bb897a4471df9031f40250b89774",
            "source": "https://github.com/ljharb/internal-slot/archive/refs/tags/v1.1.0.zip",
            "status": "approved"
        }
    ]
}