{
    "id": "maven/mavencentral/org.cyclonedx/cyclonedx-core-java/7.3.2",
    "license": "Apache-2.0",
    "authority": "https://gitlab.eclipse.org/eclipsefdn/emo-team/iplab/-/issues/13272",
    "source": "https://repo1.maven.org/maven2/org/cyclonedx/cyclonedx-core-java/7.3.2/cyclonedx-core-java-7.3.2-sources.jar",
    "status": "approved",
    "scans": [
        {
            "date": "February 15, 2024 at 10:11:20 a.m. GMT",
            "authority": "https://gitlab.eclipse.org/eclipsefdn/emo-team/iplab/-/issues/13272",
            "scancode-version": "31.2.1",
            "licenses-discovered": [
                "Apache-2.0"
            ],
            "copyrights": [
                "Copyright (c) OWASP Foundation"
            ],
            "file-count": 100,
            "sha256": "a8f3f627059970d067512cdc936e9dc78cfb8aa8ba858a2c29af2a109394225f",
            "source": "https://repo1.maven.org/maven2/org/cyclonedx/cyclonedx-core-java/7.3.2/cyclonedx-core-java-7.3.2-sources.jar",
            "status": "approved"
        }
    ]
}