{
    "license": "Apache-2.0",
    "file-count": 1395,
    "authority": "https://gitlab.eclipse.org/eclipsefdn/emo-team/iplab/-/issues/1685",
    "scancode-version": "30.1.0",
    "licenses-discovered": [
        "Apache-2.0",
        "LicenseRef-scancode-unknown-license-reference"
    ],
    "id": "maven/mavencentral/org.apache.tomcat.embed/tomcat-embed-core/8.5.66",
    "source": "https://search.maven.org/remotecontent?filepath=org/apache/tomcat/embed/tomcat-embed-core/8.5.66/tomcat-embed-core-8.5.66-sources.jar",
    "status": "approved"
}
