{
    "id": "maven/mavencentral/org.junit/junit-bom/5.11.0",
    "license": "EPL-2.0",
    "authority": "https://gitlab.eclipse.org/eclipsefdn/emo-team/iplab/-/issues/16062",
    "source": "https://repo1.maven.org/maven2/org/junit/junit-bom/5.11.0/junit-bom-5.11.0.pom",
    "status": "approved",
    "scans": [
        {
            "date": "September 4, 2024 at 6:46:12 a.m. GMT",
            "authority": "https://gitlab.eclipse.org/eclipsefdn/emo-team/iplab/-/issues/16062",
            "scancode-version": "31.2.1",
            "licenses-discovered": [
                "EPL-2.0"
            ],
            "copyrights": [
            ],
            "file-count": 1,
            "sha256": "e67459d4882424ac6374f40db1c8f4a2e88946b340ba072c80be932a2be4644d",
            "source": "https://repo1.maven.org/maven2/org/junit/junit-bom/5.11.0/junit-bom-5.11.0.pom",
            "status": "approved"
        }
    ]
}