{
    "id": "npm/npmjs/@webassemblyjs/helper-buffer/1.11.5",
    "license": "MIT",
    "authority": "https://gitlab.eclipse.org/eclipsefdn/emo-team/iplab/-/issues/7955",
    "source": "https://registry.npmjs.org/@webassemblyjs/helper-buffer/-/helper-buffer-1.11.5.tgz",
    "status": "approved",
    "scans": [
        {
            "date": "April 26, 2023 at 1:29:13 p.m. GMT",
            "authority": "https://gitlab.eclipse.org/eclipsefdn/emo-team/iplab/-/issues/7955",
            "scancode-version": "31.2.1",
            "licenses-discovered": [
                "MIT"
            ],
            "copyrights": [
            ],
            "file-count": 3,
            "sha256": "822367dea708ff3b5794874c15fe40dbe88baa3df81efbdb3b568fad00588244",
            "source": "https://registry.npmjs.org/@webassemblyjs/helper-buffer/-/helper-buffer-1.11.5.tgz",
            "status": "approved"
        }
    ]
}