{
    "id": "maven/mavencentral/software.amazon.awssdk/arns/2.24.1",
    "license": "Apache-2.0",
    "authority": "https://gitlab.eclipse.org/eclipsefdn/emo-team/iplab/-/issues/13243",
    "source": "https://repo1.maven.org/maven2/software/amazon/awssdk/arns/2.24.1/arns-2.24.1-sources.jar",
    "status": "approved",
    "scans": [
        {
            "date": "February 14, 2024 at 3:06:05 p.m. GMT",
            "authority": "https://gitlab.eclipse.org/eclipsefdn/emo-team/iplab/-/issues/13243",
            "scancode-version": "31.2.1",
            "licenses-discovered": [
                "Apache-2.0"
            ],
            "copyrights": [
                "Copyright Amazon.com, Inc. or its affiliates"
            ],
            "file-count": 6,
            "sha256": "59535495ac631c16eabf13ec47a7bd2dea8f92c262ca5699fae1a2036461f36c",
            "source": "https://repo1.maven.org/maven2/software/amazon/awssdk/arns/2.24.1/arns-2.24.1-sources.jar",
            "status": "approved"
        }
    ]
}