{
    "id": "pypi/pypi/-/bleach/6.0.0",
    "license": "Apache-2.0 AND MIT",
    "authority": "https://gitlab.eclipse.org/eclipsefdn/emo-team/iplab/-/issues/15018",
    "source": "https://files.pythonhosted.org/packages/7e/e6/d5f220ca638f6a25557a611860482cb6e54b2d97f0332966b1b005742e1f/bleach-6.0.0.tar.gz",
    "status": "approved",
    "scans": [
        {
            "date": "May 29, 2024 at 4:31:54 p.m. GMT",
            "authority": "https://gitlab.eclipse.org/eclipsefdn/emo-team/iplab/-/issues/15018",
            "scancode-version": "31.2.1",
            "licenses-discovered": [
                "Apache-2.0",
                "MIT"
            ],
            "copyrights": [
                "Copyright (c) 2006-2013 James Graham and other contributors",
                "Copyright (c) 2014-2017, Mozilla Foundation",
                "copyright 2012-2015, James Socol 2015-2017, Mozilla Foundation"
            ],
            "file-count": 118,
            "sha256": "1a1a85c1595e07d8db14c5f09f09e6433502c51c595970edc090551f0db99414",
            "source": "https://files.pythonhosted.org/packages/7e/e6/d5f220ca638f6a25557a611860482cb6e54b2d97f0332966b1b005742e1f/bleach-6.0.0.tar.gz",
            "status": "approved"
        }
    ]
}