{
    "id": "npm/npmjs/-/eslint-plugin-vue/9.30.0",
    "license": "MIT",
    "authority": "https://gitlab.eclipse.org/eclipsefdn/emo-team/iplab/-/issues/16955",
    "source": "https://github.com/vuejs/eslint-plugin-vue/archive/refs/tags/v9.30.0.zip",
    "status": "approved",
    "scans": [
        {
            "date": "October 29, 2024, 12:26:56 p.m. GMT",
            "authority": "https://gitlab.eclipse.org/eclipsefdn/emo-team/iplab/-/issues/16955",
            "scancode-version": "31.2.1",
            "licenses-discovered": [
                "MIT"
            ],
            "copyrights": [
                "Copyright (c) 2014 Yannick Croissant",
                "Copyright (c) 2017 Toru Nagashima",
                "copyright 2016 Toru Nagashima",
                "copyright 2017 Toru Nagashima",
                "copyright 2017 Xie Ding E De Mao",
                "copyright 2018 Michal Sajnog",
                "copyright 2020 Flo Edelmann",
                "copyright 2021 Flo Edelmann",
                "copyright 2021 Yosuke Ota",
                "copyright 2022 Yosuke Ota",
                "copyright 2023 Perry Song",
                "copyright 2023- Wei Ran"
            ],
            "file-count": 1542,
            "sha256": "2bcc6c2ce339b6dee16f59cd3126d03d940412b9822bf493cb9a5c2234aadc30",
            "source": "https://github.com/vuejs/eslint-plugin-vue/archive/refs/tags/v9.30.0.zip",
            "status": "approved"
        }
    ]
}