{
    "id": "maven/mavencentral/org.apache.hadoop.thirdparty/hadoop-shaded-protobuf_3_21/1.2.0",
    "license": "BSD-3-Clause",
    "authority": "https://gitlab.eclipse.org/eclipsefdn/emo-team/iplab/-/issues/14121",
    "source": "https://search.maven.org/remotecontent?filepath=com/google/protobuf/protobuf-java/3.21.12/protobuf-java-3.21.12-sources.jar",
    "status": "approved",
    "scans": [
        {
            "date": "April 17, 2024 at 3:50:34 a.m. GMT",
            "authority": "https://gitlab.eclipse.org/eclipsefdn/emo-team/iplab/-/issues/14121",
            "scancode-version": "31.2.1",
            "licenses-discovered": [
                "BSD-3-Clause"
            ],
            "copyrights": [
                "Copyright 2008 Google Inc."
            ],
            "file-count": 206,
            "sha256": "58e3c7ed26ea646dfe332249971db684e7564100379251631950c69fabdcb34c",
            "source": "https://search.maven.org/remotecontent?filepath=com/google/protobuf/protobuf-java/3.21.12/protobuf-java-3.21.12-sources.jar",
            "status": "approved"
        }
    ]
}