{
    "id": "pypi/pypi/-/kiwisolver/1.4.5",
    "license": "BSD-3-Clause AND MIT AND LicenseRef-scancode-mit-old-style",
    "authority": "https://gitlab.eclipse.org/eclipsefdn/emo-team/iplab/-/issues/15043",
    "source": "https://files.pythonhosted.org/packages/b9/2d/226779e405724344fc678fcc025b812587617ea1a48b9442628b688e85ea/kiwisolver-1.4.5.tar.gz",
    "status": "approved",
    "scans": [
        {
            "date": "May 29, 2024 at 5:40:07 p.m. GMT",
            "authority": "https://gitlab.eclipse.org/eclipsefdn/emo-team/iplab/-/issues/15043",
            "scancode-version": "31.2.1",
            "licenses-discovered": [
                "BSD-3-Clause",
                "BSD-2-Clause AND BSD-3-Clause",
                "BSD-2-Clause",
                "MIT",
                "LicenseRef-scancode-mit-old-style"
            ],
            "copyrights": [
                "Copyright (c) 2001 by Andrei Alexandrescu",
                "Copyright (c) 2001. Addison-Wesley",
                "Copyright (c) 2013, Nucleic Development Team",
                "Copyright (c) 2013-2017, Nucleic Development Team",
                "Copyright (c) 2013-2019, Nucleic Development Team",
                "Copyright (c) 2013-2021, Nucleic Development Team",
                "Copyright (c) 2013-2022, Nucleic Development Team",
                "Copyright (c) 2014-2021, Nucleic Development Team",
                "Copyright (c) 2014-2022, Nucleic Development Team",
                "Copyright (c) 2019, Nucleic Development Team",
                "Copyright (c) 2019-2021 Martin Ankerl <martin.ankerl@gmail.com>",
                "Copyright (c) 2020, Nucleic Development Team",
                "Copyright (c) 2021, Nucleic Development Team",
                "Copyright (c) 2023, Nucleic Development Team",
                "Copyright 2000, 2004, 2005Adobe Systems Incorporated",
                "copyright 2018-2021, Nucleic team"
            ],
            "file-count": 85,
            "sha256": "e57e563a57fb22a142da34f38acc2fc1a5c864bc29ca1517a88abc963e60d6ec",
            "source": "https://files.pythonhosted.org/packages/b9/2d/226779e405724344fc678fcc025b812587617ea1a48b9442628b688e85ea/kiwisolver-1.4.5.tar.gz",
            "status": "restricted"
        }
    ]
}