{
    "id": "maven/mavencentral/org.apache.curator/curator-framework/5.7.1",
    "license": "Apache-2.0",
    "authority": "https://gitlab.eclipse.org/eclipsefdn/emo-team/iplab/-/issues/17339",
    "source": "https://repo1.maven.org/maven2/org/apache/curator/curator-framework/5.7.1/curator-framework-5.7.1-sources.jar",
    "status": "approved",
    "scans": [
        {
            "date": "November 19, 2024, 6:26:20 p.m. GMT",
            "authority": "https://gitlab.eclipse.org/eclipsefdn/emo-team/iplab/-/issues/17339",
            "scancode-version": "31.2.1",
            "licenses-discovered": [
                "Apache-2.0"
            ],
            "copyrights": [
            ],
            "file-count": 185,
            "sha256": "04d5d698f2833c5cfd46283c4cc562f4a05a5aa8a31f678a3ba427a02d86c89f",
            "source": "https://repo1.maven.org/maven2/org/apache/curator/curator-framework/5.7.1/curator-framework-5.7.1-sources.jar",
            "status": "approved"
        }
    ]
}