{
    "id": "project/dt.aas4j/-/aas4j-model-generator/0.0",
    "license": "Apache-2.0",
    "licenses-discovered": [
        "Apache-2.0 AND CC-BY-3.0 AND LicenseRef-scancode-free-unknown",
        "Apache-2.0"
    ],
    "copyrights": [
        "Copyright (c) 2021 Fraunhofer-Gesellschaft zur Foerderung"
    ],
    "file-count": 125,
    "scancode-version": "31.2.1",
    "authority": "https://gitlab.eclipse.org/eclipsefdn/emo-team/iplab/-/issues/4690",
    "source": "https://github.com/eclipse-aas4j/aas4j-model-generator/archive/refs/heads/main.zip",
    "status": "approved"
}
