{
    "id": "git/github/golang/net/927f97764cc3",
    "license": "Apache-2.0 AND BSD-3-Clause AND BSD-3-Clause AND (BSD-2-Clause AND BSD-3-Clause)",
    "licenses-discovered": [
        "Apache-2.0 AND BSD-3-Clause",
        "BSD-3-Clause",
        "BSD-2-Clause AND BSD-3-Clause"
    ],
    "copyrights": [
        "(c) cc.fr",
        "(c) if err p.JoinGroup en0, &net.UDPAddr IP group",
        "Copyright (c) Apple Inc.",
        "Copyright (c) The Go Authors"
    ],
    "file-count": 614,
    "scancode-version": "30.1.0",
    "authority": "https://gitlab.eclipse.org/eclipsefdn/emo-team/iplab/-/issues/3652",
    "source": "https://github.com/golang/net/archive/927f97764cc3.zip",
    "status": "approved"
}