{
    "id": "maven/mavencentral/org.calrissian.mango/mango-core/3.0.0",
    "license": "Apache-2.0",
    "authority": "https://gitlab.eclipse.org/eclipsefdn/emo-team/iplab/-/issues/6565",
    "source": "https://search.maven.org/remotecontent?filepath=org/calrissian/mango/mango-core/3.0.0/mango-core-3.0.0-sources.jar",
    "status": "approved",
    "scans": [
        {
            "date": "January 23, 2023 at 10:40:57 p.m. GMT",
            "authority": "https://gitlab.eclipse.org/eclipsefdn/emo-team/iplab/-/issues/6565",
            "scancode-version": "31.2.1",
            "licenses-discovered": [
                "Apache-2.0"
            ],
            "copyrights": [
                "Copyright (c) 2019 The Calrissian Authors"
            ],
            "file-count": 122,
            "sha256": "a9b173365629bb6d7b0d1ca2f4e657dbb349a545cf084d041a663c4b9f1d007f",
            "source": "https://search.maven.org/remotecontent?filepath=org/calrissian/mango/mango-core/3.0.0/mango-core-3.0.0-sources.jar",
            "status": "approved"
        }
    ]
}