{
    "id": "npm/npmjs/@swc/core-win32-x64-msvc/1.10.18",
    "license": "Apache-2.0 AND MIT",
    "authority": "https://gitlab.eclipse.org/eclipsefdn/emo-team/iplab/-/issues/19628",
    "source": "https://github.com/swc-project/swc/archive/refs/tags/v1.10.18.zip",
    "status": "approved",
    "scans": [
        {
            "date": "February 27, 2025 at 7:30:53 p.m. GMT",
            "authority": "https://gitlab.eclipse.org/eclipsefdn/emo-team/iplab/-/issues/19628",
            "scancode-version": "31.2.1",
            "licenses-discovered": [
                "Apache-2.0",
                "Apache-2.0 WITH LLVM-exception AND BSD-2-Clause AND BSD-3-Clause AND CC0-1.0 AND MIT",
                "MIT",
                "GPL-2.0-only",
                "BSD-3-Clause AND MIT",
                "Zlib",
                "BSD-3-Clause",
                "MPL-2.0",
                "Apache-2.0 AND BSD-3-Clause",
                "Unlicense",
                "0BSD",
                "ISC",
                "Apache-2.0 AND MIT",
                "JSON",
                "CC0-1.0 AND MIT",
                "0BSD AND Apache-2.0",
                "BSD-2-Clause AND BSD-3-Clause",
                "ISC AND MIT",
                "Apache-2.0 AND BSD-2-Clause",
                "CC0-1.0",
                "BSD-3-Clause AND FSFAP AND ISC AND MIT",
                "BSD-3-Clause AND GPL-2.0-only AND MIT",
                "BSD-3-Clause AND LGPL-2.0-or-later AND MIT",
                "AGPL-3.0-only",
                "LicenseRef-scancode-other-permissive AND W3C-20150513",
                "CC-BY-SA-3.0"
            ],
            "copyrights": [
                "(c) , http://www.w3.org/1999/xhtml",
                "(c) 1995-2013 Jean-loup Gailly and Mark Adler",
                "(c) 2005 Elsevier Inc.",
                "(c) 2007-2008 Steven Levithan <http://stevenlevithan.com/regex/xregexp/>",
                "(c) 2009-2013 Jeremy Ashkenas, DocumentCloud and Investigative Reporters & Editors Underscore",
                "(c) 2010-2011 Jeremy Ashkenas, DocumentCloud Inc.",
                "(c) 2010-2014 Google, Inc. http://angularjs.org",
                "(c) 2010-2018 Google, Inc. https://angular.io",
                "(c) 2011-2013 Jeremy Ashkenas, DocumentCloud and Investigative Reporters & Editors Backbone",
                "(c) 2014-2017 Vitaly Puzrin and Andrey Tupitsin",
                "(c) 2014-2020 Evan",
                "(c) 2017 Rob Wu <rob@robwu.nl> (https://robwu.nl)",
                "(c) 2020-present Anthony Mancini Dex",
                "(c) 2022 GitHub, Inc.",
                "(c) 2022 Stack Exchange Inc",
                "(c) Ja (c)",
                "(c) La (c)",
                "(c) Michael Mathews <micmath@gmail.com>",
                "(c) Sindre Sorhus",
                "(c) classDeclInContainingScopeStaticBlock.ts",
                "(c) classDeclInContainingScopeStaticField.ts",
                "(c) classExprInContainingScopeStaticBlock.ts",
                "(c) classExprInContainingScopeStaticField.ts",
                "(c) constEnumInContainingScopeStaticBlock.ts",
                "(c) constEnumInContainingScopeStaticField.ts",
                "(c) defaultImportInContainingScopeStaticBlock.ts",
                "(c) defaultImportInContainingScopeStaticField.ts",
                "(c) enumInContainingScopeStaticBlock.ts",
                "(c) enumInContainingScopeStaticField.ts",
                "(c) funcDeclInContainingScopeStaticBlock.ts",
                "(c) funcDeclInContainingScopeStaticField.ts",
                "(c) funcExprInContainingScopeStaticBlock.ts",
                "(c) funcExprInContainingScopeStaticField.ts",
                "(c) http://www.w3.org/1999/xhtml",
                "(c) inContainingClassExprStaticBlock.ts",
                "(c) inContainingClassExprStaticField.ts",
                "(c) inContainingFuncExprStaticField.ts",
                "(c) interfaceInContainingScopeStaticBlock.ts",
                "(c) interfaceInContainingScopeStaticField.ts",
                "(c) namedImportInContainingScopeStaticBlock.ts",
                "(c) namedImportInContainingScopeStaticField.ts",
                "(c) namedImportOfConstEnumInContainingScopeStaticBlock.ts",
                "(c) namedImportOfConstEnumInContainingScopeStaticField.ts",
                "(c) namedImportOfInterfaceInContainingScopeStaticBlock.ts",
                "(c) namedImportOfInterfaceInContainingScopeStaticField.ts",
                "(c) namedImportOfUninstantiatedNamespaceInContainingScopeStaticBlock.ts",
                "(c) namedImportOfUninstantiatedNamespaceInContainingScopeStaticField.ts",
                "(c) namespaceImportInContainingScopeStaticBlock.ts",
                "(c) namespaceImportInContainingScopeStaticField.ts",
                "(c) typeInContainingScopeStaticBlock.ts",
                "(c) typeInContainingScopeStaticField.ts",
                "(c) typeOnlyDefaultImportInContainingScopeStaticBlock.ts",
                "(c) typeOnlyDefaultImportInContainingScopeStaticField.ts",
                "(c) typeOnlyNamedImportInContainingScopeStaticBlock.ts",
                "(c) typeOnlyNamedImportInContainingScopeStaticField.ts",
                "(c) uninstantiatedNamespaceInContainingScopeStaticBlock.ts",
                "(c) uninstantiatedNamespaceInContainingScopeStaticField.ts",
                "(c) valueNamespaceInContainingScopeStaticBlock.ts",
                "(c) valueNamespaceInContainingScopeStaticField.ts",
                "(c) varInContainingScopeStaticBlock1.ts",
                "(c) varInContainingScopeStaticBlock2.ts",
                "(c) varInContainingScopeStaticBlock3.ts",
                "(c) varInContainingScopeStaticField1.ts",
                "(c) varInContainingScopeStaticField2.ts",
                "(c) varInContainingScopeStaticField3.ts",
                "(c), Ac (c)",
                "(c), None, None",
                "Copyright (c) 1990, 2004, 2005 Gerard D.C. Kuiken",
                "Copyright (c) 2005-2007 Sam Stephenson",
                "Copyright (c) 2006 Dean Edwards, GNU Lesser General",
                "Copyright (c) 2006-2012 Valerio Proietti (http://mad4milk.net/)",
                "Copyright (c) 2008, Adobe Systems Incorporated",
                "Copyright (c) 2010 - 2019 Brian Carlson",
                "Copyright (c) 2010 Cowboy Ben Alman",
                "Copyright (c) 2010, Ajax.org B.V.",
                "Copyright (c) 2010-2014 Brian Carlson (brian.m.carlson@gmail.com)",
                "Copyright (c) 2011 T. Jameson Little",
                "Copyright (c) 2011 TJ Holowaychuk <tj@vision-media.ca>",
                "Copyright (c) 2012 Ecma International",
                "Copyright (c) 2012 Federico Romero",
                "Copyright (c) 2012 Isaac Z. Schlueter",
                "Copyright (c) 2012 TJ Holowaychuk",
                "Copyright (c) 2012-2013 TJ Holowaychuk",
                "Copyright (c) 2012-2014 Federico Romero",
                "Copyright (c) 2012-2014 Isaac Z. Schlueter",
                "Copyright (c) 2012-2014 TJ Holowaychuk",
                "Copyright (c) 2013 Roman Shtylman <shtylman@gmail.com>",
                "Copyright (c) 2013, Baidu Inc.",
                "Copyright (c) 2013-present, Facebook, Inc.",
                "Copyright (c) 2014 David Bjorklund",
                "Copyright (c) 2014 Federico Romero",
                "Copyright (c) 2014 Jonathan Ong",
                "Copyright (c) 2014 Jonathan Ong <me@jongleberry.com>",
                "Copyright (c) 2014 Jonathan Ong me@jongleberry.com",
                "Copyright (c) 2014-2015 Douglas Christopher Wilson",
                "Copyright (c) 2014-2016 Douglas Christopher Wilson",
                "Copyright (c) 2014-2017 Douglas Christopher Wilson",
                "Copyright (c) 2014-2017, Jon Schlinkert",
                "Copyright (c) 2014-present, Facebook, Inc.",
                "Copyright (c) 2015 Alexander C. Mingoia",
                "Copyright (c) 2015 Andreas Lubbe",
                "Copyright (c) 2015 Douglas Christopher Wilson",
                "Copyright (c) 2015 Douglas Christopher Wilson <doug@somethingdoug.com>",
                "Copyright (c) 2015 Tiancheng Timothy Gu",
                "Copyright (c) 2015-2016 Douglas Christopher Wilson",
                "Copyright (c) 2015-2018 Douglas Christopher Wilson <doug@somethingdoug.com>",
                "Copyright (c) 2016 David Frank",
                "Copyright (c) 2016 Douglas Christopher Wilson",
                "Copyright (c) 2016 Douglas Christopher Wilson doug@somethingdoug.com",
                "Copyright (c) 2016 Jorik Tangelder",
                "Copyright (c) 2016 The V8 Project authors",
                "Copyright (c) 2016-2017 Douglas Christopher Wilson",
                "Copyright (c) 2018 Jed Watson",
                "Copyright (c) 2018 Terkel Gjervig Nielsen",
                "Copyright (c) 2018-2020 Xiamen Yaji Software Co., Ltd.",
                "Copyright (c) 2018-2021 the Deno authors",
                "Copyright (c) 2019 Denolibs authors",
                "Copyright (c) 2019 Jun Kato",
                "Copyright (c) 2019, J2 Innovations",
                "Copyright (c) 2020 Christian Norrman",
                "Copyright (c) 2020 Henry Zhuang",
                "Copyright (c) 2020 the Deno authors",
                "Copyright (c) 2020 the oak",
                "Copyright (c) 2020, J2 Innovations",
                "Copyright (c) 2020. MeLike2D",
                "Copyright (c) 2021 Yevhen Tiurin (yevhentiurin@gmail.com) https://github.com/ytiurin/hyphen",
                "Copyright (c) 2021 https://www.w3.org/' title World Wide",
                "Copyright (c) 2021, J2 Innovations",
                "Copyright (c) 2022 Michael Mclaughlin <M8ch88l@gmail.com>",
                "Copyright (c) Ben Drucker <bvdrucker@gmail.com>",
                "Copyright (c) Brightcove",
                "Copyright (c) Facebook, Inc. and its affiliates",
                "Copyright (c) Microsoft",
                "Copyright (c) Microsoft Corporation",
                "Copyright (c) Nicolas Gallagher and Jonathan Neal",
                "Copyright 2005, 2012 jQuery Foundation, Inc. and other contributors",
                "Copyright 2008 the V8 project authors",
                "Copyright 2009 The Go Authors",
                "Copyright 2009 the Sputnik authors",
                "Copyright 2009-2010 Emily Stark, Mike Hamburg, Dan Boneh",
                "Copyright 2009-2010, Bram Stein",
                "Copyright 2010, 2014 jQuery Foundation, Inc. and other contributors",
                "Copyright 2010-2022 Three.js",
                "Copyright 2011-2015 by Vitaly Puzrin",
                "Copyright 2011-2021 The Bootstrap Authors",
                "Copyright 2011-2021 Twitter, Inc.",
                "Copyright 2012 (c) Mihai Bazon <mihai.bazon@gmail.com>",
                "Copyright 2012 The Rust Project",
                "Copyright 2012 jQuery Foundation and other contributors",
                "Copyright 2012-2014 The Rust Project",
                "Copyright 2012-2015 The Rust Project",
                "Copyright 2013 Yahoo",
                "Copyright 2013 Yahoo! Inc.",
                "Copyright 2013 jQuery Foundation and other contributors",
                "Copyright 2013 vtt.js Contributors",
                "Copyright 2015, Yahoo! Inc.",
                "Copyright 2015-present, Alipay, Inc.",
                "Copyright 2016 The Rust Project",
                "Copyright 2016-2020 The NATS Authors",
                "Copyright 2016-2021 The NATS Authors",
                "Copyright 2017 Andrey Sitnik <andrey@sitnik.ru>",
                "Copyright 2017 Google LLC",
                "Copyright 2017 The Rust Project",
                "Copyright 2018 Google Inc.",
                "Copyright 2018 Google LLC",
                "Copyright 2018 Terkel Gjervig Nielsen",
                "Copyright 2018 The Go Authors",
                "Copyright 2018 The NATS Authors",
                "Copyright 2018 The Rust Project",
                "Copyright 2018 Vladimir Agafonkin",
                "Copyright 2018-2019 the Deno authors",
                "Copyright 2018-2020 The NATS Authors",
                "Copyright 2018-2020 the Deno authors",
                "Copyright 2018-2020 the oak authors",
                "Copyright 2018-2021 The NATS Authors",
                "Copyright 2018-2021 the Deno authors",
                "Copyright 2018-2021 the oak authors",
                "Copyright 2019 Google LLC",
                "Copyright 2020 Filippo Rossi",
                "Copyright 2020 Google LLC",
                "Copyright 2020 Mike Bostock",
                "Copyright 2020 The NATS Authors",
                "Copyright 2020 the oak authors",
                "Copyright 2020-2021 The NATS Authors",
                "Copyright 2020-present the denosaurs team",
                "Copyright 2021 Google LLC",
                "Copyright 2021 The NATS Authors",
                "Copyright 2024 SWC contributors",
                "Copyright Brightcove, Inc. <https://www.brightcove.com/>",
                "Copyright Google Inc.",
                "Copyright Google LLC",
                "Copyright JS Foundation and other contributors",
                "Copyright Jeremy Ashkenas, DocumentCloud and Investigative Reporters & Editors",
                "Copyright Jeremy Ashkenas, DocumentCloud and Investigative Reporters & Editors function Error",
                "Copyright Joyent, Inc. and other Node contributors",
                "Copyright Node.js contributors",
                "Copyright OpenJS Foundation and other contributors <https://openjsf.org/>",
                "Image Resizer (c) 2012 - Grant Galitz",
                "Rs (c) Only",
                "copyright (c) 2011 Michael",
                "copyright (c) 2011 Michael Mathews",
                "copyright (c) 2011 Rotorz Limited",
                "copyright (c) 2012 Scott Jehl, Paul Irish, Nicholas Zakas",
                "copyright (c) 2018 Denis Pushkarev",
                "copyright (c) 2020 Denis Pushkarev",
                "copyright (c) 2021 Denis Pushkarev",
                "copyright (c) by Marijn Haverbeke and others",
                "copyright 2011 (c) Michael Mathews <micmath@gmail.com>",
                "copyright Chen, Yi-Cyuan 2014-2017",
                "copyright Chen, Yi-Cyuan 2014-2018",
                "copyright Michael Mathews 2011",
                "copyright data-fill-with copyright' https://www.w3.org/Consortium/Legal/ipr-notice"
            ],
            "file-count": 69830,
            "sha256": "eabd23185d27c62f521b5066b00dbaff2d3d21a23efdec16a34667c5d0dbad87",
            "source": "https://github.com/swc-project/swc/archive/refs/tags/v1.10.18.zip",
            "status": "restricted"
        }
    ]
}