{
    "id": "p2/orbit/p2.eclipse.plugin/org.commonmark-task-list-items/0.24.0.v20241021-1700",
    "license": "BSD-2-Clause",
    "authority": "https://gitlab.eclipse.org/eclipsefdn/emo-team/iplab/-/issues/16829",
    "source": "https://repo1.maven.org/maven2/org/commonmark/commonmark-ext-task-list-items/0.24.0/commonmark-ext-task-list-items-0.24.0-sources.jar",
    "status": "approved",
    "scans": [
        {
            "date": "October 21, 2024, 3:53:19 p.m. GMT",
            "authority": "https://gitlab.eclipse.org/eclipsefdn/emo-team/iplab/-/issues/16829",
            "scancode-version": "31.2.1",
            "licenses-discovered": [
                "BSD-2-Clause"
            ],
            "copyrights": [
                "Copyright (c) 2015, Atlassian Pty Ltd"
            ],
            "file-count": 9,
            "sha256": "789c8cfae9ea0fa387e63503ae03c78942feb2b651dd24c86febfe29a9822628",
            "source": "https://repo1.maven.org/maven2/org/commonmark/commonmark-ext-task-list-items/0.24.0/commonmark-ext-task-list-items-0.24.0-sources.jar",
            "status": "approved"
        }
    ]
}