{
    "id": "maven/mavencentral/org.wildfly.security/wildfly-elytron-mechanism-digest/2.2.1.Final",
    "license": "Apache-2.0",
    "authority": "https://gitlab.eclipse.org/eclipsefdn/emo-team/iplab/-/issues/9489",
    "source": "https://repo.maven.apache.org/maven2/org/wildfly/security/wildfly-elytron-mechanism-digest/2.2.1.Final/wildfly-elytron-mechanism-digest-2.2.1.Final-sources.jar",
    "status": "approved",
    "scans": [
        {
            "date": "July 17, 2023 at 11:32:38 a.m. GMT",
            "authority": "https://gitlab.eclipse.org/eclipsefdn/emo-team/iplab/-/issues/9489",
            "scancode-version": "31.2.1",
            "licenses-discovered": [
                "Apache-2.0"
            ],
            "copyrights": [
                "Copyright 2014 Red Hat, Inc., and individual contributors",
                "Copyright 2016 Red Hat, Inc., and individual contributors",
                "Copyright 2017 Red Hat, Inc., and individual contributors",
                "Copyright 2018 Red Hat, Inc., and individual contributors"
            ],
            "file-count": 7,
            "sha256": "585bcd52730de861ca906408d3237b59e8740be6a00a1c25061f1a8fb7f320c8",
            "source": "https://repo.maven.apache.org/maven2/org/wildfly/security/wildfly-elytron-mechanism-digest/2.2.1.Final/wildfly-elytron-mechanism-digest-2.2.1.Final-sources.jar",
            "status": "approved"
        }
    ]
}