{
    "id": "npm/npmjs/@typescript-eslint/parser/7.3.1",
    "license": "BSD-2-Clause AND (BSD-2-Clause AND ISC AND MIT) AND MIT",
    "authority": "https://gitlab.eclipse.org/eclipsefdn/emo-team/iplab/-/issues/13938",
    "source": "https://github.com/typescript-eslint/typescript-eslint/archive/refs/tags/v7.3.1.zip",
    "status": "approved",
    "scans": [
        {
            "date": "March 20, 2024 at 1:32:39 p.m. GMT",
            "authority": "https://gitlab.eclipse.org/eclipsefdn/emo-team/iplab/-/issues/13938",
            "scancode-version": "31.2.1",
            "licenses-discovered": [
                "BSD-2-Clause",
                "BSD-2-Clause AND ISC AND MIT",
                "MIT"
            ],
            "copyrights": [
                "Copyright (c) 2016 unional",
                "Copyright (c) 2019 typescript-eslint and other contributors",
                "Copyright (c) 2021 typescript-eslint and other contributors",
                "Copyright (c) 2023 typescript-eslint and other contributors",
                "Copyright JS Foundation and other contributors, https://js.foundation",
                "Copyright Joyent, Inc. and other Node contributors"
            ],
            "file-count": 6979,
            "sha256": "fab87d7b049ab05d1d6f8a760cd294135af2becfe9d12613b7fda3754b42da73",
            "source": "https://github.com/typescript-eslint/typescript-eslint/archive/refs/tags/v7.3.1.zip",
            "status": "approved"
        }
    ]
}