{
    "id": "project/ecd.theia/-/vscode-proposed-api/1.72.2",
    "license": "MIT",
    "authority": "https://gitlab.eclipse.org/eclipsefdn/emo-team/iplab/-/issues/8443",
    "source": "https://gitlab.eclipse.org/eclipsefdn/emo-team/iplab/uploads/0bc5e447e90c911763df775a2d7b9a2f/src-attachment.tar.gz",
    "status": "approved",
    "scans": [
        {
            "date": "May 10, 2023 at 3:46:44 p.m. GMT",
            "authority": "https://gitlab.eclipse.org/eclipsefdn/emo-team/iplab/-/issues/8443",
            "scancode-version": "31.2.1",
            "licenses-discovered": [
                "MIT"
            ],
            "copyrights": [
                "Copyright (c) Microsoft Corporation"
            ],
            "file-count": 2,
            "sha256": "03dc8f877bf97d421fa98d29db1959384b9687ee1c71171edc0eb6621462cd47",
            "source": "https://gitlab.eclipse.org/eclipsefdn/emo-team/iplab/uploads/0bc5e447e90c911763df775a2d7b9a2f/src-attachment.tar.gz",
            "status": "restricted"
        }
    ]
}
