{
    "id": "maven/mavencentral/org.geotools.xsd/gt-xsd-gml2/32.0",
    "license": "LGPL-2.1-only",
    "authority": "https://gitlab.eclipse.org/eclipsefdn/emo-team/iplab/-/issues/16208",
    "source": "https://repo.osgeo.org/repository/geotools-releases/org/geotools/xsd/gt-xsd-gml2/32.0/gt-xsd-gml2-32.0-sources.jar",
    "status": "approved",
    "scans": [
        {
            "date": "September 19, 2024, 2:33:03 p.m. GMT",
            "authority": "https://gitlab.eclipse.org/eclipsefdn/emo-team/iplab/-/issues/16208",
            "scancode-version": "31.2.1",
            "licenses-discovered": [
                "LGPL-2.1-only"
            ],
            "copyrights": [
                "(c) 2002-2008, Open Source Geospatial Foundation",
                "(c) 2002-2010, Open Source Geospatial Foundation",
                "(c) 2002-2012, Open Source Geospatial Foundation",
                "(c) 2002-2015, Open Source Geospatial Foundation",
                "(c) 2002-2016, Open Source Geospatial Foundation",
                "(c) 2015 - 2016, Open Source Geospatial Foundation",
                "(c) 2015, Open Source Geospatial Foundation",
                "(c) 2015-2016, Open Source Geospatial Foundation",
                "(c) 2016, Open Source Geospatial Foundation",
                "Copyright (c) 2001,2002 OGC",
                "Copyright (c) 2002 OGC"
            ],
            "file-count": 67,
            "sha256": "beb391544dc713e6cc52e512883db366b1c905001523eaf97765074f2ce216b2",
            "source": "https://repo.osgeo.org/repository/geotools-releases/org/geotools/xsd/gt-xsd-gml2/32.0/gt-xsd-gml2-32.0-sources.jar",
            "status": "approved"
        }
    ]
}