{
    "id": "maven/mavencentral/org.jetbrains.dokka/kotlin-analysis-intellij/1.6.10",
    "license": "Apache-2.0",
    "licenses-discovered": [
    ],
    "copyrights": [
    ],
    "file-count": 1,
    "scancode-version": "31.2.1",
    "authority": "https://gitlab.eclipse.org/eclipsefdn/emo-team/iplab/-/issues/4540",
    "source": "https://search.maven.org/remotecontent?filepath=org/jetbrains/dokka/kotlin-analysis-intellij/1.6.10/kotlin-analysis-intellij-1.6.10-sources.jar",
    "status": "approved"
}
