{
    "id": "project/dt.slm/eclipse-slm/awx-jwt-authenticator/31a66456e4fdcdaa3f3463c3423d5f80ea4b4a3d",
    "license": "Apache-2.0",
    "authority": "https://gitlab.eclipse.org/eclipsefdn/emo-team/iplab/-/issues/8526",
    "source": "https://github.com/eclipse-slm/awx-jwt-authenticator/archive/31a66456e4fdcdaa3f3463c3423d5f80ea4b4a3d.zip",
    "status": "approved",
    "scans": [
        {
            "date": "May 23, 2023 at 9:52:08 p.m. GMT",
            "authority": "https://gitlab.eclipse.org/eclipsefdn/emo-team/iplab/-/issues/8526",
            "scancode-version": "31.2.1",
            "licenses-discovered": [
                "Apache-2.0"
            ],
            "copyrights": [
                "Copyright 2023 Matthias Schneider, Benjamin Goetz"
            ],
            "file-count": 56,
            "sha256": "7b65f840204c2f5242eb6ff8ae8ce957215086e91999b79e4308b3b0b390bedb",
            "source": "https://github.com/eclipse-slm/awx-jwt-authenticator/archive/31a66456e4fdcdaa3f3463c3423d5f80ea4b4a3d.zip",
            "status": "restricted"
        }
    ]
}
