{
    "id": "crate/cratesio/-/displaydoc/0.2.5",
    "license": "Apache-2.0 AND MIT AND Apache-2.0 AND MIT",
    "authority": "https://gitlab.eclipse.org/eclipsefdn/emo-team/iplab/-/issues/17430",
    "source": "https://crates.io/api/v1/crates/displaydoc/0.2.5/download",
    "status": "approved",
    "scans": [
        {
            "date": "November 26, 2024 at 7:40:33 a.m. GMT",
            "authority": "https://gitlab.eclipse.org/eclipsefdn/emo-team/iplab/-/issues/17430",
            "scancode-version": "31.2.1",
            "licenses-discovered": [
                "Apache-2.0 AND MIT",
                "Apache-2.0",
                "MIT"
            ],
            "copyrights": [
            ],
            "file-count": 37,
            "sha256": "97369cbbc041bc366949bc74d34658d6cda5621039731c6310521892a3a20ae0",
            "source": "https://crates.io/api/v1/crates/displaydoc/0.2.5/download",
            "status": "approved"
        }
    ]
}