{
    "id": "go/golang/github.com%2Flinuxkit/virtsock/v0.0.0-20201010232012-f8cee7dfc7a3",
    "license": "Apache-2.0 AND MIT",
    "authority": "https://gitlab.eclipse.org/eclipsefdn/emo-team/iplab/-/issues/12251",
    "source": "https://proxy.golang.org/github.com%2Flinuxkit/virtsock/@v/v0.0.0-20201010232012-f8cee7dfc7a3.zip",
    "status": "approved",
    "scans": [
        {
            "date": "December 21, 2023 at 6:20:15 a.m. GMT",
            "authority": "https://gitlab.eclipse.org/eclipsefdn/emo-team/iplab/-/issues/12251",
            "scancode-version": "31.2.1",
            "licenses-discovered": [
                "Apache-2.0",
                "MIT"
            ],
            "copyrights": [
                "Copyright (c) 2015 Microsoft",
                "Copyright 2016-2017 The"
            ],
            "file-count": 58,
            "sha256": "e299ce8b7d58f3cc0e375936a80527ea115e2eedbf8a9251d90de298db2b5dd3",
            "source": "https://proxy.golang.org/github.com%2Flinuxkit/virtsock/@v/v0.0.0-20201010232012-f8cee7dfc7a3.zip",
            "status": "approved"
        }
    ]
}