{
    "id": "maven/mavencentral/org.apache.jena/jena-fuseki-core/4.2.0",
    "license": "Apache-2.0",
    "licenses-discovered": [
        "Apache-2.0",
        "Apache-2.0 AND LicenseRef-scancode-unknown-license-reference",
        "Apache-2.0 AND EPL-1.0"
    ],
    "file-count": 136,
    "scancode-version": "30.1.0",
    "authority": "https://gitlab.eclipse.org/eclipsefdn/emo-team/iplab/-/issues/2382",
    "source": "https://search.maven.org/remotecontent?filepath=org/apache/jena/jena-fuseki-core/4.2.0/jena-fuseki-core-4.2.0-sources.jar",
    "status": "approved"
}
