{
    "id": "npm/npmjs/-/rc-textarea/1.7.0",
    "license": "MIT",
    "authority": "https://gitlab.eclipse.org/eclipsefdn/emo-team/iplab/-/issues/14860",
    "source": "https://registry.yarnpkg.com/rc-textarea/-/rc-textarea-1.7.0.tgz",
    "status": "approved",
    "scans": [
        {
            "date": "May 21, 2024 at 12:43:58 p.m. GMT",
            "authority": "https://gitlab.eclipse.org/eclipsefdn/emo-team/iplab/-/issues/14860",
            "scancode-version": "31.2.1",
            "licenses-discovered": [
                "MIT"
            ],
            "copyrights": [
                "Copyright (c) 2019-present afc163"
            ],
            "file-count": 25,
            "sha256": "708c4f7c15da33dff3a4bbda07eac1341562d0cd48497cdcecc1cceff32dee13",
            "source": "https://registry.yarnpkg.com/rc-textarea/-/rc-textarea-1.7.0.tgz",
            "status": "approved"
        }
    ]
}