{
    "id": "npm/npmjs/-/typescript-template-language-service-decorator/2.3.2",
    "license": "MIT",
    "authority": "https://gitlab.eclipse.org/eclipsefdn/emo-team/iplab/-/issues/7740",
    "source": "https://registry.yarnpkg.com/typescript-template-language-service-decorator/-/typescript-template-language-service-decorator-2.3.2.tgz",
    "status": "approved",
    "scans": [
        {
            "date": "April 3, 2023 at 8:40:17 p.m. GMT",
            "authority": "https://gitlab.eclipse.org/eclipsefdn/emo-team/iplab/-/issues/7740",
            "scancode-version": "31.2.1",
            "licenses-discovered": [
                "MIT"
            ],
            "copyrights": [
                "Copyright (c) Microsoft Corporation",
                "Copyright (c) base project 2017 Quramy",
                "copyright Microsoft 2017"
            ],
            "file-count": 29,
            "sha256": "94f7566ef633b29b897766eedc4dcb40dc8429b39452878b410663f3d8d9b4aa",
            "source": "https://registry.yarnpkg.com/typescript-template-language-service-decorator/-/typescript-template-language-service-decorator-2.3.2.tgz",
            "status": "approved"
        }
    ]
}