{
    "id": "npm/npmjs/@mui/x-data-grid-pro/5.17.2",
    "license": "MIT",
    "licenses-discovered": [
        "MIT"
    ],
    "copyrights": [
        "Copyright (c) Material-UI SAS"
    ],
    "file-count": 391,
    "scancode-version": "30.1.0",
    "authority": "https://gitlab.eclipse.org/eclipsefdn/emo-team/iplab/-/issues/3491",
    "source": "https://registry.npmjs.org/@mui/x-data-grid-pro/-/x-data-grid-pro-5.17.2.tgz",
    "status": "approved"
}