{
    "id": "maven/mavencentral/software.amazon.awssdk/netty-nio-client/2.24.1",
    "license": "Apache-2.0",
    "authority": "https://gitlab.eclipse.org/eclipsefdn/emo-team/iplab/-/issues/13260",
    "source": "https://repo1.maven.org/maven2/software/amazon/awssdk/netty-nio-client/2.24.1/netty-nio-client-2.24.1-sources.jar",
    "status": "approved",
    "scans": [
        {
            "date": "February 14, 2024 at 2:29:39 p.m. GMT",
            "authority": "https://gitlab.eclipse.org/eclipsefdn/emo-team/iplab/-/issues/13260",
            "scancode-version": "31.2.1",
            "licenses-discovered": [
                "Apache-2.0"
            ],
            "copyrights": [
                "Copyright Amazon.com, Inc. or its affiliates"
            ],
            "file-count": 98,
            "sha256": "9a8136196e9c39e40e080afdda7c060794915969408e2fcc275c6a98ce874399",
            "source": "https://repo1.maven.org/maven2/software/amazon/awssdk/netty-nio-client/2.24.1/netty-nio-client-2.24.1-sources.jar",
            "status": "approved"
        }
    ]
}