{
    "id": "p2/orbit/p2.eclipse.plugin/org.junit.jupiter.params/5.9.1.v20221103-2317",
    "license": "EPL-2.0",
    "authority": "https://gitlab.eclipse.org/eclipsefdn/emo-team/iplab/-/issues/10228",
    "source": "https://repo.maven.apache.org/maven2/org/junit/jupiter/junit-jupiter-params/5.9.0-M1/junit-jupiter-params-5.9.0-M1-sources.jar",
    "status": "approved",
    "scans": [
        {
            "date": "August 25, 2023 at 9:08:30 a.m. GMT",
            "authority": "https://gitlab.eclipse.org/eclipsefdn/emo-team/iplab/-/issues/10228",
            "scancode-version": "31.2.1",
            "licenses-discovered": [
                "EPL-2.0"
            ],
            "copyrights": [
                "Copyright 2015-2021 the original author or authors",
                "Copyright 2015-2022 the original author or authors"
            ],
            "file-count": 55,
            "sha256": "b59474e01657eaef84da987db0938dad63ea894c9ee9edba4af16b79526c381a",
            "source": "https://repo.maven.apache.org/maven2/org/junit/jupiter/junit-jupiter-params/5.9.0-M1/junit-jupiter-params-5.9.0-M1-sources.jar",
            "status": "approved"
        }
    ]
}