{
    "id": "npm/npmjs/@eslint-community/regexpp/4.8.0",
    "license": "MIT AND BSD-3-Clause",
    "authority": "https://gitlab.eclipse.org/eclipsefdn/emo-team/iplab/-/issues/10362",
    "source": "https://github.com/eslint-community/regexpp/archive/refs/tags/v4.8.0.zip",
    "status": "approved",
    "scans": [
        {
            "date": "September 8, 2023 at 1:30:26 p.m. GMT",
            "authority": "https://gitlab.eclipse.org/eclipsefdn/emo-team/iplab/-/issues/10362",
            "scancode-version": "31.2.1",
            "licenses-discovered": [
                "MIT",
                "BSD-3-Clause"
            ],
            "copyrights": [
                "Copyright (c) 2012-2013 Ecma International",
                "Copyright (c) 2018 Toru Nagashima"
            ],
            "file-count": 108,
            "sha256": "c902596dcbcf07612261d295f55efe1211b2067daf4809b18f5eaf891a0c6c07",
            "source": "https://github.com/eslint-community/regexpp/archive/refs/tags/v4.8.0.zip",
            "status": "approved"
        }
    ]
}