{
    "id": "maven/mavencentral/org.apache.xbean/xbean-asm9-shaded/4.20",
    "license": "Apache-2.0 AND BSD-3-Clause",
    "authority": "https://gitlab.eclipse.org/eclipsefdn/emo-team/iplab/-/issues/6488",
    "source": "https://search.maven.org/remotecontent?filepath=org/apache/xbean/xbean-asm9-shaded/4.20/xbean-asm9-shaded-4.20-sources.jar",
    "status": "approved",
    "scans": [
        {
            "date": "January 24, 2023 at 1:32:59 a.m. GMT",
            "authority": "https://gitlab.eclipse.org/eclipsefdn/emo-team/iplab/-/issues/6488",
            "scancode-version": "31.2.1",
            "licenses-discovered": [
                "Apache-2.0",
                "BSD-3-Clause",
                "Apache-2.0 AND BSD-3-Clause"
            ],
            "copyrights": [
                "Copyright (c) 2000-2011 INRIA, France Telecom"
            ],
            "file-count": 120,
            "sha256": "cf4e978a9e68b333f0fc81236441f40b424e6e7fc3342d51146d35d904dc3e95",
            "source": "https://search.maven.org/remotecontent?filepath=org/apache/xbean/xbean-asm9-shaded/4.20/xbean-asm9-shaded-4.20-sources.jar",
            "status": "approved"
        }
    ]
}