{
    "id": "p2/orbit/p2.eclipse-plugin/org.osgi.org.osgi.core/6.0.0",
    "license": "Apache-2.0",
    "licenses-discovered": [
        "Apache-2.0"
    ],
    "file-count": 154,
    "scancode-version": "30.1.0",
    "authority": "https://gitlab.eclipse.org/eclipsefdn/emo-team/iplab/-/issues/2279",
    "source": "https://search.maven.org/remotecontent?filepath=org/osgi/osgi.core/6.0.0/osgi.core-6.0.0-sources.jar",
    "status": "approved"
}