{
    "id": "pypi/pypi/-/pip/24.1.1",
    "license": "MIT AND ISC AND Apache-2.0 AND (BSD-2-Clause OR Apache-2.0) AND BSD-2-Clause AND BSD-3-Clause AND Python-2.0 AND MPL-2.0",
    "authority": "https://gitlab.eclipse.org/eclipsefdn/emo-team/iplab/-/issues/15503",
    "source": "https://files.pythonhosted.org/packages/c0/d0/9641dc7b05877874c6418f8034ddefc809495e65caa14d38c7551cd114bb/pip-24.1.1.tar.gz",
    "status": "approved",
    "scans": [
        {
            "date": "July 2, 2024 at 7:29:22 a.m. GMT",
            "authority": "https://gitlab.eclipse.org/eclipsefdn/emo-team/iplab/-/issues/15503",
            "scancode-version": "31.2.1",
            "licenses-discovered": [
                "MIT",
                "BSD-3-Clause",
                "Apache-2.0 AND BSD-2-Clause AND BSD-3-Clause AND MIT",
                "BSD-3-Clause AND Python-2.0 AND Python-2.0.1",
                "Apache-2.0",
                "MPL-2.0",
                "Python-2.0",
                "Apache-2.0 AND BSD-2-Clause AND BSD-3-Clause",
                "Apache-2.0 AND BSD-3-Clause",
                "BSD-2-Clause",
                "ISC"
            ],
            "copyrights": [
                "(c) 1999 Entrust.net Limited",
                "(c) 1999 Entrust.net Limited Label Entrust.net Premium 2048 Secure Server CA Serial",
                "(c) 2006 Entrust, Inc.",
                "(c) 2006 Entrust, Inc. Label Entrust Root Certification",
                "(c) 2006-2023 by Georg Brandl, Matthaus Chajdas and contributors",
                "(c) 2009 Entrust, Inc. - for",
                "(c) 2012 Entrust, Inc. - for",
                "(c) 2015 Entrust, Inc. - for",
                "Copyright (c) 1991 - 1995, Stichting Mathematisch Centrum Amsterdam, The Netherlands",
                "Copyright (c) 1995-2001 Corporation for National Research Initiatives",
                "Copyright (c) 2001, 2002, 2003, 2004, 2005, 2006, 2007, 2008, 2009, 2010 Python Software Foundation",
                "Copyright (c) 2001, 2002, 2003, 2004, 2005, 2006, 2007, 2008, 2009, 2010, 2011, 2012, 2013, 2014, 2015, 2016, 2017, 2018, 2019, 2020, 2021, 2022, 2023 Python Software Foundation",
                "Copyright (c) 2006-2022 by the",
                "Copyright (c) 2008-2011 INADA Naoki <songofacandy@gmail.com>",
                "Copyright (c) 2008-2020 Andrey Petrov and contributors",
                "Copyright (c) 2008-2020 The pip",
                "Copyright (c) 2008-present The pip",
                "Copyright (c) 2010-2020 Benjamin Peterson",
                "Copyright (c) 2010-202x The platformdirs",
                "Copyright (c) 2012 The Python Software Foundation",
                "Copyright (c) 2012-2023 Python Software Foundation",
                "Copyright (c) 2012-2023 The Python Software Foundation",
                "Copyright (c) 2012-2023 Vinay Sajip",
                "Copyright (c) 2013-2017 Vinay Sajip",
                "Copyright (c) 2013-2023 Vinay Sajip",
                "Copyright (c) 2013-2024, Kim Davies and contributors",
                "Copyright (c) 2015-2016 Will Bond <will@wbond.net>",
                "Copyright (c) 2017 Thomas Kluyver",
                "Copyright (c) 2018, Tzu-ping Chung <uranusjr@gmail.com>",
                "Copyright (c) 2020 Will McGugan",
                "Copyright (c) 2021 Taneli Hukkinen",
                "Copyright (c) 2022 Seth Michael Larson",
                "Copyright (c) Donald Stufft and individual contributors",
                "Copyright (c) Simple Launcher",
                "Copyright (c) Sindre Sorhus <sindresorhus@gmail.com> (sindresorhus.com)",
                "Copyright 2006-2023 by the Pygments team",
                "Copyright 2012-2021 Eric Larson",
                "Copyright 2013-2014 Ray",
                "Copyright 2015 Eric Larson",
                "Copyright 2015-2021 Nir Cohen",
                "Copyright 2016 Etienne Bersac",
                "Copyright 2016 Joshua Harlow",
                "Copyright 2016 Julien Danjou",
                "Copyright 2016-2018 Julien Danjou",
                "Copyright 2016-2021 Julien Danjou",
                "Copyright 2017 Elisey Zanko",
                "Copyright 2021 Taneli Hukkinen",
                "Copyright Jason R. Coombs",
                "Copyright Kenneth Reitz",
                "copyright (c) 2012 by Kenneth Reitz",
                "copyright (c) 2017 by Kenneth Reitz",
                "copyright 2014 s"
            ],
            "file-count": 586,
            "sha256": "5aa64f65e1952733ee0a9a9b1f52496ebdb3f3077cc46f80a16d983b58d1180a",
            "source": "https://files.pythonhosted.org/packages/c0/d0/9641dc7b05877874c6418f8034ddefc809495e65caa14d38c7551cd114bb/pip-24.1.1.tar.gz",
            "status": "restricted"
        }
    ]
}