{
    "id": "maven/mavencentral/io.fabric8/openshift-model-machineconfig/6.8.0",
    "license": "Apache-2.0",
    "authority": "https://gitlab.eclipse.org/eclipsefdn/emo-team/iplab/-/issues/9727",
    "source": "https://repo.maven.apache.org/maven2/io/fabric8/openshift-model-machineconfig/6.8.0/openshift-model-machineconfig-6.8.0-sources.jar",
    "status": "approved",
    "scans": [
        {
            "date": "July 26, 2023 at 3:56:11 a.m. GMT",
            "authority": "https://gitlab.eclipse.org/eclipsefdn/emo-team/iplab/-/issues/9727",
            "scancode-version": "31.2.1",
            "licenses-discovered": [
                "Apache-2.0"
            ],
            "copyrights": [
                "Copyright (c) 2015 Red Hat, Inc."
            ],
            "file-count": 83,
            "sha256": "0dfda41be06c087afc21e1ce2c31101ac041cd80489287f828171f1e2f997140",
            "source": "https://repo.maven.apache.org/maven2/io/fabric8/openshift-model-machineconfig/6.8.0/openshift-model-machineconfig-6.8.0-sources.jar",
            "status": "approved"
        }
    ]
}