{
    "id": "maven/mavencentral/org.apache.maven.archetype/archetype-common/3.3.1",
    "license": "Apache-2.0 AND (Apache-2.0 AND LicenseRef-scancode-jdom)",
    "authority": "https://gitlab.eclipse.org/eclipsefdn/emo-team/iplab/-/issues/19831",
    "source": "https://repo1.maven.org/maven2/org/apache/maven/archetype/archetype-common/3.3.1/archetype-common-3.3.1-sources.jar",
    "status": "restricted",
    "scans": [
        {
            "date": "March 2, 2025 at 10:26:46 a.m. GMT",
            "authority": "https://gitlab.eclipse.org/eclipsefdn/emo-team/iplab/-/issues/19831",
            "scancode-version": "31.2.1",
            "licenses-discovered": [
                "Apache-2.0",
                "Apache-2.0 AND LicenseRef-scancode-jdom"
            ],
            "copyrights": [
                "Copyright (c) 2000-2004 Jason Hunter & Brett McLaughlin"
            ],
            "file-count": 74,
            "sha256": "e29d552336d652cf51192c64af195f7749a3c47de9799d7769a9cdc0bd7f0259",
            "source": "https://repo1.maven.org/maven2/org/apache/maven/archetype/archetype-common/3.3.1/archetype-common-3.3.1-sources.jar",
            "status": "restricted"
        }
    ]
}