{
    "id": "maven/mavencentral/org.apache.jena/jena-shex/4.7.0",
    "license": "Apache-2.0",
    "authority": "https://gitlab.eclipse.org/eclipsefdn/emo-team/iplab/-/issues/8152",
    "source": "https://search.maven.org/remotecontent?filepath=org/apache/jena/jena-shex/4.7.0/jena-shex-4.7.0-sources.jar",
    "status": "approved",
    "scans": [
        {
            "date": "May 3, 2023 at 8:38:55 a.m. GMT",
            "authority": "https://gitlab.eclipse.org/eclipsefdn/emo-team/iplab/-/issues/8152",
            "scancode-version": "31.2.1",
            "licenses-discovered": [
                "Apache-2.0"
            ],
            "copyrights": [
            ],
            "file-count": 93,
            "sha256": "c956a16be89accedc3f933e20745159499a7df45e2effe192b57601c0372c587",
            "source": "https://search.maven.org/remotecontent?filepath=org/apache/jena/jena-shex/4.7.0/jena-shex-4.7.0-sources.jar",
            "status": "approved"
        }
    ]
}