{
    "id": "maven/mavencentral/io.opentelemetry.proto/opentelemetry-proto/1.3.1-alpha",
    "license": "Apache-2.0",
    "authority": "https://gitlab.eclipse.org/eclipsefdn/emo-team/iplab/-/issues/14688",
    "source": "https://repo1.maven.org/maven2/io/opentelemetry/proto/opentelemetry-proto/1.3.1-alpha/opentelemetry-proto-1.3.1-alpha-sources.jar",
    "status": "approved",
    "scans": [
        {
            "date": "May 13, 2024 at 7:43:42 a.m. GMT",
            "authority": "https://gitlab.eclipse.org/eclipsefdn/emo-team/iplab/-/issues/14688",
            "scancode-version": "31.2.1",
            "licenses-discovered": [
            ],
            "copyrights": [
            ],
            "file-count": 111,
            "sha256": "0e1bc7f752a62dc74cbc0635d69a299c27501c34bfd2a4764dfa4686f925593c",
            "source": "https://repo1.maven.org/maven2/io/opentelemetry/proto/opentelemetry-proto/1.3.1-alpha/opentelemetry-proto-1.3.1-alpha-sources.jar",
            "status": "restricted"
        }
    ]
}