{
    "id": "crate/cratesio/-/terminfo/0.7.5",
    "license": "WTFPL AND X11-distribute-modifications-variant",
    "authority": "https://gitlab.eclipse.org/eclipsefdn/emo-team/iplab/-/issues/6663",
    "source": "https://crates.io/api/v1/crates/terminfo/0.7.5/download",
    "status": "approved",
    "scans": [
        {
            "date": "January 25, 2023 at 7:59:24 p.m. GMT",
            "authority": "https://gitlab.eclipse.org/eclipsefdn/emo-team/iplab/-/issues/6663",
            "scancode-version": "31.2.1",
            "licenses-discovered": [
                "WTFPL",
                "X11-distribute-modifications-variant"
            ],
            "copyrights": [
                "Copyright 1996-2011,2012 by Thomas E. Dickey"
            ],
            "file-count": 26,
            "sha256": "da31aef70da0f6352dbcb462683eb4dd2bfad01cf3fc96cf204547b9a839a585",
            "source": "https://crates.io/api/v1/crates/terminfo/0.7.5/download",
            "status": "restricted"
        }
    ]
}
