{
    "id": "npm/npmjs/-/path2d/0.1.2",
    "license": "MIT",
    "authority": "https://gitlab.eclipse.org/eclipsefdn/emo-team/iplab/-/issues/14279",
    "source": "https://github.com/nilzona/path2d-polyfill/archive/refs/tags/path2d@0.1.2.zip",
    "status": "approved",
    "scans": [
        {
            "date": "April 12, 2024 at 8:26:59 a.m. GMT",
            "authority": "https://gitlab.eclipse.org/eclipsefdn/emo-team/iplab/-/issues/14279",
            "scancode-version": "31.2.1",
            "licenses-discovered": [
                "MIT"
            ],
            "copyrights": [
                "Copyright (c) 2018 Anders Nilsson"
            ],
            "file-count": 55,
            "sha256": "8005c0779b38048df1e892605aa5dfcaf9132e3d5f8ec5054b18a588acec89b8",
            "source": "https://github.com/nilzona/path2d-polyfill/archive/refs/tags/path2d@0.1.2.zip",
            "status": "approved"
        }
    ]
}