{
    "id": "maven/mavencentral/org.wildfly.openssl/wildfly-openssl/1.1.3.Final",
    "license": "Apache-2.0 AND LGPL-2.1-or-later AND (Apache-2.0 AND CC0-1.0)",
    "authority": "https://gitlab.eclipse.org/eclipsefdn/emo-team/iplab/-/issues/19690",
    "source": "https://repo1.maven.org/maven2/org/wildfly/openssl/wildfly-openssl/1.1.3.Final/wildfly-openssl-1.1.3.Final-sources.jar",
    "status": "approved",
    "scans": [
        {
            "date": "March 1, 2025 at 12:07:35 a.m. GMT",
            "authority": "https://gitlab.eclipse.org/eclipsefdn/emo-team/iplab/-/issues/19690",
            "scancode-version": "31.2.1",
            "licenses-discovered": [
                "Apache-2.0",
                "LGPL-2.1-or-later",
                "Apache-2.0 AND CC0-1.0"
            ],
            "copyrights": [
                "Copyright 2012, Red Hat, Inc., and individual contributors",
                "Copyright 2016 Red Hat, Inc., and individual contributors"
            ],
            "file-count": 39,
            "sha256": "012d7627e6caab5d53bcb984200a662f4828b71e790a119e4eb59914b6610aea",
            "source": "https://repo1.maven.org/maven2/org/wildfly/openssl/wildfly-openssl/1.1.3.Final/wildfly-openssl-1.1.3.Final-sources.jar",
            "status": "approved"
        }
    ]
}