{
    "id": "npm/npmjs/-/tar/4.4.13",
    "license": "ISC AND MIT AND (BSD-2-Clause AND BSD-3-Clause) AND (ISC AND MIT) AND (CC-BY-SA-4.0 AND ISC) AND CC-BY-SA-4.0 AND Artistic-2.0 AND (Artistic-2.0 AND BSD-2-Clause AND ISC AND JSON AND LicenseRef-scancode-proprietary-license AND MIT) AND LicenseRef-scancode-unknown-spdx AND GPL-1.0-or-later AND (CC-BY-SA-4.0 AND MIT) AND BSD-2-Clause AND LicenseRef-scancode-mit-synopsys AND LicenseRef-scancode-markus-kuhn-license AND LicenseRef-scancode-proprietary-license AND BSD-3-Clause AND Apache-2.0 AND WTFPL AND (Apache-2.0 AND MIT) AND (CC0-1.0 AND MIT) AND (BSD-3-Clause AND MIT) AND (BSD-2-Clause AND JSON AND MIT) AND (MIT AND WTFPL) AND AFL-2.1 AND (BSD-3-Clause AND ISC) AND LicenseRef-scancode-mit-addition AND Unlicense AND (BSD-3-Clause AND MPL-2.0) AND (BSD-2-Clause AND BSD-3-Clause AND MIT) AND BSD-2-Clause-Views AND (Apache-2.0 AND BSD-2-Clause AND MIT) AND (Apache-2.0 AND BSD-2-Clause AND GPL-3.0-only) AND (JSON AND Unlicense) AND (AFL-3.0 AND AGPL-1.0-only AND AGPL-3.0-only AND APSL-1.0 AND APSL-1.1 AND Apache-1.1 AND Apache-2.0 AND Autoconf-exception-2.0 AND Autoconf-exception-3.0 AND BSD-2-Clause AND BSD-3-Clause AND BSD-4-Clause AND BSD-4-Clause-UC AND Bison-exception-2.2 AND CC-BY-SA-2.0 AND CC-BY-SA-4.0 AND CC0-1.0 AND CDDL-1.0 AND CDDL-1.1 AND CECILL-2.0 AND CECILL-2.1 AND CPOL-1.02 AND EFL-2.0 AND EPL-1.0 AND Font-exception-2.0 AND Frameworx-1.0 AND GCC-exception-2.0 AND GCC-exception-3.1 AND GFDL-1.1-only AND GPL-1.0-only AND (GPL-2.0-only WITH Classpath-exception-2.0) AND GPL-3.0-only AND HPND AND HaskellReport AND IBM-pibs AND Interbase-1.0 AND LGPL-2.0-only AND LGPL-2.1-only AND LGPL-3.0-only AND LicenseRef-scancode-d-fsl-1.0-en AND MS-PL AND MS-RL AND NGPL AND Spencer-86 AND TMate AND Zimbra-1.3 AND Zimbra-1.4 AND eCos-exception-2.0) AND (AFL-3.0 AND AGPL-1.0-only AND AGPL-3.0-only AND APSL-1.0 AND APSL-1.1 AND Apache-1.1 AND Apache-2.0 AND BSD-2-Clause AND BSD-2-Clause-Views AND BSD-3-Clause AND BSD-4-Clause AND BSD-4-Clause-UC AND CC-BY-SA-2.0 AND CC-BY-SA-4.0 AND CC0-1.0 AND CDDL-1.0 AND CDDL-1.1 AND CECILL-2.0 AND CECILL-2.1 AND CPOL-1.02 AND EFL-2.0 AND EPL-1.0 AND Frameworx-1.0 AND GFDL-1.1-only AND GPL-1.0-only AND (GPL-2.0-only WITH Classpath-exception-2.0) AND GPL-3.0-only AND HPND AND HaskellReport AND IBM-pibs AND Interbase-1.0 AND LGPL-2.0-only AND LGPL-2.1-only AND LGPL-3.0-only AND LZMA-exception AND LicenseRef-scancode-d-fsl-1.0-en AND MS-PL AND MS-RL AND NGPL AND Spencer-86 AND TMate AND Zimbra-1.3 AND Zimbra-1.4) AND (BSD-3-Clause AND CC-BY-3.0 AND LGPL-2.1-or-later) AND (Classpath-exception-2.0 AND FLTK-exception AND LZMA-exception) AND CC-BY-3.0 AND CC0-1.0",
    "authority": "https://gitlab.eclipse.org/eclipsefdn/emo-team/iplab/-/issues/5888",
    "source": "https://github.com/npm/node-tar/archive/v4.4.13.zip",
    "status": "restricted",
    "scans": [
        {
            "date": "December 17, 2022 at 12:41:46 a.m. GMT",
            "authority": "https://gitlab.eclipse.org/eclipsefdn/emo-team/iplab/-/issues/5888",
            "scancode-version": "31.2.1",
            "licenses-discovered": [
                "ISC",
                "MIT",
                "BSD-2-Clause AND BSD-3-Clause",
                "ISC AND MIT",
                "CC-BY-SA-4.0 AND ISC",
                "CC-BY-SA-4.0",
                "Artistic-2.0",
                "Artistic-2.0 AND BSD-2-Clause AND ISC AND JSON AND LicenseRef-scancode-proprietary-license AND MIT",
                "LicenseRef-scancode-unknown-spdx",
                "GPL-1.0-or-later",
                "CC-BY-SA-4.0 AND MIT",
                "BSD-2-Clause",
                "LicenseRef-scancode-mit-synopsys",
                "LicenseRef-scancode-markus-kuhn-license",
                "LicenseRef-scancode-proprietary-license",
                "BSD-3-Clause",
                "Apache-2.0",
                "WTFPL",
                "Apache-2.0 AND MIT",
                "CC0-1.0 AND MIT",
                "BSD-3-Clause AND MIT",
                "BSD-2-Clause AND JSON AND MIT",
                "MIT AND WTFPL",
                "AFL-2.1",
                "BSD-3-Clause AND ISC",
                "LicenseRef-scancode-mit-addition",
                "Unlicense",
                "BSD-3-Clause AND MPL-2.0",
                "BSD-2-Clause AND BSD-3-Clause AND MIT",
                "BSD-2-Clause-Views",
                "Apache-2.0 AND BSD-2-Clause AND MIT",
                "Apache-2.0 AND BSD-2-Clause AND GPL-3.0-only",
                "JSON AND Unlicense",
                "AFL-3.0 AND AGPL-1.0-only AND AGPL-3.0-only AND APSL-1.0 AND APSL-1.1 AND Apache-1.1 AND Apache-2.0 AND Autoconf-exception-2.0 AND Autoconf-exception-3.0 AND BSD-2-Clause AND BSD-3-Clause AND BSD-4-Clause AND BSD-4-Clause-UC AND Bison-exception-2.2 AND CC-BY-SA-2.0 AND CC-BY-SA-4.0 AND CC0-1.0 AND CDDL-1.0 AND CDDL-1.1 AND CECILL-2.0 AND CECILL-2.1 AND CPOL-1.02 AND EFL-2.0 AND EPL-1.0 AND Font-exception-2.0 AND Frameworx-1.0 AND GCC-exception-2.0 AND GCC-exception-3.1 AND GFDL-1.1-only AND GPL-1.0-only AND (GPL-2.0-only WITH Classpath-exception-2.0) AND GPL-3.0-only AND HPND AND HaskellReport AND IBM-pibs AND Interbase-1.0 AND LGPL-2.0-only AND LGPL-2.1-only AND LGPL-3.0-only AND LicenseRef-scancode-d-fsl-1.0-en AND MS-PL AND MS-RL AND NGPL AND Spencer-86 AND TMate AND Zimbra-1.3 AND Zimbra-1.4 AND eCos-exception-2.0",
                "AFL-3.0 AND AGPL-1.0-only AND AGPL-3.0-only AND APSL-1.0 AND APSL-1.1 AND Apache-1.1 AND Apache-2.0 AND BSD-2-Clause AND BSD-2-Clause-Views AND BSD-3-Clause AND BSD-4-Clause AND BSD-4-Clause-UC AND CC-BY-SA-2.0 AND CC-BY-SA-4.0 AND CC0-1.0 AND CDDL-1.0 AND CDDL-1.1 AND CECILL-2.0 AND CECILL-2.1 AND CPOL-1.02 AND EFL-2.0 AND EPL-1.0 AND Frameworx-1.0 AND GFDL-1.1-only AND GPL-1.0-only AND (GPL-2.0-only WITH Classpath-exception-2.0) AND GPL-3.0-only AND HPND AND HaskellReport AND IBM-pibs AND Interbase-1.0 AND LGPL-2.0-only AND LGPL-2.1-only AND LGPL-3.0-only AND LZMA-exception AND LicenseRef-scancode-d-fsl-1.0-en AND MS-PL AND MS-RL AND NGPL AND Spencer-86 AND TMate AND Zimbra-1.3 AND Zimbra-1.4",
                "BSD-3-Clause AND CC-BY-3.0 AND LGPL-2.1-or-later",
                "Classpath-exception-2.0 AND FLTK-exception AND LZMA-exception",
                "CC-BY-3.0",
                "CC0-1.0"
            ],
            "copyrights": [
                "(c) 2009-2012 Jeremy Ashkenas, DocumentCloud Inc. Underscore",
                "(c) 2013 Mikola Lysenko",
                "(c) Microsoft Corporation",
                "(c) Sindre Sorhus",
                "(c) Sindre Sorhus (http://sindresorhus.com)",
                "(c) Sindre Sorhus (https://sindresorhus.com)",
                "(c) Vsevolod Strukchinsky (floatdrop@gmail.com)",
                "(c) Vsevolod Strukchinsky (http://github.com/floatdrop)",
                "(c) console.log c.shortid https://github.com/npm/npm/commit/$",
                "Copyright ( (c ) )? (year)s Google Inc",
                "Copyright (c) 2000-2006, The Perl Foundation",
                "Copyright (c) 2003-2005 Tom Wu",
                "Copyright (c) 2004 Sam Hocevar <sam@hocevar.net>",
                "Copyright (c) 2005 Tom Wu",
                "Copyright (c) 2005-2009 Tom Wu",
                "Copyright (c) 2006, 2008 Junio C Hamano",
                "Copyright (c) 2007 Kris Zyp SitePen (www.sitepen.com)",
                "Copyright (c) 2007, 2013, 2014 Michele Bini",
                "Copyright (c) 2007, 2013, 2014 Michele Bini <michele.bini@gmail.com>",
                "Copyright (c) 2009 Google Inc.",
                "Copyright (c) 2009 Raymond Hettinger",
                "Copyright (c) 2009-2012 Jeremy Ashkenas, DocumentCloud",
                "Copyright (c) 2009-2013, Jeff Mott",
                "Copyright (c) 2010, Linden Research, Inc.",
                "Copyright (c) 2010-2016 Robert Kieffer and other contributors",
                "Copyright (c) 2011 Debuggable Limited <felix@debuggable.com>",
                "Copyright (c) 2011 Dominic Tarr",
                "Copyright (c) 2011 Google Inc.",
                "Copyright (c) 2011 Joyent, Inc. and the persons identified as document authors",
                "Copyright (c) 2011 Mark Cavage",
                "Copyright (c) 2011 Tim Kosch",
                "Copyright (c) 2011 Tim Koschutzki (tim@debuggable.com) Felix Geisendorfer (felix@debuggable.com)",
                "Copyright (c) 2011, 2012, 2014 Ron Garret",
                "Copyright (c) 2011, Yahoo Inc.",
                "Copyright (c) 2011-2012 Tim Caswell",
                "Copyright (c) 2011-2014, Walmart and other contributors",
                "Copyright (c) 2011-2015 Paul Vorbach (http://paul.vorba.ch/) and contributors (https://github.com/pvorb/node-clone/graphs/contributors)",
                "Copyright (c) 2011-2015 Paul Vorbach <paul@vorba.ch>",
                "Copyright (c) 2012 Felix Geisendorfer (felix@debuggable.com) and contributors",
                "Copyright (c) 2012 Google Inc.",
                "Copyright (c) 2012 Mark Cavage",
                "Copyright (c) 2012 Michael Hart (michael.hart.au@gmail.com)",
                "Copyright (c) 2012 Nathan Rajlich <nathan@tootallnate.net>",
                "Copyright (c) 2012 Ron Garret",
                "Copyright (c) 2012 The Chromium Authors",
                "Copyright (c) 2012 Tim Caswell",
                "Copyright (c) 2012 by Jun Woong",
                "Copyright (c) 2012, Joshua Bell",
                "Copyright (c) 2012, Joyent, Inc.",
                "Copyright (c) 2012, Mark Cavage",
                "Copyright (c) 2012-2014 Raynos",
                "Copyright (c) 2012-2014, Eran Hammer <eran@hammer.io>",
                "Copyright (c) 2012-2014, Eran Hammer and other contributors",
                "Copyright (c) 2012-2014, Walmart and other contributors",
                "Copyright (c) 2012-2016 Domenic Denicola <d@domenic.me>",
                "Copyright (c) 2013 Forbes Lindesay",
                "Copyright (c) 2013 Gary Court, Jens Taylor",
                "Copyright (c) 2013 Google Inc.",
                "Copyright (c) 2013 Joyent Inc.",
                "Copyright (c) 2013 Julian Gruber <julian@juliangruber.com>",
                "Copyright (c) 2013 Max Ogden",
                "Copyright (c) 2013 Meryn Stol",
                "Copyright (c) 2013 Mikola Lysenko",
                "Copyright (c) 2013 Rod Vagg rvagg (https://twitter.com/rvagg)",
                "Copyright (c) 2013 Ted Unangst <tedu@openbsd.org>",
                "Copyright (c) 2013 Tim Oxley",
                "Copyright (c) 2013 Trent Mick",
                "Copyright (c) 2013, Deoxxa Development",
                "Copyright (c) 2013, Dominic Tarr",
                "Copyright (c) 2013-2015 Viacheslav Lotsmanov",
                "Copyright (c) 2013-2015, Viacheslav Lotsmanov",
                "Copyright (c) 2013-2016 Domenic Denicola <d@domenic.me>",
                "Copyright (c) 2013-2017 Petka Antonov",
                "Copyright (c) 2014 Google Inc.",
                "Copyright (c) 2014 Hugh Kennedy",
                "Copyright (c) 2014 Jeremie Miller",
                "Copyright (c) 2014 Jonathan Ong",
                "Copyright (c) 2014 Jonathan Ong <me@jongleberry.com>",
                "Copyright (c) 2014 Jonathan Ong me@jongleberry.com",
                "Copyright (c) 2014 Mathias Buus",
                "Copyright (c) 2014 Mega Limited",
                "Copyright (c) 2014 Nadav Ivgi",
                "Copyright (c) 2014 Nathan LaFreniere and other contributors",
                "Copyright (c) 2014 Nathan Rajlich <nathan@tootallnate.net>",
                "Copyright (c) 2014 Stefan Thomas",
                "Copyright (c) 2014 TJ Holowaychuk <tj@vision-media.ca>",
                "Copyright (c) 2014, Eran Hammer and other contributors",
                "Copyright (c) 2014, Rebecca Turner <me@re-becca.org>",
                "Copyright (c) 2014-2015, Forrest L Norvell",
                "Copyright (c) 2014-2016 Domenic Denicola <d@domenic.me>",
                "Copyright (c) 2015 Calvin Metcalf",
                "Copyright (c) 2015 Douglas Christopher Wilson",
                "Copyright (c) 2015 Douglas Christopher Wilson <doug@somethingdoug.com>",
                "Copyright (c) 2015 Elijah Insua",
                "Copyright (c) 2015 Evgeny Poberezkin",
                "Copyright (c) 2015 IndigoUnited",
                "Copyright (c) 2015 Julian Gruber <julian@juliangruber.com>",
                "Copyright (c) 2015 Kyle E. Mitchell and other contributors",
                "Copyright (c) 2015 Mathias Buus",
                "Copyright (c) 2015 Rod Vagg",
                "Copyright (c) 2015 Rod Vagg rvagg (https://twitter.com/rvagg)",
                "Copyright (c) 2015 Sam Mikes",
                "Copyright (c) 2015 TJ Holowaychuk <tj@vision-media.ca>",
                "Copyright (c) 2015, Ahmad Nassri <ahmad@ahmadnassri.com>",
                "Copyright (c) 2015, Contributors",
                "Copyright (c) 2015, Forrest L Norvell",
                "Copyright (c) 2015, Rebecca Turner",
                "Copyright (c) 2015, Rebecca Turner <me@re-becca.org>",
                "Copyright (c) 2015, Salesforce.com, Inc.",
                "Copyright (c) 2015, npm, Inc",
                "Copyright (c) 2016 Alex Indigo",
                "Copyright (c) 2016 Calvin Metcalf",
                "Copyright (c) 2016 Espen Hovlandsdal",
                "Copyright (c) 2016 Mathias Buus",
                "Copyright (c) 2016 Rod Vagg",
                "Copyright (c) 2016, Contributors",
                "Copyright (c) 2017, Rebecca Turner <me@re-becca.org>",
                "Copyright (c) Feross Aboukhadijeh",
                "Copyright (c) Feross Aboukhadijeh (http://feross.org)",
                "Copyright (c) Isaac Z. Schlueter",
                "Copyright (c) Isaac Z. Schlueter 'Author",
                "Copyright (c) Isaac Z. Schlueter and Contributors",
                "Copyright (c) Isaac Z. Schlueter, Ben Noordhuis, and Contributors",
                "Copyright (c) Mathias Pettersson and Brian Hammond",
                "Copyright (c) Mathias Pettersson and Brian Hammond Gubblebum Blocky",
                "Copyright (c) Meryn Stol 'Author",
                "Copyright (c) Robert Kowalski",
                "Copyright (c) Robert Kowalski and Isaac Z. Schlueter 'Authors",
                "Copyright (c) Sindre Sorhus <sindresorhus@gmail.com> (sindresorhus.com)",
                "Copyright (c) Tjarda Koster, https://jelloween.deviantart.com",
                "Copyright (c) Vsevolod Strukchinsky <floatdrop@gmail.com>",
                "Copyright (c) npm, Inc",
                "Copyright (c) npm, Inc.",
                "Copyright (c) npm, Inc. and Contributors",
                "Copyright 1997 Niels Provos <provos@physnet.uni-hamburg.de>",
                "Copyright 2009-2014",
                "Copyright 2009-2014 Contributors",
                "Copyright 2009-2015 Jeremy Ashkenas, DocumentCloud and Investigative Reporters & Editors",
                "Copyright 2009-2016 Jeremy Ashkenas, DocumentCloud and Investigative Reporters & Editors",
                "Copyright 2010 James Halliday (mail@substack.net)",
                "Copyright 2010 LearnBoost <dev@learnboost.com>",
                "Copyright 2010-2012 Mikeal Rogers",
                "Copyright 2011 Mark Cavage <mcavage@gmail.com>",
                "Copyright 2012 Joyent, Inc.",
                "Copyright 2012-2015 The Dojo Foundation <http://dojofoundation.org/>",
                "Copyright 2012-2016 The Dojo Foundation <http://dojofoundation.org/>",
                "Copyright 2013 Google Inc.",
                "Copyright 2013 James Halliday (mail@substack.net)",
                "Copyright 2013 Mathias Buus",
                "Copyright 2013 Michael Hart (michael.hart.au@gmail.com)",
                "Copyright 2013 The Chromium Authors",
                "Copyright 2013 Thorsten Lorenz",
                "Copyright 2014 Google Inc.",
                "Copyright 2015 Joyent, Inc.",
                "Copyright 2016 Domenic Denicola <d@domenic.me>",
                "Copyright 2016 Joyent, Inc.",
                "Copyright 2016 Trent Mick",
                "Copyright 2016, Joyent Inc",
                "Copyright 2016, Joyent, Inc.",
                "Copyright Isaac Z . Schlueter",
                "Copyright Isaac Z. Schlueter",
                "Copyright Jeremy Ashkenas, DocumentCloud and Investigative Reporters & Editors",
                "Copyright Joyent, Inc.",
                "Copyright Joyent, Inc. and other Node contributors",
                "Copyright Mathias Bynens <https://mathiasbynens.be/>",
                "Copyright Node.js contributors",
                "Copyright jQuery Foundation and other contributors <https://jquery.org/>",
                "copyright (c) 2013 Jake Luer, jake@alogicalparadox.com",
                "copyright 2009-2015 Jeremy Ashkenas, DocumentCloud and Investigative Reporters & Editors <http://underscorejs.org/>",
                "copyright 2009-2016 Jeremy Ashkenas, DocumentCloud and Investigative Reporters & Editors <http://underscorejs.org/>",
                "copyright Jeremy Ashkenas, DocumentCloud and Investigative Reporters & Editors <http://underscorejs.org/>",
                "copyright ahmadnassri.com (https://www.ahmadnassri.com/)"
            ],
            "file-count": 7434,
            "sha256": "b8125713acde2725b162813ee0cb844260205611da535cb37475e1524fec096b",
            "source": "https://github.com/npm/node-tar/archive/v4.4.13.zip",
            "status": "restricted"
        }
    ]
}