{
    "id": "maven/mavencentral/io.cucumber/html-formatter/21.3.0",
    "license": "Apache-2.0 AND MIT",
    "authority": "https://gitlab.eclipse.org/eclipsefdn/emo-team/iplab/-/issues/14275",
    "source": "https://repo1.maven.org/maven2/io/cucumber/html-formatter/21.3.0/html-formatter-21.3.0-sources.jar",
    "status": "approved",
    "scans": [
        {
            "date": "April 12, 2024 at 7:05:00 a.m. GMT",
            "authority": "https://gitlab.eclipse.org/eclipsefdn/emo-team/iplab/-/issues/14275",
            "scancode-version": "31.2.1",
            "licenses-discovered": [
                "Apache-2.0 AND MIT"
            ],
            "copyrights": [
                "Copyright (c) 2014-2015, Jon Schlinkert",
                "Copyright (c) Facebook, Inc. and its affiliates",
                "Copyright (c) Microsoft"
            ],
            "file-count": 8,
            "sha256": "b0821d3ff79d8b36a4301683b966653f24413a99a776a6b99254f8415584bf5a",
            "source": "https://repo1.maven.org/maven2/io/cucumber/html-formatter/21.3.0/html-formatter-21.3.0-sources.jar",
            "status": "approved"
        }
    ]
}