{
    "id": "maven/mavencentral/p2.eclipse.plugin/org.w3c.dom.smil/1.0.1.v200903091627",
    "license": "Apache-2.0 AND EPL-1.0 AND LicenseRef-scancode-unknown-license-reference",
    "licenses-discovered": [
        "Apache-2.0 AND EPL-1.0 AND LicenseRef-scancode-unknown-license-reference"
    ],
    "file-count": 2,
    "scancode-version": "30.1.0",
    "authority": "https://gitlab.eclipse.org/eclipsefdn/emo-team/iplab/-/issues/2464",
    "source": "https://search.maven.org/remotecontent?filepath=org/eclipse/birt/runtime/org.w3c.dom.smil/1.0.1.v200903091627/org.w3c.dom.smil-1.0.1.v200903091627-sources.jar",
    "status": "restricted"
}