{
    "id": "maven/mavencentral/software.amazon.awssdk/aws-query-protocol/2.20.77",
    "license": "Apache-2.0",
    "authority": "https://gitlab.eclipse.org/eclipsefdn/emo-team/iplab/-/issues/8629",
    "source": "https://repo.maven.apache.org/maven2/software/amazon/awssdk/aws-query-protocol/2.20.0/aws-query-protocol-2.20.0-sources.jar",
    "status": "approved",
    "scans": [
        {
            "date": "June 2, 2023 at 5:50:26 p.m. GMT",
            "authority": "https://gitlab.eclipse.org/eclipsefdn/emo-team/iplab/-/issues/8629",
            "scancode-version": "31.2.1",
            "licenses-discovered": [
                "Apache-2.0"
            ],
            "copyrights": [
                "Copyright Amazon.com, Inc. or its affiliates"
            ],
            "file-count": 27,
            "sha256": "996b0eca14930c467823c6adabb7d7de03bf7f474c3bc325744cd93fdbd6d8a8",
            "source": "https://repo.maven.apache.org/maven2/software/amazon/awssdk/aws-query-protocol/2.20.0/aws-query-protocol-2.20.0-sources.jar",
            "status": "approved"
        }
    ]
}