{
    "id": "project/dt/aaspe/aaspe/0.0",
    "license": "Apache-2.0 AND MIT AND BSD-3-Clause AND BSD-4-Clause AND CPOL-1.02 AND CC-BY-ND-3.0-DE AND OFL-1.1 AND MPL-2.0 AND (GPL-2.0-or-later AND (OpenSSL AND SSLeay) AND (BSD-3-Clause AND GPL-2.0-or-later) AND (LGPL-2.1-or-later AND BSD-3-Clause)",
    "licenses-discovered": [
        "Apache-2.0 AND BSD-3-Clause AND CC-BY-3.0 AND CPOL-1.02 AND LicenseRef-scancode-free-unknown AND MIT",
        "Apache-2.0 AND LicenseRef-scancode-unknown AND MIT",
        "MIT",
        "Apache-2.0",
        "LicenseRef-scancode-proprietary-license",
        "Apache-2.0 AND MIT",
        "Apache-2.0 AND CC-BY-3.0 AND CPOL-1.02 AND LicenseRef-scancode-free-unknown AND MIT",
        "Apache-2.0 AND CC-BY-3.0 AND LicenseRef-scancode-free-unknown AND MIT AND MPL-2.0",
        "CPOL-1.02",
        "Apache-2.0 AND BSD-3-Clause AND CC-BY-3.0 AND LicenseRef-scancode-free-unknown AND MIT",
        "CC-BY-ND-4.0",
        "CC-BY-4.0 AND CC0-1.0 AND MIT AND OFL-1.1",
        "OFL-1.1",
        "MIT AND OFL-1.1",
        "CC0-1.0",
        "CC-BY-4.0 AND MIT AND OFL-1.1",
        "BSD-3-Clause",
        "LicenseRef-scancode-x11-lucent AND MPL-2.0",
        "MPL-2.0"
    ],
    "copyrights": [
        "(c) 2019 Michael Hoffmeister, Festo AG & Co.",
        "(c) 2019 by Michael Hoffmeister, Festo AG Co.",
        "(c) Bosch Rexroth AG, 2017 Weitergabe sowie Vervielfaltigung",
        "(c) Parametric Technol",
        "(c) Temp. (F) Summary",
        "(c) by Michael Hoffmeister",
        "Copyright (c) 1991, 2000, 2001 by Lucent Technologies",
        "Copyright (c) 2005-2019 The OPC Foundation, Inc.",
        "Copyright (c) 2007 James Newton-King",
        "Copyright (c) 2008,2009 OPC Foundation, Inc.",
        "Copyright (c) 2013-2018 Raffael Herrmann",
        "Copyright (c) 2013-2019 Kevin Thompson",
        "Copyright (c) 2014 ExcelDataReader",
        "Copyright (c) 2014 Waybury",
        "Copyright (c) 2014-2019 dvsekhvalnov",
        "Copyright (c) 2014-2019 dvsekhvalnov par par hich af31506 dbch af31505 loch f31506 Permission",
        "Copyright (c) 2016 ClosedXML",
        "Copyright (c) 2016-2019 Christian Kratky",
        "Copyright (c) 2017 Meshack Musundi",
        "Copyright (c) 2017 andersnm",
        "Copyright (c) 2017 andersnm par par hich af31506 dbch af31505 loch f31506 Permission",
        "Copyright (c) 2018",
        "Copyright (c) 2018 - 2019 Festo AG & Co. KG <https://www.festo.com/net/de_de/Forms/web/contact_international>",
        "Copyright (c) 2018-2019 Festo AG & Co. KG",
        "Copyright (c) 2018-2019 Festo AG & Co. KG <https://www.festo.com/net/de_de/Forms/web/contact_international>",
        "Copyright (c) 2018-2020 Festo AG & Co. KG <https://www.festo.com/net/de_de/Forms/web/contact_international>",
        "Copyright (c) 2018-2021 Festo AG & Co. KG",
        "Copyright (c) 2018-2021 Festo AG & Co. KG + <https://www.festo.com/net/de_de/Forms/web/contact_international>",
        "Copyright (c) 2018-2021 Festo AG & Co. KG <https://www.festo.com/net/de_de/Forms/web/contact_international>",
        "Copyright (c) 2018-2021 Festo SE Co.",
        "Copyright (c) 2018-2021 PHOENIX CONTACT GmbH & Co. KG <opensource@phoenixcontact.com>",
        "Copyright (c) 2018-2022",
        "Copyright (c) 2018-2022 Festo AG & Co. KG <https://www.festo.com/net/de_de/Forms/web/contact_international>",
        "Copyright (c) 2019",
        "Copyright (c) 2019 Festo AG & Co. KG <https://www.festo.com/net/de_de/Forms/web/contact_international>",
        "Copyright (c) 2019 Fraunhofer IOSB-INA Lemgo",
        "Copyright (c) 2019 Phoenix Contact GmbH & Co.",
        "Copyright (c) 2019-2020 Fraunhofer IOSB-INA Lemgo",
        "Copyright (c) 2019-2020 PHOENIX CONTACT GmbH & Co. KG <opensource@phoenixcontact.com>",
        "Copyright (c) 2019-2021 PHOENIX CONTACT GmbH & Co. KG",
        "Copyright (c) 2019-2021 PHOENIX CONTACT GmbH & Co. KG <opensource@phoenixcontact.com>",
        "Copyright (c) 2020",
        "Copyright (c) 2020 Fraunhofer IOSB-INA Lemgo",
        "Copyright (c) 2020 Marko Ristin <https://github.com/mristin/opinionated-commit-message>",
        "Copyright (c) 2020 Phoenix Contact GmbH & Co.",
        "Copyright (c) 2020 SICK AG <info@sick.de>",
        "Copyright (c) 2020 Schneider Electric Automation GmbH <https://www.se.com/ww/en/work/support>",
        "Copyright (c) 2020 Schneider Electric Automation GmbH <marco.mendes@se.com>",
        "Copyright (c) 2020 ZHAW Zurcher Hochschule fur Angewandte Wissenschaften <http://www.zhaw.ch>",
        "Copyright (c) 2020 see https://github.com/IdentityServer/IdentityServer4",
        "Copyright (c) 2021",
        "Copyright (c) 2021 Fraunhofer IOSB-INA Lemgo",
        "Copyright (c) 2021 KEB Automation KG",
        "Copyright (c) 2021 KEB Automation KG <https://www.keb.de/>",
        "Copyright (c) 2021 Lenze SE",
        "Copyright (c) 2021 Lenze SE <https://www.lenze.com/en-de/>",
        "Copyright (c) 2021 Phoenix Contact GmbH & Co.",
        "Copyright (c) 2021 Robert Bosch Manufacturing Solutions GmbH",
        "Copyright (c) 2021-2022 Otto-von-Guericke-Universitat Magdeburg, Lehrstuhl Integrierte Automation harish.pakala@ovgu.de",
        "Copyright (c) 2021-2022 Robert Bosch Manufacturing Solutions GmbH",
        "Copyright (c) Bosch Rexroth AG, 2017",
        "Copyright (c) Font Awesome",
        "Copyright (c) Font Awesome Font Awesome",
        "Copyright (c) Microsoft Corporation",
        "Copyright (c) Microsoft Corporation par par hich af31506 dbch af31505 loch f31506",
        "Copyright (c) SICK 2020",
        "Copyright (c) The CefSharp Authors",
        "Copyright +(r) 2017 Meshack Musundi",
        "Copyright +(r) The CefSharp Authors",
        "Copyright 2006-2018 WebPKI.org (http://webpki.org)",
        "Copyright 2006-2019 WebPKI.org (http://webpki.org)",
        "Copyright 2010 the V8 project authors",
        "Copyright 2011-2019 The Bootstrap Authors",
        "Copyright 2011-2019 Twitter, Inc.",
        "Copyright 2017 AutomationML e.V.",
        "Copyright 2017, Festo AG Co.",
        "Copyright a9 loch f31506 The CefSharp Authors",
        "Portions copyright (c) by OPC Foundation, Inc.",
        "copyright (c) by OPC Foundation, Inc.",
        "copyright 2014 Waybury. https://useiconic.com/open"
    ],
    "file-count": 1481,
    "scancode-version": "31.2.1",
    "authority": "https://gitlab.eclipse.org/eclipsefdn/emo-team/iplab/-/issues/3160",
    "source": "https://github.com/eclipse-aaspe/aaspe/archive/refs/heads/master.zip",
    "status": "approved"
}
