{
    "id": "maven/mavencentral/org.apache.activemq/artemis-plugin/2.38.0",
    "license": "Apache-2.0",
    "authority": "https://gitlab.eclipse.org/eclipsefdn/emo-team/iplab/-/issues/17329",
    "source": "https://repo1.maven.org/maven2/org/apache/activemq/artemis-plugin/2.38.0/artemis-plugin-2.38.0-sources.jar",
    "status": "approved",
    "scans": [
        {
            "date": "November 19, 2024, 6:12:53 p.m. GMT",
            "authority": "https://gitlab.eclipse.org/eclipsefdn/emo-team/iplab/-/issues/17329",
            "scancode-version": "31.2.1",
            "licenses-discovered": [
                "Apache-2.0"
            ],
            "copyrights": [
            ],
            "file-count": 6,
            "sha256": "60af2e624e23a1d852cdfd68e3927d141b6e414b619e5bb8a21fd100208baf73",
            "source": "https://repo1.maven.org/maven2/org/apache/activemq/artemis-plugin/2.38.0/artemis-plugin-2.38.0-sources.jar",
            "status": "approved"
        }
    ]
}