{
    "id": "npm/npmjs/-/flow-parser/0.208.1",
    "license": "MIT",
    "authority": "https://gitlab.eclipse.org/eclipsefdn/emo-team/iplab/-/issues/8947",
    "source": "https://registry.yarnpkg.com/flow-parser/-/flow-parser-0.208.1.tgz",
    "status": "approved",
    "scans": [
        {
            "date": "June 15, 2023 at 3:10:08 p.m. GMT",
            "authority": "https://gitlab.eclipse.org/eclipsefdn/emo-team/iplab/-/issues/8947",
            "scancode-version": "31.2.1",
            "licenses-discovered": [
                "MIT"
            ],
            "copyrights": [
            ],
            "file-count": 3,
            "sha256": "f14ee5ecc0ad49cb550657b44fc39529325b68c2f1a4b9486d26ba1499da295c",
            "source": "https://registry.yarnpkg.com/flow-parser/-/flow-parser-0.208.1.tgz",
            "status": "approved"
        }
    ]
}