{
    "id": "npm/npmjs/-/diff/5.1.0",
    "license": "BSD-3-Clause",
    "licenses-discovered": [
        "BSD-3-Clause"
    ],
    "file-count": 28,
    "scancode-version": "30.1.0",
    "authority": "https://gitlab.eclipse.org/eclipsefdn/emo-team/iplab/-/issues/2678",
    "source": "https://registry.npmjs.org/diff/-/diff-5.1.0.tgz",
    "status": "approved"
}