{
    "id": "maven/mavencentral/org.ejml/ejml-ddense/0.41",
    "license": "Apache-2.0",
    "authority": "https://gitlab.eclipse.org/eclipsefdn/emo-team/iplab/-/issues/19659",
    "source": "https://repo1.maven.org/maven2/org/ejml/ejml-ddense/0.41/ejml-ddense-0.41-sources.jar",
    "status": "approved",
    "scans": [
        {
            "date": "February 28, 2025 at 11:27:47 p.m. GMT",
            "authority": "https://gitlab.eclipse.org/eclipsefdn/emo-team/iplab/-/issues/19659",
            "scancode-version": "31.2.1",
            "licenses-discovered": [
                "Apache-2.0"
            ],
            "copyrights": [
                "Copyright (c) 2009-2017, Peter Abeles",
                "Copyright (c) 2009-2020, Peter Abeles",
                "Copyright (c) 2020, Peter Abeles",
                "Copyright (c) 2021, Peter Abeles"
            ],
            "file-count": 147,
            "sha256": "9b26516e568e94d4e21e0dbb5b66017c6834d154a4298166d1293354ea46ce9a",
            "source": "https://repo1.maven.org/maven2/org/ejml/ejml-ddense/0.41/ejml-ddense-0.41-sources.jar",
            "status": "approved"
        }
    ]
}