{
    "license": "MIT",
    "file-count": 4,
    "authority": "https://gitlab.eclipse.org/eclipsefdn/emo-team/iplab/-/issues/1240",
    "scancode-version": "21.3.31",
    "licenses-discovered": [
        "MIT"
    ],
    "id": "npm/npmjs/babel/code-frame/7.12.11",
    "source": "https://registry.yarnpkg.com/@babel/code-frame/-/code-frame-7.12.11.tgz",
    "status": "approved"
}