{
    "id": "maven/mavencentral/org.openjfx/javafx-media/18.0.1",
    "license": "GPL-2.0-only WITH Classpath-exception-2.0",
    "authority": "https://gitlab.eclipse.org/eclipsefdn/emo-team/iplab/-/issues/17243",
    "source": "https://repo1.maven.org/maven2/org/openjfx/javafx-media/18.0.1/javafx-media-18.0.1-sources.jar",
    "status": "approved",
    "scans": [
        {
            "date": "November 15, 2024, 5:39:16 a.m. GMT",
            "authority": "https://gitlab.eclipse.org/eclipsefdn/emo-team/iplab/-/issues/17243",
            "scancode-version": "31.2.1",
            "licenses-discovered": [
                "GPL-2.0-only WITH Classpath-exception-2.0"
            ],
            "copyrights": [
                "Copyright (c) 2010, 2013, Oracle and/or its affiliates",
                "Copyright (c) 2010, 2014, Oracle and/or its affiliates",
                "Copyright (c) 2010, 2015, Oracle and/or its affiliates",
                "Copyright (c) 2010, 2016, Oracle and/or its affiliates",
                "Copyright (c) 2010, 2017, Oracle and/or its affiliates",
                "Copyright (c) 2010, 2020, Oracle and/or its affiliates",
                "Copyright (c) 2010, 2021, Oracle and/or its affiliates",
                "Copyright (c) 2011, 2016, Oracle and/or its affiliates",
                "Copyright (c) 2011, 2021, Oracle and/or its affiliates",
                "Copyright (c) 2015, 2017, Oracle and/or its affiliates",
                "Copyright (c) 2016, 2018, Oracle and/or its affiliates",
                "Copyright (c) 2016, Oracle and/or its affiliates"
            ],
            "file-count": 88,
            "sha256": "7cc195ddd77b6240337a06c731707db81c35894bfbc052887b9471cfcb8d3a57",
            "source": "https://repo1.maven.org/maven2/org/openjfx/javafx-media/18.0.1/javafx-media-18.0.1-sources.jar",
            "status": "restricted"
        }
    ]
}