{
    "id": "maven/mavencentral/com.google.api.grpc/grpc-google-cloud-storage-v2/2.43.1-beta",
    "license": "Apache-2.0",
    "authority": "https://gitlab.eclipse.org/eclipsefdn/emo-team/iplab/-/issues/16741",
    "source": "https://repo1.maven.org/maven2/com/google/api/grpc/grpc-google-cloud-storage-v2/2.43.1-beta/grpc-google-cloud-storage-v2-2.43.1-beta-sources.jar",
    "status": "approved",
    "scans": [
        {
            "date": "October 15, 2024, 6:11:13 p.m. GMT",
            "authority": "https://gitlab.eclipse.org/eclipsefdn/emo-team/iplab/-/issues/16741",
            "scancode-version": "31.2.1",
            "licenses-discovered": [
                "Apache-2.0"
            ],
            "copyrights": [
                "Copyright 2024 Google LLC"
            ],
            "file-count": 4,
            "sha256": "f0a6170cc46606c0debdad344eeb1663076ab945dcd08a13eb24d1a71d80d9f6",
            "source": "https://repo1.maven.org/maven2/com/google/api/grpc/grpc-google-cloud-storage-v2/2.43.1-beta/grpc-google-cloud-storage-v2-2.43.1-beta-sources.jar",
            "status": "approved"
        }
    ]
}