{
    "id": "maven/mavencentral/org.apache.arrow/arrow-vector/7.0.0",
    "license": "Apache-2.0 AND (Apache-2.0 AND FTL)",
    "licenses-discovered": [
        "Apache-2.0",
        "Apache-2.0 AND FTL"
    ],
    "copyrights": [
        "Copyright The Apache Software Foundation"
    ],
    "file-count": 534,
    "scancode-version": "30.1.0",
    "authority": "https://gitlab.eclipse.org/eclipsefdn/emo-team/iplab/-/issues/3366",
    "source": "https://search.maven.org/remotecontent?filepath=org/apache/arrow/arrow-vector/7.0.0/arrow-vector-7.0.0-sources.jar",
    "status": "approved"
}