{
    "license": "CDDL-1.0 or GPL-2.0-only WITH Classpath-exception-2.0",
    "file-count": 2081,
    "authority": "https://gitlab.eclipse.org/eclipsefdn/emo-team/iplab/-/issues/1767",
    "scancode-version": "30.1.0",
    "licenses-discovered": [
        "Apache-2.0",
        "LicenseRef-scancode-proprietary-license",
        "BSD-3-Clause",
        "EPL-1.0",
        "CDDL-1.0",
        "CDDL-1.1"
    ],
    "id": "maven/mavencentral/javax/javaee-api/7.0",
    "source": "https://search.maven.org/remotecontent?filepath=javax/javaee-api/7.0/javaee-api-7.0-sources.jar",
    "status": "approved"
}
