{
    "id": "go/golang/github.com%2Fgo-logfmt/logfmt/v0.5.0",
    "license": "BSD-3-Clause AND MIT",
    "authority": "https://gitlab.eclipse.org/eclipsefdn/emo-team/iplab/-/issues/5643",
    "source": "https://proxy.golang.org/github.com%2Fgo-logfmt/logfmt/@v/v0.5.0.zip",
    "status": "approved",
    "scans": [
        {
            "date": "December 12, 2022 at 4:51:50 a.m. GMT",
            "authority": "https://gitlab.eclipse.org/eclipsefdn/emo-team/iplab/-/issues/5643",
            "scancode-version": "31.2.1",
            "licenses-discovered": [
                "BSD-3-Clause",
                "MIT"
            ],
            "copyrights": [
                "Copyright (c) 2015 go-logfmt",
                "Copyright 2010 The Go Authors"
            ],
            "file-count": 13,
            "sha256": "59a6b59ae3da84f7a58373844ca8d298f5007ce0e173437fc85c26d4fc76ca8b",
            "source": "https://proxy.golang.org/github.com%2Fgo-logfmt/logfmt/@v/v0.5.0.zip",
            "status": "approved"
        }
    ]
}