{
    "id": "npm/npmjs/-/react-datepicker/4.8.0",
    "license": "MIT AND BSD-3-Clause",
    "licenses-discovered": [
        "MIT",
        "BSD-3-Clause"
    ],
    "copyrights": [
        "(c) Vasily Polovnyov <vast@whiteants.net>",
        "Copyright (c) Facebook, Inc.",
        "Copyright (c) HackerOne Inc and individual contributors"
    ],
    "file-count": 203,
    "scancode-version": "30.1.0",
    "authority": "https://gitlab.eclipse.org/eclipsefdn/emo-team/iplab/-/issues/3262",
    "source": "https://github.com/Hacker0x01/react-datepicker/archive/v4.8.0.zip",
    "status": "approved"
}