{
    "id": "npm/npmjs/-/get-uri/6.0.3",
    "license": "MIT",
    "authority": "https://gitlab.eclipse.org/eclipsefdn/emo-team/iplab/-/issues/18499",
    "source": "https://github.com/TooTallNate/proxy-agents/archive/refs/tags/get-uri@6.0.3.zip",
    "status": "approved",
    "scans": [
        {
            "date": "January 9, 2025 at 4:23:52 a.m. GMT",
            "authority": "https://gitlab.eclipse.org/eclipsefdn/emo-team/iplab/-/issues/18499",
            "scancode-version": "31.2.1",
            "licenses-discovered": [
                "MIT",
                "GPL-3.0-only"
            ],
            "copyrights": [
                "Copyright (c) 2006-2014 Eyeo GmbH",
                "Copyright (c) 2013 Nathan Rajlich <nathan@tootallnate.net>",
                "Copyright (c) 2014 Nathan Rajlich <nathan@tootallnate.net>",
                "Copyright (c) 2014 breakwa11 https://github.com/breakwa11/gfw_whitelist"
            ],
            "file-count": 190,
            "sha256": "640ec7913adf363532403c2c632f05a95c5d9049f6f3aa32a205cf288665625f",
            "source": "https://github.com/TooTallNate/proxy-agents/archive/refs/tags/get-uri@6.0.3.zip",
            "status": "restricted"
        }
    ]
}