{
    "id": "maven/mavencentral/io.cucumber/cucumber-plugin/7.21.0",
    "license": "MIT",
    "authority": "https://gitlab.eclipse.org/eclipsefdn/emo-team/iplab/-/issues/19283",
    "source": "https://repo1.maven.org/maven2/io/cucumber/cucumber-plugin/7.21.0/cucumber-plugin-7.21.0-sources.jar",
    "status": "approved",
    "scans": [
        {
            "date": "February 4, 2025 at 8:13:46 a.m. GMT",
            "authority": "https://gitlab.eclipse.org/eclipsefdn/emo-team/iplab/-/issues/19283",
            "scancode-version": "31.2.1",
            "licenses-discovered": [
            ],
            "copyrights": [
            ],
            "file-count": 42,
            "sha256": "cc74a03fdb03f479a5ebb2b6efb144dbb0e587bc821e7e86197df8e3dd5ed58e",
            "source": "https://repo1.maven.org/maven2/io/cucumber/cucumber-plugin/7.21.0/cucumber-plugin-7.21.0-sources.jar",
            "status": "restricted"
        }
    ]
}