{
    "id": "go/golang/github.com%2Fcontainernetworking/plugins/v0.8.6",
    "license": "Apache-2.0",
    "authority": "https://gitlab.eclipse.org/eclipsefdn/emo-team/iplab/-/issues/12570",
    "source": "https://proxy.golang.org/github.com%2Fcontainernetworking/plugins/@v/v0.8.6.zip",
    "status": "approved",
    "scans": [
        {
            "date": "December 26, 2023 at 10:16:35 a.m. GMT",
            "authority": "https://gitlab.eclipse.org/eclipsefdn/emo-team/iplab/-/issues/12570",
            "scancode-version": "31.2.1",
            "licenses-discovered": [
                "Apache-2.0"
            ],
            "copyrights": [
                "Copyright (c) 2004, 2006 The Linux Foundation and its contributors",
                "Copyright 2014 CNI authors",
                "Copyright 2015 CNI authors",
                "Copyright 2015-2017 CNI authors",
                "Copyright 2015-2018 CNI authors",
                "Copyright 2016 CNI authors",
                "Copyright 2016-2018 CNI authors",
                "Copyright 2017 CNI authors",
                "Copyright 2017-2018 CNI authors",
                "Copyright 2017-2020 CNI authors",
                "Copyright 2018 CNI authors",
                "Copyright 2019 CNI authors",
                "Copyright 2020 CNI authors"
            ],
            "file-count": 179,
            "sha256": "ed891c49726752deef353d1b2643bb6cdf00393ee7aef953ec65ca7bf4b0ce65",
            "source": "https://proxy.golang.org/github.com%2Fcontainernetworking/plugins/@v/v0.8.6.zip",
            "status": "approved"
        }
    ]
}