{
    "id": "maven/mavencentral/org.apache.hbase/hbase-metrics/2.5.2",
    "license": "Apache-2.0",
    "authority": "https://gitlab.eclipse.org/eclipsefdn/emo-team/iplab/-/issues/6527",
    "source": "https://search.maven.org/remotecontent?filepath=org/apache/hbase/hbase-metrics/2.5.2/hbase-metrics-2.5.2-sources.jar",
    "status": "approved",
    "scans": [
        {
            "date": "January 24, 2023 at 12:17:25 a.m. GMT",
            "authority": "https://gitlab.eclipse.org/eclipsefdn/emo-team/iplab/-/issues/6527",
            "scancode-version": "31.2.1",
            "licenses-discovered": [
                "Apache-2.0"
            ],
            "copyrights": [
            ],
            "file-count": 15,
            "sha256": "9b0fabe507562e6167ca31666272612e76147b00ade37122912e4360cc0b5732",
            "source": "https://search.maven.org/remotecontent?filepath=org/apache/hbase/hbase-metrics/2.5.2/hbase-metrics-2.5.2-sources.jar",
            "status": "approved"
        }
    ]
}