{
    "id": "maven/mavencentral/org.geotools/gt-process-feature/28.0",
    "license": "LGPL-2.1-only",
    "authority": "https://gitlab.eclipse.org/eclipsefdn/emo-team/iplab/-/issues/6525",
    "source": "https://repo.osgeo.org/repository/geotools-releases/org/geotools/gt-process-feature/28.0/gt-process-feature-28.0-sources.jar",
    "status": "approved",
    "scans": [
        {
            "date": "January 24, 2023 at 12:20:33 a.m. GMT",
            "authority": "https://gitlab.eclipse.org/eclipsefdn/emo-team/iplab/-/issues/6525",
            "scancode-version": "31.2.1",
            "licenses-discovered": [
                "LGPL-2.1-only"
            ],
            "copyrights": [
                "(c) 2001-2007 TOPP - www.openplans.org",
                "(c) 2007-2011 Refractions Research",
                "(c) 2008, Open Source Geospatial Foundation",
                "(c) 2008-2011 TOPP - www.openplans.org",
                "(c) 2008-2011, Open Source Geospatial Foundation",
                "(c) 2011, Open Source Geospatial Foundation",
                "(c) 2011-2016, Open Source Geospatial Foundation",
                "(c) 2012, Open Source Geospatial Foundation",
                "(c) 2016, Open Source Geospatial Foundation",
                "(c) 2017, Open Source Geospatial Foundation",
                "(c) 2019, Open Source Geospatial Foundation",
                "(c) 2020, Open Source Geospatial Foundation"
            ],
            "file-count": 51,
            "sha256": "f56ec9a92ae6fc8c92298d6c9a09d1596b97cd01df95274010d3a5757487086a",
            "source": "https://repo.osgeo.org/repository/geotools-releases/org/geotools/gt-process-feature/28.0/gt-process-feature-28.0-sources.jar",
            "status": "approved"
        }
    ]
}