{
    "id": "nuget/nuget/-/coverlet.collector/3.1.0",
    "license": "MIT",
    "licenses-discovered": [
        "MIT"
    ],
    "copyrights": [
        "Copyright (c) Toni Solarin-Sodara"
    ],
    "file-count": 66,
    "scancode-version": "30.1.0",
    "authority": "https://gitlab.eclipse.org/eclipsefdn/emo-team/iplab/-/issues/3187",
    "source": "https://github.com/coverlet-coverage/coverlet/archive/refs/tags/v3.1.0.zip",
    "status": "approved"
}