{
    "id": "maven/mavencentral/org.easymock/easymock/4.3",
    "license": "Apache-2.0 AND BSD-3-Clause",
    "licenses-discovered": [
        "Apache-2.0",
        "BSD-3-Clause"
    ],
    "copyrights": [
        "Copyright (c) INRIA, France Telecom",
        "Copyright The Apache Software Foundation"
    ],
    "file-count": 170,
    "scancode-version": "30.1.0",
    "authority": "https://gitlab.eclipse.org/eclipsefdn/emo-team/iplab/-/issues/3400",
    "source": "https://search.maven.org/remotecontent?filepath=org/easymock/easymock/4.3/easymock-4.3-sources.jar",
    "status": "approved"
}