{
    "id": "maven/mavencentral/org.apache.jena/jena-dboe-transaction/4.9.0",
    "license": "Apache-2.0",
    "authority": "https://gitlab.eclipse.org/eclipsefdn/emo-team/iplab/-/issues/14712",
    "source": "https://repo1.maven.org/maven2/org/apache/jena/jena-dboe-transaction/4.9.0/jena-dboe-transaction-4.9.0-sources.jar",
    "status": "approved",
    "scans": [
        {
            "date": "May 14, 2024 at 8:07:50 a.m. GMT",
            "authority": "https://gitlab.eclipse.org/eclipsefdn/emo-team/iplab/-/issues/14712",
            "scancode-version": "31.2.1",
            "licenses-discovered": [
                "Apache-2.0"
            ],
            "copyrights": [
            ],
            "file-count": 49,
            "sha256": "1e5da0241bd25f995ccd532c0318b378e980bd0c838b3a794aacd0b936f27513",
            "source": "https://repo1.maven.org/maven2/org/apache/jena/jena-dboe-transaction/4.9.0/jena-dboe-transaction-4.9.0-sources.jar",
            "status": "approved"
        }
    ]
}