{
    "id": "npm/npmjs/-/compression/1.7.1",
    "license": "MIT",
    "licenses-discovered": [
        "MIT"
    ],
    "file-count": 5,
    "scancode-version": "30.1.0",
    "authority": "https://gitlab.eclipse.org/eclipsefdn/emo-team/iplab/-/issues/1972",
    "source": "https://registry.npmjs.org/compression/-/compression-1.7.1.tgz",
    "status": "approved"
}