{
    "id": "nuget/nuget/-/HotChocolate/13.5.1",
    "license": "MIT",
    "authority": "https://gitlab.eclipse.org/eclipsefdn/emo-team/iplab/-/issues/14808",
    "source": "https://gitlab.eclipse.org/eclipsefdn/emo-team/iplab/uploads/92d982146ff7eb500cb63fb9634f76c0/HotChocolate.zip",
    "status": "approved",
    "scans": [
        {
            "date": "May 23, 2024 at 8:48:14 p.m. GMT",
            "authority": "https://gitlab.eclipse.org/eclipsefdn/emo-team/iplab/-/issues/14808",
            "scancode-version": "31.2.1",
            "licenses-discovered": [
                "GPL-3.0-only AND LicenseRef-scancode-proprietary-license",
                "GPL-3.0-only",
                "MIT"
            ],
            "copyrights": [
                "Copyright (c) 2015-present, Facebook, Inc.",
                "Copyright (c) 2021 ChilliCream (Michael Rafael Staib) LICENSE https://chillicream.com"
            ],
            "file-count": 11097,
            "sha256": "79b6e63bb2b876907069b7438b598c619bc43605bbffba9e3192a4ccf980ea25",
            "source": "https://gitlab.eclipse.org/eclipsefdn/emo-team/iplab/uploads/92d982146ff7eb500cb63fb9634f76c0/HotChocolate.zip",
            "status": "restricted"
        }
    ]
}