{
    "id": "npm/npmjs/@tanstack/query-core/5.17.9",
    "license": "MIT",
    "authority": "https://gitlab.eclipse.org/eclipsefdn/emo-team/iplab/-/issues/12762",
    "source": "https://github.com/TanStack/query/archive/refs/tags/v5.17.9.zip",
    "status": "approved",
    "scans": [
        {
            "date": "January 12, 2024 at 11:11:24 a.m. GMT",
            "authority": "https://gitlab.eclipse.org/eclipsefdn/emo-team/iplab/-/issues/12762",
            "scancode-version": "31.2.1",
            "licenses-discovered": [
                "MIT"
            ],
            "copyrights": [
                "Copyright (c) 2021-present Tanner Linsley"
            ],
            "file-count": 1214,
            "sha256": "975550cbf55a42b09ccf7282c51488be0f4c09dcf0f21ce17e24417bd06620ba",
            "source": "https://github.com/TanStack/query/archive/refs/tags/v5.17.9.zip",
            "status": "approved"
        }
    ]
}