{
    "id": "maven/mavencentral/org.apache.jena/jena-dboe-index/4.9.0",
    "license": "Apache-2.0",
    "authority": "https://gitlab.eclipse.org/eclipsefdn/emo-team/iplab/-/issues/14710",
    "source": "https://repo1.maven.org/maven2/org/apache/jena/jena-dboe-index/4.9.0/jena-dboe-index-4.9.0-sources.jar",
    "status": "approved",
    "scans": [
        {
            "date": "May 14, 2024 at 7:49:20 a.m. GMT",
            "authority": "https://gitlab.eclipse.org/eclipsefdn/emo-team/iplab/-/issues/14710",
            "scancode-version": "31.2.1",
            "licenses-discovered": [
                "Apache-2.0"
            ],
            "copyrights": [
            ],
            "file-count": 12,
            "sha256": "96decf97924d91ea2078c2e9035d1433b4599b10df9bb167aec4738c480f26e1",
            "source": "https://repo1.maven.org/maven2/org/apache/jena/jena-dboe-index/4.9.0/jena-dboe-index-4.9.0-sources.jar",
            "status": "approved"
        }
    ]
}