{
    "id": "maven/mavencentral/org.osgi/org.osgi.service.jakartars/2.0.0-RC1",
    "license": "Apache-2.0",
    "licenses-discovered": [
        "Apache-2.0"
    ],
    "copyrights": [
    ],
    "file-count": 34,
    "scancode-version": "31.2.1",
    "authority": "https://gitlab.eclipse.org/eclipsefdn/emo-team/iplab/-/issues/4692",
    "source": "https://search.maven.org/remotecontent?filepath=org/osgi/org.osgi.service.jakartars/2.0.0-RC1/org.osgi.service.jakartars-2.0.0-RC1-sources.jar",
    "status": "approved"
}