{
    "id": "npm/npmjs/-/regenerate-unicode-properties/10.2.0",
    "license": "MIT",
    "authority": "https://gitlab.eclipse.org/eclipsefdn/emo-team/iplab/-/issues/16172",
    "source": "https://github.com/mathiasbynens/regenerate-unicode-properties/archive/refs/tags/v10.2.0.zip",
    "status": "approved",
    "scans": [
        {
            "date": "September 18, 2024, 6:45:10 p.m. GMT",
            "authority": "https://gitlab.eclipse.org/eclipsefdn/emo-team/iplab/-/issues/16172",
            "scancode-version": "31.2.1",
            "licenses-discovered": [
                "MIT"
            ],
            "copyrights": [
                "Copyright Mathias Bynens <https://mathiasbynens.be/>"
            ],
            "file-count": 448,
            "sha256": "ae5aa89b4c783ea534c333b529b355afb66d8dffdd62076471c80e0086c0ebf6",
            "source": "https://github.com/mathiasbynens/regenerate-unicode-properties/archive/refs/tags/v10.2.0.zip",
            "status": "approved"
        }
    ]
}