{
    "id": "maven/mavencentral/org.geotools.xsd/gt-xsd-fes/31.0",
    "license": "LGPL-2.1-only",
    "authority": "https://gitlab.eclipse.org/eclipsefdn/emo-team/iplab/-/issues/13873",
    "source": "https://repo.osgeo.org/repository/geotools-releases/org/geotools/xsd/gt-xsd-fes/31.0/gt-xsd-fes-31.0-sources.jar",
    "status": "approved",
    "scans": [
        {
            "date": "March 19, 2024 at 9:56:02 p.m. GMT",
            "authority": "https://gitlab.eclipse.org/eclipsefdn/emo-team/iplab/-/issues/13873",
            "scancode-version": "31.2.1",
            "licenses-discovered": [
                "LGPL-2.1-only"
            ],
            "copyrights": [
                "(c) 2002-2008, Open Source Geospatial Foundation",
                "(c) 2002-2011, Open Source Geospatial Foundation",
                "(c) 2002-2014, Open Source Geospatial Foundation",
                "(c) 2002-2015, Open Source Geospatial Foundation",
                "(c) 2002-2016, Open Source Geospatial Foundation",
                "(c) 2012, Open Source Geospatial Foundation",
                "(c) 2014, Open Source Geospatial Foundation",
                "(c) 2019, Open Source Geospatial Foundation",
                "(c) 2023, Open Source Geospatial Foundation",
                "Copyright (c) 2002, 2003, 2004 OpenGIS"
            ],
            "file-count": 84,
            "sha256": "3096e50ba95604687b3c2dd442ab3d48c99093e639183a38a1cf4af2ca7eeb04",
            "source": "https://repo.osgeo.org/repository/geotools-releases/org/geotools/xsd/gt-xsd-fes/31.0/gt-xsd-fes-31.0-sources.jar",
            "status": "approved"
        }
    ]
}