{
    "id": "npm/npmjs/@storybook/types/7.0.21",
    "license": "MIT",
    "authority": "https://gitlab.eclipse.org/eclipsefdn/emo-team/iplab/-/issues/9020",
    "source": "https://registry.npmjs.org/@storybook/types/-/types-7.0.21.tgz",
    "status": "approved",
    "scans": [
        {
            "date": "June 15, 2023 at 2:09:51 p.m. GMT",
            "authority": "https://gitlab.eclipse.org/eclipsefdn/emo-team/iplab/-/issues/9020",
            "scancode-version": "31.2.1",
            "licenses-discovered": [
                "MIT"
            ],
            "copyrights": [
            ],
            "file-count": 6,
            "sha256": "c45d061d277792ac2830dc97f95e43a46ae5ad22bc65960f5603980ec0f0eed9",
            "source": "https://registry.npmjs.org/@storybook/types/-/types-7.0.21.tgz",
            "status": "approved"
        }
    ]
}