{
    "id": "maven/mavencentral/com.google.api.grpc/gapic-google-cloud-storage-v2/2.44.1-beta",
    "license": "Apache-2.0",
    "authority": "https://gitlab.eclipse.org/eclipsefdn/emo-team/iplab/-/issues/17203",
    "source": "https://repo1.maven.org/maven2/com/google/api/grpc/gapic-google-cloud-storage-v2/2.44.1-beta/gapic-google-cloud-storage-v2-2.44.1-beta-sources.jar",
    "status": "approved",
    "scans": [
        {
            "date": "November 14, 2024, 4:00:04 a.m. GMT",
            "authority": "https://gitlab.eclipse.org/eclipsefdn/emo-team/iplab/-/issues/17203",
            "scancode-version": "31.2.1",
            "licenses-discovered": [
                "Apache-2.0"
            ],
            "copyrights": [
                "Copyright 2024 Google LLC"
            ],
            "file-count": 12,
            "sha256": "56a0a74a1d9c43265850e408208a9575aa43d85b4e7a7623bf1bacebdb753732",
            "source": "https://repo1.maven.org/maven2/com/google/api/grpc/gapic-google-cloud-storage-v2/2.44.1-beta/gapic-google-cloud-storage-v2-2.44.1-beta-sources.jar",
            "status": "approved"
        }
    ]
}