{
    "id": "pypi/pypi/-/py-postgresql/1.2.2",
    "license": "AAL AND LicenseRef-scancode-other-permissive AND MIT",
    "licenses-discovered": [
        "AAL",
        "MIT",
        "LicenseRef-scancode-other-permissive"
    ],
    "file-count": 135,
    "scancode-version": "30.1.0",
    "authority": "https://gitlab.eclipse.org/eclipsefdn/emo-team/iplab/-/issues/2119",
    "source": "https://files.pythonhosted.org/packages/42/47/422e41fa989056137bb286d42a7b74dc5e80a39632f9f119e16bd94bbdec/py-postgresql-1.2.2.tar.gz",
    "status": "restricted"
}