{
    "id": "maven/mavencentral/com.amazonaws/aws-java-sdk-s3/1.12.735",
    "license": "Apache-2.0",
    "authority": "https://gitlab.eclipse.org/eclipsefdn/emo-team/iplab/-/issues/15079",
    "source": "https://repo1.maven.org/maven2/com/amazonaws/aws-java-sdk-s3/1.12.735/aws-java-sdk-s3-1.12.735-sources.jar",
    "status": "approved",
    "scans": [
        {
            "date": "June 5, 2024 at 6:51:15 p.m. GMT",
            "authority": "https://gitlab.eclipse.org/eclipsefdn/emo-team/iplab/-/issues/15079",
            "scancode-version": "31.2.1",
            "licenses-discovered": [
                "Apache-2.0"
            ],
            "copyrights": [
                "Copyright (c) 2016. Amazon.com, Inc. or its affiliates",
                "Copyright (c) 2017. Amazon.com, Inc. or its affiliates",
                "Copyright 2010-2024 Amazon.com, Inc. or its affiliates",
                "Copyright 2010-20244 Amazon.com, Inc. or its affiliates",
                "Copyright 2011-2024 Amazon Technologies, Inc.",
                "Copyright 2011-2024 Amazon.com, Inc. or its affiliates",
                "Copyright 2012-2024 Amazon Technologies, Inc.",
                "Copyright 2012-2024 Amazon.com, Inc. or its affiliates",
                "Copyright 2013-2024 Amazon.com, Inc. or its affiliates",
                "Copyright 2014-2024 Amazon Technologies, Inc.",
                "Copyright 2014-2024 Amazon.com, Inc. or its affiliates",
                "Copyright 2015-2024 Amazon Technologies, Inc.",
                "Copyright 2015-2024 Amazon.com, Inc. or its affiliates",
                "Copyright 2016-2024 Amazon Technologies, Inc.",
                "Copyright 2016-2024 Amazon.com, Inc. or its affiliates",
                "Copyright 2017-2024 Amazon.com, Inc. or its affiliates",
                "Copyright 2018-2024 Amazon.com, Inc. or its affiliates",
                "Copyright 2019-2024 Amazon Technologies, Inc.",
                "Copyright 2019-2024 Amazon.com, Inc. or its affiliates",
                "Copyright 2020-2024 Amazon.com, Inc. or its affiliates",
                "Copyright 2021-2024 Amazon.com, Inc. or its affiliates",
                "Copyright Amazon.com, Inc. or its affiliates",
                "Portions copyright 2006-2009 James Murty"
            ],
            "file-count": 683,
            "sha256": "713d0b7b82867ea928b5c5a2bde8cd12fb94c9ac785e9a09b3af8a7939f4ed7f",
            "source": "https://repo1.maven.org/maven2/com/amazonaws/aws-java-sdk-s3/1.12.735/aws-java-sdk-s3-1.12.735-sources.jar",
            "status": "approved"
        }
    ]
}