{
    "id": "git/github/klauspost/compress/v1.8.2",
    "license": "BSD-3-Clause AND Apache-2.0 AND MIT AND W3C-19980720",
    "licenses-discovered": [
        "BSD-3-Clause",
        "Apache-2.0 AND BSD-3-Clause",
        "LicenseRef-scancode-proprietary-license",
        "MIT",
        "LicenseRef-scancode-other-permissive AND LicenseRef-scancode-proprietary-license",
        "LicenseRef-scancode-other-permissive",
        "W3C-19980720"
    ],
    "copyrights": [
        "(c) \u0006 ij7!a\u000e'bedegak3 D!UEC/ SA",
        "(c) \u0010',AE\u0015G.2oDS'x c v KDC(r)xOE@5wZ'\u000eyH+c@\u0001P6 bV",
        "(c) \u001b8 (c) C",
        "(c) \u001bAEC\u001bay (c) T",
        "(c) (c) AII",
        "(c) (c) Dn",
        "(c) (c) H",
        "(c) (c) Juuuuu",
        "(c) (c) SUO",
        "(c) (c) TAE",
        "(c) (c) U",
        "(c) (c) Ua Ua8AEayAETa",
        "(c) (c) Y",
        "(c) (c) a J'raUTUT8saaAEaT\u001bE a\u0001a8 AE TaT",
        "(c) /axove+xose/7,-1,0,B/frameset&F axuntanza&1,,3 http://biblio.cesga.es:81/search",
        "(c) /axove+xose/7,-1,0,B/frameset&F axuntanza&3,,3 http://db.zaq.ne.jp/asp/bbs/jttk_baasc506_1/article/36 http://db.zaq.ne.jp/asp/bbs/jttk_baasc506_1/article/37",
        "(c) 2AO H3CEoy3FN Y",
        "(c) 2Th (c) H",
        "(c) A AEZaO5",
        "(c) AAi (c)",
        "(c) AB",
        "(c) AE4yossa (c)",
        "(c) AEE8a9TT (c)",
        "(c) AESSAA IiqY",
        "(c) AEssu AE",
        "(c) AO-OufUY Y",
        "(c) APika4S Xn7",
        "(c) AUa Y",
        "(c) AofUa, K",
        "(c) CCa8a8a (c)",
        "(c) CCee (c)",
        "(c) Co",
        "(c) Credit",
        "(c) Credit Agricole",
        "(c) D84ueR C",
        "(c) DANLDL Yl",
        "(c) DdK Pv",
        "(c) E8 (c)",
        "(c) EEE Ejj O Th-jjjjjj",
        "(c) EaaTAE AE",
        "(c) Ei El",
        "(c) Evaoy'\u0006 (c) Y",
        "(c) F\u00165W\bpi o a1FGV so4\u0007!UEC/ SA",
        "(c) G Ox",
        "(c) G U3Je NJ3JJ3",
        "(c) H Th",
        "(c) H2 (c)",
        "(c) HTAaeI3x j OtNx6E",
        "(c) HoA S",
        "(c) Hu K",
        "(c) I UuE",
        "(c) Jydeg, AC",
        "(c) L3O Ii",
        "(c) LAEAEo1nas AOOOOOOOO6",
        "(c) NqYA3I M",
        "(c) O Ed I",
        "(c) O,'~o (c) OO",
        "(c) OE Ea2O",
        "(c) OOOOs AeaOPSw8M",
        "(c) OOUA UuUS1a OEviy",
        "(c) OeqeNPAO AO",
        "(c) Og ThHOOOr",
        "(c) Oj-Naq U",
        "(c) PSu I1o",
        "(c) PSu O",
        "(c) Q ThY",
        "(c) SA",
        "(c) SSvOOOOO hd IOOOOllOouU",
        "(c) SklE \u0011 SSpoY",
        "(c) T8 (c)",
        "(c) TAEaUa (c)",
        "(c) TMYo WY\u00011O,o UiaQO",
        "(c) TTTaq (c)",
        "(c) Ta (c)",
        "(c) Taa (c)",
        "(c) Tai UAEUq",
        "(c) Th V",
        "(c) Th-c O",
        "(c) U6ab G",
        "(c) U8 (c)",
        "(c) U8a (c)",
        "(c) UAEa\u001bTa8AE9 (c) T",
        "(c) UUeBll (c)",
        "(c) UiL (c)",
        "(c) V3 ZkCou",
        "(c) Va (c)",
        "(c) Vjjj H",
        "(c) Vuae Ulac2",
        "(c) Wx, OOO",
        "(c) X I2 ZVva",
        "(c) XooO ThEbjPS",
        "(c) Y Say",
        "(c) YaAoO-SS BWa",
        "(c) a (c) AE8",
        "(c) aT'u'uJ'ua (c) AE",
        "(c) s IVNA CO",
        "(c) u\u0013a~'!Uu (c) I",
        "(c) uu (c) V",
        "(c) uuu (c) J",
        "(c) x\u0007 (c) U",
        "(c) y (c) M",
        "(c) yTaAEAEAEqTaC9TT (c) AE",
        "(c) yU co",
        "(c) yVae\u0014 (c) GO",
        "(c) ~ (c) SOSS",
        "(c) ~ (c) SS",
        "Copyright (c) Caleb Spare",
        "Copyright (c) Klaus Post",
        "Copyright (c) The Go Authors",
        "Copyright (c) Yann Collet",
        "Copyright (c) http://www.w3.org/ title World Wide",
        "Copyright Depository of Electronic Materials",
        "Copyright Issues Marybeth Peters",
        "Copyright The Snappy-Go Authors",
        "I5AThI eDc (c) SSUaEdeg",
        "Klaus Post (c)",
        "NFaeo (c) Io",
        "NPPSoKa Y\u0017/uIdy (c) Ixaa",
        "OOO1pMa (c) QyyioVY",
        "OOOOAOOOt \u0005D (c) We",
        "YIi \u000e (c) Aaq",
        "YP2u (c) Uui",
        "copyright by Cornell University"
    ],
    "file-count": 2413,
    "scancode-version": "30.1.0",
    "authority": "https://gitlab.eclipse.org/eclipsefdn/emo-team/iplab/-/issues/3619",
    "source": "https://github.com/klauspost/compress/archive/refs/tags/v1.8.2.zip",
    "status": "approved"
}
