{
    "id": "maven/mavencentral/org.apache.xmlgraphics/batik-shared-resources/1.18",
    "license": "Apache-2.0",
    "authority": "https://gitlab.eclipse.org/eclipsefdn/emo-team/iplab/-/issues/16599",
    "source": "https://repo1.maven.org/maven2/org/apache/xmlgraphics/batik-shared-resources/1.18/batik-shared-resources-1.18-sources.jar",
    "status": "approved",
    "scans": [
        {
            "date": "October 9, 2024, 3:09:40 p.m. GMT",
            "authority": "https://gitlab.eclipse.org/eclipsefdn/emo-team/iplab/-/issues/16599",
            "scancode-version": "31.2.1",
            "licenses-discovered": [
                "Apache-2.0"
            ],
            "copyrights": [
            ],
            "file-count": 4,
            "sha256": "a7d4ad327376ecbfaf6d66d4f07b847886a5906ac94ea31de3435846b35a631c",
            "source": "https://repo1.maven.org/maven2/org/apache/xmlgraphics/batik-shared-resources/1.18/batik-shared-resources-1.18-sources.jar",
            "status": "approved"
        }
    ]
}