{
    "id": "maven/mavencentral/org.apache.kafka/kafka-streams-scala_2.13/3.7.0",
    "license": "Apache-2.0",
    "authority": "https://gitlab.eclipse.org/eclipsefdn/emo-team/iplab/-/issues/17158",
    "source": "https://repo1.maven.org/maven2/org/apache/kafka/kafka-streams-scala_2.13/3.7.0/kafka-streams-scala_2.13-3.7.0-sources.jar",
    "status": "approved",
    "scans": [
        {
            "date": "November 11, 2024, 5:21:11 p.m. GMT",
            "authority": "https://gitlab.eclipse.org/eclipsefdn/emo-team/iplab/-/issues/17158",
            "scancode-version": "31.2.1",
            "licenses-discovered": [
                "Apache-2.0"
            ],
            "copyrights": [
            ],
            "file-count": 27,
            "sha256": "dc418086768c4be9421ab967b753fdac12a28108235548dccf4c8771b1e7c72a",
            "source": "https://repo1.maven.org/maven2/org/apache/kafka/kafka-streams-scala_2.13/3.7.0/kafka-streams-scala_2.13-3.7.0-sources.jar",
            "status": "approved"
        }
    ]
}