{
    "id": "npm/npmjs/-/webpack/5.82.0",
    "license": "MIT",
    "authority": "https://gitlab.eclipse.org/eclipsefdn/emo-team/iplab/-/issues/8248",
    "source": "https://github.com/webpack/webpack/archive/v5.82.0.zip",
    "status": "approved",
    "scans": [
        {
            "date": "May 4, 2023 at 10:41:33 p.m. GMT",
            "authority": "https://gitlab.eclipse.org/eclipsefdn/emo-team/iplab/-/issues/8248",
            "scancode-version": "31.2.1",
            "licenses-discovered": [
                "MIT"
            ],
            "copyrights": [
                "(c) 1990 RSA Data Security, Inc.",
                "Copyright (c) 2016 Stephan Brumme",
                "Copyright JS Foundation and other contributors"
            ],
            "file-count": 7427,
            "sha256": "6db0ddaabc5a9fe461a9443651bf14f14aeb9d1ec9bf68e2a7e27ff402d51793",
            "source": "https://github.com/webpack/webpack/archive/v5.82.0.zip",
            "status": "approved"
        }
    ]
}