{
    "id": "maven/mavencentral/com.azure.resourcemanager/azure-resourcemanager-containerservice/2.31.0",
    "license": "MIT",
    "authority": "https://gitlab.eclipse.org/eclipsefdn/emo-team/iplab/-/issues/10870",
    "source": "https://repo.maven.apache.org/maven2/com/azure/resourcemanager/azure-resourcemanager-containerservice/2.31.0/azure-resourcemanager-containerservice-2.31.0-sources.jar",
    "status": "approved",
    "scans": [
        {
            "date": "October 4, 2023 at 12:49:34 p.m. GMT",
            "authority": "https://gitlab.eclipse.org/eclipsefdn/emo-team/iplab/-/issues/10870",
            "scancode-version": "31.2.1",
            "licenses-discovered": [
                "MIT"
            ],
            "copyrights": [
                "(c) 2008 VeriSign, Inc.",
                "Copyright (c) Microsoft Corporation"
            ],
            "file-count": 242,
            "sha256": "152eece6e1d95d1829bea52a52aa55c6a51e2344fc49b717e5de49d11e91e851",
            "source": "https://repo.maven.apache.org/maven2/com/azure/resourcemanager/azure-resourcemanager-containerservice/2.31.0/azure-resourcemanager-containerservice-2.31.0-sources.jar",
            "status": "approved"
        }
    ]
}