{
    "license": "MIT",
    "file-count": 25,
    "authority": "https://gitlab.eclipse.org/eclipsefdn/emo-team/iplab/-/issues/1188",
    "scancode-version": "21.3.31",
    "licenses-discovered": [
        "MIT"
    ],
    "id": "npm/npmjs/@octokit/plugin-paginate-rest/2.15.1",
    "source": "https://registry.npmjs.org/@octokit/plugin-paginate-rest/-/plugin-paginate-rest-2.15.1.tgz",
    "status": "approved"
}