{
    "id": "maven/mavencentral/com.google.api.grpc/proto-google-cloud-secretmanager-v1beta2/2.52.0",
    "license": "Apache-2.0",
    "authority": "https://gitlab.eclipse.org/eclipsefdn/emo-team/iplab/-/issues/16763",
    "source": "https://repo1.maven.org/maven2/com/google/api/grpc/proto-google-cloud-secretmanager-v1beta2/2.52.0/proto-google-cloud-secretmanager-v1beta2-2.52.0-sources.jar",
    "status": "approved",
    "scans": [
        {
            "date": "October 17, 2024, 3:56:18 a.m. GMT",
            "authority": "https://gitlab.eclipse.org/eclipsefdn/emo-team/iplab/-/issues/16763",
            "scancode-version": "31.2.1",
            "licenses-discovered": [
                "Apache-2.0"
            ],
            "copyrights": [
                "Copyright 2024 Google LLC"
            ],
            "file-count": 59,
            "sha256": "3419104b0963f16c955ea562923db21c97214dafd7e636e9b97dd237993e78a4",
            "source": "https://repo1.maven.org/maven2/com/google/api/grpc/proto-google-cloud-secretmanager-v1beta2/2.52.0/proto-google-cloud-secretmanager-v1beta2-2.52.0-sources.jar",
            "status": "approved"
        }
    ]
}