{
    "license": "Apache-2.0",
    "file-count": 710,
    "authority": "https://gitlab.eclipse.org/eclipsefdn/emo-team/iplab/-/issues/1875",
    "scancode-version": "30.1.0",
    "licenses-discovered": [
        "Apache-2.0"
    ],
    "id": "maven/mavencentral/io.fabric8/openshift-model-operator/5.11.2",
    "source": "https://search.maven.org/remotecontent?filepath=io/fabric8/openshift-model-operator/5.11.2/openshift-model-operator-5.11.2-sources.jar",
    "status": "approved"
}