{
    "id": "npm/npmjs/-/style-to-object/0.4.1",
    "license": "MIT",
    "authority": "https://gitlab.eclipse.org/eclipsefdn/emo-team/iplab/-/issues/6637",
    "source": "https://github.com/remarkablemark/style-to-object/archive/v0.4.1.zip",
    "status": "approved",
    "scans": [
        {
            "date": "January 25, 2023 at 12:28:27 p.m. GMT",
            "authority": "https://gitlab.eclipse.org/eclipsefdn/emo-team/iplab/-/issues/6637",
            "scancode-version": "31.2.1",
            "licenses-discovered": [
                "MIT"
            ],
            "copyrights": [
                "Copyright (c) 2017 Menglin Mark Xu <mark@remarkablemark.org>"
            ],
            "file-count": 31,
            "sha256": "35966061bacde2b3ac30e4ba5c7d356ab54c7e875a53f2d63416d0a57695c161",
            "source": "https://github.com/remarkablemark/style-to-object/archive/v0.4.1.zip",
            "status": "approved"
        }
    ]
}