{
    "id": "git/github/haya14busa/action-cond/v1",
    "license": "MIT",
    "authority": "https://gitlab.eclipse.org/eclipsefdn/emo-team/iplab/-/issues/7982",
    "source": "https://github.com/haya14busa/action-cond/archive/refs/tags/v1.zip",
    "status": "approved",
    "scans": [
        {
            "date": "April 27, 2023 at 2:56:34 p.m. GMT",
            "authority": "https://gitlab.eclipse.org/eclipsefdn/emo-team/iplab/-/issues/7982",
            "scancode-version": "31.2.1",
            "licenses-discovered": [
                "MIT"
            ],
            "copyrights": [
                "Copyright (c) 2018 GitHub, Inc. and contributors"
            ],
            "file-count": 16,
            "sha256": "db90e78adf07a72332ffd274087fc8327f456462eab55d67890d50d95d8d7b39",
            "source": "https://github.com/haya14busa/action-cond/archive/refs/tags/v1.zip",
            "status": "approved"
        }
    ]
}