{
    "id": "npm/npmjs/-/tslib/2.4.1",
    "license": "0BSD",
    "licenses-discovered": [
        "0BSD"
    ],
    "copyrights": [
        "Copyright (c) Microsoft Corporation"
    ],
    "file-count": 12,
    "scancode-version": "31.2.1",
    "authority": "https://gitlab.eclipse.org/eclipsefdn/emo-team/iplab/-/issues/4336",
    "source": "https://registry.npmjs.org/tslib/-/tslib-2.4.1.tgz",
    "status": "approved"
}