{
    "id": "maven/mavencentral/org.springframework.plugin/spring-plugin-core/2.0.0.RELEASE",
    "license": "Apache-2.0",
    "licenses-discovered": [
        "Apache-2.0"
    ],
    "copyrights": [
        "Copyright (c) Pivotal Software, Inc.",
        "Copyright the original author or authors"
    ],
    "file-count": 25,
    "scancode-version": "30.1.0",
    "authority": "https://gitlab.eclipse.org/eclipsefdn/emo-team/iplab/-/issues/3049",
    "source": "https://search.maven.org/remotecontent?filepath=org/springframework/plugin/spring-plugin-core/2.0.0.RELEASE/spring-plugin-core-2.0.0.RELEASE-sources.jar",
    "status": "approved"
}