{
    "id": "npm/npmjs/-/magic-string/0.30.7",
    "license": "MIT",
    "authority": "https://gitlab.eclipse.org/eclipsefdn/emo-team/iplab/-/issues/13189",
    "source": "https://github.com/Rich-Harris/magic-string/archive/refs/tags/v0.30.7.zip",
    "status": "approved",
    "scans": [
        {
            "date": "February 8, 2024 at 2:22:12 p.m. GMT",
            "authority": "https://gitlab.eclipse.org/eclipsefdn/emo-team/iplab/-/issues/13189",
            "scancode-version": "31.2.1",
            "licenses-discovered": [
                "MIT"
            ],
            "copyrights": [
                "Copyright 2018 Rich Harris"
            ],
            "file-count": 34,
            "sha256": "4f9b52e84e3258274e77f3b09c9996db561679913d2524d100e15aad1fbfe4b7",
            "source": "https://github.com/Rich-Harris/magic-string/archive/refs/tags/v0.30.7.zip",
            "status": "approved"
        }
    ]
}