{
    "id": "go/golang/cloud.google.com/go/v0.62.0",
    "license": "Apache-2.0 AND (Apache-2.0 AND BSD-3-Clause) AND BSD-2-Clause",
    "authority": "https://gitlab.eclipse.org/eclipsefdn/emo-team/iplab/-/issues/5594",
    "source": "https://proxy.golang.org/cloud.google.com/go/@v/v0.62.0.zip",
    "status": "approved",
    "scans": [
        {
            "date": "December 9, 2022 at 10:50:57 p.m. GMT",
            "authority": "https://gitlab.eclipse.org/eclipsefdn/emo-team/iplab/-/issues/5594",
            "scancode-version": "31.2.1",
            "licenses-discovered": [
                "Apache-2.0",
                "Apache-2.0 AND BSD-3-Clause",
                "BSD-2-Clause"
            ],
            "copyrights": [
                "Copyright (c) 1996-1998 John D. Polstra",
                "Copyright (c) 2001 David E. O'Brien",
                "Copyright 2014 Google LLC",
                "Copyright 2016 Google LLC",
                "Copyright 2017 Google LLC",
                "Copyright 2017, Google LLC",
                "Copyright 2018 Google Inc.",
                "Copyright 2018 Google LLC",
                "Copyright 2019 Google LLC",
                "Copyright 2020 Google LLC",
                "Copyright 2020, Google LLC",
                "Portions Copyright 2018 Google LLC."
            ],
            "file-count": 610,
            "sha256": "cf6519c44b9a4b11d34fdc08f36a224bb2772caf247ac37d7b5cfa14f3d7ea87",
            "source": "https://proxy.golang.org/cloud.google.com/go/@v/v0.62.0.zip",
            "status": "approved"
        }
    ]
}