{
    "id": "npm/npmjs/-/nx/16.9.1",
    "license": "MIT AND ISC AND Apache-2.0",
    "authority": "https://gitlab.eclipse.org/eclipsefdn/emo-team/iplab/-/issues/10786",
    "source": "https://github.com/nrwl/nx/archive/refs/tags/16.9.1.zip",
    "status": "approved",
    "scans": [
        {
            "date": "October 2, 2023 at 2:32:43 p.m. GMT",
            "authority": "https://gitlab.eclipse.org/eclipsefdn/emo-team/iplab/-/issues/10786",
            "scancode-version": "31.2.1",
            "licenses-discovered": [
                "MIT",
                "TMate",
                "MIT AND Unlicense",
                "ISC",
                "Apache-2.0",
                "Apache-2.0 AND BSD-3-Clause AND CDDL-1.0 AND CDDL-1.1 AND EPL-1.0 AND EPL-2.0 AND (GPL-2.0-only WITH Classpath-exception-2.0) AND MIT"
            ],
            "copyrights": [
                "(c) 2023 made with",
                "Copyright (c) 2014 The Android Open Source Project",
                "Copyright (c) 2015-2021 the original",
                "Copyright (c) 2017-2023 Narwhal Technologies Inc.",
                "Copyright (c) 2022 Mohammad Ataei",
                "Copyright (c) Meta Platforms, Inc. and affiliates",
                "Copyright 2015 the original author or authors",
                "Copyright Google Inc."
            ],
            "file-count": 6199,
            "sha256": "61e25bdcbf62d3b7dae46c89fc0351329e69a9eab306fcd021c3087bcf8b20a7",
            "source": "https://github.com/nrwl/nx/archive/refs/tags/16.9.1.zip",
            "status": "restricted"
        }
    ]
}
