{
    "id": "maven/mavencentral/com.azure.resourcemanager/azure-resourcemanager-network/2.29.0",
    "license": "MIT",
    "authority": "https://gitlab.eclipse.org/eclipsefdn/emo-team/iplab/-/issues/10043",
    "source": "https://repo.maven.apache.org/maven2/com/azure/resourcemanager/azure-resourcemanager-network/2.29.0/azure-resourcemanager-network-2.29.0-sources.jar",
    "status": "approved",
    "scans": [
        {
            "date": "August 12, 2023 at 7:38:24 a.m. GMT",
            "authority": "https://gitlab.eclipse.org/eclipsefdn/emo-team/iplab/-/issues/10043",
            "scancode-version": "31.2.1",
            "licenses-discovered": [
                "MIT"
            ],
            "copyrights": [
                "(c) 2008 VeriSign, Inc.",
                "Copyright (c) Microsoft Corporation"
            ],
            "file-count": 1573,
            "sha256": "cfb4c66d1b10183c1d6ed64011a487a0da9ecc7d3c55d6198c2a47f209917b8d",
            "source": "https://repo.maven.apache.org/maven2/com/azure/resourcemanager/azure-resourcemanager-network/2.29.0/azure-resourcemanager-network-2.29.0-sources.jar",
            "status": "approved"
        }
    ]
}