{
    "id": "maven/mavencentral/org.apache.activemq/artemis-journal/2.33.0",
    "license": "Apache-2.0 AND (Apache-2.0 AND MIT)",
    "authority": "https://gitlab.eclipse.org/eclipsefdn/emo-team/iplab/-/issues/14979",
    "source": "https://repo1.maven.org/maven2/org/apache/activemq/artemis-journal/2.33.0/artemis-journal-2.33.0-sources.jar",
    "status": "approved",
    "scans": [
        {
            "date": "May 29, 2024 at 11:58:28 a.m. GMT",
            "authority": "https://gitlab.eclipse.org/eclipsefdn/emo-team/iplab/-/issues/14979",
            "scancode-version": "31.2.1",
            "licenses-discovered": [
                "Apache-2.0",
                "Apache-2.0 AND MIT"
            ],
            "copyrights": [
            ],
            "file-count": 72,
            "sha256": "27d1dcae92294cb04de4c5e0cec25bc72fdc7911534025dc01b7c922cc363434",
            "source": "https://repo1.maven.org/maven2/org/apache/activemq/artemis-journal/2.33.0/artemis-journal-2.33.0-sources.jar",
            "status": "approved"
        }
    ]
}