{
    "id": "npm/npmjs/-/lucide-react/0.292.0",
    "license": "ISC",
    "authority": "https://gitlab.eclipse.org/eclipsefdn/emo-team/iplab/-/issues/12057",
    "source": "https://github.com/lucide-icons/lucide/archive/refs/tags/0.292.0.zip",
    "status": "approved",
    "scans": [
        {
            "date": "December 14, 2023 at 8:58:06 a.m. GMT",
            "authority": "https://gitlab.eclipse.org/eclipsefdn/emo-team/iplab/-/issues/12057",
            "scancode-version": "31.2.1",
            "licenses-discovered": [
                "ISC",
                "ISC AND LicenseRef-scancode-unknown"
            ],
            "copyrights": [
                "Copyright (c) 2017, Oleksandr Kucherenko"
            ],
            "file-count": 3220,
            "sha256": "b9423b0974de2809aac93ae3a366df47048378e99b0a8dfdbe5916057ace2607",
            "source": "https://github.com/lucide-icons/lucide/archive/refs/tags/0.292.0.zip",
            "status": "restricted"
        }
    ]
}
