{
    "id": "npm/npmjs/-/lilconfig/3.0.0",
    "license": "MIT",
    "authority": "https://gitlab.eclipse.org/eclipsefdn/emo-team/iplab/-/issues/11668",
    "source": "https://github.com/antonk52/lilconfig/archive/refs/tags/v3.0.0.zip",
    "status": "approved",
    "scans": [
        {
            "date": "November 22, 2023 at 11:34:34 a.m. GMT",
            "authority": "https://gitlab.eclipse.org/eclipsefdn/emo-team/iplab/-/issues/11668",
            "scancode-version": "31.2.1",
            "licenses-discovered": [
                "MIT"
            ],
            "copyrights": [
                "Copyright (c) 2022 Anton Kastritskiy"
            ],
            "file-count": 30,
            "sha256": "633e572824d45ce7ee33f9f8db11e12132942d04656d75660914b5c01319b6bf",
            "source": "https://github.com/antonk52/lilconfig/archive/refs/tags/v3.0.0.zip",
            "status": "approved"
        }
    ]
}