{
    "id": "maven/mavencentral/org.graalvm.sdk/nativeimage/23.1.0",
    "license": "UPL-1.0",
    "authority": "https://gitlab.eclipse.org/eclipsefdn/emo-team/iplab/-/issues/10921",
    "source": "https://repo.maven.apache.org/maven2/org/graalvm/sdk/nativeimage/23.1.0/nativeimage-23.1.0-sources.jar",
    "status": "approved",
    "scans": [
        {
            "date": "October 5, 2023 at 2:55:16 p.m. GMT",
            "authority": "https://gitlab.eclipse.org/eclipsefdn/emo-team/iplab/-/issues/10921",
            "scancode-version": "31.2.1",
            "licenses-discovered": [
                "UPL-1.0"
            ],
            "copyrights": [
                "Copyright (c) 2007, 2022, Oracle and/or its affiliates",
                "Copyright (c) 2007, 2023, Oracle and/or its affiliates",
                "Copyright (c) 2009, 2023, Oracle and/or its affiliates",
                "Copyright (c) 2010, 2022, Oracle and/or its affiliates",
                "Copyright (c) 2012, 2022, Oracle and/or its affiliates",
                "Copyright (c) 2013, 2019, Oracle and/or its affiliates",
                "Copyright (c) 2013, 2021, Oracle and/or its affiliates",
                "Copyright (c) 2013, 2022, Oracle and/or its affiliates",
                "Copyright (c) 2013, 2023, Oracle and/or its affiliates",
                "Copyright (c) 2014, 2019, Oracle and/or its affiliates",
                "Copyright (c) 2014, 2021, Oracle and/or its affiliates",
                "Copyright (c) 2014, 2022, Oracle and/or its affiliates",
                "Copyright (c) 2015, 2019, Oracle and/or its affiliates",
                "Copyright (c) 2016, 2020, Oracle and/or its affiliates",
                "Copyright (c) 2016, 2022, Oracle and/or its affiliates",
                "Copyright (c) 2017, 2018, Oracle and/or its affiliates",
                "Copyright (c) 2017, 2019, Oracle and/or its affiliates",
                "Copyright (c) 2017, 2020, Oracle and/or its affiliates",
                "Copyright (c) 2017, 2021, Oracle and/or its affiliates",
                "Copyright (c) 2017, 2023, Oracle and/or its affiliates",
                "Copyright (c) 2018, 2019, Oracle and/or its affiliates",
                "Copyright (c) 2018, 2021, Oracle and/or its affiliates",
                "Copyright (c) 2018, 2022, Oracle and/or its affiliates",
                "Copyright (c) 2018, 2023, Oracle and/or its affiliates",
                "Copyright (c) 2018, Oracle and/or its affiliates",
                "Copyright (c) 2019, 2021, Oracle and/or its affiliates",
                "Copyright (c) 2019, 2022, Oracle and/or its affiliates",
                "Copyright (c) 2019, Oracle and/or its affiliates",
                "Copyright (c) 2020, 2020, Oracle and/or its affiliates",
                "Copyright (c) 2020, Oracle and/or its affiliates",
                "Copyright (c) 2021, 2022, Oracle and/or its affiliates",
                "Copyright (c) 2021, Oracle and/or its affiliates",
                "Copyright (c) 2022, 2023, Oracle and/or its affiliates",
                "Copyright (c) 2022, Oracle and/or its affiliates",
                "Copyright (c) 2023, Oracle and/or its affiliates"
            ],
            "file-count": 123,
            "sha256": "d54206d11df1d448032116be30c51ab29a62f9be3481d27b08c8674d2c99b1e9",
            "source": "https://repo.maven.apache.org/maven2/org/graalvm/sdk/nativeimage/23.1.0/nativeimage-23.1.0-sources.jar",
            "status": "approved"
        }
    ]
}