{
    "id": "maven/mavencentral/org.apache.activemq/artemis-lockmanager-ri/2.33.0",
    "license": "Apache-2.0",
    "authority": "https://gitlab.eclipse.org/eclipsefdn/emo-team/iplab/-/issues/14923",
    "source": "https://repo1.maven.org/maven2/org/apache/activemq/artemis-lockmanager-ri/2.33.0/artemis-lockmanager-ri-2.33.0-sources.jar",
    "status": "approved",
    "scans": [
        {
            "date": "May 29, 2024 at 9:55:33 a.m. GMT",
            "authority": "https://gitlab.eclipse.org/eclipsefdn/emo-team/iplab/-/issues/14923",
            "scancode-version": "31.2.1",
            "licenses-discovered": [
                "Apache-2.0"
            ],
            "copyrights": [
            ],
            "file-count": 11,
            "sha256": "dc1839f4dbee4cfc921db2a4eebbc8f4278f77ee1af4e491f72db193c0af1f72",
            "source": "https://repo1.maven.org/maven2/org/apache/activemq/artemis-lockmanager-ri/2.33.0/artemis-lockmanager-ri-2.33.0-sources.jar",
            "status": "approved"
        }
    ]
}