{
    "id": "maven/mavencentral/io.micrometer/micrometer-observation/1.10.4",
    "license": "Apache-2.0",
    "authority": "https://gitlab.eclipse.org/eclipsefdn/emo-team/iplab/-/issues/7331",
    "source": "https://search.maven.org/remotecontent?filepath=io/micrometer/micrometer-observation/1.10.4/micrometer-observation-1.10.4-sources.jar",
    "status": "approved",
    "scans": [
        {
            "date": "March 7, 2023 at 12:30:13 p.m. GMT",
            "authority": "https://gitlab.eclipse.org/eclipsefdn/emo-team/iplab/-/issues/7331",
            "scancode-version": "31.2.1",
            "licenses-discovered": [
                "Apache-2.0"
            ],
            "copyrights": [
                "Copyright 2002-2021 the original author or authors",
                "Copyright 2021 VMware, Inc.",
                "Copyright 2022 VMware, Inc."
            ],
            "file-count": 37,
            "sha256": "b661a6c8925f08048d1f5e33f843ecbcc88274db3e234e6ef932f143a0ddf7fd",
            "source": "https://search.maven.org/remotecontent?filepath=io/micrometer/micrometer-observation/1.10.4/micrometer-observation-1.10.4-sources.jar",
            "status": "approved"
        }
    ]
}