{
    "id": "npm/npmjs/@eslint/compat/1.2.4",
    "license": "Apache-2.0 AND MIT",
    "authority": "https://gitlab.eclipse.org/eclipsefdn/emo-team/iplab/-/issues/18934",
    "source": "https://github.com/eslint/rewrite/archive/refs/tags/compat-v1.2.4.zip",
    "status": "approved",
    "scans": [
        {
            "date": "January 19, 2025 at 11:33:52 a.m. GMT",
            "authority": "https://gitlab.eclipse.org/eclipsefdn/emo-team/iplab/-/issues/18934",
            "scancode-version": "31.2.1",
            "licenses-discovered": [
                "Apache-2.0",
                "JSON",
                "MIT"
            ],
            "copyrights": [
                "Copyright (c) 2018 Lars Kappert",
                "Copyright (c) 2023 Lars Kappert, https://webpro.nl <lars@webpro.nl>"
            ],
            "file-count": 157,
            "sha256": "5260455559d47c73b4dfba69a1d2be2899f3843ff057856bfcdaf1c34f7c8b2a",
            "source": "https://github.com/eslint/rewrite/archive/refs/tags/compat-v1.2.4.zip",
            "status": "restricted"
        }
    ]
}