{
    "id": "maven/mavencentral/org.springframework.security/spring-security-oauth2-jose/6.0.2",
    "license": "Apache-2.0",
    "authority": "https://gitlab.eclipse.org/eclipsefdn/emo-team/iplab/-/issues/7337",
    "source": "https://search.maven.org/remotecontent?filepath=org/springframework/security/spring-security-oauth2-jose/6.0.2/spring-security-oauth2-jose-6.0.2-sources.jar",
    "status": "approved",
    "scans": [
        {
            "date": "March 7, 2023 at 12:20:01 p.m. GMT",
            "authority": "https://gitlab.eclipse.org/eclipsefdn/emo-team/iplab/-/issues/7337",
            "scancode-version": "31.2.1",
            "licenses-discovered": [
                "Apache-2.0"
            ],
            "copyrights": [
                "Copyright 2002-2017 the original author or authors",
                "Copyright 2002-2018 the original author or authors",
                "Copyright 2002-2019 the original author or authors",
                "Copyright 2002-2020 the original author or authors",
                "Copyright 2002-2021 the original author or authors",
                "Copyright 2002-2022 the original author or authors"
            ],
            "file-count": 43,
            "sha256": "866f64b0a4f2b2c80595db251a1a17a08605bc5c515981fb1f03b800d35c46df",
            "source": "https://search.maven.org/remotecontent?filepath=org/springframework/security/spring-security-oauth2-jose/6.0.2/spring-security-oauth2-jose-6.0.2-sources.jar",
            "status": "approved"
        }
    ]
}