{
    "id": "git/github/microsoft/vscode-node-debug2/v1.42.5",
    "license": "MIT",
    "licenses-discovered": [
        "MIT"
    ],
    "copyrights": [
        "Copyright (c) 2011 Einar Otto Stangvik <einaros@gmail.com>",
        "Copyright (c) Microsoft Corporation"
    ],
    "file-count": 193,
    "scancode-version": "31.2.1",
    "authority": "https://gitlab.eclipse.org/eclipsefdn/emo-team/iplab/-/issues/4121",
    "source": "https://github.com/microsoft/vscode-node-debug2/archive/refs/tags/v1.42.5.zip",
    "status": "approved"
}