{
    "id": "npm/npmjs/-/i18next/22.4.15",
    "license": "MIT",
    "authority": "https://gitlab.eclipse.org/eclipsefdn/emo-team/iplab/-/issues/8063",
    "source": "https://github.com/i18next/i18next/archive/v22.4.15.zip",
    "status": "approved",
    "scans": [
        {
            "date": "April 28, 2023 at 2:38:04 p.m. GMT",
            "authority": "https://gitlab.eclipse.org/eclipsefdn/emo-team/iplab/-/issues/8063",
            "scancode-version": "31.2.1",
            "licenses-discovered": [
                "MIT"
            ],
            "copyrights": [
                "Copyright (c) 2015 Jan Muhlemann",
                "Copyright (c) 2022 i18next"
            ],
            "file-count": 135,
            "sha256": "f8f37b8b1fe93d54d8dba379083a73c562610cc9550b3cccee4b6345c02b3c59",
            "source": "https://github.com/i18next/i18next/archive/v22.4.15.zip",
            "status": "approved"
        }
    ]
}