{
    "id": "maven/mavencentral/com.fasterxml.jackson.core/jackson-annotations/2.15.4",
    "license": "Apache-2.0",
    "authority": "https://gitlab.eclipse.org/eclipsefdn/emo-team/iplab/-/issues/15260",
    "source": "https://repo1.maven.org/maven2/com/fasterxml/jackson/core/jackson-annotations/2.15.4/jackson-annotations-2.15.4-sources.jar",
    "status": "approved",
    "scans": [
        {
            "date": "June 14, 2024 at 3:59:52 p.m. GMT",
            "authority": "https://gitlab.eclipse.org/eclipsefdn/emo-team/iplab/-/issues/15260",
            "scancode-version": "31.2.1",
            "licenses-discovered": [
                "Apache-2.0"
            ],
            "copyrights": [
            ],
            "file-count": 50,
            "sha256": "fb6e95e65649600277a3ab8a8df7aea490d3ee12b42f0eb9e8f3319d6903b652",
            "source": "https://repo1.maven.org/maven2/com/fasterxml/jackson/core/jackson-annotations/2.15.4/jackson-annotations-2.15.4-sources.jar",
            "status": "approved"
        }
    ]
}