{
    "id": "npm/npmjs/-/reftools/1.1.9",
    "license": "BSD-3-Clause AND (BSD-3-Clause AND MIT)",
    "licenses-discovered": [
        "BSD-3-Clause",
        "BSD-3-Clause AND MIT"
    ],
    "copyrights": [
        "Copyright (c) Mike Ralphson"
    ],
    "file-count": 13,
    "scancode-version": "30.1.0",
    "authority": "https://gitlab.eclipse.org/eclipsefdn/emo-team/iplab/-/issues/3490",
    "source": "https://registry.npmjs.org/reftools/-/reftools-1.1.9.tgz",
    "status": "approved"
}