{
    "id": "pypi/pypi/-/beautifulsoup4/4.11.0",
    "license": "MIT AND (GPL-1.0-or-later AND MIT)",
    "licenses-discovered": [
        "MIT",
        "GPL-1.0-or-later AND MIT"
    ],
    "copyrights": [
        "Copyright (c) 2004-2017 Leonard Richardson",
        "Copyright (c) 2004-2019 Leonard Richardson",
        "Copyright (c) 2004-2022 Leonard Richardson",
        "Copyright (c) 2006-2013 James Graham and other contributors",
        "Copyright (c) 2018 Isaac Muse",
        "copyright u'2004-2015, Leonard Richardson",
        "copyright u'2004-2020, Leonard Richardson",
        "copyright u'2012, Leonard Richardson"
    ],
    "file-count": 44,
    "scancode-version": "31.2.1",
    "authority": "https://gitlab.eclipse.org/eclipsefdn/emo-team/iplab/-/issues/4730",
    "source": "https://files.pythonhosted.org/packages/ce/a1/b8e714f2e6345ded6a6c43cc43b308903153e3091763ec6832f82de7a269/beautifulsoup4-4.11.0.tar.gz",
    "status": "restricted"
}