{
    "id": "npm/npmjs/-/styled-components/5.3.5",
    "license": "MIT",
    "licenses-discovered": [
        "MIT"
    ],
    "copyrights": [
        "Copyright (c) Glen Maddern and Maximilian Stoiber",
        "Copyright (c) Jon Schlinkert",
        "Copyright (c) Paul Armstrong https://github.com/paularmstrong/react-component-benchmark",
        "Copyright (c) Sultan Tarimo"
    ],
    "file-count": 446,
    "scancode-version": "30.1.0",
    "authority": "https://gitlab.eclipse.org/eclipsefdn/emo-team/iplab/-/issues/3021",
    "source": "https://github.com/styled-components/styled-components/archive/v5.3.5.zip",
    "status": "approved"
}