{
    "id": "maven/mavencentral/com.google.api.grpc/grpc-google-cloud-bigquerystorage-v1/3.9.2",
    "license": "Apache-2.0",
    "authority": "https://gitlab.eclipse.org/eclipsefdn/emo-team/iplab/-/issues/16738",
    "source": "https://repo1.maven.org/maven2/com/google/api/grpc/grpc-google-cloud-bigquerystorage-v1/3.9.2/grpc-google-cloud-bigquerystorage-v1-3.9.2-sources.jar",
    "status": "approved",
    "scans": [
        {
            "date": "October 15, 2024, 6:08:17 p.m. GMT",
            "authority": "https://gitlab.eclipse.org/eclipsefdn/emo-team/iplab/-/issues/16738",
            "scancode-version": "31.2.1",
            "licenses-discovered": [
                "Apache-2.0"
            ],
            "copyrights": [
                "Copyright 2024 Google LLC"
            ],
            "file-count": 5,
            "sha256": "30221f3c7da8f10a315c6f84815d00c88c6cab5e3209e8691dba707bc12cdf9e",
            "source": "https://repo1.maven.org/maven2/com/google/api/grpc/grpc-google-cloud-bigquerystorage-v1/3.9.2/grpc-google-cloud-bigquerystorage-v1-3.9.2-sources.jar",
            "status": "approved"
        }
    ]
}