{
    "id": "-/sourceforge/lpg/lpg-generator-cpp/2.0.17",
    "license": "EPL-1.0",
    "authority": "https://gitlab.eclipse.org/eclipsefdn/emo-team/iplab/-/issues/11249",
    "source": "https://sourceforge.net/projects/lpg/files/LPG/v2.0.17/lpg-generator-cpp-src-2.0.17.zip/download",
    "status": "approved",
    "scans": [
        {
            "date": "October 26, 2023 at 5:22:19 p.m. GMT",
            "authority": "https://gitlab.eclipse.org/eclipsefdn/emo-team/iplab/-/issues/11249",
            "scancode-version": "31.2.1",
            "licenses-discovered": [
            ],
            "copyrights": [
                "(c) Copyright IBM Corp. 1984, 2006"
            ],
            "file-count": 110,
            "sha256": "bba5e09c88aacbe3983c8d435c38620f38df68c812db34fa045305a1d3b4c9c8",
            "source": "https://sourceforge.net/projects/lpg/files/LPG/v2.0.17/lpg-generator-cpp-src-2.0.17.zip/download",
            "status": "restricted"
        }
    ]
}
