{
    "license": "MIT",
    "file-count": 31,
    "authority": "https://gitlab.eclipse.org/eclipsefdn/emo-team/iplab/-/issues/4821",
    "scancode-version": "31.2.1",
    "licenses-discovered": [
        "MIT",
        "GPL-2.0-only",
        "Apache-2.0"
    ],
    "id": "pypi/pypi/-/pyinotify/0.9.6",
    "source": "https://files.pythonhosted.org/packages/e3/c0/fd5b18dde17c1249658521f69598f3252f11d9d7a980c5be8619970646e1/pyinotify-0.9.6.tar.gz",
    "status": "approved",
    "copyrights": [
        "Copyright (c) 2005-2011 Sebastien Martini <seb@dbzteam.org>",
        "Copyright (c) 2005-2015 Sebastien Martini <seb@dbzteam.org>",
        "Copyright (c) 2010 Sebastien Martini <seb@dbzteam.org>"
    ]
}
