{
    "license": "MIT",
    "file-count": 9,
    "authority": "https://gitlab.eclipse.org/eclipsefdn/emo-team/iplab/-/issues/1038",
    "scancode-version": "21.3.31",
    "licenses-discovered": [
        "MIT"
    ],
    "id": "npm/npmjs/-/preserve/0.2.0",
    "source": "https://registry.npmjs.org/preserve/-/preserve-0.2.0.tgz",
    "status": "approved"
}