{
    "id": "project/iot.keypop/eclipse-keypop/keypop-ops/0ec4a128c37b83290d58b711b543e8aca3bb344e",
    "license": "MIT",
    "authority": "https://gitlab.eclipse.org/eclipsefdn/emo-team/iplab/-/issues/10226",
    "source": "https://github.com/eclipse-keypop/keypop-ops/archive/0ec4a128c37b83290d58b711b543e8aca3bb344e.zip",
    "status": "approved",
    "scans": [
        {
            "date": "August 24, 2023 at 5:35:05 p.m. GMT",
            "authority": "https://gitlab.eclipse.org/eclipsefdn/emo-team/iplab/-/issues/10226",
            "scancode-version": "31.2.1",
            "licenses-discovered": [
                "MIT"
            ],
            "copyrights": [
                "Copyright (c) 2023 Calypso Networks Association"
            ],
            "file-count": 2,
            "sha256": "c1a7ab91547baa1b7def238bda51dc838ed2c89e69b6e533dacc7453419538d5",
            "source": "https://github.com/eclipse-keypop/keypop-ops/archive/0ec4a128c37b83290d58b711b543e8aca3bb344e.zip",
            "status": "restricted"
        }
    ]
}
