{
    "id": "npm/npmjs/@esbuild/linux-ppc64/0.18.20",
    "license": "Apache-2.0 AND MIT AND BSD-3-Clause AND (BSD-2-Clause AND BSD-3-Clause)",
    "authority": "https://gitlab.eclipse.org/eclipsefdn/emo-team/iplab/-/issues/9931",
    "source": "https://github.com/evanw/esbuild/archive/refs/tags/v0.18.20.zip",
    "status": "approved",
    "scans": [
        {
            "date": "August 11, 2023 at 12:28:07 a.m. GMT",
            "authority": "https://gitlab.eclipse.org/eclipsefdn/emo-team/iplab/-/issues/9931",
            "scancode-version": "31.2.1",
            "licenses-discovered": [
                "Apache-2.0",
                "MIT",
                "BSD-3-Clause",
                "BSD-2-Clause AND BSD-3-Clause"
            ],
            "copyrights": [
                "(c) Evil Software Corp",
                "(c) Good Software",
                "(c) Good Software Corp",
                "(c) expectPrintedTarget t, 2019",
                "Copyright (c) 2009 The Go Authors",
                "Copyright (c) 2016 Caleb Spare",
                "Copyright (c) 2020 Evan Wallace",
                "Copyright (c) Microsoft Corporation",
                "Copyright 2012-2019 (c) Mihai Bazon <mihai.bazon@gmail.com>"
            ],
            "file-count": 297,
            "sha256": "8bca542bc4771748235b870bd28ef9d245d10cbd915413c16abee2290753da25",
            "source": "https://github.com/evanw/esbuild/archive/refs/tags/v0.18.20.zip",
            "status": "approved"
        }
    ]
}