{
    "id": "maven/mavencentral/org.apache.jena/jena-tdb2/4.8.0",
    "license": "Apache-2.0",
    "authority": "https://gitlab.eclipse.org/eclipsefdn/emo-team/iplab/-/issues/8881",
    "source": "https://repo.maven.apache.org/maven2/org/apache/jena/jena-tdb2/4.8.0/jena-tdb2-4.8.0-sources.jar",
    "status": "approved",
    "scans": [
        {
            "date": "June 14, 2023 at 6:35:56 p.m. GMT",
            "authority": "https://gitlab.eclipse.org/eclipsefdn/emo-team/iplab/-/issues/8881",
            "scancode-version": "31.2.1",
            "licenses-discovered": [
                "Apache-2.0"
            ],
            "copyrights": [
            ],
            "file-count": 134,
            "sha256": "e75fa2540463d02262a03c85313ae99a323b897b32f456bddadb27366653ffa2",
            "source": "https://repo.maven.apache.org/maven2/org/apache/jena/jena-tdb2/4.8.0/jena-tdb2-4.8.0-sources.jar",
            "status": "approved"
        }
    ]
}