{
    "id": "maven/mavencentral/org.apache.lucene/lucene-misc/9.4.2",
    "license": "Apache-2.0",
    "authority": "https://gitlab.eclipse.org/eclipsefdn/emo-team/iplab/-/issues/6992",
    "source": "https://search.maven.org/remotecontent?filepath=org/apache/lucene/lucene-misc/9.4.2/lucene-misc-9.4.2-sources.jar",
    "status": "approved",
    "scans": [
        {
            "date": "February 3, 2023 at 7:00:52 p.m. GMT",
            "authority": "https://gitlab.eclipse.org/eclipsefdn/emo-team/iplab/-/issues/6992",
            "scancode-version": "31.2.1",
            "licenses-discovered": [
                "Apache-2.0"
            ],
            "copyrights": [
            ],
            "file-count": 33,
            "sha256": "189d3ecc24e43e4966e9ff604f3f06cb2bcecf5b0eb173bdfc998d22890811e0",
            "source": "https://search.maven.org/remotecontent?filepath=org/apache/lucene/lucene-misc/9.4.2/lucene-misc-9.4.2-sources.jar",
            "status": "approved"
        }
    ]
}