{
    "id": "maven/mavencentral/org.apache.activemq/artemis-amqp-protocol/2.31.0",
    "license": "Apache-2.0",
    "authority": "https://gitlab.eclipse.org/eclipsefdn/emo-team/iplab/-/issues/10631",
    "source": "https://repo.maven.apache.org/maven2/org/apache/activemq/artemis-amqp-protocol/2.31.0/artemis-amqp-protocol-2.31.0-sources.jar",
    "status": "approved",
    "scans": [
        {
            "date": "September 22, 2023 at 7:48:36 a.m. GMT",
            "authority": "https://gitlab.eclipse.org/eclipsefdn/emo-team/iplab/-/issues/10631",
            "scancode-version": "31.2.1",
            "licenses-discovered": [
                "Apache-2.0"
            ],
            "copyrights": [
                "Copyright 2016 Ognyan Bankov"
            ],
            "file-count": 152,
            "sha256": "db6eebeba7a9e1ca4daf7af39a1930173aa3bb5a7994634ef3435695d9333c9d",
            "source": "https://repo.maven.apache.org/maven2/org/apache/activemq/artemis-amqp-protocol/2.31.0/artemis-amqp-protocol-2.31.0-sources.jar",
            "status": "approved"
        }
    ]
}