{
    "id": "npm/npmjs/@types/mime-types/2.1.2",
    "license": "MIT",
    "authority": "https://gitlab.eclipse.org/eclipsefdn/emo-team/iplab/-/issues/11007",
    "source": "https://registry.yarnpkg.com/@types/mime-types/-/mime-types-2.1.2.tgz",
    "status": "approved",
    "scans": [
        {
            "date": "October 11, 2023 at 5:32:47 a.m. GMT",
            "authority": "https://gitlab.eclipse.org/eclipsefdn/emo-team/iplab/-/issues/11007",
            "scancode-version": "31.2.1",
            "licenses-discovered": [
                "MIT"
            ],
            "copyrights": [
                "Copyright (c) Microsoft Corporation"
            ],
            "file-count": 4,
            "sha256": "61196a30b02477500b80edd37d07e5c4b177c29bd36b33337e2ac509efe1b61d",
            "source": "https://registry.yarnpkg.com/@types/mime-types/-/mime-types-2.1.2.tgz",
            "status": "approved"
        }
    ]
}