{
    "id": "maven/mavencentral/io.gatling/gatling-http-java/3.9.2",
    "license": "Apache-2.0",
    "authority": "https://gitlab.eclipse.org/eclipsefdn/emo-team/iplab/-/issues/10173",
    "source": "https://repo.maven.apache.org/maven2/io/gatling/gatling-http-java/3.9.2/gatling-http-java-3.9.2-sources.jar",
    "status": "approved",
    "scans": [
        {
            "date": "August 23, 2023 at 10:33:42 a.m. GMT",
            "authority": "https://gitlab.eclipse.org/eclipsefdn/emo-team/iplab/-/issues/10173",
            "scancode-version": "31.2.1",
            "licenses-discovered": [
                "Apache-2.0"
            ],
            "copyrights": [
                "Copyright 2011-2023 GatlingCorp (https://gatling.io)"
            ],
            "file-count": 35,
            "sha256": "a7bdbe414afdf0e9b1ee2ae96eade307a373ff81cec0c8ec5b4fa7ded103df60",
            "source": "https://repo.maven.apache.org/maven2/io/gatling/gatling-http-java/3.9.2/gatling-http-java-3.9.2-sources.jar",
            "status": "approved"
        }
    ]
}