{
    "license": "MIT AND MPL-2.0",
    "file-count": 265,
    "authority": "https://gitlab.eclipse.org/eclipsefdn/emo-team/iplab/-/issues/1186",
    "scancode-version": "21.3.31",
    "licenses-discovered": [
        "MIT",
        "MPL-2.0"
    ],
    "id": "npm/npmjs/-/shiki/0.9.7",
    "source": "https://github.com/octref/shiki/archive/v0.9.7.zip",
    "status": "approved"
}