{
    "id": "go/golang/helm.sh%2Fhelm/v3/v3.10.2",
    "license": "Apache-2.0 AND (Apache-2.0 AND BSD-3-Clause) AND BSD-3-Clause AND (Apache-2.0 AND MIT)",
    "authority": "https://gitlab.eclipse.org/eclipsefdn/emo-team/iplab/-/issues/5862",
    "source": "https://proxy.golang.org/helm.sh%2Fhelm/v3/@v/v3.10.2.zip",
    "status": "approved",
    "scans": [
        {
            "date": "December 14, 2022 at 10:37:13 p.m. GMT",
            "authority": "https://gitlab.eclipse.org/eclipsefdn/emo-team/iplab/-/issues/5862",
            "scancode-version": "31.2.1",
            "licenses-discovered": [
                "Apache-2.0",
                "Apache-2.0 AND BSD-3-Clause",
                "BSD-3-Clause",
                "Apache-2.0 AND MIT"
            ],
            "copyrights": [
                "Copyright (c) 2004, 2006 The Linux Foundation and its contributors",
                "Copyright 2016 The Kubernetes Authors"
            ],
            "file-count": 1781,
            "sha256": "06e8a5a9bd002a4c205bbf7b47762aca1c485900c393570dafbb3463fda48192",
            "source": "https://proxy.golang.org/helm.sh%2Fhelm/v3/@v/v3.10.2.zip",
            "status": "approved"
        }
    ]
}