{
    "id": "git/github/envoyproxy/go-control-plane/v0.9.0",
    "license": "Apache-2.0",
    "authority": "https://gitlab.eclipse.org/eclipsefdn/emo-team/iplab/-/issues/5170",
    "source": "https://github.com/envoyproxy/go-control-plane/archive/refs/tags/v0.9.0.zip",
    "status": "approved",
    "scans": [
        {
            "date": "November 25, 2022 at 6:12:23 a.m. GMT",
            "authority": "https://gitlab.eclipse.org/eclipsefdn/emo-team/iplab/-/issues/5170",
            "scancode-version": "31.2.1",
            "licenses-discovered": [
                "Apache-2.0"
            ],
            "copyrights": [
                "Copyright 2018 Envoyproxy",
                "Copyright 2019 Envoyproxy"
            ],
            "file-count": 505,
            "sha256": "1aed30a6807d9fb51491e4cb0261ce2d88b9f6e987093c65fcab0d7151217021",
            "source": "https://github.com/envoyproxy/go-control-plane/archive/refs/tags/v0.9.0.zip",
            "status": "approved"
        }
    ]
}