{
    "id": "maven/mavencentral/com.fasterxml.jackson.module/jackson-module-jakarta-xmlbind-annotations/2.18.0",
    "license": "Apache-2.0",
    "authority": "https://gitlab.eclipse.org/eclipsefdn/emo-team/iplab/-/issues/16368",
    "source": "https://repo1.maven.org/maven2/com/fasterxml/jackson/module/jackson-module-jakarta-xmlbind-annotations/2.18.0/jackson-module-jakarta-xmlbind-annotations-2.18.0-sources.jar",
    "status": "approved",
    "scans": [
        {
            "date": "September 27, 2024, 6:05:55 a.m. GMT",
            "authority": "https://gitlab.eclipse.org/eclipsefdn/emo-team/iplab/-/issues/16368",
            "scancode-version": "31.2.1",
            "licenses-discovered": [
                "Apache-2.0"
            ],
            "copyrights": [
            ],
            "file-count": 12,
            "sha256": "128f6a9d12012ca4b7297fc7a6acdfaff7e5f1ed2d2d40cbce3bd78dadfdc339",
            "source": "https://repo1.maven.org/maven2/com/fasterxml/jackson/module/jackson-module-jakarta-xmlbind-annotations/2.18.0/jackson-module-jakarta-xmlbind-annotations-2.18.0-sources.jar",
            "status": "approved"
        }
    ]
}