{
    "id": "project/ecd.theia/-/vscode-builtin-extensions/1.72.2",
    "license": "MIT AND Apache-2.0 AND BSD-3-Clause AND W3C AND Unicode-TOU",
    "authority": "https://gitlab.eclipse.org/eclipsefdn/emo-team/iplab/-/issues/7951",
    "source": "https://gitlab.eclipse.org/eclipsefdn/emo-team/iplab/uploads/1494b604e895696df3cc848eff744973/vscode-builtin-extensions-1.72.2.tar.gz",
    "status": "approved",
    "scans": [
        {
            "date": "April 25, 2023 at 7:25:50 p.m. GMT",
            "authority": "https://gitlab.eclipse.org/eclipsefdn/emo-team/iplab/-/issues/7951",
            "scancode-version": "31.2.1",
            "licenses-discovered": [
                "Apache-2.0",
                "MIT",
                "LicenseRef-scancode-boost-original AND MIT",
                "BSD-3-Clause",
                "LicenseRef-scancode-boost-original",
                "Apache-2.0 AND MIT AND W3C",
                "LicenseRef-scancode-boost-original AND LicenseRef-scancode-unknown AND MIT",
                "Apache-2.0 AND LicenseRef-scancode-unicode AND MIT AND W3C AND W3C-20150513"
            ],
            "copyrights": [
                "Copyright (c) 1991-2017 Unicode, Inc.",
                "Copyright (c) 2008 Tim",
                "Copyright (c) 2014 Darin",
                "Copyright (c) 2014 Darin Morrison",
                "Copyright (c) 2014 GitHub",
                "Copyright (c) 2014 James",
                "Copyright (c) 2014 Jesse Weed",
                "Copyright (c) 2015 David Owens",
                "Copyright (c) 2015 David Owens II",
                "Copyright (c) 2015 FichteFoll <fichtefoll2@googlemail.com>",
                "Copyright (c) 2015 W3C(r) (MIT, ERCIM, Keio, Beihang)",
                "Copyright (c) 2015 W3C(r) MIT, ERCIM, Keio",
                "Copyright (c) 2019 Jeff Hykin",
                "Copyright (c) Microsoft 2018",
                "Copyright (c) Microsoft Corporation",
                "Copyright (c) daaain/Handlebars project",
                "Copyright (c) sumneko-lua.tmbundle project",
                "Copyright (c) textmate-asp.vb.net.tmbundle project",
                "Copyright (c) textmate-diff.tmbundle project",
                "Copyright (c) textmate-groovy.tmbundle project",
                "Copyright (c) textmate-html.tmbundle project",
                "Copyright (c) textmate-ini.tmbundle project",
                "Copyright (c) textmate-javascript.tmbundle project",
                "Copyright (c) textmate-make.tmbundle project",
                "Copyright (c) textmate-perl.tmbundle project",
                "Copyright (c) textmate-ruby.tmbundle project",
                "Copyright 2020, the Dart project",
                "Copyright Drifty Co. http://drifty.com/"
            ],
            "file-count": 1418,
            "sha256": "3779e5980d606bc6c8062c20fb326151f1acb61eb105194f809f03c4dacc4d1a",
            "source": "https://gitlab.eclipse.org/eclipsefdn/emo-team/iplab/uploads/1494b604e895696df3cc848eff744973/vscode-builtin-extensions-1.72.2.tar.gz",
            "status": "restricted"
        }
    ]
}
