{
    "id": "p2/orbit/p2.eclipse-plugin/org.swinglabs.swing-layout/1.0.3",
    "license": "LGPL-2.1-only",
    "licenses-discovered": [
    ],
    "file-count": 9,
    "scancode-version": "30.1.0",
    "authority": "https://gitlab.eclipse.org/eclipsefdn/emo-team/iplab/-/issues/2316",
    "source": "https://search.maven.org/remotecontent?filepath=org/swinglabs/swing-layout/1.0.3/swing-layout-1.0.3-sources.jar",
    "status": "restricted",
    "workswith": [
        "ee4j.jersey"
    ]
}
