{
    "id": "npm/npmjs/-/volar-service-css/0.0.2",
    "license": "MIT",
    "authority": "https://gitlab.eclipse.org/eclipsefdn/emo-team/iplab/-/issues/8791",
    "source": "https://github.com/volarjs/services/archive/refs/tags/v0.0.2.zip",
    "status": "approved",
    "scans": [
        {
            "date": "June 11, 2023 at 11:12:56 p.m. GMT",
            "authority": "https://gitlab.eclipse.org/eclipsefdn/emo-team/iplab/-/issues/8791",
            "scancode-version": "31.2.1",
            "licenses-discovered": [
                "MIT"
            ],
            "copyrights": [
                "Copyright (c) Microsoft Corporation"
            ],
            "file-count": 122,
            "sha256": "8e11c184b0efda0706a89d46759f7dac86a4dbde4b02054f21493b9c7e1f0350",
            "source": "https://github.com/volarjs/services/archive/refs/tags/v0.0.2.zip",
            "status": "approved"
        }
    ]
}