{
    "id": "pypi/pypi/-/blinker/1.4",
    "license": "MIT AND BSD-3-Clause",
    "authority": "https://gitlab.eclipse.org/eclipsefdn/emo-team/iplab/-/issues/6310",
    "source": "https://files.pythonhosted.org/packages/1b/51/e2a9f3b757eb802f61dc1f2b09c8c99f6eb01cf06416c0671253536517b6/blinker-1.4.tar.gz",
    "status": "approved",
    "scans": [
        {
            "date": "January 12, 2023 at 8:10:40 p.m. GMT",
            "authority": "https://gitlab.eclipse.org/eclipsefdn/emo-team/iplab/-/issues/6310",
            "scancode-version": "31.2.1",
            "licenses-discovered": [
                "MIT",
                "BSD-3-Clause"
            ],
            "copyrights": [
                "(c) 2009-2012 Jeremy Ashkenas, DocumentCloud Inc. Underscore",
                "Copyright (c) 2006 Patrick K. O'Brien, Mike C. Fletcher, Matthew R. Scott",
                "Copyright (c) The Blinker authors and contributors",
                "Copyright 2007-2010 by the Sphinx team",
                "Copyright 2007-2013 by the Sphinx team",
                "copyright u'2010, Jason Kirtland The version info for the project"
            ],
            "file-count": 50,
            "sha256": "471aee25f3992bd325afa3772f1063dbdbbca947a041b8b89466dc00d606f8b6",
            "source": "https://files.pythonhosted.org/packages/1b/51/e2a9f3b757eb802f61dc1f2b09c8c99f6eb01cf06416c0671253536517b6/blinker-1.4.tar.gz",
            "status": "approved"
        }
    ]
}