{
    "id": "maven/mavencentral/org.commonmark/commonmark-ext-gfm-tables/0.22.0",
    "license": "BSD-2-Clause",
    "authority": "https://gitlab.eclipse.org/eclipsefdn/emo-team/iplab/-/issues/13797",
    "source": "https://repo1.maven.org/maven2/org/commonmark/commonmark-ext-gfm-tables/0.22.0/commonmark-ext-gfm-tables-0.22.0-sources.jar",
    "status": "approved",
    "scans": [
        {
            "date": "March 16, 2024 at 7:30:27 a.m. GMT",
            "authority": "https://gitlab.eclipse.org/eclipsefdn/emo-team/iplab/-/issues/13797",
            "scancode-version": "31.2.1",
            "licenses-discovered": [
                "BSD-2-Clause"
            ],
            "copyrights": [
                "Copyright (c) 2015, Atlassian Pty Ltd"
            ],
            "file-count": 16,
            "sha256": "c03426a38d8383d49c7219cd42e1f69831666691d547131a0be0296caad9b884",
            "source": "https://repo1.maven.org/maven2/org/commonmark/commonmark-ext-gfm-tables/0.22.0/commonmark-ext-gfm-tables-0.22.0-sources.jar",
            "status": "approved"
        }
    ]
}