{
    "id": "npm/npmjs/@types/react-is/18.2.1",
    "license": "MIT",
    "authority": "https://gitlab.eclipse.org/eclipsefdn/emo-team/iplab/-/issues/9131",
    "source": "https://registry.npmjs.org/@types/react-is/-/react-is-18.2.1.tgz",
    "status": "approved",
    "scans": [
        {
            "date": "June 22, 2023 at 3:14:01 a.m. GMT",
            "authority": "https://gitlab.eclipse.org/eclipsefdn/emo-team/iplab/-/issues/9131",
            "scancode-version": "31.2.1",
            "licenses-discovered": [
                "MIT"
            ],
            "copyrights": [
                "Copyright (c) Microsoft Corporation"
            ],
            "file-count": 5,
            "sha256": "c235baea4d1194857ea60bfe606acd53f0f95d276f8da9f90fc1828299f53d6f",
            "source": "https://registry.npmjs.org/@types/react-is/-/react-is-18.2.1.tgz",
            "status": "approved"
        }
    ]
}