{
    "id": "npm/npmjs/-/ignore/5.2.4",
    "license": "MIT",
    "authority": "https://gitlab.eclipse.org/eclipsefdn/emo-team/iplab/-/issues/5907",
    "source": "https://registry.yarnpkg.com/ignore/-/ignore-5.2.4.tgz",
    "status": "approved",
    "scans": [
        {
            "date": "December 20, 2022 at 12:35:57 a.m. GMT",
            "authority": "https://gitlab.eclipse.org/eclipsefdn/emo-team/iplab/-/issues/5907",
            "scancode-version": "31.2.1",
            "licenses-discovered": [
                "MIT"
            ],
            "copyrights": [
                "Copyright (c) 2013 Kael Zhang <i@kael.me> , contributors http://kael.me"
            ],
            "file-count": 6,
            "sha256": "8cddcbabeb147a8d5e3fda9ab02f250248708827c7a3ef8b948b2d458dd5e2f7",
            "source": "https://registry.yarnpkg.com/ignore/-/ignore-5.2.4.tgz",
            "status": "approved"
        }
    ]
}