{
    "id": "p2/orbit/p2.eclipse-plugin/org.apache.poi.ooxml/4.1.1",
    "license": "Apache-2.0 AND BSD-3-Clause AND EPL-1.0 AND MIT AND Apache-2.0",
    "licenses-discovered": [
        "Apache-2.0 AND BSD-3-Clause AND EPL-1.0 AND MIT",
        "Apache-2.0"
    ],
    "copyrights": [
        "Copyright (c) 2000-2006, www.hamcrest.org",
        "Copyright (c) 2004-2013 QOS.ch",
        "Copyright (c) 2008-2014 FedICT.",
        "Copyright (c) 2015 Inbot"
    ],
    "file-count": 614,
    "scancode-version": "31.2.1",
    "authority": "https://gitlab.eclipse.org/eclipsefdn/emo-team/iplab/-/issues/3938",
    "source": "https://search.maven.org/remotecontent?filepath=org/apache/poi/poi-ooxml/4.1.1/poi-ooxml-4.1.1-sources.jar",
    "status": "approved"
}