{
    "id": "crate/cratesio/-/futures/0.3.31",
    "license": "Apache-2.0 AND MIT AND Apache-2.0 AND MIT",
    "authority": "https://gitlab.eclipse.org/eclipsefdn/emo-team/iplab/-/issues/17221",
    "source": "https://crates.io/api/v1/crates/futures/0.3.31/download",
    "status": "approved",
    "scans": [
        {
            "date": "November 14, 2024, 7:52:06 a.m. GMT",
            "authority": "https://gitlab.eclipse.org/eclipsefdn/emo-team/iplab/-/issues/17221",
            "scancode-version": "31.2.1",
            "licenses-discovered": [
                "Apache-2.0 AND MIT",
                "Apache-2.0",
                "MIT"
            ],
            "copyrights": [
                "Copyright (c) 2016 Alex Crichton",
                "Copyright (c) 2017 The Tokio Authors"
            ],
            "file-count": 66,
            "sha256": "65bc07b1a8bc7c85c5f2e110c476c7389b4554ba72af57d8445ea63a576b0876",
            "source": "https://crates.io/api/v1/crates/futures/0.3.31/download",
            "status": "approved"
        }
    ]
}