{
    "id": "maven/mavencentral/io.grpc/grpc-context/1.59.1",
    "license": "Apache-2.0",
    "authority": "https://gitlab.eclipse.org/eclipsefdn/emo-team/iplab/-/issues/12034",
    "source": "https://repo1.maven.org/maven2/io/grpc/grpc-context/1.59.1/grpc-context-1.59.1-sources.jar",
    "status": "approved",
    "scans": [
        {
            "date": "December 14, 2023 at 11:03:47 a.m. GMT",
            "authority": "https://gitlab.eclipse.org/eclipsefdn/emo-team/iplab/-/issues/12034",
            "scancode-version": "31.2.1",
            "licenses-discovered": [
            ],
            "copyrights": [
            ],
            "file-count": 1,
            "sha256": "59dd023012777a8a51918c8571c49e232af46ac6db7fc2a3a8d805396d8a4863",
            "source": "https://repo1.maven.org/maven2/io/grpc/grpc-context/1.59.1/grpc-context-1.59.1-sources.jar",
            "status": "restricted"
        }
    ]
}
