{
    "id": "maven/mavencentral/com.vaadin/vaadin-renderer-flow/24.6.5",
    "license": "Apache-2.0",
    "authority": "https://gitlab.eclipse.org/eclipsefdn/emo-team/iplab/-/issues/19815",
    "source": "https://repo1.maven.org/maven2/com/vaadin/vaadin-renderer-flow/24.6.5/vaadin-renderer-flow-24.6.5-sources.jar",
    "status": "approved",
    "scans": [
        {
            "date": "March 1, 2025 at 3:37:39 a.m. GMT",
            "authority": "https://gitlab.eclipse.org/eclipsefdn/emo-team/iplab/-/issues/19815",
            "scancode-version": "31.2.1",
            "licenses-discovered": [
                "Apache-2.0"
            ],
            "copyrights": [
                "Copyright 2000-2024 Vaadin Ltd."
            ],
            "file-count": 19,
            "sha256": "7b7a7cc000f8de8fd3d3f049b285d580a278d9c3f0dd14233b0f46adabba1c42",
            "source": "https://repo1.maven.org/maven2/com/vaadin/vaadin-renderer-flow/24.6.5/vaadin-renderer-flow-24.6.5-sources.jar",
            "status": "approved"
        }
    ]
}