{
    "id": "npm/npmjs/-/json5/2.2.3",
    "license": "MIT",
    "authority": "https://gitlab.eclipse.org/eclipsefdn/emo-team/iplab/-/issues/15226",
    "source": "https://github.com/json5/json5/archive/refs/tags/v2.2.3.zip",
    "status": "approved",
    "scans": [
        {
            "date": "June 14, 2024 at 10:47:08 a.m. GMT",
            "authority": "https://gitlab.eclipse.org/eclipsefdn/emo-team/iplab/-/issues/15226",
            "scancode-version": "31.2.1",
            "licenses-discovered": [
                "MIT"
            ],
            "copyrights": [
                "Copyright (c) 2012-2018 Aseem Kishore, and others"
            ],
            "file-count": 36,
            "sha256": "40cfac65746622792c8fc2743af5acf735a0c96344dce551bad5d822b6888afc",
            "source": "https://github.com/json5/json5/archive/refs/tags/v2.2.3.zip",
            "status": "approved"
        }
    ]
}