{
    "id": "npm/npmjs/-/loader-utils/1.4.1",
    "license": "MIT",
    "licenses-discovered": [
        "MIT"
    ],
    "copyrights": [
        "Copyright JS Foundation and other contributors"
    ],
    "file-count": 14,
    "scancode-version": "31.2.1",
    "authority": "https://gitlab.eclipse.org/eclipsefdn/emo-team/iplab/-/issues/4597",
    "source": "https://registry.npmjs.org/loader-utils/-/loader-utils-1.4.1.tgz",
    "status": "approved"
}