{
    "id": "npm/npmjs/-/useragent/2.2.1",
    "license": "Apache-2.0 AND MIT",
    "licenses-discovered": [
        "Apache-2.0",
        "MIT"
    ],
    "copyrights": [
        "Copyright (c) Arnout Kazemier (http://3rd-Eden.com)",
        "Copyright Google Inc."
    ],
    "file-count": 16,
    "scancode-version": "30.1.0",
    "authority": "https://gitlab.eclipse.org/eclipsefdn/emo-team/iplab/-/issues/2879",
    "source": "https://registry.npmjs.org/useragent/-/useragent-2.2.1.tgz",
    "status": "approved"
}