{
    "id": "npm/npmjs/-/vue/3.4.5",
    "license": "MIT",
    "authority": "https://gitlab.eclipse.org/eclipsefdn/emo-team/iplab/-/issues/12656",
    "source": "https://github.com/vuejs/core/archive/refs/tags/v3.4.5.zip",
    "status": "approved",
    "scans": [
        {
            "date": "January 8, 2024 at 10:03:27 a.m. GMT",
            "authority": "https://gitlab.eclipse.org/eclipsefdn/emo-team/iplab/-/issues/12656",
            "scancode-version": "31.2.1",
            "licenses-discovered": [
                "MIT"
            ],
            "copyrights": [
                "Copyright (c) 2013-present, Yuxi",
                "Copyright (c) 2018-present, Yuxi",
                "Copyright 2010, 2011, Chris Winberry <chris@winberry.net>"
            ],
            "file-count": 655,
            "sha256": "55254a816c502d0d553f5e17e2370a6c36d06867e349845a9433fcea0c097afa",
            "source": "https://github.com/vuejs/core/archive/refs/tags/v3.4.5.zip",
            "status": "approved"
        }
    ]
}