{
    "id": "maven/mavencentral/io.fabric8/kubernetes-model-extensions/6.5.0",
    "license": "Apache-2.0",
    "authority": "https://gitlab.eclipse.org/eclipsefdn/emo-team/iplab/-/issues/7359",
    "source": "https://search.maven.org/remotecontent?filepath=io/fabric8/kubernetes-model-extensions/6.5.0/kubernetes-model-extensions-6.5.0-sources.jar",
    "status": "approved",
    "scans": [
        {
            "date": "March 14, 2023 at 10:24:28 a.m. GMT",
            "authority": "https://gitlab.eclipse.org/eclipsefdn/emo-team/iplab/-/issues/7359",
            "scancode-version": "31.2.1",
            "licenses-discovered": [
                "Apache-2.0"
            ],
            "copyrights": [
                "Copyright (c) 2015 Red Hat, Inc."
            ],
            "file-count": 177,
            "sha256": "75c2dbe04be3d56b3317b2c5a1e0308e15dd4cab112a2b4d19e78158e4b5cb58",
            "source": "https://search.maven.org/remotecontent?filepath=io/fabric8/kubernetes-model-extensions/6.5.0/kubernetes-model-extensions-6.5.0-sources.jar",
            "status": "approved"
        }
    ]
}