{
    "id": "maven/mavencentral/androidx.interpolator/interpolator/1.0.0",
    "license": "Apache-2.0",
    "authority": "https://gitlab.eclipse.org/eclipsefdn/emo-team/iplab/-/issues/10495",
    "source": "https://dl.google.com/android/maven2/androidx/interpolator/interpolator/1.0.0/interpolator-1.0.0-sources.jar",
    "status": "approved",
    "scans": [
        {
            "date": "September 12, 2023 at 7:52:32 a.m. GMT",
            "authority": "https://gitlab.eclipse.org/eclipsefdn/emo-team/iplab/-/issues/10495",
            "scancode-version": "31.2.1",
            "licenses-discovered": [
                "Apache-2.0"
            ],
            "copyrights": [
                "Copyright 2018 The Android Open Source Project"
            ],
            "file-count": 5,
            "sha256": "fa13ada71fe7bd9461f622f418e7c16a18e85da7708fb505c75229a9b8830345",
            "source": "https://dl.google.com/android/maven2/androidx/interpolator/interpolator/1.0.0/interpolator-1.0.0-sources.jar",
            "status": "approved"
        }
    ]
}