{
    "id": "maven/mavencentral/javax.xml.bind/jaxb-api/2.4.0-b180725.0427",
    "license": "CDDL-1.1 or GPL-2.0-only with Classpath-exception-2.0",
    "licenses-discovered": [
        "CDDL-1.1",
        "Classpath-exception-2.0",
        "GPL-2.0-only"
    ],
    "file-count": 106,
    "scancode-version": "30.1.0",
    "authority": "https://gitlab.eclipse.org/eclipsefdn/emo-team/iplab/-/issues/2150",
    "source": "https://search.maven.org/remotecontent?filepath=javax/xml/bind/jaxb-api/2.4.0-b180725.0427/jaxb-api-2.4.0-b180725.0427-sources.jar",
    "status": "approved"
}
