{
    "id": "maven/mavencentral/com.danubetech/verifiable-credentials-java/1.9.0",
    "license": "MIT",
    "authority": "https://gitlab.eclipse.org/eclipsefdn/emo-team/iplab/-/issues/19458",
    "source": "https://repo.danubetech.com/repository/maven-public/com/danubetech/verifiable-credentials-java/1.9.0/verifiable-credentials-java-1.9.0-sources.jar",
    "status": "approved",
    "scans": [
        {
            "date": "February 13, 2025 at 1:31:02 p.m. GMT",
            "authority": "https://gitlab.eclipse.org/eclipsefdn/emo-team/iplab/-/issues/19458",
            "scancode-version": "31.2.1",
            "licenses-discovered": [
            ],
            "copyrights": [
            ],
            "file-count": 31,
            "sha256": "c656bdfbdfd164f49a6c3d3bf17f854f2b572774baa68190919ec1ca1cd4f711",
            "source": "https://repo.danubetech.com/repository/maven-public/com/danubetech/verifiable-credentials-java/1.9.0/verifiable-credentials-java-1.9.0-sources.jar",
            "status": "restricted"
        }
    ]
}