{
    "id": "npm/npmjs/-/keycloak-angular/14.2.0",
    "license": "MIT",
    "authority": "https://gitlab.eclipse.org/eclipsefdn/emo-team/iplab/-/issues/13301",
    "source": "https://registry.npmjs.org/keycloak-angular/-/keycloak-angular-14.2.0.tgz",
    "status": "approved",
    "scans": [
        {
            "date": "February 19, 2024 at 3:16:46 p.m. GMT",
            "authority": "https://gitlab.eclipse.org/eclipsefdn/emo-team/iplab/-/issues/13301",
            "scancode-version": "31.2.1",
            "licenses-discovered": [
                "MIT"
            ],
            "copyrights": [
                "Copyright Mauricio Gemelli Vigolo and contributors"
            ],
            "file-count": 22,
            "sha256": "afebf35e08e082b5fcc8950fd03f81453c5aedddd3af7bb84def0119d64dcd89",
            "source": "https://registry.npmjs.org/keycloak-angular/-/keycloak-angular-14.2.0.tgz",
            "status": "approved"
        }
    ]
}