{
    "id": "npm/npmjs/-/vscode-json-languageservice/5.3.0",
    "license": "BSD-2-Clause AND MIT AND MIT",
    "authority": "https://gitlab.eclipse.org/eclipsefdn/emo-team/iplab/-/issues/7161",
    "source": "https://registry.yarnpkg.com/vscode-json-languageservice/-/vscode-json-languageservice-5.3.0.tgz",
    "status": "approved",
    "scans": [
        {
            "date": "February 16, 2023 at 9:30:42 p.m. GMT",
            "authority": "https://gitlab.eclipse.org/eclipsefdn/emo-team/iplab/-/issues/7161",
            "scancode-version": "31.2.1",
            "licenses-discovered": [
                "BSD-2-Clause AND MIT",
                "MIT"
            ],
            "copyrights": [
                "Copyright (c) 2013, Nick Fitzgerald",
                "Copyright (c) Microsoft",
                "Copyright (c) Microsoft Corporation"
            ],
            "file-count": 56,
            "sha256": "b6a726eaadbceb85181520d2d164392166b16b29d24e935a2795b8e3af3b877d",
            "source": "https://registry.yarnpkg.com/vscode-json-languageservice/-/vscode-json-languageservice-5.3.0.tgz",
            "status": "approved"
        }
    ]
}