{
    "id": "maven/mavencentral/com.vaadin/vaadin-tabs-flow/24.6.5",
    "license": "Apache-2.0",
    "authority": "https://gitlab.eclipse.org/eclipsefdn/emo-team/iplab/-/issues/19776",
    "source": "https://repo1.maven.org/maven2/com/vaadin/vaadin-tabs-flow/24.6.5/vaadin-tabs-flow-24.6.5-sources.jar",
    "status": "approved",
    "scans": [
        {
            "date": "March 1, 2025 at 3:07:21 a.m. GMT",
            "authority": "https://gitlab.eclipse.org/eclipsefdn/emo-team/iplab/-/issues/19776",
            "scancode-version": "31.2.1",
            "licenses-discovered": [
                "Apache-2.0"
            ],
            "copyrights": [
                "Copyright 2000-2024 Vaadin Ltd."
            ],
            "file-count": 9,
            "sha256": "739ad1fa7ddad14791abaa46bb329544cc04133093039f951cfaeff0cfe400d8",
            "source": "https://repo1.maven.org/maven2/com/vaadin/vaadin-tabs-flow/24.6.5/vaadin-tabs-flow-24.6.5-sources.jar",
            "status": "approved"
        }
    ]
}