{
    "id": "project/iot.tocandira/eclipse-tocandira/Tocandira-opcua-gateway/a1dd23b443a6dd190aa5ecd6ca2d66e9d0d8b740",
    "license": "EPL-2.0",
    "authority": "https://gitlab.eclipse.org/eclipsefdn/emo-team/iplab/-/issues/10519",
    "source": "https://github.com/eclipse-tocandira/Tocandira-opcua-gateway/archive/a1dd23b443a6dd190aa5ecd6ca2d66e9d0d8b740.zip",
    "status": "approved",
    "scans": [
        {
            "date": "September 14, 2023 at 11:42:57 a.m. GMT",
            "authority": "https://gitlab.eclipse.org/eclipsefdn/emo-team/iplab/-/issues/10519",
            "scancode-version": "31.2.1",
            "licenses-discovered": [
            ],
            "copyrights": [
                "Copyright (c) 2017 Aimirim STI."
            ],
            "file-count": 6,
            "sha256": "36d072c8f13a372fa61ae94268f2457c0ab536a72b4c620d8237eb2be8477378",
            "source": "https://github.com/eclipse-tocandira/Tocandira-opcua-gateway/archive/a1dd23b443a6dd190aa5ecd6ca2d66e9d0d8b740.zip",
            "status": "restricted"
        }
    ]
}
