{
    "id": "maven/mavencentral/org.apache.jena/jena-dboe-base/4.8.0",
    "license": "Apache-2.0",
    "authority": "https://gitlab.eclipse.org/eclipsefdn/emo-team/iplab/-/issues/8884",
    "source": "https://repo.maven.apache.org/maven2/org/apache/jena/jena-dboe-base/4.8.0/jena-dboe-base-4.8.0-sources.jar",
    "status": "approved",
    "scans": [
        {
            "date": "June 14, 2023 at 6:11:47 p.m. GMT",
            "authority": "https://gitlab.eclipse.org/eclipsefdn/emo-team/iplab/-/issues/8884",
            "scancode-version": "31.2.1",
            "licenses-discovered": [
                "Apache-2.0"
            ],
            "copyrights": [
            ],
            "file-count": 77,
            "sha256": "93f71ec9770499ce5810ee5788f6c55f922ca8f25f9f9f690dfbac09240d7aca",
            "source": "https://repo.maven.apache.org/maven2/org/apache/jena/jena-dboe-base/4.8.0/jena-dboe-base-4.8.0-sources.jar",
            "status": "approved"
        }
    ]
}