{
    "license": "BSD-3-Clause",
    "file-count": 1,
    "authority": "https://gitlab.eclipse.org/eclipsefdn/emo-team/iplab/-/issues/1914",
    "scancode-version": "30.1.0",
    "licenses-discovered": [
    ],
    "id": "maven/mavencentral/org.jmock/jmock-legacy/2.5.0",
    "source": "https://search.maven.org/remotecontent?filepath=org/jmock/jmock-legacy/2.5.0/jmock-legacy-2.5.0-sources.jar",
    "status": "approved"
}
