{
    "id": "maven/mavencentral/com.google.api.grpc/proto-google-cloud-iamcredentials-v1/2.53.0",
    "license": "Apache-2.0",
    "authority": "https://gitlab.eclipse.org/eclipsefdn/emo-team/iplab/-/issues/17211",
    "source": "https://repo1.maven.org/maven2/com/google/api/grpc/proto-google-cloud-iamcredentials-v1/2.53.0/proto-google-cloud-iamcredentials-v1-2.53.0-sources.jar",
    "status": "approved",
    "scans": [
        {
            "date": "November 14, 2024, 4:11:19 a.m. GMT",
            "authority": "https://gitlab.eclipse.org/eclipsefdn/emo-team/iplab/-/issues/17211",
            "scancode-version": "31.2.1",
            "licenses-discovered": [
                "Apache-2.0"
            ],
            "copyrights": [
                "Copyright 2024 Google LLC"
            ],
            "file-count": 24,
            "sha256": "1c1fc9b719ca70181c63e5327d47f66dbafbff27605ceb5f35e2cf37b4b2fce5",
            "source": "https://repo1.maven.org/maven2/com/google/api/grpc/proto-google-cloud-iamcredentials-v1/2.53.0/proto-google-cloud-iamcredentials-v1-2.53.0-sources.jar",
            "status": "approved"
        }
    ]
}