{
    "id": "maven/mavencentral/org.apache.lucene/lucene-join/8.9.0",
    "license": "Apache-2.0",
    "authority": "https://gitlab.eclipse.org/eclipsefdn/emo-team/iplab/-/issues/6145",
    "source": "https://search.maven.org/remotecontent?filepath=org/apache/lucene/lucene-join/8.9.0/lucene-join-8.9.0-sources.jar",
    "status": "approved",
    "scans": [
        {
            "date": "January 6, 2023 at 11:01:15 p.m. GMT",
            "authority": "https://gitlab.eclipse.org/eclipsefdn/emo-team/iplab/-/issues/6145",
            "scancode-version": "31.2.1",
            "licenses-discovered": [
                "Apache-2.0"
            ],
            "copyrights": [
            ],
            "file-count": 27,
            "sha256": "74634cb28d25b4ba483e36f3a0496786b776864186dfed31320b2465ec121f6e",
            "source": "https://search.maven.org/remotecontent?filepath=org/apache/lucene/lucene-join/8.9.0/lucene-join-8.9.0-sources.jar",
            "status": "approved"
        }
    ]
}