{
    "id": "maven/mavencentral/biz.aQute.bnd/biz.aQute.repository/7.1.0",
    "license": "Apache-2.0",
    "authority": "https://gitlab.eclipse.org/eclipsefdn/emo-team/iplab/-/issues/17515",
    "source": "https://repo1.maven.org/maven2/biz/aQute/bnd/biz.aQute.repository/7.1.0/biz.aQute.repository-7.1.0-sources.jar",
    "status": "approved",
    "scans": [
        {
            "date": "November 28, 2024 at 7:19:26 a.m. GMT",
            "authority": "https://gitlab.eclipse.org/eclipsefdn/emo-team/iplab/-/issues/17515",
            "scancode-version": "31.2.1",
            "licenses-discovered": [
                "Apache-2.0"
            ],
            "copyrights": [
            ],
            "file-count": 252,
            "sha256": "314e71d784da8daa5f79f7a979c452dad4907c4ed927f4d6eb2eab94b41e8451",
            "source": "https://repo1.maven.org/maven2/biz/aQute/bnd/biz.aQute.repository/7.1.0/biz.aQute.repository-7.1.0-sources.jar",
            "status": "approved"
        }
    ]
}