{
    "id": "npm/npmjs/@csstools/postcss-nested-calc/4.0.0",
    "license": "MIT-0",
    "authority": "https://gitlab.eclipse.org/eclipsefdn/emo-team/iplab/-/issues/18989",
    "source": "https://registry.yarnpkg.com/@csstools/postcss-nested-calc/-/postcss-nested-calc-4.0.0.tgz",
    "status": "approved",
    "scans": [
        {
            "date": "January 19, 2025 at 8:17:33 p.m. GMT",
            "authority": "https://gitlab.eclipse.org/eclipsefdn/emo-team/iplab/-/issues/18989",
            "scancode-version": "31.2.1",
            "licenses-discovered": [
                "MIT-0"
            ],
            "copyrights": [
                "Copyright (c) CSSTools Contributors"
            ],
            "file-count": 6,
            "sha256": "a70a229cf24968f28ab7c50e9fdb36163a10f73afa36d24d5414df46174f89df",
            "source": "https://registry.yarnpkg.com/@csstools/postcss-nested-calc/-/postcss-nested-calc-4.0.0.tgz",
            "status": "approved"
        }
    ]
}