{
    "id": "maven/mavencentral/com.google.cloud/google-cloud-core-grpc/2.44.1",
    "license": "Apache-2.0",
    "authority": "https://gitlab.eclipse.org/eclipsefdn/emo-team/iplab/-/issues/16743",
    "source": "https://repo1.maven.org/maven2/com/google/cloud/google-cloud-core-grpc/2.44.1/google-cloud-core-grpc-2.44.1-sources.jar",
    "status": "approved",
    "scans": [
        {
            "date": "October 15, 2024, 6:12:28 p.m. GMT",
            "authority": "https://gitlab.eclipse.org/eclipsefdn/emo-team/iplab/-/issues/16743",
            "scancode-version": "31.2.1",
            "licenses-discovered": [
                "Apache-2.0"
            ],
            "copyrights": [
                "Copyright 2016 Google LLC",
                "Copyright 2017 Google LLC",
                "Copyright 2023 Google LLC"
            ],
            "file-count": 7,
            "sha256": "1b2a6324fb076ce10865307e1f4c20df313490b1d1b48f594db373e25923a8eb",
            "source": "https://repo1.maven.org/maven2/com/google/cloud/google-cloud-core-grpc/2.44.1/google-cloud-core-grpc-2.44.1-sources.jar",
            "status": "approved"
        }
    ]
}