{
    "id": "maven/mavencentral/org.apache.commons/commons-lang3/3.17.0",
    "license": "Apache-2.0",
    "authority": "https://gitlab.eclipse.org/eclipsefdn/emo-team/iplab/-/issues/16044",
    "source": "https://repo1.maven.org/maven2/org/apache/commons/commons-lang3/3.17.0/commons-lang3-3.17.0-sources.jar",
    "status": "approved",
    "scans": [
        {
            "date": "August 30, 2024 at 6:55:23 a.m. GMT",
            "authority": "https://gitlab.eclipse.org/eclipsefdn/emo-team/iplab/-/issues/16044",
            "scancode-version": "31.2.1",
            "licenses-discovered": [
                "Apache-2.0"
            ],
            "copyrights": [
            ],
            "file-count": 253,
            "sha256": "5fdcac21ad329766054a95367d7583dfcdca737d221d5e01a5f2a198c04c6b18",
            "source": "https://repo1.maven.org/maven2/org/apache/commons/commons-lang3/3.17.0/commons-lang3-3.17.0-sources.jar",
            "status": "approved"
        }
    ]
}