{
    "id": "npm/npmjs/@vitejs/plugin-vue/5.0.2",
    "license": "MIT",
    "authority": "https://gitlab.eclipse.org/eclipsefdn/emo-team/iplab/-/issues/12651",
    "source": "https://github.com/vitejs/vite-plugin-vue/archive/refs/tags/plugin-vue@5.0.2.zip",
    "status": "approved",
    "scans": [
        {
            "date": "January 8, 2024 at 5:35:40 a.m. GMT",
            "authority": "https://gitlab.eclipse.org/eclipsefdn/emo-team/iplab/-/issues/12651",
            "scancode-version": "31.2.1",
            "licenses-discovered": [
                "MIT"
            ],
            "copyrights": [
                "Copyright (c) 2019-present, Yuxi"
            ],
            "file-count": 228,
            "sha256": "0107afa5a4b133cb15a40127207f3ae764887dad2d3a4b9b405c7e8aefbd23a6",
            "source": "https://github.com/vitejs/vite-plugin-vue/archive/refs/tags/plugin-vue@5.0.2.zip",
            "status": "approved"
        }
    ]
}