{
    "id": "pypi/pypi/-/python-dateutil/2.8.2",
    "license": "Apache-2.0 AND BSD-3-Clause",
    "authority": "https://gitlab.eclipse.org/eclipsefdn/emo-team/iplab/-/issues/7825",
    "source": "https://files.pythonhosted.org/packages/4c/c4/13b4776ea2d76c115c1d1b84579f3764ee6d57204f6be27119f13a61d0a9/python-dateutil-2.8.2.tar.gz",
    "status": "approved",
    "scans": [
        {
            "date": "April 5, 2023 at 1:34:19 p.m. GMT",
            "authority": "https://gitlab.eclipse.org/eclipsefdn/emo-team/iplab/-/issues/7825",
            "scancode-version": "31.2.1",
            "licenses-discovered": [
                "Apache-2.0 AND BSD-3-Clause",
                "Apache-2.0 AND BSD-2-Clause AND Python-2.0"
            ],
            "copyrights": [
                "Copyright (c) 2003-2011 - Gustavo Niemeyer <gustavo@niemeyer.net>",
                "Copyright (c) 2012-2014 - Tomi Pievilainen <tomi.pievilainen@iki.fi>",
                "Copyright (c) 2014-2016 - Yaron de Leeuw <me@jarondl.net>",
                "Copyright (c) 2015- - Paul Ganssle <paul@ganssle.io>",
                "Copyright (c) 2015- - dateutil contributors",
                "Copyright 2017- Paul Ganssle <paul@ganssle.io>",
                "Copyright 2017- dateutil contributors",
                "copyright 2019, dateutil"
            ],
            "file-count": 685,
            "sha256": "0123cacc1627ae19ddf3c27a5de5bd67ee4586fbdd6440d9748f8abb483d3e86",
            "source": "https://files.pythonhosted.org/packages/4c/c4/13b4776ea2d76c115c1d1b84579f3764ee6d57204f6be27119f13a61d0a9/python-dateutil-2.8.2.tar.gz",
            "status": "restricted"
        }
    ]
}
