{
    "id": "npm/npmjs/-/fast-xml-parser/4.3.4",
    "license": "MIT AND (MIT AND OFL-1.1)",
    "authority": "https://gitlab.eclipse.org/eclipsefdn/emo-team/iplab/-/issues/13098",
    "source": "https://github.com/NaturalIntelligence/fast-xml-parser/archive/refs/tags/v4.3.4.zip",
    "status": "approved",
    "scans": [
        {
            "date": "February 2, 2024 at 10:39:34 a.m. GMT",
            "authority": "https://gitlab.eclipse.org/eclipsefdn/emo-team/iplab/-/issues/13098",
            "scancode-version": "31.2.1",
            "licenses-discovered": [
                "MIT",
                "MIT AND OFL-1.1"
            ],
            "copyrights": [
                "(c) JS Foundation and other contributors",
                "Copyright (c) 2016 Daniel Eden",
                "Copyright (c) 2017 Amit Kumar Gupta",
                "Copyright 2011-2014 Twitter, Inc.",
                "Copyright 2011-2017 The Bootstrap Authors",
                "Copyright 2011-2017 Twitter, Inc.",
                "Copyright 2013 Timothy J Fontaine <tjfontaine@gmail.com>",
                "Copyright 2013-2016 jquery-confirm"
            ],
            "file-count": 125,
            "sha256": "3e988e646deedc9c52eaece3e7e5021e8b5e25826e4a706f3e71e3c33d7f93e4",
            "source": "https://github.com/NaturalIntelligence/fast-xml-parser/archive/refs/tags/v4.3.4.zip",
            "status": "approved"
        }
    ]
}