{
    "id": "maven/mavencentral/org.robolectric/sandbox/4.14.1",
    "license": "Apache-2.0",
    "authority": "https://gitlab.eclipse.org/eclipsefdn/emo-team/iplab/-/issues/19851",
    "source": "https://repo1.maven.org/maven2/org/robolectric/sandbox/4.14.1/sandbox-4.14.1-sources.jar",
    "status": "approved",
    "scans": [
        {
            "date": "March 3, 2025 at 6:51:12 a.m. GMT",
            "authority": "https://gitlab.eclipse.org/eclipsefdn/emo-team/iplab/-/issues/19851",
            "scancode-version": "31.2.1",
            "licenses-discovered": [
                "Apache-2.0"
            ],
            "copyrights": [
                "Copyright (c) 2011 The Android Open Source Project",
                "Copyright (c) 2012 The Android Open Source Project"
            ],
            "file-count": 48,
            "sha256": "faf8595cb738fca4015b97e681a8adf26a0fc34f44b7c2f9c69836683102a441",
            "source": "https://repo1.maven.org/maven2/org/robolectric/sandbox/4.14.1/sandbox-4.14.1-sources.jar",
            "status": "approved"
        }
    ]
}