{
    "id": "git/github/ArthurSonzogni/FTXUI/v4.1.1",
    "license": "MIT AND WTFPL",
    "authority": "https://gitlab.eclipse.org/eclipsefdn/emo-team/iplab/-/issues/9598",
    "source": "https://github.com/ArthurSonzogni/FTXUI/archive/refs/tags/v4.1.1.zip",
    "status": "approved",
    "scans": [
        {
            "date": "July 18, 2023 at 9:38:05 a.m. GMT",
            "authority": "https://gitlab.eclipse.org/eclipsefdn/emo-team/iplab/-/issues/9598",
            "scancode-version": "31.2.1",
            "licenses-discovered": [
                "MIT",
                "WTFPL"
            ],
            "copyrights": [
                "(c) . TEST(Event, Character)",
                "Copyright (c) 2011, Auerhaus Development, LLC",
                "Copyright (c) 2019 Arthur Sonzogni",
                "Copyright 2020 Arthur Sonzogni",
                "Copyright 2021 Arthur Sonzogni",
                "Copyright 2022 Arthur Sonzogni",
                "Copyright 2023 Arthur Sonzogni"
            ],
            "file-count": 262,
            "sha256": "f838f441daf02ea29dc2ce7d847c0d94ebfcb843f2b32a07d37c17a19e2cf9e3",
            "source": "https://github.com/ArthurSonzogni/FTXUI/archive/refs/tags/v4.1.1.zip",
            "status": "approved"
        }
    ]
}