{
    "id": "project/technology.xfsc/eclipse-xfsc-por/article-service/85e774891b91fd32d4a87dcadd369f7abe19dbb3",
    "license": "Apache-2.0",
    "authority": "https://gitlab.eclipse.org/eclipsefdn/emo-team/iplab/-/issues/9577",
    "source": "https://gitlab.eclipse.org/api/v4/projects/eclipse%2Fxfsc%2Fpor%2Farticle-service/repository/archive.zip?sha=85e774891b91fd32d4a87dcadd369f7abe19dbb3",
    "status": "approved",
    "scans": [
        {
            "date": "July 18, 2023 at 4:19:24 a.m. GMT",
            "authority": "https://gitlab.eclipse.org/eclipsefdn/emo-team/iplab/-/issues/9577",
            "scancode-version": "31.2.1",
            "licenses-discovered": [
                "Apache-2.0",
                "Apache-2.0 AND BSD-3-Clause AND CDDL-1.0 AND EPL-1.0 AND (GPL-2.0-only WITH Classpath-exception-2.0) AND LGPL-2.0-or-later AND MIT"
            ],
            "copyrights": [
            ],
            "file-count": 74,
            "sha256": "7895c5f346ded30c71bc1b748a0801f969b3e3d80bfabf57ef934835f8b9ed6b",
            "source": "https://gitlab.eclipse.org/api/v4/projects/eclipse%2Fxfsc%2Fpor%2Farticle-service/repository/archive.zip?sha=85e774891b91fd32d4a87dcadd369f7abe19dbb3",
            "status": "restricted"
        }
    ]
}
