{
    "id": "maven/mavencentral/com.google.api.grpc/proto-google-iam-admin-v1/3.19.0",
    "license": "Apache-2.0",
    "authority": "https://gitlab.eclipse.org/eclipsefdn/emo-team/iplab/-/issues/10573",
    "source": "https://repo.maven.apache.org/maven2/com/google/api/grpc/proto-google-iam-admin-v1/3.19.0/proto-google-iam-admin-v1-3.19.0-sources.jar",
    "status": "approved",
    "scans": [
        {
            "date": "September 18, 2023 at 11:07:01 a.m. GMT",
            "authority": "https://gitlab.eclipse.org/eclipsefdn/emo-team/iplab/-/issues/10573",
            "scancode-version": "31.2.1",
            "licenses-discovered": [
                "Apache-2.0"
            ],
            "copyrights": [
                "Copyright 2022 Google LLC",
                "Copyright 2023 Google LLC"
            ],
            "file-count": 101,
            "sha256": "536a6ee03fca1042339e45e7618c82a7ecfec5b7cf60c3ab044ec056cca5f30a",
            "source": "https://repo.maven.apache.org/maven2/com/google/api/grpc/proto-google-iam-admin-v1/3.19.0/proto-google-iam-admin-v1-3.19.0-sources.jar",
            "status": "approved"
        }
    ]
}