{
    "id": "maven/mavencentral/org.springframework.boot/spring-boot-starter-reactor-netty/3.4.0",
    "license": "Apache-2.0",
    "authority": "https://gitlab.eclipse.org/eclipsefdn/emo-team/iplab/-/issues/17527",
    "source": "https://repo1.maven.org/maven2/org/springframework/boot/spring-boot-starter-reactor-netty/3.4.0/spring-boot-starter-reactor-netty-3.4.0-sources.jar",
    "status": "approved",
    "scans": [
        {
            "date": "November 29, 2024 at 3:30:05 a.m. GMT",
            "authority": "https://gitlab.eclipse.org/eclipsefdn/emo-team/iplab/-/issues/17527",
            "scancode-version": "31.2.1",
            "licenses-discovered": [
                "Apache-2.0"
            ],
            "copyrights": [
            ],
            "file-count": 2,
            "sha256": "b5c09153d07aee27a953eb147a924a013207e22d44edff36ab15e26b24a6434d",
            "source": "https://repo1.maven.org/maven2/org/springframework/boot/spring-boot-starter-reactor-netty/3.4.0/spring-boot-starter-reactor-netty-3.4.0-sources.jar",
            "status": "approved"
        }
    ]
}