{
    "id": "maven/mavencentral/org.springframework/spring-beans/6.1.1",
    "license": "Apache-2.0",
    "authority": "https://gitlab.eclipse.org/eclipsefdn/emo-team/iplab/-/issues/11754",
    "source": "https://repo1.maven.org/maven2/org/springframework/spring-beans/6.1.1/spring-beans-6.1.1-sources.jar",
    "status": "approved",
    "scans": [
        {
            "date": "November 29, 2023 at 8:23:17 p.m. GMT",
            "authority": "https://gitlab.eclipse.org/eclipsefdn/emo-team/iplab/-/issues/11754",
            "scancode-version": "31.2.1",
            "licenses-discovered": [
                "Apache-2.0"
            ],
            "copyrights": [
                "Copyright 2002-2007 the original author or authors",
                "Copyright 2002-2009 the original author or authors",
                "Copyright 2002-2011 the original author or authors",
                "Copyright 2002-2012 the original author or authors",
                "Copyright 2002-2013 the original author or authors",
                "Copyright 2002-2014 the original author or authors",
                "Copyright 2002-2015 the original author or authors",
                "Copyright 2002-2016 the original author or authors",
                "Copyright 2002-2017 the original author or authors",
                "Copyright 2002-2018 the original author or authors",
                "Copyright 2002-2019 the original author or authors",
                "Copyright 2002-2020 the original author or authors",
                "Copyright 2002-2021 the original author or authors",
                "Copyright 2002-2022 the original author or authors",
                "Copyright 2002-2023 the original author or authors"
            ],
            "file-count": 344,
            "sha256": "de906a87bf3bac04b845d7e49058cf6d54e2119ae031254582afa4aaf1be2636",
            "source": "https://repo1.maven.org/maven2/org/springframework/spring-beans/6.1.1/spring-beans-6.1.1-sources.jar",
            "status": "approved"
        }
    ]
}