{
    "id": "npm/npmjs/-/react-router-dom/6.26.0",
    "license": "MIT",
    "authority": "https://gitlab.eclipse.org/eclipsefdn/emo-team/iplab/-/issues/15860",
    "source": "https://github.com/remix-run/react-router/archive/refs/tags/react-router@6.26.0.zip",
    "status": "approved",
    "scans": [
        {
            "date": "August 14, 2024 at 11:39:03 a.m. GMT",
            "authority": "https://gitlab.eclipse.org/eclipsefdn/emo-team/iplab/-/issues/15860",
            "scancode-version": "31.2.1",
            "licenses-discovered": [
                "LicenseRef-scancode-google-cla",
                "MIT"
            ],
            "copyrights": [
                "Copyright (c) React Training LLC 2015-2019",
                "Copyright (c) Remix Software Inc.",
                "Copyright (c) Remix Software Inc. 2020-2021",
                "Copyright (c) Shopify Inc. 2022-2023"
            ],
            "file-count": 603,
            "sha256": "4e921c5681120b34a5605d48ffe5c2b8aba34c7a9d95b3bc79fabcee012d25ca",
            "source": "https://github.com/remix-run/react-router/archive/refs/tags/react-router@6.26.0.zip",
            "status": "restricted"
        }
    ]
}