{
    "id": "maven/mavencentral/androidx.loader/loader/1.0.0",
    "license": "Apache-2.0",
    "authority": "https://gitlab.eclipse.org/eclipsefdn/emo-team/iplab/-/issues/10395",
    "source": "https://dl.google.com/android/maven2/androidx/loader/loader/1.0.0/loader-1.0.0-sources.jar",
    "status": "approved",
    "scans": [
        {
            "date": "September 11, 2023 at 9:28:06 p.m. GMT",
            "authority": "https://gitlab.eclipse.org/eclipsefdn/emo-team/iplab/-/issues/10395",
            "scancode-version": "31.2.1",
            "licenses-discovered": [
                "Apache-2.0"
            ],
            "copyrights": [
                "Copyright 2018 The Android Open Source Project"
            ],
            "file-count": 7,
            "sha256": "efcbafaac8fc06bd5b162b57ac1e146d11919b79dea2202339470c931cecdc67",
            "source": "https://dl.google.com/android/maven2/androidx/loader/loader/1.0.0/loader-1.0.0-sources.jar",
            "status": "approved"
        }
    ]
}