{
    "id": "maven/mavencentral/org.jboss.jdeparser/jdeparser/2.0.3.Final",
    "license": "LGPL-2.1-or-later AND Apache-2.0",
    "licenses-discovered": [
        "LGPL-2.1-or-later",
        "Apache-2.0"
    ],
    "copyrights": [
        "Copyright Red Hat, Inc., and individual contributors"
    ],
    "file-count": 184,
    "scancode-version": "30.1.0",
    "authority": "https://gitlab.eclipse.org/eclipsefdn/emo-team/iplab/-/issues/3531",
    "source": "https://search.maven.org/remotecontent?filepath=org/jboss/jdeparser/jdeparser/2.0.3.Final/jdeparser-2.0.3.Final-sources.jar",
    "status": "approved"
}
