{
    "id": "maven/mavencentral/com.azure.resourcemanager/azure-resourcemanager/2.39.0",
    "license": "MIT",
    "authority": "https://gitlab.eclipse.org/eclipsefdn/emo-team/iplab/-/issues/15092",
    "source": "https://repo1.maven.org/maven2/com/azure/resourcemanager/azure-resourcemanager/2.39.0/azure-resourcemanager-2.39.0-sources.jar",
    "status": "approved",
    "scans": [
        {
            "date": "June 6, 2024 at 10:55:51 a.m. GMT",
            "authority": "https://gitlab.eclipse.org/eclipsefdn/emo-team/iplab/-/issues/15092",
            "scancode-version": "31.2.1",
            "licenses-discovered": [
                "MIT"
            ],
            "copyrights": [
                "(c) 2008 VeriSign, Inc.",
                "Copyright (c) Microsoft Corporation"
            ],
            "file-count": 9,
            "sha256": "dc468d436700da160ca9055d57d11e069678d9e451ffbb7a42c4fed43838d828",
            "source": "https://repo1.maven.org/maven2/com/azure/resourcemanager/azure-resourcemanager/2.39.0/azure-resourcemanager-2.39.0-sources.jar",
            "status": "approved"
        }
    ]
}