{
    "id": "pypi/pypi/-/rdflib/7.0.0",
    "license": "MIT AND (LicenseRef-W3C-Test-Suite-License AND BSD-3-Clause) AND BSD-3-Clause AND CC-BY-4.0 AND (GPL-2.0-only OR W3C OR BSD-2-Clause OR MIT) AND MIT AND LicenseRef-Public-domain AND PDDL-1.0 AND W3C",
    "authority": "https://gitlab.eclipse.org/eclipsefdn/emo-team/iplab/-/issues/16016",
    "source": "https://files.pythonhosted.org/packages/0d/a3/63740490a392921a611cfc05b5b17bffd4259b3c9589c7904a4033b3d291/rdflib-7.0.0.tar.gz",
    "status": "approved",
    "scans": [
        {
            "date": "August 27, 2024 at 1:41:37 p.m. GMT",
            "authority": "https://gitlab.eclipse.org/eclipsefdn/emo-team/iplab/-/issues/16016",
            "scancode-version": "31.2.1",
            "licenses-discovered": [
                "BSD-3-Clause",
                "MIT",
                "CC-BY-NC-3.0",
                "LicenseRef-scancode-other-copyleft AND LicenseRef-scancode-proprietary-license",
                "LicenseRef-scancode-proprietary-license",
                "MIT AND W3C-19980720",
                "BSD-3-Clause AND GPL-2.0-only AND MIT AND W3C",
                "NIST-PD",
                "W3C"
            ],
            "copyrights": [
                "(c) doctest DEFAULT http://www.example.com/gr",
                "<http://purl.org/dc/elements/1.1/rights> copyright (c) 2001 W3C",
                "Copyright (c) 2002-2023, RDFLib Team",
                "Copyright (c) 2004 Examples-R-Us",
                "Copyright (c) 2010 Charles Leifer, Eric Holscher, Bobby Grace",
                "Copyright (c) 2011 Bay Citizen & Texas Tribune",
                "Copyright (c) World Wide Web Consortium, (Massachusetts Institute of Technology, European Research Consortium for Informatics and Mathematics, Keio University) and others",
                "Copyright 2000-2007, World Wide",
                "Copyright 2001, Zolera Systems Inc.",
                "Copyright 2007, Sean B. Palmer",
                "Copyright 2007-2010 by the Sphinx team",
                "Copyright 2010, Gunnar A. Grimnes",
                "Copyright URIRef",
                "Copyright World Wide Web Consortium, (Massachusetts Institute of Technology, European Research Consortium for Informatics and Mathematics, Keio University)",
                "Copyright World Wide Web Consortium, (Massachusetts Institute of Technology, Institut National de Recherche en Informatique et en Automatique, Keio University)",
                "Copyright clause at <http://www.w3.org/Consortium/Legal/copyright-software.html>",
                "Web Consortium. Copyright 2001",
                "copyright (c) 2001 W3C",
                "copyright 2009 - 2023, RDFLib Team",
                "copyright e (c)"
            ],
            "file-count": 9199,
            "sha256": "9995eb8569428059b8c1affd26b25eac510d64f5043d9ce8c84e0d0036e995ae",
            "source": "https://files.pythonhosted.org/packages/0d/a3/63740490a392921a611cfc05b5b17bffd4259b3c9589c7904a4033b3d291/rdflib-7.0.0.tar.gz",
            "status": "restricted"
        }
    ]
}