{
    "id": "git/github/golang/exp/6cc2880d07d6",
    "license": "BSD-3-Clause",
    "authority": "https://gitlab.eclipse.org/eclipsefdn/emo-team/iplab/-/issues/5196",
    "source": "https://github.com/golang/exp/archive/6cc2880d07d6.zip",
    "status": "approved",
    "scans": [
        {
            "date": "November 25, 2022 at 11:48:46 p.m. GMT",
            "authority": "https://gitlab.eclipse.org/eclipsefdn/emo-team/iplab/-/issues/5196",
            "scancode-version": "31.2.1",
            "licenses-discovered": [
                "BSD-3-Clause"
            ],
            "copyrights": [
                "Copyright (c) 2009 The Go Authors",
                "Copyright (c) 2009 The XGB Authors",
                "Copyright 2009 The Go Authors",
                "Copyright 2010 The Go Authors",
                "Copyright 2011 The Go Authors",
                "Copyright 2012 The Go Authors",
                "Copyright 2013 The Go Authors",
                "Copyright 2014 The Go Authors",
                "Copyright 2015 The Go Authors",
                "Copyright 2016 The Go Authors",
                "Copyright 2017 The Go Authors",
                "Copyright 2018 The Go Authors",
                "Copyright 2019 The Go Authors",
                "Copyright 2020 The Go Authors"
            ],
            "file-count": 510,
            "sha256": "0f19bfbb2ec3029b878c894951cd949af9c06a911716f0c68778cb4a54207a8b",
            "source": "https://github.com/golang/exp/archive/6cc2880d07d6.zip",
            "status": "approved"
        }
    ]
}