{
    "id": "maven/mavencentral/io.micrometer/micrometer-observation/1.14.1",
    "license": "Apache-2.0",
    "authority": "https://gitlab.eclipse.org/eclipsefdn/emo-team/iplab/-/issues/17270",
    "source": "https://repo1.maven.org/maven2/io/micrometer/micrometer-observation/1.14.1/micrometer-observation-1.14.1-sources.jar",
    "status": "approved",
    "scans": [
        {
            "date": "November 19, 2024, 12:34:53 a.m. GMT",
            "authority": "https://gitlab.eclipse.org/eclipsefdn/emo-team/iplab/-/issues/17270",
            "scancode-version": "31.2.1",
            "licenses-discovered": [
                "Apache-2.0"
            ],
            "copyrights": [
                "Copyright 2002-2021 the original author or authors",
                "Copyright 2021 VMware, Inc.",
                "Copyright 2022 VMware, Inc.",
                "Copyright 2023 VMware, Inc.",
                "Copyright 2024 VMware, Inc."
            ],
            "file-count": 40,
            "sha256": "66f6c247de00e33dc028b4e1787fd16a09bc129d8b9bc5603f873b3b3a433c98",
            "source": "https://repo1.maven.org/maven2/io/micrometer/micrometer-observation/1.14.1/micrometer-observation-1.14.1-sources.jar",
            "status": "approved"
        }
    ]
}