{
    "id": "maven/mavencentral/com.azure/azure-identity/1.15.0",
    "license": "MIT",
    "authority": "https://gitlab.eclipse.org/eclipsefdn/emo-team/iplab/-/issues/18662",
    "source": "https://repo1.maven.org/maven2/com/azure/azure-identity/1.15.0/azure-identity-1.15.0-sources.jar",
    "status": "approved",
    "scans": [
        {
            "date": "January 14, 2025 at 3:37:02 a.m. GMT",
            "authority": "https://gitlab.eclipse.org/eclipsefdn/emo-team/iplab/-/issues/18662",
            "scancode-version": "31.2.1",
            "licenses-discovered": [
                "MIT"
            ],
            "copyrights": [
                "Copyright (c) Microsoft Corporation"
            ],
            "file-count": 105,
            "sha256": "9df6836fd21957833e87f6da6a102c186d5e5657b31ce754321fefa8445297f1",
            "source": "https://repo1.maven.org/maven2/com/azure/azure-identity/1.15.0/azure-identity-1.15.0-sources.jar",
            "status": "approved"
        }
    ]
}