{
    "id": "npm/npmjs/-/i18next/24.0.5",
    "license": "MIT",
    "authority": "https://gitlab.eclipse.org/eclipsefdn/emo-team/iplab/-/issues/18015",
    "source": "https://github.com/i18next/i18next/archive/refs/tags/v24.0.5.zip",
    "status": "approved",
    "scans": [
        {
            "date": "December 29, 2024 at 10:49:23 p.m. GMT",
            "authority": "https://gitlab.eclipse.org/eclipsefdn/emo-team/iplab/-/issues/18015",
            "scancode-version": "31.2.1",
            "licenses-discovered": [
                "MIT"
            ],
            "copyrights": [
                "Copyright (c) 2024 i18next"
            ],
            "file-count": 181,
            "sha256": "5f981a0f5f3caea43ab342d78541dd9fc193dd9316833cd64ef59cb81c4eae1d",
            "source": "https://github.com/i18next/i18next/archive/refs/tags/v24.0.5.zip",
            "status": "approved"
        }
    ]
}