{
    "id": "npm/npmjs/-/espree/10.1.0",
    "license": "BSD-2-Clause AND BSD-3-Clause AND MIT AND BSD-2-Clause AND BSD-3-Clause AND MIT AND (BSD-2-Clause AND MIT) AND (BSD-3-Clause AND LGPL-2.0-or-later AND MIT) AND LGPL-2.1-or-later",
    "authority": "https://gitlab.eclipse.org/eclipsefdn/emo-team/iplab/-/issues/15958",
    "source": "https://github.com/eslint/js/archive/refs/tags/v10.1.0.zip",
    "status": "approved",
    "scans": [
        {
            "date": "August 19, 2024 at 8:49:08 a.m. GMT",
            "authority": "https://gitlab.eclipse.org/eclipsefdn/emo-team/iplab/-/issues/15958",
            "scancode-version": "31.2.1",
            "licenses-discovered": [
                "BSD-2-Clause AND BSD-3-Clause AND MIT",
                "BSD-2-Clause",
                "BSD-3-Clause",
                "MIT",
                "BSD-2-Clause AND MIT",
                "BSD-3-Clause AND LGPL-2.0-or-later AND MIT",
                "LGPL-2.1-or-later"
            ],
            "copyrights": [
                "(c) 2007-2008 Steven Levithan <http://stevenlevithan.com/regex/xregexp/>",
                "(c) 2009-2013 Jeremy Ashkenas, DocumentCloud and Investigative Reporters & Editors Underscore",
                "(c) 2010-2011 Jeremy Ashkenas, DocumentCloud Inc.",
                "(c) 2010-2014 Google, Inc. http://angularjs.org",
                "(c) 2011-2013 Jeremy Ashkenas, DocumentCloud and Investigative Reporters & Editors Backbone",
                "Copyright (c) 2005-2007 Sam Stephenson",
                "Copyright (c) 2006 Dean Edwards, GNU Lesser General",
                "Copyright (c) 2006-2012 Valerio Proietti (http://mad4milk.net/)",
                "Copyright (c) 2011 Sergey Ilinsky (http://www.ilinsky.com)",
                "Copyright (c) 2011-2012 Ariya Hidayat <ariya.hidayat@gmail.com>",
                "Copyright (c) 2012 Ariya Hidayat <ariya.hidayat@gmail.com>",
                "Copyright (c) 2012 Arpad Borsos <arpad.borsos@googlemail.com>",
                "Copyright (c) 2012 John Freeman <jfreeman08@gmail.com>",
                "Copyright (c) 2012 Joost-Wim Boekesteijn <joost-wim@boekesteijn.nl>",
                "Copyright (c) 2012 Kris Kowal <kris.kowal@cixar.com>",
                "Copyright (c) 2012 Mathias Bynens <mathias@qiwi.be>",
                "Copyright (c) 2012 Michael Ficarra <escodegen.copyright@michael.ficarra.me>",
                "Copyright (c) 2012 Michael Ficarra <esmangle.copyright@michael.ficarra.me>",
                "Copyright (c) 2012 Mihai Bazon <mihai.bazon@gmail.com>",
                "Copyright (c) 2012 Robert Gust-Bardon <donate@robert.gust-bardon.org>",
                "Copyright (c) 2012 Yusuke Suzuki <utatane.tea@gmail.com>",
                "Copyright (c) 2012-2013 Ecma International",
                "Copyright (c) 2013 Ariya Hidayat <ariya.hidayat@gmail.com>",
                "Copyright (c) 2021 the V8 project authors",
                "Copyright (c) Open JS Foundation",
                "Copyright (c) jQuery Foundation, Inc. and Contributors",
                "Copyright 2005, 2012 jQuery Foundation, Inc. and other contributors",
                "Copyright 2010-2012 Mathias Bynens <http://mths.be/>",
                "Copyright 2012 jQuery Foundation and other contributors",
                "Copyright 2012-2015 Acorn",
                "Copyright 2013 Yahoo! Inc.",
                "Copyright 2014-2015 Sebastian McKenzie <sebmck@gmail.com>",
                "Copyright 2014-2015 various",
                "copyright Robert Kieffer <http://broofa.com/>"
            ],
            "file-count": 1917,
            "sha256": "39316acf8525ea75e4bc6e688eeb52ccba82484ad917d1515797f2ae802fb044",
            "source": "https://github.com/eslint/js/archive/refs/tags/v10.1.0.zip",
            "status": "approved"
        }
    ]
}