{
    "id": "maven/mavencentral/decentralized-identity/jsonld-common-java/1.1.0",
    "license": "Apache-2.0",
    "authority": "https://gitlab.eclipse.org/eclipsefdn/emo-team/iplab/-/issues/10954",
    "source": "https://repo.danubetech.com/repository/maven-public//decentralized-identity/jsonld-common-java/1.1.0/jsonld-common-java-1.1.0-sources.jar",
    "status": "approved",
    "scans": [
        {
            "date": "October 11, 2023 at 2:07:48 p.m. GMT",
            "authority": "https://gitlab.eclipse.org/eclipsefdn/emo-team/iplab/-/issues/10954",
            "scancode-version": "31.2.1",
            "licenses-discovered": [
                "Apache-2.0"
            ],
            "copyrights": [
                "Copyright (c) 2010 Google Inc."
            ],
            "file-count": 12,
            "sha256": "17959c320ff368682aaf35b3a2dbdd134641e096bb538bd42da23fed4ad29536",
            "source": "https://repo.danubetech.com/repository/maven-public//decentralized-identity/jsonld-common-java/1.1.0/jsonld-common-java-1.1.0-sources.jar",
            "status": "approved"
        }
    ]
}