{
    "id": "maven/mavencentral/com.google.api/gax/2.19.1",
    "license": "BSD-3-Clause",
    "authority": "https://gitlab.eclipse.org/eclipsefdn/emo-team/iplab/-/issues/6862",
    "source": "https://search.maven.org/remotecontent?filepath=com/google/api/gax/2.19.1/gax-2.19.1-sources.jar",
    "status": "approved",
    "scans": [
        {
            "date": "January 30, 2023 at 8:55:33 a.m. GMT",
            "authority": "https://gitlab.eclipse.org/eclipsefdn/emo-team/iplab/-/issues/6862",
            "scancode-version": "31.2.1",
            "licenses-discovered": [
                "BSD-3-Clause"
            ],
            "copyrights": [
                "Copyright 2016 Google LLC",
                "Copyright 2017 Google LLC",
                "Copyright 2018 Google LLC",
                "Copyright 2019 Google LLC",
                "Copyright 2020 Google LLC",
                "Copyright 2021 Google LLC",
                "Copyright 2022 Google LLC"
            ],
            "file-count": 231,
            "sha256": "83a72a42c5c91e5a902e9941e8ad216832d34e54a95959eebf86138c3ac8d366",
            "source": "https://search.maven.org/remotecontent?filepath=com/google/api/gax/2.19.1/gax-2.19.1-sources.jar",
            "status": "approved"
        }
    ]
}