{
    "id": "maven/mavencentral/com.azure.resourcemanager/azure-resourcemanager-containerservice/2.39.0",
    "license": "MIT",
    "authority": "https://gitlab.eclipse.org/eclipsefdn/emo-team/iplab/-/issues/15101",
    "source": "https://repo1.maven.org/maven2/com/azure/resourcemanager/azure-resourcemanager-containerservice/2.39.0/azure-resourcemanager-containerservice-2.39.0-sources.jar",
    "status": "approved",
    "scans": [
        {
            "date": "June 6, 2024 at 11:57:04 a.m. GMT",
            "authority": "https://gitlab.eclipse.org/eclipsefdn/emo-team/iplab/-/issues/15101",
            "scancode-version": "31.2.1",
            "licenses-discovered": [
                "MIT"
            ],
            "copyrights": [
                "(c) 2008 VeriSign, Inc.",
                "Copyright (c) Microsoft Corporation"
            ],
            "file-count": 265,
            "sha256": "a1189dad7ba8a5e2e244d7cc3cd0d4e989334a1ebfdabb875abf973584dd153a",
            "source": "https://repo1.maven.org/maven2/com/azure/resourcemanager/azure-resourcemanager-containerservice/2.39.0/azure-resourcemanager-containerservice-2.39.0-sources.jar",
            "status": "approved"
        }
    ]
}