{
    "id": "git/github/cncf/xds/01bcc9b48dfe",
    "license": "Apache-2.0",
    "authority": "https://gitlab.eclipse.org/eclipsefdn/emo-team/iplab/-/issues/5151",
    "source": "https://github.com/cncf/xds/archive/01bcc9b48dfe.zip",
    "status": "approved",
    "scans": [
        {
            "date": "November 24, 2022 at 9:05:01 p.m. GMT",
            "authority": "https://gitlab.eclipse.org/eclipsefdn/emo-team/iplab/-/issues/5151",
            "scancode-version": "31.2.1",
            "licenses-discovered": [
                "Apache-2.0"
            ],
            "copyrights": [
            ],
            "file-count": 88,
            "sha256": "497f6f3c6b1e172b70033bd3c03555c1132a6e6df14e173bcde530d3493ae352",
            "source": "https://github.com/cncf/xds/archive/01bcc9b48dfe.zip",
            "status": "approved"
        }
    ]
}