{
    "id": "go/golang/github.com%2Fcontainerd/containerd/v1.2.10",
    "license": "Apache-2.0 AND BSD-2-Clause",
    "authority": "https://gitlab.eclipse.org/eclipsefdn/emo-team/iplab/-/issues/12416",
    "source": "https://proxy.golang.org/github.com%2Fcontainerd/containerd/@v/v1.2.10.zip",
    "status": "approved",
    "scans": [
        {
            "date": "December 21, 2023 at 11:15:25 a.m. GMT",
            "authority": "https://gitlab.eclipse.org/eclipsefdn/emo-team/iplab/-/issues/12416",
            "scancode-version": "31.2.1",
            "licenses-discovered": [
                "Apache-2.0",
                "BSD-2-Clause"
            ],
            "copyrights": [
                "Copyright (c) 1999-2008 Novell Inc.",
                "Copyright (c) 2013, The GoGo Authors",
                "Copyright 2009-2012 Canonical Ltd."
            ],
            "file-count": 632,
            "sha256": "793daa067d15606a9d38619be9d28925c04b0690315471b225a00b9cd064bdcb",
            "source": "https://proxy.golang.org/github.com%2Fcontainerd/containerd/@v/v1.2.10.zip",
            "status": "approved"
        }
    ]
}