{
    "id": "maven/mavencentral/org.jboss.forge.roaster/roaster-api/2.19.5.Final",
    "license": "Apache-2.0",
    "licenses-discovered": [
        "Apache-2.0"
    ],
    "file-count": 92,
    "scancode-version": "30.1.0",
    "authority": "https://gitlab.eclipse.org/eclipsefdn/emo-team/iplab/-/issues/2063",
    "source": "https://search.maven.org/remotecontent?filepath=org/jboss/forge/roaster/roaster-api/2.19.5.Final/roaster-api-2.19.5.Final-sources.jar",
    "status": "approved"
}