{
    "id": "go/golang/github.com%2Fgolang/snappy/v0.0.4",
    "license": "BSD-3-Clause",
    "authority": "https://gitlab.eclipse.org/eclipsefdn/emo-team/iplab/-/issues/12001",
    "source": "https://proxy.golang.org/github.com%2Fgolang/snappy/@v/v0.0.4.zip",
    "status": "approved",
    "scans": [
        {
            "date": "December 14, 2023 at 12:45:24 p.m. GMT",
            "authority": "https://gitlab.eclipse.org/eclipsefdn/emo-team/iplab/-/issues/12001",
            "scancode-version": "31.2.1",
            "licenses-discovered": [
                "BSD-3-Clause"
            ],
            "copyrights": [
                "Copyright (c) 2011 The Snappy-Go Authors",
                "Copyright 2011 The Snappy-Go Authors",
                "Copyright 2016 The Go Authors",
                "Copyright 2016 The Snappy-Go Authors",
                "Copyright 2020 The Go Authors"
            ],
            "file-count": 22,
            "sha256": "ea4545ca44ee990554094df6de440386a440a5bd99106e048939409d63beb423",
            "source": "https://proxy.golang.org/github.com%2Fgolang/snappy/@v/v0.0.4.zip",
            "status": "approved"
        }
    ]
}