{
    "id": "maven/mavencentral/com.vaadin/flow-lit-template/24.3.7",
    "license": "Apache-2.0",
    "authority": "https://gitlab.eclipse.org/eclipsefdn/emo-team/iplab/-/issues/13743",
    "source": "https://repo1.maven.org/maven2/com/vaadin/flow-lit-template/24.3.7/flow-lit-template-24.3.7-sources.jar",
    "status": "approved",
    "scans": [
        {
            "date": "March 15, 2024 at 2:02:42 p.m. GMT",
            "authority": "https://gitlab.eclipse.org/eclipsefdn/emo-team/iplab/-/issues/13743",
            "scancode-version": "31.2.1",
            "licenses-discovered": [
                "Apache-2.0"
            ],
            "copyrights": [
                "Copyright 2000-2023 Vaadin Ltd."
            ],
            "file-count": 11,
            "sha256": "b59cc379d452f9f95d23df0c0050db88931d29fd5a76f5543a00755881e5e84f",
            "source": "https://repo1.maven.org/maven2/com/vaadin/flow-lit-template/24.3.7/flow-lit-template-24.3.7-sources.jar",
            "status": "approved"
        }
    ]
}