{
    "id": "maven/mavencentral/com.vaadin/vaadin-grid-flow/24.6.5",
    "license": "Apache-2.0",
    "authority": "https://gitlab.eclipse.org/eclipsefdn/emo-team/iplab/-/issues/19784",
    "source": "https://repo1.maven.org/maven2/com/vaadin/vaadin-grid-flow/24.6.5/vaadin-grid-flow-24.6.5-sources.jar",
    "status": "approved",
    "scans": [
        {
            "date": "March 1, 2025 at 3:14:31 a.m. GMT",
            "authority": "https://gitlab.eclipse.org/eclipsefdn/emo-team/iplab/-/issues/19784",
            "scancode-version": "31.2.1",
            "licenses-discovered": [
                "Apache-2.0"
            ],
            "copyrights": [
                "Copyright 2000-2024 Vaadin Ltd."
            ],
            "file-count": 64,
            "sha256": "49942bd1d5dd14636de3da912e73244ca2ec01d6f755a24e7a2a1faf40fa3686",
            "source": "https://repo1.maven.org/maven2/com/vaadin/vaadin-grid-flow/24.6.5/vaadin-grid-flow-24.6.5-sources.jar",
            "status": "approved"
        }
    ]
}