{
    "id": "maven/mavencentral/io.ocfl/ocfl-java-core/2.2.1",
    "license": "MIT AND (CC-BY-2.0 AND CC-BY-4.0)",
    "authority": "https://gitlab.eclipse.org/eclipsefdn/emo-team/iplab/-/issues/17498",
    "source": "https://repo1.maven.org/maven2/io/ocfl/ocfl-java-core/2.2.1/ocfl-java-core-2.2.1-sources.jar",
    "status": "approved",
    "scans": [
        {
            "date": "November 26, 2024 at 11:08:30 p.m. GMT",
            "authority": "https://gitlab.eclipse.org/eclipsefdn/emo-team/iplab/-/issues/17498",
            "scancode-version": "31.2.1",
            "licenses-discovered": [
                "MIT",
                "CC-BY-4.0",
                "CC-BY-2.0 AND CC-BY-4.0"
            ],
            "copyrights": [
                "Copyright (c) 2019-2021"
            ],
            "file-count": 130,
            "sha256": "083a01455dad816387dc796c3a65a53b6dfb69302c0f10e8182d712fb2722fb7",
            "source": "https://repo1.maven.org/maven2/io/ocfl/ocfl-java-core/2.2.1/ocfl-java-core-2.2.1-sources.jar",
            "status": "restricted"
        }
    ]
}