{
    "id": "maven/mavencentral/software.amazon.awssdk/http-client-spi/2.30.2",
    "license": "Apache-2.0",
    "authority": "https://gitlab.eclipse.org/eclipsefdn/emo-team/iplab/-/issues/19169",
    "source": "https://repo1.maven.org/maven2/software/amazon/awssdk/http-client-spi/2.30.2/http-client-spi-2.30.2-sources.jar",
    "status": "approved",
    "scans": [
        {
            "date": "January 22, 2025 at 3:34:51 a.m. GMT",
            "authority": "https://gitlab.eclipse.org/eclipsefdn/emo-team/iplab/-/issues/19169",
            "scancode-version": "31.2.1",
            "licenses-discovered": [
                "Apache-2.0"
            ],
            "copyrights": [
                "Copyright Amazon.com, Inc. or its affiliates"
            ],
            "file-count": 46,
            "sha256": "c63ba360d887844337159f75ad8b12c95f3b5a9f32562783e9ea69363f0fb37a",
            "source": "https://repo1.maven.org/maven2/software/amazon/awssdk/http-client-spi/2.30.2/http-client-spi-2.30.2-sources.jar",
            "status": "approved"
        }
    ]
}