{
    "id": "maven/mavencentral/org.apache.commons/commons-compress/1.22",
    "license": "Apache-2.0 AND BSD-3-Clause",
    "licenses-discovered": [
        "Apache-2.0",
        "Apache-2.0 AND BSD-3-Clause",
        "Apache-2.0 AND LicenseRef-scancode-proprietary-license"
    ],
    "copyrights": [
        "Copyright (c) 2004-2006 Intel Corporation"
    ],
    "alternate-ids": [
    	"p2/orbit/p2.eclipse-plugin/org.apache.commons.compress/1.22.0"
    ],
    "file-count": 392,
    "scancode-version": "31.2.1",
    "authority": "https://gitlab.eclipse.org/eclipsefdn/emo-team/iplab/-/issues/4299",
    "source": "https://search.maven.org/remotecontent?filepath=org/apache/commons/commons-compress/1.22/commons-compress-1.22-sources.jar",
    "status": "approved"
}
