{
    "id": "maven/mavencentral/org.json/json/20210307",
    "license": "JSON",
    "licenses-discovered": [
        "JSON"
    ],
    "file-count": 23,
    "scancode-version": "30.1.0",
    "authority": "https://gitlab.eclipse.org/eclipsefdn/emo-team/iplab/-/issues/2145",
    "source": "https://search.maven.org/remotecontent?filepath=org/json/json/20210307/json-20210307-sources.jar",
    "status": "restricted"
}