{
    "id": "p2/orbit/p2.eclipse.plugin/org.eclipse.jdt.launching/3.18.0.v20200824-1854",
    "license": "EPL-1.0 AND EPL-2.0 AND EPL-2.0",
    "licenses-discovered": [
        "EPL-1.0 AND EPL-2.0",
        "EPL-2.0"
    ],
    "copyrights": [
        "(c) 2008 VeriSign, Inc.",
        "Copyright (c) 2000",
        "Copyright (c) 2000, 2005 IBM Corporation and others",
        "Copyright (c) 2000, 2007 IBM Corporation and others",
        "Copyright (c) 2000, 2008 IBM Corporation and others",
        "Copyright (c) 2000, 2011 IBM Corporation and others",
        "Copyright (c) 2000, 2012 IBM Corporation and others",
        "Copyright (c) 2000, 2013 IBM Corporation and others",
        "Copyright (c) 2000, 2015 IBM Corporation and others",
        "Copyright (c) 2000, 2016 IBM Corporation and others",
        "Copyright (c) 2000, 2017 IBM Corporation and others",
        "Copyright (c) 2000, 2018 IBM Corporation and others",
        "Copyright (c) 2000, 2019 IBM Corporation and others",
        "Copyright (c) 2000, 2020 IBM Corporation and others",
        "Copyright (c) 2004, 2015 IBM Corporation and others",
        "Copyright (c) 2005 IBM Corporation and others",
        "Copyright (c) 2005, 2006 IBM Corporation and others",
        "Copyright (c) 2005, 2010 IBM Corporation and others",
        "Copyright (c) 2005, 2012 IBM Corporation and others",
        "Copyright (c) 2005, 2015 IBM Corporation and others",
        "Copyright (c) 2005, 2017 IBM Corporation and others",
        "Copyright (c) 2005, 2019 IBM Corporation and others",
        "Copyright (c) 2005, 2020 IBM Corporation and others",
        "Copyright (c) 2006 IBM Corporation and others",
        "Copyright (c) 2006, 2012 IBM Corporation and others",
        "Copyright (c) 2006, 2015 IBM Corporation and others",
        "Copyright (c) 2006, 2018 IBM Corporation and others",
        "Copyright (c) 2006, 2020 IBM Corporation and others",
        "Copyright (c) 2007 IBM Corporation and others",
        "Copyright (c) 2007, 2011 IBM Corporation and others",
        "Copyright (c) 2007, 2015 IBM Corporation and others",
        "Copyright (c) 2007, 2016 IBM Corporation and others",
        "Copyright (c) 2008, 2012 IBM Corporation and others",
        "Copyright (c) 2008, 2019 IBM Corporation and others",
        "Copyright (c) 2008, 2020 IBM Corporation and others",
        "Copyright (c) 2010, 2012 IBM Corporation and others",
        "Copyright (c) 2010, 2013 IBM Corporation and others",
        "Copyright (c) 2010, 2015 IBM Corporation and others",
        "Copyright (c) 2010, 2018 IBM Corporation and others",
        "Copyright (c) 2011-2016 Igor Fedorenko",
        "Copyright (c) 2012-2016 Igor Fedorenko",
        "Copyright (c) 2013 BestSolution.at and others",
        "Copyright (c) 2014, 2015 IBM Corporation and others",
        "Copyright (c) 2014-2016 Igor Fedorenko",
        "Copyright (c) 2015-2016 Igor Fedorenko",
        "Copyright (c) 2016 Igor Fedorenko",
        "Copyright (c) 2018, 2019 Cedric Chabanois and others"
    ],
    "file-count": 148,
    "scancode-version": "31.2.1",
    "authority": "https://gitlab.eclipse.org/eclipsefdn/emo-team/iplab/-/issues/4045",
    "source": "https://search.maven.org/remotecontent?filepath=org/eclipse/jdt/org.eclipse.jdt.launching/3.18.0/org.eclipse.jdt.launching-3.18.0-sources.jar",
    "status": "approved"
}