{
    "id": "npm/npmjs/@algolia/autocomplete-preset-algolia/1.17.7",
    "license": "MIT",
    "authority": "https://gitlab.eclipse.org/eclipsefdn/emo-team/iplab/-/issues/18949",
    "source": "https://github.com/algolia/autocomplete/archive/refs/tags/v1.17.7.zip",
    "status": "approved",
    "scans": [
        {
            "date": "January 19, 2025 at 2:57:49 p.m. GMT",
            "authority": "https://gitlab.eclipse.org/eclipsefdn/emo-team/iplab/-/issues/18949",
            "scancode-version": "31.2.1",
            "licenses-discovered": [
                "MIT"
            ],
            "copyrights": [
                "(c) Algolia, Inc. and contributors",
                "Copyright (c) 2015-present Algolia, Inc."
            ],
            "file-count": 784,
            "sha256": "8764678b932885e5dfd37cb3c84e551a379a3db32c2cd308514986f14cbdbf18",
            "source": "https://github.com/algolia/autocomplete/archive/refs/tags/v1.17.7.zip",
            "status": "approved"
        }
    ]
}