{
    "license": "Apache-2.0",
    "file-count": 27,
    "authority": "https://gitlab.eclipse.org/eclipsefdn/emo-team/iplab/-/issues/1219",
    "scancode-version": "21.3.31",
    "licenses-discovered": [
        "Apache-2.0"
    ],
    "id": "maven/mavencentral/org.apache.httpcomponents/httpmime/4.3.3",
    "source": "https://search.maven.org/remotecontent?filepath=org/apache/httpcomponents/httpmime/4.3.3/httpmime-4.3.3-sources.jar",
    "status": "approved"
}