{
    "id": "p2/orbit/p2.eclipse.plugin/javax.activation/2.0.0.v20221112-0806",
    "license": "BSD-3-Clause",
    "authority": "https://gitlab.eclipse.org/eclipsefdn/emo-team/iplab/-/issues/5321",
    "source": "https://search.maven.org/remotecontent?filepath=jakarta/activation/jakarta.activation-api/2.0.0/jakarta.activation-api-2.0.0-sources.jar",
    "status": "approved",
    "scans": [
        {
            "date": "December 2, 2022 at 6:34:13 p.m. GMT",
            "authority": "https://gitlab.eclipse.org/eclipsefdn/emo-team/iplab/-/issues/5321",
            "scancode-version": "31.2.1",
            "licenses-discovered": [
                "BSD-3-Clause"
            ],
            "copyrights": [
                "Copyright (c) 1997, 2019 Oracle and/or its affiliates",
                "Copyright (c) 1997, 2020 Oracle and/or its affiliates",
                "Copyright (c) 2018 Oracle and/or its affiliates"
            ],
            "file-count": 24,
            "sha256": "b9544348245fe412b87b4b7342b3e51435a3122a68f60f07919ee732af19c8c2",
            "source": "https://search.maven.org/remotecontent?filepath=jakarta/activation/jakarta.activation-api/2.0.0/jakarta.activation-api-2.0.0-sources.jar",
            "status": "approved"
        }
    ]
}