{
    "id": "maven/mavencentral/org.springframework.security/spring-security-oauth2-jose/6.3.4",
    "license": "Apache-2.0",
    "authority": "https://gitlab.eclipse.org/eclipsefdn/emo-team/iplab/-/issues/16884",
    "source": "https://repo1.maven.org/maven2/org/springframework/security/spring-security-oauth2-jose/6.3.4/spring-security-oauth2-jose-6.3.4-sources.jar",
    "status": "approved",
    "scans": [
        {
            "date": "October 28, 2024, 6:26:32 a.m. GMT",
            "authority": "https://gitlab.eclipse.org/eclipsefdn/emo-team/iplab/-/issues/16884",
            "scancode-version": "31.2.1",
            "licenses-discovered": [
                "Apache-2.0"
            ],
            "copyrights": [
                "Copyright 2002-2017 the original author or authors",
                "Copyright 2002-2018 the original author or authors",
                "Copyright 2002-2019 the original author or authors",
                "Copyright 2002-2020 the original author or authors",
                "Copyright 2002-2021 the original author or authors",
                "Copyright 2002-2022 the original author or authors",
                "Copyright 2002-2023 the original author or authors",
                "Copyright 2002-2024 the original author or authors"
            ],
            "file-count": 44,
            "sha256": "f446cab13f1b21d3b79090e599ea9dcd1482617009488d55916a1a27a5c77276",
            "source": "https://repo1.maven.org/maven2/org/springframework/security/spring-security-oauth2-jose/6.3.4/spring-security-oauth2-jose-6.3.4-sources.jar",
            "status": "approved"
        }
    ]
}