{
    "id": "p2/orbit/p2.eclipse.plugin/org.apache.lucene.queries/9.8.0.v20230929-1030",
    "license": "Apache-2.0",
    "authority": "https://gitlab.eclipse.org/eclipsefdn/emo-team/iplab/-/issues/10735",
    "source": "https://repo.maven.apache.org/maven2/org/apache/lucene/lucene-queries/9.8.0/lucene-queries-9.8.0-sources.jar",
    "status": "approved",
    "scans": [
        {
            "date": "September 29, 2023 at 6:36:52 p.m. GMT",
            "authority": "https://gitlab.eclipse.org/eclipsefdn/emo-team/iplab/-/issues/10735",
            "scancode-version": "31.2.1",
            "licenses-discovered": [
                "Apache-2.0"
            ],
            "copyrights": [
            ],
            "file-count": 166,
            "sha256": "131d909d8b006896ee02dae6bae17edf57a5311649ba41f805349f5d380b8ca0",
            "source": "https://repo.maven.apache.org/maven2/org/apache/lucene/lucene-queries/9.8.0/lucene-queries-9.8.0-sources.jar",
            "status": "approved"
        }
    ]
}