{
    "id": "npm/npmjs/@babel/preset-react/7.22.5",
    "license": "MIT",
    "authority": "https://gitlab.eclipse.org/eclipsefdn/emo-team/iplab/-/issues/8987",
    "source": "https://registry.npmjs.org/@babel/preset-react/-/preset-react-7.22.5.tgz",
    "status": "approved",
    "scans": [
        {
            "date": "June 15, 2023 at 2:26:07 p.m. GMT",
            "authority": "https://gitlab.eclipse.org/eclipsefdn/emo-team/iplab/-/issues/8987",
            "scancode-version": "31.2.1",
            "licenses-discovered": [
                "MIT"
            ],
            "copyrights": [
                "Copyright (c) 2014-present Sebastian McKenzie and other contributors"
            ],
            "file-count": 7,
            "sha256": "4b107112106c55fab733cbba341fd25965012ed50f0ea0b4d078fd55c4061662",
            "source": "https://registry.npmjs.org/@babel/preset-react/-/preset-react-7.22.5.tgz",
            "status": "approved"
        }
    ]
}