{
    "license": "CDDL-1.1 OR GPL-2.0 WITH Classpath-exception-2.0",
    "file-count": 332,
    "authority": "https://gitlab.eclipse.org/eclipsefdn/emo-team/iplab/-/issues/1168",
    "scancode-version": "30.1.0",
    "licenses-discovered": [],
    "id": "maven/mavencentral/com.sun.xml.ws/samples/2.3.0",
    "source": "https://search.maven.org/remotecontent?filepath=com/sun/xml/ws/samples/2.3.0/samples-2.3.0.zip",
    "status": "approved"
}
