{
    "id": "maven/mavencentral/io.gatling/gatling-shared-enterprise/3.10.5",
    "license": "Apache-2.0",
    "authority": "https://gitlab.eclipse.org/eclipsefdn/emo-team/iplab/-/issues/14464",
    "source": "https://repo1.maven.org/maven2/io/gatling/gatling-shared-enterprise/3.10.5/gatling-shared-enterprise-3.10.5-sources.jar",
    "status": "approved",
    "scans": [
        {
            "date": "April 19, 2024 at 1:42:45 p.m. GMT",
            "authority": "https://gitlab.eclipse.org/eclipsefdn/emo-team/iplab/-/issues/14464",
            "scancode-version": "31.2.1",
            "licenses-discovered": [
            ],
            "copyrights": [
            ],
            "file-count": 1,
            "sha256": "133225b1f335b507e803b7d2768f33589f1600dd3824cbf731e1aac2fd349463",
            "source": "https://repo1.maven.org/maven2/io/gatling/gatling-shared-enterprise/3.10.5/gatling-shared-enterprise-3.10.5-sources.jar",
            "status": "restricted"
        }
    ]
}
