{
    "id": "crate/cratesio/-/influxrs/3.0.0",
    "license": "MIT AND Apache-2.0",
    "authority": "https://gitlab.eclipse.org/eclipsefdn/emo-team/iplab/-/issues/16631",
    "source": "https://crates.io/api/v1/crates/influxrs/3.0.0/download",
    "status": "approved",
    "scans": [
        {
            "date": "October 11, 2024, 12:29:08 p.m. GMT",
            "authority": "https://gitlab.eclipse.org/eclipsefdn/emo-team/iplab/-/issues/16631",
            "scancode-version": "31.2.1",
            "licenses-discovered": [
                "MIT",
                "Apache-2.0"
            ],
            "copyrights": [
            ],
            "file-count": 10,
            "sha256": "ae2b0b3d0ecac700fd3b3833d8faf40e3606e9759fa232758998a098a69670c5",
            "source": "https://crates.io/api/v1/crates/influxrs/3.0.0/download",
            "status": "approved"
        }
    ]
}