{
    "id": "npm/npmjs/@microsoft/1ds-core-js/4.3.4",
    "license": "MIT",
    "authority": "https://gitlab.eclipse.org/eclipsefdn/emo-team/iplab/-/issues/17250",
    "source": "https://registry.npmjs.org/@microsoft/1ds-core-js/-/1ds-core-js-4.3.4.tgz",
    "status": "approved",
    "scans": [
        {
            "date": "November 15, 2024, 1:46:47 p.m. GMT",
            "authority": "https://gitlab.eclipse.org/eclipsefdn/emo-team/iplab/-/issues/17250",
            "scancode-version": "31.2.1",
            "licenses-discovered": [
                "MIT"
            ],
            "copyrights": [
                "Copyright (c) 2022 NevWare21 Solutions LLC",
                "Copyright (c) 2023 NevWare21 Solutions LLC",
                "Copyright (c) 2024 NevWare21 Solutions LLC",
                "Copyright (c) Microsoft Corporation",
                "Copyright (c) Microsoft and contributors",
                "Copyright (c) NevWare21 Solutions LLC and contributors",
                "copyright Microsoft 2018"
            ],
            "file-count": 51,
            "sha256": "cc1fdec6ad974c450967f041fb74c134374537cd272d70d1b1e31acdd0762379",
            "source": "https://registry.npmjs.org/@microsoft/1ds-core-js/-/1ds-core-js-4.3.4.tgz",
            "status": "approved"
        }
    ]
}