{
    "id": "npm/npmjs/-/knip/5.16.0",
    "license": "ISC AND OFL-1.1 AND MIT",
    "authority": "https://gitlab.eclipse.org/eclipsefdn/emo-team/iplab/-/issues/14839",
    "source": "https://github.com/webpro/knip/archive/refs/tags/5.16.0.zip",
    "status": "approved",
    "scans": [
        {
            "date": "May 21, 2024 at 12:09:11 p.m. GMT",
            "authority": "https://gitlab.eclipse.org/eclipsefdn/emo-team/iplab/-/issues/14839",
            "scancode-version": "31.2.1",
            "licenses-discovered": [
                "ISC",
                "OFL-1.1",
                "MIT"
            ],
            "copyrights": [
                "(c) 2006 VeriSign, Inc.",
                "(c) 2024 https://www.webpro.nl'> Lars Kappert",
                "(c) today.getFullYear Your name here",
                "Copyright 2010, 2012, 2014 Adobe Systems Incorporated (http://www.adobe.com/)",
                "Copyright 2022-2024 Lars Kappert"
            ],
            "file-count": 2013,
            "sha256": "d7042c125a24604d508a43c83cdb91620d0a0e15f915d46e9af6dda547beb3d7",
            "source": "https://github.com/webpro/knip/archive/refs/tags/5.16.0.zip",
            "status": "approved"
        }
    ]
}