{
    "id": "project/automotive.velocitas/eclipse-velocitas/vehicle-app-python-sdk/0397dc485dfaeb3e7db2a0aed240b939dd87bec2",
    "license": "Apache-2.0",
    "authority": "https://gitlab.eclipse.org/eclipsefdn/emo-team/iplab/-/issues/5229",
    "source": "https://github.com/eclipse-velocitas/vehicle-app-python-sdk/archive/0397dc485dfaeb3e7db2a0aed240b939dd87bec2.zip",
    "status": "approved",
    "scans": [
        {
            "date": "November 29, 2022 at 2:28:58 a.m. GMT",
            "authority": "https://gitlab.eclipse.org/eclipsefdn/emo-team/iplab/-/issues/5229",
            "scancode-version": "31.2.1",
            "licenses-discovered": [
                "Apache-2.0",
                "Apache-2.0 AND BSD-2-Clause AND BSD-3-Clause AND GPL-2.0-only AND LGPL-2.0-only AND MIT AND MPL-2.0 AND Python-2.0"
            ],
            "copyrights": [
                "Copyright (c) 2022 Robert Bosch GmbH and Microsoft Corporation"
            ],
            "file-count": 165,
            "sha256": "0963b72068aef465ebc8cf8ead921821a179969807a523fdec8d81bfa7cf2132",
            "source": "https://github.com/eclipse-velocitas/vehicle-app-python-sdk/archive/0397dc485dfaeb3e7db2a0aed240b939dd87bec2.zip",
            "status": "restricted"
        }
    ]
}
