{
    "id": "maven/mavencentral/org.uberfire/uberfire-all/7.63.0-20211207.163409-15",
    "license": "Apache-2.0",
    "licenses-discovered": [
        "Apache-2.0"
    ],
    "copyrights": [
        "Copyright Red Hat, Inc. and/or its affiliates"
    ],
    "file-count": 1,
    "scancode-version": "30.1.0",
    "authority": "https://gitlab.eclipse.org/eclipsefdn/emo-team/iplab/-/issues/2814",
    "source": "https://search.maven.org/remotecontent?filepath=org/uberfire/uberfire-all/7.63.0.Final/uberfire-all-7.63.0.Final.pom",
    "status": "approved"
}