{
    "id": "go/golang/github.com%2Fyudai/gojsondiff/v1.0.0",
    "license": "MIT",
    "authority": "https://gitlab.eclipse.org/eclipsefdn/emo-team/iplab/-/issues/12540",
    "source": "https://proxy.golang.org/github.com%2Fyudai/gojsondiff/@v/v1.0.0.zip",
    "status": "approved",
    "scans": [
        {
            "date": "December 26, 2023 at 2:49:25 a.m. GMT",
            "authority": "https://gitlab.eclipse.org/eclipsefdn/emo-team/iplab/-/issues/12540",
            "scancode-version": "31.2.1",
            "licenses-discovered": [
                "MIT"
            ],
            "copyrights": [
                "Copyright (c) 2012 Sergi Mansilla <sergi.mansilla@gmail.com>",
                "Copyright (c) 2013 Jeremy Saenz",
                "Copyright (c) 2013-2014 Onsi Fakhouri",
                "Copyright (c) 2015 Iwasaki Yudai"
            ],
            "file-count": 33,
            "sha256": "90c457b595a661a25760d9f10cfda3fec27f7213c0e7026a5b97b30168e8f2d1",
            "source": "https://proxy.golang.org/github.com%2Fyudai/gojsondiff/@v/v1.0.0.zip",
            "status": "approved"
        }
    ]
}