{
    "id": "crate/cratesio/-/smallvec/1.14.0",
    "license": "Apache-2.0 AND MIT AND Apache-2.0 AND MIT",
    "authority": "https://gitlab.eclipse.org/eclipsefdn/emo-team/iplab/-/issues/19483",
    "source": "https://crates.io/api/v1/crates/smallvec/1.14.0/download",
    "status": "approved",
    "scans": [
        {
            "date": "February 19, 2025 at 9:38:01 a.m. GMT",
            "authority": "https://gitlab.eclipse.org/eclipsefdn/emo-team/iplab/-/issues/19483",
            "scancode-version": "31.2.1",
            "licenses-discovered": [
                "Apache-2.0 AND MIT",
                "Apache-2.0",
                "MIT"
            ],
            "copyrights": [
                "Copyright (c) 2018 The Servo Project"
            ],
            "file-count": 17,
            "sha256": "7fcf8323ef1faaee30a44a340193b1ac6814fd9b7b4e88e9d4519a3e4abe1cfd",
            "source": "https://crates.io/api/v1/crates/smallvec/1.14.0/download",
            "status": "approved"
        }
    ]
}