{
    "id": "npm/npmjs/-/mgrs/1.0.0",
    "license": "MIT AND LicenseRef-scancode-openmap AND (LGPL-2.1-or-later AND MIT)",
    "authority": "https://gitlab.eclipse.org/eclipsefdn/emo-team/iplab/-/issues/7728",
    "source": "https://registry.yarnpkg.com/mgrs/-/mgrs-1.0.0.tgz",
    "status": "restricted",
    "scans": [
        {
            "date": "March 31, 2023 at 12:01:11 p.m. GMT",
            "authority": "https://gitlab.eclipse.org/eclipsefdn/emo-team/iplab/-/issues/7728",
            "scancode-version": "31.2.1",
            "licenses-discovered": [
                "MIT",
                "LicenseRef-scancode-openmap",
                "LGPL-2.1-or-later AND MIT"
            ],
            "copyrights": [
                "Copyright (c) 2012, Mike Adair, Richard Greenwood, Didier Richard, Stephen Irons, Olivier Terral, Calvin Metcalf"
            ],
            "file-count": 11,
            "sha256": "9df8b8b657f828fa8ef6729789865b96a121e148f6fc54128a7b695c6231b8dd",
            "source": "https://registry.yarnpkg.com/mgrs/-/mgrs-1.0.0.tgz",
            "status": "restricted"
        }
    ]
}