{
    "id": "maven/mavencentral/org.webjars/swagger-ui/4.15.5",
    "license": "Apache-2.0 AND MIT",
    "authority": "https://gitlab.eclipse.org/eclipsefdn/emo-team/iplab/-/issues/5921",
    "source": "https://search.maven.org/remotecontent?filepath=org/webjars/swagger-ui/4.15.5/swagger-ui-4.15.5.jar",
    "status": "approved",
    "scans": [
        {
            "date": "January 4, 2023 at 4:15:13 p.m. GMT",
            "authority": "https://gitlab.eclipse.org/eclipsefdn/emo-team/iplab/-/issues/5921",
            "scancode-version": "31.2.1",
            "licenses-discovered": [
                "Apache-2.0",
                "MIT"
            ],
            "copyrights": [
                "(c) ,u r(1970)",
                "(c) 2014-2022 Denis Pushkarev",
                "Copyright (c) 2013-2018 Viacheslav Lotsmanov",
                "Copyright Angel Marin, Paul Johnston 2000 - 2009. Other contributors Greg Holt, Andrew Kepert, Ydnar, Lostinet",
                "Copyright Joyent, Inc. and other Node contributors",
                "Copyright Paul Johnston 2000 - 2002. Other contributors Greg Holt, Andrew Kepert, Ydnar, Lostinet",
                "copyright (c) 2014-2022 Denis Pushkarev"
            ],
            "file-count": 41,
            "sha256": "7115eec67255793d3d3e5a34adfef7767af2f497723715ac0fad1f478496c771",
            "source": "https://search.maven.org/remotecontent?filepath=org/webjars/swagger-ui/4.15.5/swagger-ui-4.15.5.jar",
            "status": "approved"
        }
    ]
}