{
    "id": "npm/npmjs/-/dompurify/3.1.6",
    "license": "Apache-2.0 OR MPL-2.0",
    "authority": "https://gitlab.eclipse.org/eclipsefdn/emo-team/iplab/-/issues/16174",
    "source": "https://github.com/cure53/DOMPurify/archive/refs/tags/3.1.6.zip",
    "status": "approved",
    "scans": [
        {
            "date": "September 18, 2024, 6:52:26 p.m. GMT",
            "authority": "https://gitlab.eclipse.org/eclipsefdn/emo-team/iplab/-/issues/16174",
            "scancode-version": "31.2.1",
            "licenses-discovered": [
                "Apache-2.0 AND MPL-2.0",
                "Apache-2.0 AND GPL-2.0-only AND MPL-2.0"
            ],
            "copyrights": [
                "(c) Cure53 and other contributors",
                "Copyright 2024 Dr.-Ing. Mario Heiderich, Cure53",
                "copyright content src https://leaking.via/meta-name-copyright-reading-view",
                "copyright https://leaking.via/link-copyright"
            ],
            "file-count": 60,
            "sha256": "689eb82e698a20dde113adeaa99934d02f04c3386f429a0d3ffeae2b6356e4bd",
            "source": "https://github.com/cure53/DOMPurify/archive/refs/tags/3.1.6.zip",
            "status": "restricted"
        }
    ]
}