{
    "id": "pypi/pypi/-/python-debian/0.1.44",
    "license": "GPL-2.0-or-later AND LicenseRef-scancode-free-unknown AND GPL-3.0-or-later AND GPL-2.0-or-later AND (GPL-2.0-or-later AND LicenseRef-scancode-proprietary-license)",
    "authority": "https://gitlab.eclipse.org/eclipsefdn/emo-team/iplab/-/issues/4763",
    "source": "https://files.pythonhosted.org/packages/52/1e/971d6fc2f9da72155314b3130643198e4f0c029f6e8a8ae040a45e072d44/python-debian-0.1.44.tar.gz",
    "status": "restricted",
    "scans": [
        {
            "date": "November 10, 2022 at 8:41:02 p.m. GMT",
            "authority": "https://gitlab.eclipse.org/eclipsefdn/emo-team/iplab/-/issues/4763",
            "scancode-version": "31.2.1",
            "licenses-discovered": [
                "GPL-2.0-or-later AND LicenseRef-scancode-free-unknown",
                "GPL-3.0-or-later",
                "GPL-2.0-or-later",
                "GPL-2.0-or-later AND LicenseRef-scancode-proprietary-license"
            ],
            "copyrights": [
                "Copyright (c) 2005 Florian Weimer <fw@deneb.enyo.de>",
                "Copyright (c) 2005-2006 dann frazier <dannf@dannf.org>",
                "Copyright (c) 2006 Adeodato Simo <dato@net.com.org.es>",
                "Copyright (c) 2006 James Westby <jw+debian@jameswestby.net>",
                "Copyright (c) 2006-2007 Enrico Zini <enrico@enricozini.org>",
                "Copyright (c) 2006-2010 John Wright <john@johnwright.org>",
                "Copyright (c) 2006-7 James Westby <jw+debian@jameswestby.net>",
                "Copyright (c) 2007 Filippo Giunchedi <filippo@debian.org>",
                "Copyright (c) 2007 Stefano Zacchiroli <zack@debian.org>",
                "Copyright (c) 2007-2008 Stefano Zacchiroli <zack@debian.org>",
                "Copyright (c) 2008 Canonical Ltd.",
                "Copyright (c) 2008 Stefano Zacchiroli <zack@upsilon.cc>",
                "Copyright (c) 2010 John Wright <jsw@debian.org>",
                "Copyright (c) 2014 Google, Inc.",
                "Copyright (c) 2019-2020 Jelmer Vernooij <jelmer@debian.org>",
                "Copyright (c) Ben Finney <ben+debian@benfinney.id.au>",
                "Copyright 1996 Ian Jackson",
                "Copyright 2005 Frank Lichtenheld <frank@lichtenheld.de>"
            ],
            "file-count": 30,
            "sha256": "65592fe3b64f6c6c93d94e2d2599db5e0c22831d3bcff07cb7b96d3840b1333e",
            "source": "https://files.pythonhosted.org/packages/52/1e/971d6fc2f9da72155314b3130643198e4f0c029f6e8a8ae040a45e072d44/python-debian-0.1.44.tar.gz",
            "status": "restricted"
        }
    ]
}