{
    "id": "pypi/pypi/-/license-expression/21.6.14",
    "license": "Apache-2.0 AND (Apache-2.0 AND BSD-3-Clause AND (GPL-2.0-only WITH Classpath-exception-2.0) AND LGPL-2.0-or-later AND LGPL-2.1-only) AND LicenseRef-scancode-public-domain AND CC-BY-4.0 AND JSON",
    "authority": "https://gitlab.eclipse.org/eclipsefdn/emo-team/iplab/-/issues/4736",
    "source": "https://files.pythonhosted.org/packages/3a/ec/755cfd9cf2b78eb3e3e27fe06511df83d9def874d15ecd4d6f23f1519e73/license-expression-21.6.14.tar.gz",
    "status": "restricted",
    "scans": [
        {
            "date": "November 10, 2022 at 9:16:50 p.m. GMT",
            "authority": "https://gitlab.eclipse.org/eclipsefdn/emo-team/iplab/-/issues/4736",
            "scancode-version": "31.2.1",
            "licenses-discovered": [
                "Apache-2.0",
                "Apache-2.0 AND BSD-3-Clause AND (GPL-2.0-only WITH Classpath-exception-2.0) AND LGPL-2.0-or-later AND LGPL-2.1-only",
                "LicenseRef-scancode-public-domain",
                "CC-BY-4.0",
                "JSON"
            ],
            "copyrights": [
                "Copyright (c) nexB Inc. and others",
                "copyright nexb Inc."
            ],
            "file-count": 41,
            "sha256": "9de87a427c9a449eee7913472fb9ed03b63036295547369fdbf95f76a8b924b2",
            "source": "https://files.pythonhosted.org/packages/3a/ec/755cfd9cf2b78eb3e3e27fe06511df83d9def874d15ecd4d6f23f1519e73/license-expression-21.6.14.tar.gz",
            "status": "restricted"
        }
    ]
}