{
    "id": "npm/npmjs/-/vsce/2.15.0",
    "license": "MIT AND (ISC AND MIT) AND ISC",
    "authority": "https://gitlab.eclipse.org/eclipsefdn/emo-team/iplab/-/issues/13226",
    "source": "https://github.com/microsoft/vscode-vsce/archive/refs/tags/v2.15.0.zip",
    "status": "approved",
    "scans": [
        {
            "date": "February 13, 2024 at 3:39:06 p.m. GMT",
            "authority": "https://gitlab.eclipse.org/eclipsefdn/emo-team/iplab/-/issues/13226",
            "scancode-version": "31.2.1",
            "licenses-discovered": [
                "MIT",
                "ISC AND MIT",
                "ISC"
            ],
            "copyrights": [
                "Copyright (c) 2010 Benjamin Thomas, Robert Kieffer",
                "Copyright (c) 2011 TJ Holowaychuk <tj@vision-media.ca>",
                "Copyright (c) 2014 Josh Wolfe",
                "Copyright (c) 2014 KARASZI Istvan",
                "Copyright (c) 2015 Microsoft",
                "Copyright (c) Isaac Z. Schlueter and Contributors",
                "Copyright (c) Microsoft Corporation",
                "Copyright 2012-2015 The Dojo Foundation <http://dojofoundation.org/>",
                "copyright 2009-2015 Jeremy Ashkenas, DocumentCloud and Investigative Reporters & Editors <http://underscorejs.org/>"
            ],
            "file-count": 102,
            "sha256": "faa45404c4beb19e4b5a73f267b0558bb66e2ac22844b861b7e30833449a383a",
            "source": "https://github.com/microsoft/vscode-vsce/archive/refs/tags/v2.15.0.zip",
            "status": "approved"
        }
    ]
}