{
    "id": "npm/npmjs/@vue/tsconfig/0.3.2",
    "license": "MIT",
    "authority": "https://gitlab.eclipse.org/eclipsefdn/emo-team/iplab/-/issues/8117",
    "source": "https://github.com/vuejs/tsconfig/archive/v0.3.2.zip",
    "status": "approved",
    "scans": [
        {
            "date": "May 3, 2023 at 10:02:52 a.m. GMT",
            "authority": "https://gitlab.eclipse.org/eclipsefdn/emo-team/iplab/-/issues/8117",
            "scancode-version": "31.2.1",
            "licenses-discovered": [
                "MIT"
            ],
            "copyrights": [
                "Copyright (c) 2022-present vuejs"
            ],
            "file-count": 5,
            "sha256": "3c27fe8de1e7c148f1a851cb468ae92d61e58c18ee1b9e96bba4d679b8846ac0",
            "source": "https://github.com/vuejs/tsconfig/archive/v0.3.2.zip",
            "status": "approved"
        }
    ]
}