{
    "license": "LicenseRef-public-domain",
    "file-count": 106,
    "authority": "https://gitlab.eclipse.org/eclipsefdn/emo-team/iplab/-/issues/1301",
    "scancode-version": "21.3.31",
    "licenses-discovered": [
        "LicenseRef-scancode-public-domain",
        "LicenseRef-scancode-public-domain-disclaimer"
    ],
    "id": "maven/mavencentral/org.tukaani/xz/1.0",
    "source": "https://search.maven.org/remotecontent?filepath=org/tukaani/xz/1.0/xz-1.0-sources.jar",
    "status": "approved"
}
