{
    "id": "npm/npmjs/-/has-property-descriptors/1.0.1",
    "license": "MIT",
    "authority": "https://gitlab.eclipse.org/eclipsefdn/emo-team/iplab/-/issues/11098",
    "source": "https://github.com/inspect-js/has-property-descriptors/archive/refs/tags/v1.0.1.zip",
    "status": "approved",
    "scans": [
        {
            "date": "October 21, 2023 at 10:43:04 a.m. GMT",
            "authority": "https://gitlab.eclipse.org/eclipsefdn/emo-team/iplab/-/issues/11098",
            "scancode-version": "31.2.1",
            "licenses-discovered": [
                "MIT"
            ],
            "copyrights": [
                "Copyright (c) 2022 Inspect JS"
            ],
            "file-count": 14,
            "sha256": "2a4d32473ee362e0a7516140236a00f2df10d0d1b96b255ffecae06484df1997",
            "source": "https://github.com/inspect-js/has-property-descriptors/archive/refs/tags/v1.0.1.zip",
            "status": "approved"
        }
    ]
}