{
    "id": "go/golang/google.golang.org/genproto/v0.0.0-20180817151627-c66870c02cf8",
    "license": "Apache-2.0",
    "authority": "https://gitlab.eclipse.org/eclipsefdn/emo-team/iplab/-/issues/5839",
    "source": "https://proxy.golang.org/google.golang.org/genproto/@v/v0.0.0-20180817151627-c66870c02cf8.zip",
    "status": "approved",
    "scans": [
        {
            "date": "December 14, 2022 at 6:59:48 a.m. GMT",
            "authority": "https://gitlab.eclipse.org/eclipsefdn/emo-team/iplab/-/issues/5839",
            "scancode-version": "31.2.1",
            "licenses-discovered": [
                "Apache-2.0"
            ],
            "copyrights": [
                "Copyright 2016 Google Inc."
            ],
            "file-count": 331,
            "sha256": "46c86d623a6699bf5787e01d225e890a38224d749df4e0444872eedfd49b0d4f",
            "source": "https://proxy.golang.org/google.golang.org/genproto/@v/v0.0.0-20180817151627-c66870c02cf8.zip",
            "status": "approved"
        }
    ]
}