{
    "id": "maven/mavencentral/org.codelibs.elasticsearch.lib/dissect/7.15.2",
    "license": "Elastic-2.0 OR SSPL-1.0",
    "authority": "https://gitlab.eclipse.org/eclipsefdn/emo-team/iplab/-/issues/6408",
    "source": "https://maven.codelibs.org/org/codelibs/elasticsearch/lib/dissect/7.15.2/dissect-7.15.2-sources.jar",
    "status": "approved",
    "scans": [
        {
            "date": "January 31, 2023 at 10:29:36 p.m. GMT",
            "authority": "https://gitlab.eclipse.org/eclipsefdn/emo-team/iplab/-/issues/6408",
            "scancode-version": "31.2.1",
            "licenses-discovered": [
                "Elastic-2.0 AND SSPL-1.0"
            ],
            "copyrights": [
                "Copyright Elasticsearch B.V."
            ],
            "file-count": 5,
            "sha256": "2d2bc152cb524e23e7cb839077f5792005bd68af39ec3954127afa6d8258c3fb",
            "source": "https://maven.codelibs.org/org/codelibs/elasticsearch/lib/dissect/7.15.2/dissect-7.15.2-sources.jar",
            "status": "approved"
        }
    ]
}
