{
    "id": "npm/npmjs/@vue/reactivity-transform/3.3.0-beta.3",
    "license": "MIT",
    "authority": "https://gitlab.eclipse.org/eclipsefdn/emo-team/iplab/-/issues/8186",
    "source": "https://github.com/vuejs/core/archive/v3.3.0-beta.3.zip",
    "status": "approved",
    "scans": [
        {
            "date": "May 3, 2023 at 12:41:50 p.m. GMT",
            "authority": "https://gitlab.eclipse.org/eclipsefdn/emo-team/iplab/-/issues/8186",
            "scancode-version": "31.2.1",
            "licenses-discovered": [
                "MIT"
            ],
            "copyrights": [
                "Copyright (c) 2013-present, Yuxi",
                "Copyright (c) 2018-present, Yuxi"
            ],
            "file-count": 631,
            "sha256": "bcac2124316b0bbc3f9d2be1debb05af6f7174975a18895925d075db68cd656c",
            "source": "https://github.com/vuejs/core/archive/v3.3.0-beta.3.zip",
            "status": "approved"
        }
    ]
}