{
    "id": "maven/mavencentral/com.vegardit.no-npe/no-npe-eea-all/1.1.0",
    "license": "EPL-2.0",
    "authority": "https://gitlab.eclipse.org/eclipsefdn/emo-team/iplab/-/issues/16066",
    "source": "https://github.com/vegardit/no-npe/archive/refs/tags/1.1.0.zip",
    "status": "approved",
    "scans": [
        {
            "date": "September 4, 2024 at 12:32:49 p.m. GMT",
            "authority": "https://gitlab.eclipse.org/eclipsefdn/emo-team/iplab/-/issues/16066",
            "scancode-version": "31.2.1",
            "licenses-discovered": [
                "EPL-2.0"
            ],
            "copyrights": [
                "Copyright (c) Vegard IT GmbH (https://vegardit.com) and contributors"
            ],
            "file-count": 28895,
            "sha256": "eb44be8ba256e10276b5d9b3f3da0c35af5ccb415c2301ed6550649acf2fa191",
            "source": "https://github.com/vegardit/no-npe/archive/refs/tags/1.1.0.zip",
            "status": "approved"
        }
    ]
}