{
    "license": "MIT",
    "file-count": 5,
    "authority": "https://gitlab.eclipse.org/eclipsefdn/emo-team/iplab/-/issues/927",
    "scancode-version": "21.3.31",
    "licenses-discovered": [
        "MIT"
    ],
    "id": "npm/npmjs/-/pdfobject/2.1.1",
    "source": "https://registry.npmjs.org/pdfobject/-/pdfobject-2.1.1.tgz",
    "status": "approved"
}