{
    "id": "npm/npmjs/@angular-eslint/builder/17.1.1",
    "license": "MIT",
    "authority": "https://gitlab.eclipse.org/eclipsefdn/emo-team/iplab/-/issues/12816",
    "source": "https://github.com/angular-eslint/angular-eslint/archive/refs/tags/v17.1.1.zip",
    "status": "approved",
    "scans": [
        {
            "date": "January 17, 2024 at 4:09:57 p.m. GMT",
            "authority": "https://gitlab.eclipse.org/eclipsefdn/emo-team/iplab/-/issues/12816",
            "scancode-version": "31.2.1",
            "licenses-discovered": [
                "MIT"
            ],
            "copyrights": [
                "Copyright (c) 2020 James Henry"
            ],
            "file-count": 498,
            "sha256": "886e037aa523c0300b51525af438aa1f08c0ad8d7f8e3d27b92d544d8ce7e031",
            "source": "https://github.com/angular-eslint/angular-eslint/archive/refs/tags/v17.1.1.zip",
            "status": "approved"
        }
    ]
}