{
    "id": "maven/mavencentral/org.eclipse.dataspaceconnector/data-plane-http/0.0.1-20220922.4-20230220.143048-1",
    "license": "Apache-2.0",
    "authority": "https://gitlab.eclipse.org/eclipsefdn/emo-team/iplab/-/issues/7634",
    "source": "https://search.maven.org/remotecontent?filepath=org/eclipse/dataspaceconnector/data-plane-http/0.0.1-milestone-6/data-plane-http-0.0.1-milestone-6-sources.jar",
    "status": "approved",
    "scans": [
        {
            "date": "March 28, 2023 at 9:51:39 p.m. GMT",
            "authority": "https://gitlab.eclipse.org/eclipsefdn/emo-team/iplab/-/issues/7634",
            "scancode-version": "31.2.1",
            "licenses-discovered": [
                "Apache-2.0"
            ],
            "copyrights": [
                "Copyright (c) 2021 Microsoft Corporation",
                "Copyright (c) 2022 Amadeus"
            ],
            "file-count": 14,
            "sha256": "20d57d342ea44fe4c43ae55be60563db6525ba028b1b5b69ecfcf341a2117ae2",
            "source": "https://search.maven.org/remotecontent?filepath=org/eclipse/dataspaceconnector/data-plane-http/0.0.1-milestone-6/data-plane-http-0.0.1-milestone-6-sources.jar",
            "status": "approved"
        }
    ]
}