{
    "id": "maven/mavencentral/org.apache.curator/curator-client/5.2.0",
    "license": "Apache-2.0",
    "licenses-discovered": [
        "Apache-2.0"
    ],
    "copyrights": [
        "Copyright The Apache Software Foundation"
    ],
    "file-count": 46,
    "scancode-version": "30.1.0",
    "authority": "https://gitlab.eclipse.org/eclipsefdn/emo-team/iplab/-/issues/3529",
    "source": "https://search.maven.org/remotecontent?filepath=org/apache/curator/curator-client/5.2.0/curator-client-5.2.0-sources.jar",
    "status": "approved"
}