{
    "id": "npm/npmjs/-/handlebars/4.7.8",
    "license": "MIT",
    "authority": "https://gitlab.eclipse.org/eclipsefdn/emo-team/iplab/-/issues/9933",
    "source": "https://registry.yarnpkg.com/handlebars/-/handlebars-4.7.8.tgz",
    "status": "approved",
    "scans": [
        {
            "date": "August 11, 2023 at 12:20:11 a.m. GMT",
            "authority": "https://gitlab.eclipse.org/eclipsefdn/emo-team/iplab/-/issues/9933",
            "scancode-version": "31.2.1",
            "licenses-discovered": [
                "MIT"
            ],
            "copyrights": [
                "Copyright (c) 2011-2019 by Yehuda Katz"
            ],
            "file-count": 118,
            "sha256": "2dadfd6743a1e0d876e55d5c5622450a99c1316848048bc6c131a5fc42e776a6",
            "source": "https://registry.yarnpkg.com/handlebars/-/handlebars-4.7.8.tgz",
            "status": "approved"
        }
    ]
}