{
    "id": "npm/npmjs/@angular/language-server/17.1.0",
    "license": "MIT",
    "authority": "https://gitlab.eclipse.org/eclipsefdn/emo-team/iplab/-/issues/12782",
    "source": "https://github.com/angular/vscode-ng-language-service/archive/refs/tags/v17.1.0.zip",
    "status": "approved",
    "scans": [
        {
            "date": "January 16, 2024 at 6:40:22 p.m. GMT",
            "authority": "https://gitlab.eclipse.org/eclipsefdn/emo-team/iplab/-/issues/12782",
            "scancode-version": "31.2.1",
            "licenses-discovered": [
                "MIT"
            ],
            "copyrights": [
                "Copyright (c) 2014-2016 Google, Inc. http://angular.io",
                "Copyright Google Inc",
                "Copyright Google Inc."
            ],
            "file-count": 180,
            "sha256": "05671d655d0d9680c47add7e67901bc5d7eaee04e576ce06123bc4aa23a80b56",
            "source": "https://github.com/angular/vscode-ng-language-service/archive/refs/tags/v17.1.0.zip",
            "status": "approved"
        }
    ]
}