{
    "id": "maven/mavencentral/io.fabric8/kubernetes-model-networking/6.4.0",
    "license": "Apache-2.0",
    "authority": "https://gitlab.eclipse.org/eclipsefdn/emo-team/iplab/-/issues/6568",
    "source": "https://search.maven.org/remotecontent?filepath=io/fabric8/kubernetes-model-networking/6.4.0/kubernetes-model-networking-6.4.0-sources.jar",
    "status": "approved",
    "scans": [
        {
            "date": "January 24, 2023 at 9:40:50 a.m. GMT",
            "authority": "https://gitlab.eclipse.org/eclipsefdn/emo-team/iplab/-/issues/6568",
            "scancode-version": "31.2.1",
            "licenses-discovered": [
                "Apache-2.0"
            ],
            "copyrights": [
                "Copyright (c) 2015 Red Hat, Inc."
            ],
            "file-count": 169,
            "sha256": "86e8a8f6a2e2e596a54191ae36669acf5ada0e9554cdc294a2c0221676f6ab7e",
            "source": "https://search.maven.org/remotecontent?filepath=io/fabric8/kubernetes-model-networking/6.4.0/kubernetes-model-networking-6.4.0-sources.jar",
            "status": "approved"
        }
    ]
}