{
    "id": "nuget/nuget/-/Serilog.AspNetCore/8.0.1",
    "license": "Apache-2.0 AND MIT",
    "authority": "https://gitlab.eclipse.org/eclipsefdn/emo-team/iplab/-/issues/13967",
    "source": "https://github.com/serilog/serilog-aspnetcore/archive/refs/tags/v8.0.1.zip",
    "status": "approved",
    "scans": [
        {
            "date": "March 21, 2024 at 5:48:17 p.m. GMT",
            "authority": "https://gitlab.eclipse.org/eclipsefdn/emo-team/iplab/-/issues/13967",
            "scancode-version": "31.2.1",
            "licenses-discovered": [
                "Apache-2.0",
                "MIT",
                "Apache-2.0 AND MIT"
            ],
            "copyrights": [
                "(c) 2021 - Sample",
                "(c) JS Foundation and other contributors",
                "Copyright (c) .NET Foundation",
                "Copyright (c) 2010-2013 Diego Perini",
                "Copyright (c) 2011-2018 The Bootstrap Authors",
                "Copyright (c) 2011-2018 Twitter, Inc.",
                "Copyright (c) 2016 Federico Zivolo and contributors",
                "Copyright (c) 2017 Jorn Zaefferer",
                "Copyright 2011-2019 The Bootstrap Authors",
                "Copyright 2011-2019 The Bootstrap Authors (https://github.com/twbs/bootstrap/graphs/contributors)",
                "Copyright 2011-2019 Twitter, Inc.",
                "Copyright 2019 Serilog",
                "Copyright 2019-2020 Serilog",
                "Copyright JS Foundation and other contributors",
                "Copyright JS Foundation and other contributors, https://js.foundation",
                "Copyright Jorn Zaefferer",
                "copyright 2014 Waybury. https://useiconic.com/open"
            ],
            "file-count": 76,
            "sha256": "d2c800830e08fb84c436a7aec4cb1376c151cd459e65b0e16590fa28191a9cd1",
            "source": "https://github.com/serilog/serilog-aspnetcore/archive/refs/tags/v8.0.1.zip",
            "status": "approved"
        }
    ]
}