{
    "id": "maven/mavencentral/com.azure.resourcemanager/azure-resourcemanager-monitor/2.39.0",
    "license": "MIT",
    "authority": "https://gitlab.eclipse.org/eclipsefdn/emo-team/iplab/-/issues/15094",
    "source": "https://repo1.maven.org/maven2/com/azure/resourcemanager/azure-resourcemanager-monitor/2.39.0/azure-resourcemanager-monitor-2.39.0-sources.jar",
    "status": "approved",
    "scans": [
        {
            "date": "June 6, 2024 at 11:04:30 a.m. GMT",
            "authority": "https://gitlab.eclipse.org/eclipsefdn/emo-team/iplab/-/issues/15094",
            "scancode-version": "31.2.1",
            "licenses-discovered": [
                "MIT"
            ],
            "copyrights": [
                "(c) 2008 VeriSign, Inc.",
                "Copyright (c) Microsoft Corporation"
            ],
            "file-count": 375,
            "sha256": "cc3d1be0405e89cc693e3eb9c9d2a4165cf0cf3cfed852e1d6bb2b40d1876e54",
            "source": "https://repo1.maven.org/maven2/com/azure/resourcemanager/azure-resourcemanager-monitor/2.39.0/azure-resourcemanager-monitor-2.39.0-sources.jar",
            "status": "approved"
        }
    ]
}