{
    "id": "npm/npmjs/@iarna/toml/2.2.5",
    "license": "MIT AND ISC",
    "authority": "https://gitlab.eclipse.org/eclipsefdn/emo-team/iplab/-/issues/11977",
    "source": "https://github.com/iarna/iarna-toml/archive/refs/tags/v2.2.5.zip",
    "status": "approved",
    "scans": [
        {
            "date": "December 13, 2023 at 5:05:03 p.m. GMT",
            "authority": "https://gitlab.eclipse.org/eclipsefdn/emo-team/iplab/-/issues/11977",
            "scancode-version": "31.2.1",
            "licenses-discovered": [
                "MIT",
                "ISC"
            ],
            "copyrights": [
                "Copyright (c) 2015 Forrest L Norvell ogd@aoaioxxysz.net",
                "Copyright (c) 2015 Jak Wings",
                "Copyright (c) 2016, Rebecca Turner <me@re-becca.org>"
            ],
            "file-count": 104,
            "sha256": "c0390d670c876a3f92900a764881231a3e9b3f072b8458ea979e678384bac38e",
            "source": "https://github.com/iarna/iarna-toml/archive/refs/tags/v2.2.5.zip",
            "status": "approved"
        }
    ]
}