{
    "id": "npm/npmjs/-/keyv/4.1.1",
    "license": "MIT",
    "licenses-discovered": [
        "MIT"
    ],
    "file-count": 10,
    "scancode-version": "30.1.0",
    "authority": "https://gitlab.eclipse.org/eclipsefdn/emo-team/iplab/-/issues/1961",
    "source": "https://registry.npmjs.org/keyv/-/keyv-4.1.1.tgz",
    "status": "approved"
}