{
    "id": "maven/mavencentral/org.apfloat/apfloat/1.12.0",
    "license": "MIT",
    "authority": "https://gitlab.eclipse.org/eclipsefdn/emo-team/iplab/-/issues/15393",
    "source": "https://repo1.maven.org/maven2/org/apfloat/apfloat/1.12.0/apfloat-1.12.0-sources.jar",
    "status": "approved",
    "scans": [
        {
            "date": "January 15, 2024 at 2:41:04 p.m. GMT",
            "authority": "https://gitlab.eclipse.org/eclipsefdn/emo-team/iplab/-/issues/12775",
            "scancode-version": "31.2.1",
            "licenses-discovered": [
                "MIT"
            ],
            "copyrights": [
                "Copyright (c) 2002-2023 Mikko Tommila"
            ],
            "file-count": 223,
            "sha256": "325699f8089472f973b952afad13c1bc9444fe8a3f4f14bba24773f4fb346353",
            "source": "https://repo1.maven.org/maven2/org/apfloat/apfloat/1.12.0/apfloat-1.12.0-sources.jar",
            "status": "approved"
        },
        {
            "date": "June 14, 2024 at 11:46:00 p.m. GMT",
            "authority": "https://gitlab.eclipse.org/eclipsefdn/emo-team/iplab/-/issues/15393",
            "scancode-version": "31.2.1",
            "licenses-discovered": [
                "MIT"
            ],
            "copyrights": [
                "Copyright (c) 2002-2023 Mikko Tommila"
            ],
            "file-count": 223,
            "sha256": "325699f8089472f973b952afad13c1bc9444fe8a3f4f14bba24773f4fb346353",
            "source": "https://repo1.maven.org/maven2/org/apfloat/apfloat/1.12.0/apfloat-1.12.0-sources.jar",
            "status": "approved"
        }
    ]
}