{
    "id": "crate/cratesio/-/regex-syntax/0.8.2",
    "license": "(Apache-2.0 or MIT) AND Unicode-DFS-2016",
    "authority": "https://gitlab.eclipse.org/eclipsefdn/emo-team/iplab/-/issues/11398",
    "source": "https://crates.io/api/v1/crates/regex-syntax/0.8.2/download",
    "status": "approved",
    "scans": [
        {
            "date": "November 1, 2023 at 12:10:05 a.m. GMT",
            "authority": "https://gitlab.eclipse.org/eclipsefdn/emo-team/iplab/-/issues/11398",
            "scancode-version": "31.2.1",
            "licenses-discovered": [
                "Apache-2.0 AND MIT",
                "Apache-2.0",
                "MIT",
                "Unicode-DFS-2016"
            ],
            "copyrights": [
                "(c) 83",
                "Copyright (c) 1991-2018 Unicode, Inc.",
                "Copyright (c) 2014 The Rust Project"
            ],
            "file-count": 42,
            "sha256": "c08c74e62047bb2de4ff487b251e4a92e24f48745648451635cec7d591162d9f",
            "source": "https://crates.io/api/v1/crates/regex-syntax/0.8.2/download",
            "status": "approved"
        }
    ]
}