{
    "id": "npm/npmjs/@axa-fr/oidc-client/7.13.6",
    "license": "MIT",
    "authority": "https://gitlab.eclipse.org/eclipsefdn/emo-team/iplab/-/issues/11974",
    "source": "https://github.com/AxaFrance/oidc-client/archive/refs/tags/v7.13.6.zip",
    "status": "approved",
    "scans": [
        {
            "date": "December 13, 2023 at 6:17:23 p.m. GMT",
            "authority": "https://gitlab.eclipse.org/eclipsefdn/emo-team/iplab/-/issues/11974",
            "scancode-version": "31.2.1",
            "licenses-discovered": [
                "MIT"
            ],
            "copyrights": [
                "Copyright (c) 2018 Axa France IARD / Axa France VIE"
            ],
            "file-count": 195,
            "sha256": "3e8edecf6f67c13b8830c4b9d24957e56de70a15ad2b6a667aa32905367b119e",
            "source": "https://github.com/AxaFrance/oidc-client/archive/refs/tags/v7.13.6.zip",
            "status": "approved"
        }
    ]
}