{
    "id": "crate/cratesio/-/prost-derive/0.13.3",
    "license": "Apache-2.0",
    "authority": "https://gitlab.eclipse.org/eclipsefdn/emo-team/iplab/-/issues/16948",
    "source": "https://crates.io/api/v1/crates/prost-derive/0.13.3/download",
    "status": "approved",
    "scans": [
        {
            "date": "October 29, 2024, 7:54:26 a.m. GMT",
            "authority": "https://gitlab.eclipse.org/eclipsefdn/emo-team/iplab/-/issues/16948",
            "scancode-version": "31.2.1",
            "licenses-discovered": [
                "Apache-2.0"
            ],
            "copyrights": [
                "Copyright 2017 Dan Burkert"
            ],
            "file-count": 12,
            "sha256": "e9552f850d5f0964a4e4d0bf306459ac29323ddfbae05e35a7c0d35cb0803cc5",
            "source": "https://crates.io/api/v1/crates/prost-derive/0.13.3/download",
            "status": "approved"
        }
    ]
}