{
    "id": "maven/mavencentral/software.amazon.awssdk/aws-core/2.21.5",
    "license": "Apache-2.0",
    "authority": "https://gitlab.eclipse.org/eclipsefdn/emo-team/iplab/-/issues/11126",
    "source": "https://repo.maven.apache.org/maven2/software/amazon/awssdk/aws-core/2.21.5/aws-core-2.21.5-sources.jar",
    "status": "approved",
    "scans": [
        {
            "date": "October 24, 2023 at 11:12:47 a.m. GMT",
            "authority": "https://gitlab.eclipse.org/eclipsefdn/emo-team/iplab/-/issues/11126",
            "scancode-version": "31.2.1",
            "licenses-discovered": [
                "Apache-2.0"
            ],
            "copyrights": [
                "Copyright 2018-2023 Amazon.com, Inc. or its affiliates",
                "Copyright Amazon.com, Inc. or its affiliates"
            ],
            "file-count": 68,
            "sha256": "eb8392061862565a74035489884fe99080fb18d8eea54b3d952b8151da9e65b9",
            "source": "https://repo.maven.apache.org/maven2/software/amazon/awssdk/aws-core/2.21.5/aws-core-2.21.5-sources.jar",
            "status": "approved"
        }
    ]
}