{
    "id": "maven/mavencentral/io.github.gradle-nexus/publish-plugin/2.0.0",
    "license": "Apache-2.0",
    "authority": "https://gitlab.eclipse.org/eclipsefdn/emo-team/iplab/-/issues/16676",
    "source": "https://github.com/gradle-nexus/publish-plugin/archive/refs/tags/v2.0.0.zip",
    "status": "approved",
    "scans": [
        {
            "date": "October 15, 2024, 9:32:14 a.m. GMT",
            "authority": "https://gitlab.eclipse.org/eclipsefdn/emo-team/iplab/-/issues/16676",
            "scancode-version": "31.2.1",
            "licenses-discovered": [
                "Apache-2.0",
                "Apache-2.0 AND BSD-3-Clause AND CPL-1.0 AND LGPL-2.1-only AND LicenseRef-scancode-mit-old-style AND MIT"
            ],
            "copyrights": [
                "Copyright (c) 1991, 1999 Free Software Foundation, Inc.",
                "Copyright (c) 1999 CERN - European Organization for Nuclear Research",
                "Copyright (c) 2001, Eric D. Friedman",
                "Copyright (c) 2004-2007 QOS.ch",
                "Copyright (c) 2007, Eclipse Foundation, Inc.",
                "Copyright (c) 2015-2021 the original",
                "Copyright 2015 the original author or authors",
                "Copyright 2020 the original author or authors",
                "Copyright 2021 the original author or authors",
                "copyrighted by the Free Software Foundation"
            ],
            "file-count": 87,
            "sha256": "4361af6034788ecc165fe5564fe8a99c63e61cae686d254e22237f569c91082a",
            "source": "https://github.com/gradle-nexus/publish-plugin/archive/refs/tags/v2.0.0.zip",
            "status": "restricted"
        }
    ]
}