{
    "id": "maven/mavencentral/io.fabric8/kubernetes-model-apps/6.4.0",
    "license": "Apache-2.0",
    "authority": "https://gitlab.eclipse.org/eclipsefdn/emo-team/iplab/-/issues/6581",
    "source": "https://search.maven.org/remotecontent?filepath=io/fabric8/kubernetes-model-apps/6.4.0/kubernetes-model-apps-6.4.0-sources.jar",
    "status": "approved",
    "scans": [
        {
            "date": "January 24, 2023 at 9:24:41 a.m. GMT",
            "authority": "https://gitlab.eclipse.org/eclipsefdn/emo-team/iplab/-/issues/6581",
            "scancode-version": "31.2.1",
            "licenses-discovered": [
                "Apache-2.0"
            ],
            "copyrights": [
                "Copyright (c) 2015 Red Hat, Inc."
            ],
            "file-count": 124,
            "sha256": "24eaa0b5bb230816e4802aeb23bf61b012e5d398275f7f82709cdf91909334ee",
            "source": "https://search.maven.org/remotecontent?filepath=io/fabric8/kubernetes-model-apps/6.4.0/kubernetes-model-apps-6.4.0-sources.jar",
            "status": "approved"
        }
    ]
}