{
    "id": "pypi/pypi/-/traitlets/5.9.0",
    "license": "BSD-3-Clause",
    "authority": "https://gitlab.eclipse.org/eclipsefdn/emo-team/iplab/-/issues/14995",
    "source": "https://files.pythonhosted.org/packages/39/c3/205e88f02959712b62008502952707313640369144a7fded4cbc61f48321/traitlets-5.9.0.tar.gz",
    "status": "approved",
    "scans": [
        {
            "date": "May 29, 2024 at 12:14:48 p.m. GMT",
            "authority": "https://gitlab.eclipse.org/eclipsefdn/emo-team/iplab/-/issues/14995",
            "scancode-version": "31.2.1",
            "licenses-discovered": [
                "BSD-3-Clause"
            ],
            "copyrights": [
                "Copyright (c) 2001-, IPython Development Team",
                "Copyright (c) 2010 Doug Hellmann",
                "Copyright (c) Enthought, Inc.",
                "Copyright (c) IPython Development Team",
                "Copyright (c) Jupyter Development Team",
                "Copyright 2007-2015 by the Sphinx team",
                "copyright 2015, The IPython Development Team"
            ],
            "file-count": 80,
            "sha256": "f6cde21a9c68cf756af02035f72d5a723bf607e862e7be33ece505abf4a3bad9",
            "source": "https://files.pythonhosted.org/packages/39/c3/205e88f02959712b62008502952707313640369144a7fded4cbc61f48321/traitlets-5.9.0.tar.gz",
            "status": "approved"
        }
    ]
}