{
    "id": "maven/mavencentral/org.codehaus.plexus/plexus-compiler-api/2.10.0",
    "license": "Apache-2.0 AND MIT",
    "licenses-discovered": [
        "MIT",
        "Apache-2.0"
    ],
    "file-count": 21,
    "scancode-version": "30.1.0",
    "authority": "https://gitlab.eclipse.org/eclipsefdn/emo-team/iplab/-/issues/1964",
    "source": "https://search.maven.org/remotecontent?filepath=org/codehaus/plexus/plexus-compiler-api/2.10.0/plexus-compiler-api-2.10.0-sources.jar",
    "status": "approved"
}