{
    "id": "maven/mavencentral/com.huaweicloud.sdk/huaweicloud-sdk-vpc/3.1.81",
    "license": "Apache-2.0",
    "authority": "https://gitlab.eclipse.org/eclipsefdn/emo-team/iplab/-/issues/13347",
    "source": "https://repo1.maven.org/maven2/com/huaweicloud/sdk/huaweicloud-sdk-vpc/3.1.81/huaweicloud-sdk-vpc-3.1.81-sources.jar",
    "status": "approved",
    "scans": [
        {
            "date": "February 20, 2024 at 5:21:42 p.m. GMT",
            "authority": "https://gitlab.eclipse.org/eclipsefdn/emo-team/iplab/-/issues/13347",
            "scancode-version": "31.2.1",
            "licenses-discovered": [
            ],
            "copyrights": [
            ],
            "file-count": 572,
            "sha256": "867505b93d148eb9e28f69a674ae7137a2b9955260f273e3645b801dfa1371b8",
            "source": "https://repo1.maven.org/maven2/com/huaweicloud/sdk/huaweicloud-sdk-vpc/3.1.81/huaweicloud-sdk-vpc-3.1.81-sources.jar",
            "status": "restricted"
        }
    ]
}
