{
    "id": "maven/mavencentral/commons-dbcp/commons-dbcp/1.4",
    "license": "Apache-2.0",
    "authority": "https://gitlab.eclipse.org/eclipsefdn/emo-team/iplab/-/issues/5105",
    "source": "https://search.maven.org/remotecontent?filepath=commons-dbcp/commons-dbcp/1.4/commons-dbcp-1.4-sources.jar",
    "status": "approved",
    "scans": [
        {
            "date": "November 24, 2022 at 5:04:34 p.m. GMT",
            "authority": "https://gitlab.eclipse.org/eclipsefdn/emo-team/iplab/-/issues/5105",
            "scancode-version": "31.2.1",
            "licenses-discovered": [
                "Apache-2.0"
            ],
            "copyrights": [
            ],
            "file-count": 62,
            "sha256": "c5b337b9d3177473da7795ef437b5dfda9f2575be374029491964a69bab551d7",
            "source": "https://search.maven.org/remotecontent?filepath=commons-dbcp/commons-dbcp/1.4/commons-dbcp-1.4-sources.jar",
            "status": "approved"
        }
    ]
}