{
    "id": "maven/mavencentral/org.apache.hadoop/hadoop-yarn-registry/2.10.2",
    "license": "Apache-2.0 AND MIT AND BSD-3-Clause AND BSD-2-Clause AND CC-BY-2.5 AND CDDL-1.0 AND CDDL-1.1 AND EPL-1.0",
    "authority": "https://gitlab.eclipse.org/eclipsefdn/emo-team/iplab/-/issues/6547",
    "source": "https://search.maven.org/remotecontent?filepath=org/apache/hadoop/hadoop-yarn-registry/2.10.2/hadoop-yarn-registry-2.10.2-sources.jar",
    "status": "approved",
    "scans": [
        {
            "date": "January 23, 2023 at 11:31:14 p.m. GMT",
            "authority": "https://gitlab.eclipse.org/eclipsefdn/emo-team/iplab/-/issues/6547",
            "scancode-version": "31.2.1",
            "licenses-discovered": [
                "Apache-2.0 AND BSD-2-Clause AND BSD-2-Clause-Views AND BSD-3-Clause AND CC-BY-2.5 AND CDDL-1.0 AND CDDL-1.1 AND EPL-1.0 AND LicenseRef-scancode-protobuf AND MIT",
                "Apache-2.0"
            ],
            "copyrights": [
                "Copyright (c) 1995-2000 by the Hypersonic SQL Group",
                "Copyright (c) 2001-2016, The HSQL Development Group",
                "Copyright (c) 2003-2017 Optimatika",
                "Copyright (c) 2004-2006 Intel Corporation",
                "Copyright (c) 2005, European Commission project OneLab",
                "Copyright (c) 2007 The Guava Authors",
                "Copyright (c) 2008,2009,2010 Massachusetts Institute of Technology",
                "Copyright (c) 2008-2016, SpryMedia Ltd.",
                "Copyright (c) 2010 Aleksander Williams",
                "Copyright (c) 2011 FuseSource Corp.",
                "Copyright (c) 2011 The LevelDB Authors",
                "Copyright (c) 2011-2014, Yann Collet",
                "Copyright (c) 2011-2016 Tim Wood, Iskren Chernev",
                "Copyright (c) 2012 The FreeBSD Foundation",
                "Copyright (c) 2014 Ivan Bozhanov",
                "Copyright 2002 Niels Provos <provos@citi.umich.edu>",
                "Copyright 2008, Google Inc.",
                "Copyright 2011, Google Inc.",
                "Copyright 2014, Google Inc.",
                "Copyright jQuery Foundation and other contributors, https://jquery.org",
                "copyrighted by Bloomberg Finance",
                "copyrighted by Red Hat Inc."
            ],
            "file-count": 52,
            "sha256": "cf6c0c593e9b6ccadc14f879cc1c6fb78e760c7a37f77704fc78528d8f3f9309",
            "source": "https://search.maven.org/remotecontent?filepath=org/apache/hadoop/hadoop-yarn-registry/2.10.2/hadoop-yarn-registry-2.10.2-sources.jar",
            "status": "restricted"
        }
    ]
}
