{
    "id": "maven/mavencentral/androidx.annotation/annotation/1.6.0",
    "license": "Apache-2.0",
    "authority": "https://gitlab.eclipse.org/eclipsefdn/emo-team/iplab/-/issues/10374",
    "source": "https://dl.google.com/android/maven2/androidx/annotation/annotation/1.6.0/annotation-1.6.0-sources.jar",
    "status": "approved",
    "scans": [
        {
            "date": "September 11, 2023 at 9:56:53 p.m. GMT",
            "authority": "https://gitlab.eclipse.org/eclipsefdn/emo-team/iplab/-/issues/10374",
            "scancode-version": "31.2.1",
            "licenses-discovered": [
                "Apache-2.0"
            ],
            "copyrights": [
                "Copyright (c) 2013 The Android Open Source Project",
                "Copyright (c) 2014 The Android Open Source Project",
                "Copyright (c) 2015 The Android Open Source Project",
                "Copyright (c) 2016 The Android Open Source Project",
                "Copyright (c) 2017 The Android Open Source Project",
                "Copyright (c) 2020 The Android Open Source Project",
                "Copyright (c) 2021 The Android Open Source Project",
                "Copyright (c) 2022 The Android Open Source Project",
                "Copyright 2018 The Android Open Source Project",
                "Copyright 2019 The Android Open Source Project",
                "Copyright 2021 The Android Open Source Project"
            ],
            "file-count": 70,
            "sha256": "5e281c2fa5b123375a2b14a0756ee8c1bf3492eb882a6b1c3ba2775c4987283d",
            "source": "https://dl.google.com/android/maven2/androidx/annotation/annotation/1.6.0/annotation-1.6.0-sources.jar",
            "status": "approved"
        }
    ]
}