{
    "id": "maven/mavencentral/org.apache.camel/camel-xml-jaxb/3.22.2",
    "license": "Apache-2.0",
    "authority": "https://gitlab.eclipse.org/eclipsefdn/emo-team/iplab/-/issues/14917",
    "source": "https://repo1.maven.org/maven2/org/apache/camel/camel-xml-jaxb/3.22.2/camel-xml-jaxb-3.22.2-sources.jar",
    "status": "approved",
    "scans": [
        {
            "date": "May 29, 2024 at 9:47:38 a.m. GMT",
            "authority": "https://gitlab.eclipse.org/eclipsefdn/emo-team/iplab/-/issues/14917",
            "scancode-version": "31.2.1",
            "licenses-discovered": [
                "Apache-2.0"
            ],
            "copyrights": [
            ],
            "file-count": 11,
            "sha256": "7b171705a4e5987d60f71faac70cf890fc036ce96dc076172aba775d945d1692",
            "source": "https://repo1.maven.org/maven2/org/apache/camel/camel-xml-jaxb/3.22.2/camel-xml-jaxb-3.22.2-sources.jar",
            "status": "approved"
        }
    ]
}