{
    "id": "maven/mavencentral/org.geotools/gt-process/28.1",
    "license": "LGPL-2.1-only",
    "authority": "https://gitlab.eclipse.org/eclipsefdn/emo-team/iplab/-/issues/6698",
    "source": "https://repo.osgeo.org/repository/geotools-releases/org/geotools/gt-process/28.1/gt-process-28.1-sources.jar",
    "status": "approved",
    "scans": [
        {
            "date": "January 26, 2023 at 3:01:59 p.m. GMT",
            "authority": "https://gitlab.eclipse.org/eclipsefdn/emo-team/iplab/-/issues/6698",
            "scancode-version": "31.2.1",
            "licenses-discovered": [
                "LGPL-2.1-only"
            ],
            "copyrights": [
                "(c) 2007 TOPP - www.openplans.org",
                "(c) 2008, Open Source Geospatial Foundation",
                "(c) 2008-2016, Open Source Geospatial Foundation",
                "(c) 2009, Open Source Geospatial Foundation",
                "(c) 2009-2011, Open Source Geospatial Foundation",
                "(c) 2011-2012, Open Source Geospatial Foundation",
                "(c) 2016, Open Source Geospatial Foundation",
                "(c) 2019, Open Source Geospatial Foundation"
            ],
            "file-count": 38,
            "sha256": "3d50e7867b47816949edf4b3dd113806996d772dfe390b5ae139f9520c68b85c",
            "source": "https://repo.osgeo.org/repository/geotools-releases/org/geotools/gt-process/28.1/gt-process-28.1-sources.jar",
            "status": "approved"
        }
    ]
}