{
    "id": "pypi/pypi/-/streamlit_folium/0.21.0",
    "license": "MIT AND (0BSD AND Apache-2.0 AND BSD-3-Clause AND MIT)",
    "authority": "https://gitlab.eclipse.org/eclipsefdn/emo-team/iplab/-/issues/15526",
    "source": "https://files.pythonhosted.org/packages/3f/7e/90509b339a0c848edf0fd6ecf0b030620389fa048576fbeaa28d9aebfd7b/streamlit_folium-0.21.0.tar.gz",
    "status": "approved",
    "scans": [
        {
            "date": "July 2, 2024 at 2:10:09 p.m. GMT",
            "authority": "https://gitlab.eclipse.org/eclipsefdn/emo-team/iplab/-/issues/15526",
            "scancode-version": "31.2.1",
            "licenses-discovered": [
                "MIT",
                "0BSD AND Apache-2.0 AND BSD-3-Clause AND MIT"
            ],
            "copyrights": [
                "(c) Sindre Sorhus",
                "Copyright (c) 2020-2022 Randy Zwitch",
                "Copyright (c) Facebook, Inc. and its affiliates",
                "Copyright (c) Microsoft Corporation",
                "Copyright (c) Streamlit Inc. (2018-2022) Snowflake Inc.",
                "Copyright 2011-2020 The Bootstrap Authors",
                "Copyright 2011-2020 Twitter, Inc.",
                "Copyright 2015, Yahoo! Inc."
            ],
            "file-count": 22,
            "sha256": "114868c4daf85d8c725ac45d6ad1f1a54f728fa1fa2f7a1e772700adc13cba19",
            "source": "https://files.pythonhosted.org/packages/3f/7e/90509b339a0c848edf0fd6ecf0b030620389fa048576fbeaa28d9aebfd7b/streamlit_folium-0.21.0.tar.gz",
            "status": "approved"
        }
    ]
}