{
    "id": "maven/mavencentral/com.google.api.grpc/proto-google-cloud-storage-v2/2.43.1-beta",
    "license": "Apache-2.0",
    "authority": "https://gitlab.eclipse.org/eclipsefdn/emo-team/iplab/-/issues/16744",
    "source": "https://repo1.maven.org/maven2/com/google/api/grpc/proto-google-cloud-storage-v2/2.43.1-beta/proto-google-cloud-storage-v2-2.43.1-beta-sources.jar",
    "status": "approved",
    "scans": [
        {
            "date": "October 15, 2024, 6:16:39 p.m. GMT",
            "authority": "https://gitlab.eclipse.org/eclipsefdn/emo-team/iplab/-/issues/16744",
            "scancode-version": "31.2.1",
            "licenses-discovered": [
                "Apache-2.0"
            ],
            "copyrights": [
                "Copyright 2024 Google LLC"
            ],
            "file-count": 123,
            "sha256": "520ff4609af50ae95cee2f34c8bf245087b3758a6ca1953145218ab8f5c8462c",
            "source": "https://repo1.maven.org/maven2/com/google/api/grpc/proto-google-cloud-storage-v2/2.43.1-beta/proto-google-cloud-storage-v2-2.43.1-beta-sources.jar",
            "status": "approved"
        }
    ]
}