{
    "id": "maven/mavencentral/org.hibernate.search/hibernate-search-mapper-pojo-base/7.1.1.Final",
    "license": "LGPL-2.1-only AND LGPL-2.0-or-later AND LGPL-2.1-or-later",
    "authority": "https://gitlab.eclipse.org/eclipsefdn/emo-team/iplab/-/issues/15772",
    "source": "https://repo1.maven.org/maven2/org/hibernate/search/hibernate-search-mapper-pojo-base/7.1.1.Final/hibernate-search-mapper-pojo-base-7.1.1.Final-sources.jar",
    "status": "approved",
    "scans": [
        {
            "date": "July 24, 2024 at 2:19:56 p.m. GMT",
            "authority": "https://gitlab.eclipse.org/eclipsefdn/emo-team/iplab/-/issues/15772",
            "scancode-version": "31.2.1",
            "licenses-discovered": [
                "LGPL-2.1-only",
                "LGPL-2.0-or-later",
                "LGPL-2.1-or-later"
            ],
            "copyrights": [
            ],
            "file-count": 684,
            "sha256": "0d0938e830e4245cf18342cf0582e2dbfebdc559320dee1cca5de707704d3b78",
            "source": "https://repo1.maven.org/maven2/org/hibernate/search/hibernate-search-mapper-pojo-base/7.1.1.Final/hibernate-search-mapper-pojo-base-7.1.1.Final-sources.jar",
            "status": "approved"
        }
    ]
}