{
    "id": "npm/npmjs/-/rename-overwrite/5.0.0",
    "license": "MIT",
    "authority": "https://gitlab.eclipse.org/eclipsefdn/emo-team/iplab/-/issues/12760",
    "source": "https://registry.yarnpkg.com/rename-overwrite/-/rename-overwrite-5.0.0.tgz",
    "status": "approved",
    "scans": [
        {
            "date": "January 12, 2024 at 11:17:12 a.m. GMT",
            "authority": "https://gitlab.eclipse.org/eclipsefdn/emo-team/iplab/-/issues/12760",
            "scancode-version": "31.2.1",
            "licenses-discovered": [
                "MIT"
            ],
            "copyrights": [
                "Copyright (c) 2017-2022 Zoltan Kochan <z@kochan.io>"
            ],
            "file-count": 5,
            "sha256": "33870d013869ffd0644745a3fb06b7ef804f20f808e69f3cc0d3e7f1b50a95d7",
            "source": "https://registry.yarnpkg.com/rename-overwrite/-/rename-overwrite-5.0.0.tgz",
            "status": "approved"
        }
    ]
}