{
    "id": "npm/npmjs/-/acorn/8.8.2",
    "license": "MIT",
    "authority": "https://gitlab.eclipse.org/eclipsefdn/emo-team/iplab/-/issues/6951",
    "source": "https://registry.yarnpkg.com/acorn/-/acorn-8.8.2.tgz",
    "status": "approved",
    "scans": [
        {
            "date": "February 3, 2023 at 8:39:23 p.m. GMT",
            "authority": "https://gitlab.eclipse.org/eclipsefdn/emo-team/iplab/-/issues/6951",
            "scancode-version": "31.2.1",
            "licenses-discovered": [
                "MIT"
            ],
            "copyrights": [
                "Copyright (c) 2012-2022 by various contributors"
            ],
            "file-count": 9,
            "sha256": "8f2a83c594ca7aed47051a14f1432bd3c9cf7ea6417912f6267476cb5b43cc1f",
            "source": "https://registry.yarnpkg.com/acorn/-/acorn-8.8.2.tgz",
            "status": "approved"
        }
    ]
}