{
    "id": "npm/npmjs/-/coap/1.0.3",
    "license": "MIT AND MITNFA",
    "licenses-discovered": [
        "MIT",
        "MITNFA",
        "LicenseRef-scancode-unknown-license-reference"
    ],
    "file-count": 56,
    "scancode-version": "30.1.0",
    "authority": "https://gitlab.eclipse.org/eclipsefdn/emo-team/iplab/-/issues/2089",
    "source": "https://github.com/mcollina/node-coap/archive/v1.0.3.zip",
    "status": "approved"
}
