{
    "id": "git/github/cncf/udpa/04548b0d99d4",
    "license": "Apache-2.0",
    "authority": "https://gitlab.eclipse.org/eclipsefdn/emo-team/iplab/-/issues/5150",
    "source": "https://github.com/cncf/udpa/archive/04548b0d99d4.zip",
    "status": "approved",
    "scans": [
        {
            "date": "November 24, 2022 at 9:05:27 p.m. GMT",
            "authority": "https://gitlab.eclipse.org/eclipsefdn/emo-team/iplab/-/issues/5150",
            "scancode-version": "31.2.1",
            "licenses-discovered": [
                "Apache-2.0"
            ],
            "copyrights": [
            ],
            "file-count": 49,
            "sha256": "941133cdac1050046bb06bff05e94621fd5936b2b8f9512adf242c5d131df108",
            "source": "https://github.com/cncf/udpa/archive/04548b0d99d4.zip",
            "status": "approved"
        }
    ]
}