{
    "id": "npm/npmjs/@eslint/js/8.55.0",
    "license": "MIT AND ISC AND OFL-1.1 AND CC-BY-SA-2.0-UK",
    "authority": "https://gitlab.eclipse.org/eclipsefdn/emo-team/iplab/-/issues/11789",
    "source": "https://github.com/eslint/eslint/archive/refs/tags/v8.55.0.zip",
    "status": "approved",
    "scans": [
        {
            "date": "December 4, 2023 at 9:18:39 a.m. GMT",
            "authority": "https://gitlab.eclipse.org/eclipsefdn/emo-team/iplab/-/issues/11789",
            "scancode-version": "31.2.1",
            "licenses-discovered": [
                "MIT",
                "LGPL-2.0-or-later AND MIT",
                "ISC",
                "OFL-1.1",
                "CC-BY-SA-2.0",
                "LicenseRef-scancode-proprietary-license AND MIT"
            ],
            "copyrights": [
                "(c) 2009-2013 Jeremy Ashkenas, DocumentCloud Inc. Underscore",
                "(c) 2018-2019 John Hildenbiddle <http://hildenbiddle.com>",
                "(c) ExpressionStatement CallExpression Identifier",
                "(c) OpenJS Foundation and ESLint",
                "Copyright (c) 2009 Thomas Robinson <280north.com>",
                "Copyright (c) 2016-2019 The Inter Project",
                "Copyright (c) 2019-present, Yuxi",
                "Copyright 2012 Anton Kovalyov (http://jshint.com)",
                "Copyright 2013-2016 Dulin Marat and other contributors",
                "Copyright 2016 Google Inc.",
                "Copyright 2020 The Inter Project",
                "Copyright 2020 The Space Grotesk Project",
                "Copyright JS Foundation and other contributors, https://js.foundation",
                "Copyright Joyent, Inc. and other Node contributors",
                "Copyright OpenJS Foundation and other contributors, <www.openjsf.org>",
                "Copyright https://openjsf.org' OpenJS Foundation and ESLint contributors. The https://openjsf.org' OpenJS Foundation"
            ],
            "file-count": 2183,
            "sha256": "316981d885802570ed2c1b3dc12a926354083c0b3f10b979d2a11bb2ffe593ae",
            "source": "https://github.com/eslint/eslint/archive/refs/tags/v8.55.0.zip",
            "status": "restricted"
        }
    ]
}
