{
    "id": "maven/mavencentral/software.amazon.awssdk/http-auth-aws-eventstream/2.30.33",
    "license": "Apache-2.0",
    "authority": "https://gitlab.eclipse.org/eclipsefdn/emo-team/iplab/-/issues/19904",
    "source": "https://repo1.maven.org/maven2/software/amazon/awssdk/http-auth-aws-eventstream/2.30.33/http-auth-aws-eventstream-2.30.33-sources.jar",
    "status": "approved",
    "scans": [
        {
            "date": "March 6, 2025 at 8:08:14 a.m. GMT",
            "authority": "https://gitlab.eclipse.org/eclipsefdn/emo-team/iplab/-/issues/19904",
            "scancode-version": "31.2.1",
            "licenses-discovered": [
                "Apache-2.0"
            ],
            "copyrights": [
                "Copyright Amazon.com, Inc. or its affiliates"
            ],
            "file-count": 5,
            "sha256": "75d250bfb8385b3c50555f2af39ac26b55578cd47398229d6a8d9005df6f4f92",
            "source": "https://repo1.maven.org/maven2/software/amazon/awssdk/http-auth-aws-eventstream/2.30.33/http-auth-aws-eventstream-2.30.33-sources.jar",
            "status": "approved"
        }
    ]
}