{
    "id": "maven/mavencentral/org.springframework.security/spring-security-oauth2-client/6.1.2",
    "license": "Apache-2.0",
    "authority": "https://gitlab.eclipse.org/eclipsefdn/emo-team/iplab/-/issues/9740",
    "source": "https://repo.maven.apache.org/maven2/org/springframework/security/spring-security-oauth2-client/6.1.2/spring-security-oauth2-client-6.1.2-sources.jar",
    "status": "approved",
    "scans": [
        {
            "date": "July 24, 2023 at 3:13:33 p.m. GMT",
            "authority": "https://gitlab.eclipse.org/eclipsefdn/emo-team/iplab/-/issues/9740",
            "scancode-version": "31.2.1",
            "licenses-discovered": [
                "Apache-2.0"
            ],
            "copyrights": [
                "Copyright 2002-2017 the original author or authors",
                "Copyright 2002-2018 the original author or authors",
                "Copyright 2002-2019 the original author or authors",
                "Copyright 2002-2020 the original author or authors",
                "Copyright 2002-2021 the original author or authors",
                "Copyright 2002-2022 the original author or authors",
                "Copyright 2002-2023 the original author or authors"
            ],
            "file-count": 163,
            "sha256": "1481df00d0c35b79c4eaacceaec40d08301b1f67608c44bfb168566c95e31082",
            "source": "https://repo.maven.apache.org/maven2/org/springframework/security/spring-security-oauth2-client/6.1.2/spring-security-oauth2-client-6.1.2-sources.jar",
            "status": "approved"
        }
    ]
}