{
    "id": "npm/npmjs/-/vue-demi/0.14.0",
    "license": "MIT",
    "authority": "https://gitlab.eclipse.org/eclipsefdn/emo-team/iplab/-/issues/8112",
    "source": "https://github.com/antfu/vue-demi/archive/v0.14.0.zip",
    "status": "approved",
    "scans": [
        {
            "date": "May 3, 2023 at 10:05:07 a.m. GMT",
            "authority": "https://gitlab.eclipse.org/eclipsefdn/emo-team/iplab/-/issues/8112",
            "scancode-version": "31.2.1",
            "licenses-discovered": [
                "MIT"
            ],
            "copyrights": [
                "(c) 2020 Anthony Fu (https://github.com/antfu)",
                "Copyright (c) 2020-present, Anthony Fu"
            ],
            "file-count": 43,
            "sha256": "e68eec71a8985ad933d74119c82c78ec45fce697877bea84d3b8c1db19452887",
            "source": "https://github.com/antfu/vue-demi/archive/v0.14.0.zip",
            "status": "approved"
        }
    ]
}