{
    "id": "npm/npmjs/@csstools/postcss-initial/2.0.0",
    "license": "MIT-0",
    "authority": "https://gitlab.eclipse.org/eclipsefdn/emo-team/iplab/-/issues/18966",
    "source": "https://registry.yarnpkg.com/@csstools/postcss-initial/-/postcss-initial-2.0.0.tgz",
    "status": "approved",
    "scans": [
        {
            "date": "January 19, 2025 at 5:17:34 p.m. GMT",
            "authority": "https://gitlab.eclipse.org/eclipsefdn/emo-team/iplab/-/issues/18966",
            "scancode-version": "31.2.1",
            "licenses-discovered": [
                "MIT-0"
            ],
            "copyrights": [
                "Copyright (c) CSSTools Contributors"
            ],
            "file-count": 6,
            "sha256": "bf80b815d71d86d5e57707e2652166d579205781b8ec93f3e14bce3e99288603",
            "source": "https://registry.yarnpkg.com/@csstools/postcss-initial/-/postcss-initial-2.0.0.tgz",
            "status": "approved"
        }
    ]
}