{
    "id": "git/github/ASzc/change-string-case-action/v6",
    "license": "ISC AND MIT AND Apache-2.0 AND (BSD-3-Clause AND MIT)",
    "authority": "https://gitlab.eclipse.org/eclipsefdn/emo-team/iplab/-/issues/11738",
    "source": "https://github.com/ASzc/change-string-case-action/archive/refs/tags/v6.zip",
    "status": "approved",
    "scans": [
        {
            "date": "November 29, 2023 at 2:28:45 p.m. GMT",
            "authority": "https://gitlab.eclipse.org/eclipsefdn/emo-team/iplab/-/issues/11738",
            "scancode-version": "31.2.1",
            "licenses-discovered": [
                "ISC",
                "MIT",
                "CC0-1.0 AND LicenseRef-scancode-proprietary-license AND MIT",
                "Apache-2.0",
                "BSD-3-Clause AND MIT"
            ],
            "copyrights": [
                "Copyright (c) 2010-2020 Robert Kieffer and other contributors",
                "Copyright (c) 2011 Einar Otto Stangvik <einaros@gmail.com>",
                "Copyright (c) 2012 Koichi Kobayashi",
                "Copyright (c) 2013 Arnout Kazemier and contributors",
                "Copyright (c) 2014-2017, Jon Schlinkert",
                "Copyright (c) 2016 Luigi Pinca and contributors",
                "Copyright (c) 2018 Octokit",
                "Copyright (c) 2018, Gregor Martynus (https://github.com/gr2m)",
                "Copyright (c) 2019 Octokit",
                "Copyright (c) 2019, Jon Schlinkert (https://github.com/jonschlinkert)",
                "Copyright (c) 2020 Ethan Arrowood",
                "Copyright (c) GitHub, Inc.",
                "Copyright (c) Gregor Martynus and contributors",
                "Copyright (c) Isaac Z. Schlueter and Contributors",
                "Copyright (c) Matteo Collina and Undici contributors",
                "Copyright (c) Paul Johnston 1999 - 2009 Other contributors Greg Holt, Andrew Kepert, Ydnar, Lostinet",
                "Copyright 2011, Sebastian Tschan https://blueimp.net",
                "Copyright 2018 Gregor Martynus and other contributors",
                "Copyright 2019 GitHub",
                "Copyright 2020 Alex Szczuczko",
                "Copyright 2020 Gregor Martynus",
                "Copyright Brian White"
            ],
            "file-count": 527,
            "sha256": "944e601b5b8adee243f2954de8871ff9ceff991319dd6f6ba79a040d85de7edc",
            "source": "https://github.com/ASzc/change-string-case-action/archive/refs/tags/v6.zip",
            "status": "restricted"
        }
    ]
}
