{
    "id": "project/ecd.cdt-cloud/-/vscode-trace-extension/0.0",
    "license": "MIT",
    "authority": "https://gitlab.eclipse.org/eclipsefdn/emo-team/iplab/-/issues/6928",
    "source": "https://gitlab.eclipse.org/eclipsefdn/emo-team/iplab/uploads/3136e2750fa79aa1608d2f0b5512b418/vscode-trace-extension-master.zip",
    "status": "approved",
    "scans": [
        {
            "date": "February 2, 2023 at 2:36:54 p.m. GMT",
            "authority": "https://gitlab.eclipse.org/eclipsefdn/emo-team/iplab/-/issues/6928",
            "scancode-version": "31.2.1",
            "licenses-discovered": [
                "MIT"
            ],
            "copyrights": [
                "Copyright (c) 2020, 2021 Ecole Polytechnique de Montreal, Ericsson",
                "Copyright (c) 2022, BlackBerry Limited"
            ],
            "file-count": 59,
            "sha256": "140f2f507925aa42a3fc31104253c19d566130db25d73face56fe7b39f3c6e77",
            "source": "https://gitlab.eclipse.org/eclipsefdn/emo-team/iplab/uploads/3136e2750fa79aa1608d2f0b5512b418/vscode-trace-extension-master.zip",
            "status": "restricted"
        }
    ]
}
