{
    "id": "maven/mavencentral/io.rest-assured/rest-assured-common/5.5.1",
    "license": "Apache-2.0",
    "authority": "https://gitlab.eclipse.org/eclipsefdn/emo-team/iplab/-/issues/19522",
    "source": "https://repo1.maven.org/maven2/io/rest-assured/rest-assured-common/5.5.1/rest-assured-common-5.5.1-sources.jar",
    "status": "approved",
    "scans": [
        {
            "date": "February 22, 2025 at 12:49:35 a.m. GMT",
            "authority": "https://gitlab.eclipse.org/eclipsefdn/emo-team/iplab/-/issues/19522",
            "scancode-version": "31.2.1",
            "licenses-discovered": [
                "Apache-2.0"
            ],
            "copyrights": [
                "Copyright 2019 the original author or authors",
                "Copyright 2019, 2020 the original author or authors"
            ],
            "file-count": 25,
            "sha256": "f001768eaca394eac1f98684dc189e347663226806bc194fa91552f0a03adf9f",
            "source": "https://repo1.maven.org/maven2/io/rest-assured/rest-assured-common/5.5.1/rest-assured-common-5.5.1-sources.jar",
            "status": "approved"
        }
    ]
}