{
    "id": "maven/mavencentral/com.azure.resourcemanager/azure-resourcemanager-trafficmanager/2.30.0",
    "license": "MIT",
    "authority": "https://gitlab.eclipse.org/eclipsefdn/emo-team/iplab/-/issues/10566",
    "source": "https://repo.maven.apache.org/maven2/com/azure/resourcemanager/azure-resourcemanager-trafficmanager/2.30.0/azure-resourcemanager-trafficmanager-2.30.0-sources.jar",
    "status": "approved",
    "scans": [
        {
            "date": "September 18, 2023 at 11:21:36 a.m. GMT",
            "authority": "https://gitlab.eclipse.org/eclipsefdn/emo-team/iplab/-/issues/10566",
            "scancode-version": "31.2.1",
            "licenses-discovered": [
                "MIT"
            ],
            "copyrights": [
                "(c) 2008 VeriSign, Inc.",
                "Copyright (c) Microsoft Corporation"
            ],
            "file-count": 79,
            "sha256": "b11ec52d365843f2d1e877e47d18cb7a68830eaaef90e3258a6348200a1de093",
            "source": "https://repo.maven.apache.org/maven2/com/azure/resourcemanager/azure-resourcemanager-trafficmanager/2.30.0/azure-resourcemanager-trafficmanager-2.30.0-sources.jar",
            "status": "approved"
        }
    ]
}