{
    "id": "git/github/chromium/chromium/123.0.6312.124",
    "license": "None",
    "authority": "https://gitlab.eclipse.org/eclipsefdn/emo-team/iplab/-/issues/14506",
    "source": "https://github.com/chromium/chromium/archive/refs/tags/123.0.6312.124.zip",
    "status": "restricted",
    "scans": [
        {
            "date": "April 29, 2024 at 1:16:05 p.m. GMT",
            "authority": "https://gitlab.eclipse.org/eclipsefdn/emo-team/iplab/-/issues/14506",
            "scancode-version": "31.2.1",
            "licenses-discovered": [
            ],
            "copyrights": [
            ],
            "file-count": 1,
            "sha256": "1fe38d0c109fb4b171a061d1b8f9b17eafd2aa53e527ef271c4ccb77f3569df1",
            "source": "https://github.com/chromium/chromium/archive/refs/tags/123.0.6312.124.zip",
            "status": "restricted"
        }
    ]
}