{
    "id": "project/automotive.score/eclipse-score/examples/7b1857a97a92ee2a231eeb3d5faba4c1a5857c8c",
    "license": "Apache-2.0",
    "authority": "https://gitlab.eclipse.org/eclipsefdn/emo-team/iplab/-/issues/19939",
    "source": "https://github.com/eclipse-score/examples/archive/7b1857a97a92ee2a231eeb3d5faba4c1a5857c8c.zip",
    "status": "approved",
    "scans": [
        {
            "date": "March 6, 2025 at 7:31:19 p.m. GMT",
            "authority": "https://gitlab.eclipse.org/eclipsefdn/emo-team/iplab/-/issues/19939",
            "scancode-version": "31.2.1",
            "licenses-discovered": [
                "Apache-2.0"
            ],
            "copyrights": [
                "(c) year Contributors",
                "Copyright (c) 2025 Contributors",
                "Copyright 2025 Contributors"
            ],
            "file-count": 12,
            "sha256": "507e710f5fe3a9a0c86c139212bb3a87702c0339d29b050ff551dad24272ad1f",
            "source": "https://github.com/eclipse-score/examples/archive/7b1857a97a92ee2a231eeb3d5faba4c1a5857c8c.zip",
            "status": "restricted"
        }
    ]
}