{
    "id": "p2/orbit/p2.eclipse.plugin/org.apache.xmlgraphics.fop-util/2.10.0.v20241009-1200",
    "license": "Apache-2.0",
    "authority": "https://gitlab.eclipse.org/eclipsefdn/emo-team/iplab/-/issues/16586",
    "source": "https://repo1.maven.org/maven2/org/apache/xmlgraphics/fop-util/2.10/fop-util-2.10-sources.jar",
    "status": "approved",
    "scans": [
        {
            "date": "October 15, 2024, 6:45:38 a.m. GMT",
            "authority": "https://gitlab.eclipse.org/eclipsefdn/emo-team/iplab/-/issues/16586",
            "scancode-version": "31.2.1",
            "licenses-discovered": [
                "Apache-2.0"
            ],
            "copyrights": [
            ],
            "file-count": 7,
            "sha256": "412eca64d26740341796a6ccb6f6c00041aafa4751085fae5c06cbbf0b5097d5",
            "source": "https://repo1.maven.org/maven2/org/apache/xmlgraphics/fop-util/2.10/fop-util-2.10-sources.jar",
            "status": "approved"
        }
    ]
}