{
    "id": "go/golang/github.com%2Fdgraph-io%2Fbadger/v3/v3.2103.5",
    "license": "Apache-2.0 AND MIT AND BSD-3-Clause",
    "authority": "https://gitlab.eclipse.org/eclipsefdn/emo-team/iplab/-/issues/12022",
    "source": "https://proxy.golang.org/github.com%2Fdgraph-io%2Fbadger/v3/@v/v3.2103.5.zip",
    "status": "approved",
    "scans": [
        {
            "date": "December 14, 2023 at 11:58:22 a.m. GMT",
            "authority": "https://gitlab.eclipse.org/eclipsefdn/emo-team/iplab/-/issues/12022",
            "scancode-version": "31.2.1",
            "licenses-discovered": [
                "Apache-2.0",
                "MIT",
                "LicenseRef-scancode-proprietary-license",
                "BSD-3-Clause"
            ],
            "copyrights": [
                "(c) Zeno Rocha",
                "(c) jQuery Foundation",
                "Copyright (c) 2014 Grav",
                "Copyright (c) 2016 MATHIEU CORNIC",
                "Copyright (c) 2017 Dgraph Labs, Inc. and Contributors",
                "Copyright 2013 The LevelDB-Go Authors",
                "Copyright 2016-2018 Dgraph Labs, Inc. and Contributors",
                "Copyright 2017 Dgraph Labs, Inc. and Contributors",
                "Copyright 2018 Dgraph Labs, Inc. and Contributors",
                "Copyright 2019 Dgraph Labs, Inc. and Contributors",
                "Copyright 2020 Dgraph Labs, Inc. and Contributors",
                "Copyright 2021 Dgraph Labs, Inc. and Contributors",
                "Copyright 2022 Dgraph Labs, Inc. and Contributors",
                "Copyright Dave Gandy 2015"
            ],
            "file-count": 239,
            "sha256": "48d9e3f1f6328dca38fe98e7867d7a82c52c1b79ea942da2872051b89f2f7812",
            "source": "https://proxy.golang.org/github.com%2Fdgraph-io%2Fbadger/v3/@v/v3.2103.5.zip",
            "status": "restricted"
        }
    ]
}
