{
    "id": "npm/npmjs/-/recharts/2.11.0",
    "license": "MIT",
    "authority": "https://gitlab.eclipse.org/eclipsefdn/emo-team/iplab/-/issues/13096",
    "source": "https://github.com/recharts/recharts/archive/refs/tags/v2.11.zip",
    "status": "approved",
    "scans": [
        {
            "date": "February 2, 2024 at 10:43:56 a.m. GMT",
            "authority": "https://gitlab.eclipse.org/eclipsefdn/emo-team/iplab/-/issues/13096",
            "scancode-version": "31.2.1",
            "licenses-discovered": [
                "MIT"
            ],
            "copyrights": [
                "Copyright (c) 2015-2023 Recharts Group",
                "Copyright (c) 2015-present recharts"
            ],
            "file-count": 443,
            "sha256": "9d7a76516c952dfa7c0df1a1ac64a567ebd2551f508fb5edaca10421ab6ca853",
            "source": "https://github.com/recharts/recharts/archive/refs/tags/v2.11.zip",
            "status": "approved"
        }
    ]
}