{
    "id": "project/openhw.corev/openhwgroup/core-v-mcu-demo/701edb040d1cf169c8445344f1e627af1974c0ae",
    "license": "MIT AND Apache-2.0 AND OFL-1.1 AND BSD-3-Clause AND (Apache-2.0 WITH SHL-2.1) AND CC-BY-4.0 AND CC0-1.0 AND LGPL-3.0-or-later",
    "authority": "https://gitlab.eclipse.org/eclipsefdn/emo-team/iplab/-/issues/7899",
    "source": "https://github.com/openhwgroup/core-v-mcu-demo/archive/701edb040d1cf169c8445344f1e627af1974c0ae.zip",
    "status": "approved",
    "scans": [
        {
            "date": "April 18, 2023 at 5:14:20 a.m. GMT",
            "authority": "https://gitlab.eclipse.org/eclipsefdn/emo-team/iplab/-/issues/7899",
            "scancode-version": "31.2.1",
            "licenses-discovered": [
                "SHL-2.1",
                "GPL-2.0-or-later AND MIT AND freertos-exception-2.0",
                "Apache-2.0",
                "LGPL-2.0-or-later",
                "LicenseRef-scancode-st-mcd-2.0",
                "GPL-2.0-or-later AND freertos-exception-2.0",
                "MIT",
                "BSD-3-Clause",
                "GPL-2.0-only AND MIT AND freertos-exception-2.0",
                "GPL-2.0-only AND freertos-exception-2.0",
                "Apache-2.0 OR BSD-2-Clause",
                "Apache-2.0 WITH SHL-2.0",
                "CC-BY-4.0 AND MIT AND OFL-1.1",
                "CC-BY-4.0 AND CC0-1.0 AND MIT AND OFL-1.1",
                "CC0-1.0",
                "Apache-2.0 WITH SHL-2.1"
            ],
            "copyrights": [
                "(c) 2009-2020 Jeremy Ashkenas, DocumentCloud and Investigative Reporters & Editors Underscore",
                "(c) Copyright (c) 2021, QuickLogic",
                "(c) Fujitsu Microelectronics Europe GmbH",
                "(c) JS Foundation and other contributors",
                "Copyright (c) 2002 - 2021 Xilinx, Inc.",
                "Copyright (c) 2003-2006 Richard Barry. MCF5235 Port",
                "Copyright (c) 2003-2015 Cadence Design Systems, Inc.",
                "Copyright (c) 2006 Christian Walter",
                "Copyright (c) 2006-2015 Cadence Design Systems Inc.",
                "Copyright (c) 2007, Atmel Corporation",
                "Copyright (c) 2009 - 2021 Xilinx, Inc.",
                "Copyright (c) 2009-2017 ARM Limited",
                "Copyright (c) 2010 - 2021 Xilinx, Inc.",
                "Copyright (c) 2011-2014, Wind River Systems, Inc.",
                "Copyright (c) 2013 - 2021 Xilinx, Inc.",
                "Copyright (c) 2014 - 2021 Xilinx, Inc.",
                "Copyright (c) 2015 Real Time Engineers Ltd.",
                "Copyright (c) 2015-2015 Cadence Design Systems Inc.",
                "Copyright (c) 2015-2016 Intel Corporation",
                "Copyright (c) 2015-2019 Cadence Design Systems, Inc.",
                "Copyright (c) 2016 Federico Zivolo and contributors",
                "Copyright (c) 2016-2017 Espressif Shanghai PTE LTD",
                "Copyright (c) 2017 ARM Ltd",
                "Copyright (c) 2017 Amazon.com, Inc. or its affiliates",
                "Copyright (c) 2017 C-SKY Microsystems Co., Ltd.",
                "Copyright (c) 2017 GreenWaves Technologies SAS.",
                "Copyright (c) 2017 SiFive Inc.",
                "Copyright (c) 2018 ETH Zurich and University of Bologna",
                "Copyright (c) 2018 GreenWaves Technologies",
                "Copyright (c) 2019 Amazon.com, Inc. or its affiliates",
                "Copyright (c) 2019 ETH Zurich and University of Bologna",
                "Copyright (c) 2019 ETH Zurich, University of Bologna and GreenWaves Technologies",
                "Copyright (c) 2019 GreenWaves Technologies",
                "Copyright (c) 2019 Jan Bednar",
                "Copyright (c) 2019 Piotr Mienkowski",
                "Copyright (c) 2019-2020 Nordic Semiconductor ASA",
                "Copyright (c) 2020 Amazon.com, Inc. or its affiliates",
                "Copyright (c) 2020 ETH Zurich",
                "Copyright (c) 2020 ETH Zurich and University of Bologna",
                "Copyright (c) 2020, EBP",
                "Copyright (c) Font Awesome",
                "Copyright (c) Font Awesome Font Awesome",
                "Copyright 2007-2021 by the Sphinx team",
                "Copyright 2011-2020 The Bootstrap Authors",
                "Copyright 2011-2020 The Bootstrap Authors (https://github.com/twbs/bootstrap/graphs/contributors)",
                "Copyright 2011-2020 Twitter, Inc.",
                "Copyright 2015-2017 Espressif Systems (Shanghai) PTE LTD",
                "Copyright 2019 ETH Zurich and University of Bologna",
                "Copyright 2019 Espressif Systems (Shanghai) PTE LTD",
                "Copyright 2019 GreenWaves Technologies",
                "Copyright 2020 ETH Zurich",
                "Copyright 2020 GreenWaves Technologies",
                "Copyright 2020 Greenwaves Technologies",
                "Copyright 2020 OpenHW Group",
                "Copyright 2020 QuickLogic Corporation",
                "Copyright 2021 OpenHW Group Solderpad Hardware",
                "Copyright 2021 QuickLogic",
                "Copyright 2021 QuickLogic Corporation",
                "Copyright 2022 OpenHW Group",
                "Copyright JS Foundation and other contributors",
                "copyright (c) 2017, QuickLogic Corporation",
                "copyright (c) 2018 GreenWaves Technologies",
                "copyright STMicroelectronics. Reproduced"
            ],
            "file-count": 1021,
            "sha256": "981b9c186b61592985841a9b079e73f2d19f0116105c4275af98011e6479f96f",
            "source": "https://github.com/openhwgroup/core-v-mcu-demo/archive/701edb040d1cf169c8445344f1e627af1974c0ae.zip",
            "status": "restricted"
        }
    ]
}
