{
    "id": "crate/cratesio/-/io-lifetimes/1.0.11",
    "license": "Apache-2.0 AND MIT",
    "authority": "https://gitlab.eclipse.org/eclipsefdn/emo-team/iplab/-/issues/10134",
    "source": "https://crates.io/api/v1/crates/io-lifetimes/1.0.11/download",
    "status": "approved",
    "scans": [
        {
            "date": "August 21, 2023 at 3:35:45 p.m. GMT",
            "authority": "https://gitlab.eclipse.org/eclipsefdn/emo-team/iplab/-/issues/10134",
            "scancode-version": "31.2.1",
            "licenses-discovered": [
                "Apache-2.0 WITH LLVM-exception AND MIT",
                "Apache-2.0",
                "Apache-2.0 WITH LLVM-exception",
                "MIT"
            ],
            "copyrights": [
            ],
            "file-count": 26,
            "sha256": "eae7b9aee968036d54dce06cebaefd919e4472e753296daccd6d344e3e2df0c2",
            "source": "https://crates.io/api/v1/crates/io-lifetimes/1.0.11/download",
            "status": "restricted"
        }
    ]
}
