{
    "id": "npm/npmjs/@vscode/vsce-sign-win32-x64/2.0.2",
    "license": "LicenseRef-scancode-ms-xamarin-uitest3.2.0",
    "authority": "https://gitlab.eclipse.org/eclipsefdn/emo-team/iplab/-/issues/15972",
    "source": "https://registry.yarnpkg.com/@vscode/vsce-sign-win32-x64/-/vsce-sign-win32-x64-2.0.2.tgz",
    "status": "restricted",
    "board_exception": [
        {
            "rule": "project_all_future",
            "project": "ecd.cdt-cloud"
        },
        {
            "rule": "project_all_future",
            "project": "ecd.theia"
        }
    ],
    "scans": [
        {
            "date": "August 22, 2024 at 12:15:30 a.m. GMT",
            "authority": "https://gitlab.eclipse.org/eclipsefdn/emo-team/iplab/-/issues/15972",
            "scancode-version": "31.2.1",
            "licenses-discovered": [
                "LicenseRef-scancode-ms-xamarin-uitest3.2.0"
            ],
            "copyrights": [
                "Copyright 1995-2022 Jean-loup Gailly and Mark Adler",
                "Copyright 1995-2022 Mark Adler +3 CScs Unknown"
            ],
            "file-count": 3,
            "sha256": "3b8090c3d474f0e8b3018d69b2cbdafbda247d10092db8953e6434d40071e709",
            "source": "https://registry.yarnpkg.com/@vscode/vsce-sign-win32-x64/-/vsce-sign-win32-x64-2.0.2.tgz",
            "status": "restricted"
        }
    ]
}