{
    "id": "maven/mavencentral/org.apache.jena/jena-core/4.9.0",
    "license": "Apache-2.0 AND (Apache-2.0 AND BSD-3-Clause)",
    "authority": "https://gitlab.eclipse.org/eclipsefdn/emo-team/iplab/-/issues/14700",
    "source": "https://repo1.maven.org/maven2/org/apache/jena/jena-core/4.9.0/jena-core-4.9.0-sources.jar",
    "status": "approved",
    "scans": [
        {
            "date": "May 14, 2024 at 7:33:40 a.m. GMT",
            "authority": "https://gitlab.eclipse.org/eclipsefdn/emo-team/iplab/-/issues/14700",
            "scancode-version": "31.2.1",
            "licenses-discovered": [
                "Apache-2.0",
                "Apache-2.0 AND BSD-3-Clause"
            ],
            "copyrights": [
                "(c) Copyright 2003, Plugged In Software",
                "Copyright (c) 1999-2002 The Apache Software Foundation",
                "Copyright (c) 1999-2003 The Apache Software Foundation"
            ],
            "file-count": 1002,
            "sha256": "7ca048ae02cda93df7c3fb9e30d9055902e45020762b0bb89ef95f4eb4d8680a",
            "source": "https://repo1.maven.org/maven2/org/apache/jena/jena-core/4.9.0/jena-core-4.9.0-sources.jar",
            "status": "approved"
        }
    ]
}