{
    "id": "maven/mavencentral/org.apache.lucene/lucene-queryparser/9.5.0",
    "license": "Apache-2.0",
    "authority": "https://gitlab.eclipse.org/eclipsefdn/emo-team/iplab/-/issues/7916",
    "source": "https://search.maven.org/remotecontent?filepath=org/apache/lucene/lucene-queryparser/9.5.0/lucene-queryparser-9.5.0-sources.jar",
    "status": "approved",
    "scans": [
        {
            "date": "April 20, 2023 at 8:49:47 a.m. GMT",
            "authority": "https://gitlab.eclipse.org/eclipsefdn/emo-team/iplab/-/issues/7916",
            "scancode-version": "31.2.1",
            "licenses-discovered": [
                "Apache-2.0"
            ],
            "copyrights": [
            ],
            "file-count": 251,
            "sha256": "edb987f24810bea1811eede4afaac7c2b256d56bc58247530f02258e871cf1d9",
            "source": "https://search.maven.org/remotecontent?filepath=org/apache/lucene/lucene-queryparser/9.5.0/lucene-queryparser-9.5.0-sources.jar",
            "status": "approved"
        }
    ]
}