{
    "id": "nuget/nuget/-/NJsonSchema/11.0.1",
    "license": "MIT",
    "authority": "https://gitlab.eclipse.org/eclipsefdn/emo-team/iplab/-/issues/15632",
    "source": "https://github.com/RicoSuter/NJsonSchema/archive/refs/tags/v11.0.1.zip",
    "status": "approved",
    "scans": [
        {
            "date": "July 8, 2024 at 7:03:00 a.m. GMT",
            "authority": "https://gitlab.eclipse.org/eclipsefdn/emo-team/iplab/-/issues/15632",
            "scancode-version": "31.2.1",
            "licenses-discovered": [
                "LicenseRef-scancode-newton-king-cla",
                "MIT"
            ],
            "copyrights": [
                "(c) As UTF16",
                "Copyright (c) 2016 Rico Suter",
                "Copyright (c) Rico Suter",
                "Copyright (c) Rico Suter, 2022"
            ],
            "file-count": 471,
            "sha256": "6c906195979e5b18f223b8e53b2ed31d12f88f1a605530fdee49e41a633684e9",
            "source": "https://github.com/RicoSuter/NJsonSchema/archive/refs/tags/v11.0.1.zip",
            "status": "restricted"
        }
    ]
}