{
    "id": "maven/mavencentral/software.amazon.awssdk/apache-client/2.24.1",
    "license": "Apache-2.0",
    "authority": "https://gitlab.eclipse.org/eclipsefdn/emo-team/iplab/-/issues/13257",
    "source": "https://repo1.maven.org/maven2/software/amazon/awssdk/apache-client/2.24.1/apache-client-2.24.1-sources.jar",
    "status": "approved",
    "scans": [
        {
            "date": "February 14, 2024 at 2:31:47 p.m. GMT",
            "authority": "https://gitlab.eclipse.org/eclipsefdn/emo-team/iplab/-/issues/13257",
            "scancode-version": "31.2.1",
            "licenses-discovered": [
                "Apache-2.0"
            ],
            "copyrights": [
                "Copyright Amazon.com, Inc. or its affiliates"
            ],
            "file-count": 30,
            "sha256": "3094caca99603dcef9d57a804a5675654d0c497aa5fcc4aeb5054f1ca393d152",
            "source": "https://repo1.maven.org/maven2/software/amazon/awssdk/apache-client/2.24.1/apache-client-2.24.1-sources.jar",
            "status": "approved"
        }
    ]
}