{
    "id": "maven/mavencentral/org.apache.lucene/lucene-analysis-common/9.9.0",
    "license": "Apache-2.0 AND BSD-3-Clause",
    "authority": "https://gitlab.eclipse.org/eclipsefdn/emo-team/iplab/-/issues/11800",
    "source": "https://repo1.maven.org/maven2/org/apache/lucene/lucene-analysis-common/9.9.0/lucene-analysis-common-9.9.0-sources.jar",
    "status": "approved",
    "scans": [
        {
            "date": "December 5, 2023 at 12:13:10 p.m. GMT",
            "authority": "https://gitlab.eclipse.org/eclipsefdn/emo-team/iplab/-/issues/11800",
            "scancode-version": "31.2.1",
            "licenses-discovered": [
                "Apache-2.0",
                "Apache-2.0 AND BSD-3-Clause",
                "Apache-2.0 AND LPPL-1.3c",
                "BSD-3-Clause"
            ],
            "copyrights": [
                "Copyright (c) 2001, Dr Martin Porter",
                "Copyright (c) 2003, Center for Intelligent Information Retrieval, University of Massachusetts, Amherst",
                "Copyright (c) 2004,2005, Richard Boulton",
                "Copyright (c) 2005, Jacques Savoy",
                "Copyright (c) 2006,2007,2009,2010,2011,2014-2019, Olly Betts",
                "Copyright (c) 2013, Yoshiki Shibukawa",
                "Copyright 2003, CIIR University of Massachusetts Amherst (http://ciir.cs.umass.edu)",
                "Copyright 2008, Luicid Imagination, Inc."
            ],
            "file-count": 553,
            "sha256": "3616f49c1e30ba7c63ec795fd28295ab07aed29fb781e04508aeed9e19f680d2",
            "source": "https://repo1.maven.org/maven2/org/apache/lucene/lucene-analysis-common/9.9.0/lucene-analysis-common-9.9.0-sources.jar",
            "status": "restricted"
        }
    ]
}
