{
    "id": "maven/mavencentral/org.jboss.slf4j/slf4j-jboss-logmanager/1.0.4.GA",
    "license": "Apache-2.0",
    "licenses-discovered": [
        "Apache-2.0"
    ],
    "copyrights": [
        "Copyright Red Hat, Inc., and individual contributors"
    ],
    "file-count": 8,
    "scancode-version": "30.1.0",
    "authority": "https://gitlab.eclipse.org/eclipsefdn/emo-team/iplab/-/issues/3513",
    "source": "https://search.maven.org/remotecontent?filepath=org/jboss/slf4j/slf4j-jboss-logmanager/1.0.4.GA/slf4j-jboss-logmanager-1.0.4.GA-sources.jar",
    "status": "approved"
}