{
    "id": "maven/mavencentral/org.geotools/gt-cql/30.4",
    "license": "LGPL-2.1-only",
    "authority": "https://gitlab.eclipse.org/eclipsefdn/emo-team/iplab/-/issues/15566",
    "source": "https://repo.osgeo.org/repository/geotools-releases/org/geotools/gt-cql/30.4/gt-cql-30.4-sources.jar",
    "status": "approved",
    "scans": [
        {
            "date": "July 3, 2024 at 2:30:02 p.m. GMT",
            "authority": "https://gitlab.eclipse.org/eclipsefdn/emo-team/iplab/-/issues/15566",
            "scancode-version": "31.2.1",
            "licenses-discovered": [
                "LGPL-2.1-only"
            ],
            "copyrights": [
                "(c) 2002-2008, Open Source Geospatial Foundation",
                "(c) 2004-2008, Open Source Geospatial Foundation",
                "(c) 2006-2008, Open Source Geospatial Foundation",
                "(c) 2006-2016, Open Source Geospatial Foundation"
            ],
            "file-count": 60,
            "sha256": "635a5366391cea294efd2765bdaae51128de075016c99fbe26de08a75edadc27",
            "source": "https://repo.osgeo.org/repository/geotools-releases/org/geotools/gt-cql/30.4/gt-cql-30.4-sources.jar",
            "status": "approved"
        }
    ]
}