{
    "id": "npm/npmjs/-/storybook/7.0.21",
    "license": "MIT",
    "authority": "https://gitlab.eclipse.org/eclipsefdn/emo-team/iplab/-/issues/9064",
    "source": "https://registry.yarnpkg.com/storybook/-/storybook-7.0.21.tgz",
    "status": "approved",
    "scans": [
        {
            "date": "June 15, 2023 at 4:28:06 p.m. GMT",
            "authority": "https://gitlab.eclipse.org/eclipsefdn/emo-team/iplab/-/issues/9064",
            "scancode-version": "31.2.1",
            "licenses-discovered": [
                "MIT"
            ],
            "copyrights": [
            ],
            "file-count": 5,
            "sha256": "40ff8029fbb52e9a5915f8573553fed80b91dd5efaf687818826cd1260e6cc7a",
            "source": "https://registry.yarnpkg.com/storybook/-/storybook-7.0.21.tgz",
            "status": "approved"
        }
    ]
}