{
    "id": "maven/mavencentral/com.h2database/h2/2.3.230",
    "license": "(MPL-2.0 AND EPL-1.0) AND (MPL-2.0 AND EPL-1.0 AND LGPL-3.0-or-later) AND BSD-3-Clause",
    "authority": "https://gitlab.eclipse.org/eclipsefdn/emo-team/iplab/-/issues/15708",
    "source": "https://repo1.maven.org/maven2/com/h2database/h2/2.3.230/h2-2.3.230-sources.jar",
    "status": "approved",
    "scans": [
        {
            "date": "July 17, 2024 at 9:46:55 p.m. GMT",
            "authority": "https://gitlab.eclipse.org/eclipsefdn/emo-team/iplab/-/issues/15708",
            "scancode-version": "31.2.1",
            "licenses-discovered": [
                "EPL-1.0 AND MPL-2.0",
                "BSD-3-Clause AND EPL-1.0 AND MPL-2.0",
                "EPL-1.0 AND LGPL-2.1-or-later AND LGPL-3.0-only AND MPL-2.0",
                "LicenseRef-scancode-proprietary-license"
            ],
            "copyrights": [
                "Copyright (c) 2000-2005 Marc Alexander Lehmann <schmorp@schmorp.de>",
                "Copyright (c) 2005 Oren J. Maurice <oymaurice@hazorea.org.il>",
                "Copyright 2004-2024 H2 Group. Multiple-Licensed"
            ],
            "file-count": 839,
            "sha256": "376d3beddba5a3de23431b4b3e0ac5bae3ca46b318e7f24c62890f110f26e142",
            "source": "https://repo1.maven.org/maven2/com/h2database/h2/2.3.230/h2-2.3.230-sources.jar",
            "status": "restricted"
        }
    ]
}