{
    "id": "maven/mavencentral/androidx.compose.runtime/runtime-livedata/1.5.0",
    "license": "Apache-2.0",
    "authority": "https://gitlab.eclipse.org/eclipsefdn/emo-team/iplab/-/issues/10477",
    "source": "https://dl.google.com/android/maven2/androidx/compose/runtime/runtime-livedata/1.5.0/runtime-livedata-1.5.0-sources.jar",
    "status": "approved",
    "scans": [
        {
            "date": "September 12, 2023 at 8:26:52 a.m. GMT",
            "authority": "https://gitlab.eclipse.org/eclipsefdn/emo-team/iplab/-/issues/10477",
            "scancode-version": "31.2.1",
            "licenses-discovered": [
                "Apache-2.0"
            ],
            "copyrights": [
                "Copyright 2020 The Android Open Source Project"
            ],
            "file-count": 2,
            "sha256": "4c9f1c2f9bdb6de160c07e2f1d04268925277095ef3f52ac5924d44dfbe2e036",
            "source": "https://dl.google.com/android/maven2/androidx/compose/runtime/runtime-livedata/1.5.0/runtime-livedata-1.5.0-sources.jar",
            "status": "approved"
        }
    ]
}