{
    "id": "p2/orbit/p2.eclipse.plugin/wrapped.org.apache.ant.ant-swing/1.10.14",
    "license": "Apache-2.0 AND LicenseRef-Public-domain AND W3C",
    "authority": "https://gitlab.eclipse.org/eclipsefdn/emo-team/iplab/-/issues/10651",
    "source": "https://repo.maven.apache.org/maven2/org/apache/ant/ant-swing/1.10.14/ant-swing-1.10.14-sources.jar",
    "status": "approved",
    "scans": [
        {
            "date": "September 25, 2023 at 9:17:31 p.m. GMT",
            "authority": "https://gitlab.eclipse.org/eclipsefdn/emo-team/iplab/-/issues/10651",
            "scancode-version": "31.2.1",
            "licenses-discovered": [
                "Apache-2.0 AND SAX-PD AND W3C",
                "Apache-2.0"
            ],
            "copyrights": [
            ],
            "file-count": 4,
            "sha256": "114316606f0a60ad9260b85d42ed1c5e30061fbbf03127863b7994579c1484d4",
            "source": "https://repo.maven.apache.org/maven2/org/apache/ant/ant-swing/1.10.14/ant-swing-1.10.14-sources.jar",
            "status": "restricted"
        }
    ]
}
