{
    "id": "npm/npmjs/-/eslint/3.19.0",
    "license": "MIT",
    "authority": "https://gitlab.eclipse.org/eclipsefdn/emo-team/iplab/-/issues/4831",
    "status": "approved",
    "scans": [
        {
            "date": "November 10, 2022 at 7:39:20 p.m. GMT",
            "authority": "https://gitlab.eclipse.org/eclipsefdn/emo-team/iplab/-/issues/4831",
            "scancode-version": "31.2.1",
            "licenses-discovered": [
                "MIT"
            ],
            "copyrights": [
                "Copyright (c) 2012 Nicholas Fisher",
                "Copyright 2013-2016 Dulin Marat and other contributors",
                "Copyright JS Foundation and other contributors, https://js.foundation"
            ],
            "file-count": 340,
            "sha256": "b8de28c1338aa961c44ccaba4f293bcc2e013478c143754c4826de6382265272",
            "source": "https://registry.npmjs.org/eslint/-/eslint-3.19.0.tgz",
            "status": "approved"
        }
    ]
}