{
    "id": "maven/mavencentral/org.apache.servicemix.bundles/org.apache.servicemix.bundles.c3p0/0.9.5.5_1",
    "license": "(LGPL-2.1-only or EPL-1.0) AND Apache-2.0",
    "licenses-discovered": [
        "EPL-1.0 AND LGPL-2.0-or-later AND LGPL-2.1-only AND LicenseRef-scancode-unknown",
        "EPL-1.0 AND GPL-1.0-or-later AND LGPL-2.0-or-later AND LGPL-2.1-only AND LicenseRef-scancode-unknown",
        "Apache-2.0"
    ],
    "copyrights": [
        "Copyright (c) Machinery",
        "Copyright The Apache Software Foundation"
    ],
    "file-count": 162,
    "scancode-version": "30.1.0",
    "authority": "https://gitlab.eclipse.org/eclipsefdn/emo-team/iplab/-/issues/3761",
    "source": "https://search.maven.org/remotecontent?filepath=org/apache/servicemix/bundles/org.apache.servicemix.bundles.c3p0/0.9.5.5_1/org.apache.servicemix.bundles.c3p0-0.9.5.5_1-sources.jar",
    "status": "approved"
}
