{
    "id": "npm/npmjs/-/allure-commandline/2.32.0",
    "license": "Apache-2.0",
    "authority": "https://gitlab.eclipse.org/eclipsefdn/emo-team/iplab/-/issues/17417",
    "source": "https://github.com/allure-framework/allure-npm/archive/refs/tags/2.32.0.zip",
    "status": "approved",
    "scans": [
        {
            "date": "November 22, 2024, 8:52:02 p.m. GMT",
            "authority": "https://gitlab.eclipse.org/eclipsefdn/emo-team/iplab/-/issues/17417",
            "scancode-version": "31.2.1",
            "licenses-discovered": [
                "Apache-2.0"
            ],
            "copyrights": [
                "Copyright 2021 Qameta Software"
            ],
            "file-count": 17,
            "sha256": "0dc54a0f7552f8d0bde9437385c73dadc94b8fd1f3f3cc55825fa7708c4c5f16",
            "source": "https://github.com/allure-framework/allure-npm/archive/refs/tags/2.32.0.zip",
            "status": "approved"
        }
    ]
}