{
    "id": "maven/mavencentral/software.amazon.awssdk/checksums/2.23.12",
    "license": "Apache-2.0",
    "authority": "https://gitlab.eclipse.org/eclipsefdn/emo-team/iplab/-/issues/13144",
    "source": "https://repo1.maven.org/maven2/software/amazon/awssdk/checksums/2.23.12/checksums-2.23.12-sources.jar",
    "status": "approved",
    "scans": [
        {
            "date": "February 4, 2024 at 11:28:15 a.m. GMT",
            "authority": "https://gitlab.eclipse.org/eclipsefdn/emo-team/iplab/-/issues/13144",
            "scancode-version": "31.2.1",
            "licenses-discovered": [
                "Apache-2.0"
            ],
            "copyrights": [
                "Copyright Amazon.com, Inc. or its affiliates"
            ],
            "file-count": 5,
            "sha256": "28f1c1a6b1304839e114c0e808a3f08c95c1da7ee025dc617fba7eb20ef73149",
            "source": "https://repo1.maven.org/maven2/software/amazon/awssdk/checksums/2.23.12/checksums-2.23.12-sources.jar",
            "status": "approved"
        }
    ]
}