{
    "id": "git/github/HDFGroup/hdf5/hdf5-1_10_10",
    "license": "Apache-2.0 AND FSFULLR AND BSD-3-Clause AND BSD-1-Clause AND LicenseRef-BSD-style AND FSFULLR AND FSFAP AND (FSFUL AND GPL-2.0-or-later WITH Libtool-exception AND FSFULLR) AND (GPL-2.0-or-later AND LicenseRef-Autoconf-exception) AND (GPL-3.0-or-later AND LicenseRef-Autoconf-exception) AND MIT AND X11 AND LicenseRef-Public-domain AND Zlib AND (GPL-3.0-or-later AND LicenseRef-Bison-exception-2.2)",
    "authority": "https://gitlab.eclipse.org/eclipsefdn/emo-team/iplab/-/issues/9597",
    "source": "https://github.com/HDFGroup/hdf5/archive/refs/tags/hdf5-1_10_10.zip",
    "status": "approved",
    "scans": [
        {
            "date": "July 18, 2023 at 10:30:33 a.m. GMT",
            "authority": "https://gitlab.eclipse.org/eclipsefdn/emo-team/iplab/-/issues/9597",
            "scancode-version": "31.2.1",
            "licenses-discovered": [
                "FSFULLR AND LicenseRef-scancode-fsf-unlimited-no-warranty",
                "BSD-3-Clause",
                "FSFUL AND GPL-2.0-or-later AND Libtool-exception",
                "LicenseRef-scancode-hdf5 AND LicenseRef-scancode-llnl",
                "BSD-3-Clause-LBNL",
                "LicenseRef-scancode-fsf-unlimited-no-warranty",
                "GPL-2.0-or-later AND LicenseRef-scancode-autoconf-simple-exception-2.0",
                "GPL-3.0-or-later AND LicenseRef-scancode-autoconf-simple-exception AND LicenseRef-scancode-free-unknown",
                "X11",
                "GPL-2.0-or-later AND GPL-3.0-or-later AND Libtool-exception",
                "LicenseRef-scancode-hdf4",
                "Zlib",
                "Apache-2.0",
                "Bison-exception-2.2 AND GPL-3.0-or-later",
                "LicenseRef-scancode-other-permissive",
                "GPL-2.0-or-later AND LicenseRef-scancode-autoconf-macro-exception",
                "FSFAP",
                "FSFUL AND FSFULLR AND GPL-2.0-or-later AND Libtool-exception",
                "FSFULLR",
                "LicenseRef-scancode-proprietary-license",
                "BSD-3-Clause AND LicenseRef-scancode-free-unknown AND Zlib",
                "BSD-1-Clause"
            ],
            "copyrights": [
                "Copyright (c) 1984, 1989-1990, 2000-2015 Free Software Foundation, Inc.",
                "Copyright (c) 1989 by Michael Mauldin",
                "Copyright (c) 1991-92 by Graphics Software Labs",
                "Copyright (c) 1992-1996, 1998-2017, 2020-2021 Free Software Foundation, Inc.",
                "Copyright (c) 1994 X Consortium",
                "Copyright (c) 1994-2020 Free Software Foundation, Inc.",
                "Copyright (c) 1995-2016 Jean-loup Gailly, Mark Adler",
                "Copyright (c) 1996-2001, 2003-2015 Free Software Foundation, Inc.",
                "Copyright (c) 1996-2015 Free Software Foundation, Inc.",
                "Copyright (c) 1996-2020 Free Software Foundation, Inc.",
                "Copyright (c) 1997-2020 Free Software Foundation, Inc.",
                "Copyright (c) 1999-2020 Free Software Foundation, Inc.",
                "Copyright (c) 2000-2006, www.hamcrest.org",
                "Copyright (c) 2001-2020 Free Software Foundation, Inc.",
                "Copyright (c) 2002-2020 Free Software Foundation, Inc.",
                "Copyright (c) 2003-2020 Free Software Foundation, Inc.",
                "Copyright (c) 2003-2022, Troy D. Hanson https://troydhanson.github.io/uthash",
                "Copyright (c) 2004, 2011-2015 Free Software Foundation, Inc.",
                "Copyright (c) 2004-2005, 2007, 2009, 2011-2015 Free Software Foundation, Inc.",
                "Copyright (c) 2004-2005, 2007-2008, 2011-2015 Free Software Foundation, Inc.",
                "Copyright (c) 2004-2005, 2007-2009, 2011-2015 Free Software Foundation, Inc.",
                "Copyright (c) 2004-2015 Free Software Foundation, Inc.",
                "Copyright (c) 2004-2020 Free Software Foundation, Inc.",
                "Copyright (c) 2006-2020 Free Software Foundation, Inc.",
                "Copyright (c) 2008 Devin Weaver <ktohg@tritarget.com>",
                "Copyright (c) 2008 Don Anderson <dda@sleepycat.com>",
                "Copyright (c) 2008 Duncan Simpson <dps@simpson.demon.co.uk>",
                "Copyright (c) 2008 Egon Willighagen <e.willighagen@science.ru.nl>",
                "Copyright (c) 2008 Gleen Salmon <gleensalmon@yahoo.com>",
                "Copyright (c) 2008 Luc Maisonobe <luc@spaceroots.org>",
                "Copyright (c) 2008 Nic Ferrier <nferrier@tapsellferrier.co.uk>",
                "Copyright (c) 2008 Stephane Bortzmeyer <bortzmeyer@pasteur.fr>",
                "Copyright (c) 2009 Oren Ben-Kiki <oren@ben-kiki.org>",
                "Copyright (c) 2009-2020 Free Software Foundation, Inc.",
                "Copyright (c) 2010-2015 Free Software Foundation, Inc.",
                "Copyright (c) 2011 Free Software Foundation, Inc.",
                "Copyright (c) 2011-2020 Free Software Foundation, Inc.",
                "Copyright (c) 2014 Free Software Foundation, Inc.",
                "Copyright (c) 2015 Olaf Mandel <olaf@mandel.name>",
                "Copyright (c) 2016, The Regents of the University of California, through Lawrence Berkeley National Laboratory",
                "Copyright (c) 2018 by George Cave",
                "Copyright (c) 2018-2020 by George Cave",
                "Copyright (c) 2019 by George Cave",
                "Copyright (c) 2021 Free Software Foundation, Inc.",
                "Copyright 1992-2020 Free Software Foundation, Inc.",
                "Copyright 1998-2006 by The Board of Trustees of the University of Illinois",
                "Copyright 2001-2004, ACL, Los Alamos National Laboratory",
                "Copyright 2006 by The HDF Group",
                "Copyright The HDF Group, 2012-14",
                "Copyright by The HDF Group",
                "Copyright by The HDF Group. print $fh",
                "Copyright by the Board of Trustees of the University of Illinois",
                "copyright (c) 1993 by John Wiley & Sons, Inc."
            ],
            "file-count": 4109,
            "sha256": "b9e60a46c09172616daab9f30184be86d571b309f1944b1585e7adb36b1880d9",
            "source": "https://github.com/HDFGroup/hdf5/archive/refs/tags/hdf5-1_10_10.zip",
            "status": "restricted"
        }
    ]
}
