{
    "id": "maven/mavencentral/io.quarkus/quarkus-jsonp/3.17.4",
    "license": "Apache-2.0",
    "authority": "https://gitlab.eclipse.org/eclipsefdn/emo-team/iplab/-/issues/17863",
    "source": "https://repo1.maven.org/maven2/io/quarkus/quarkus-jsonp/3.17.4/quarkus-jsonp-3.17.4-sources.jar",
    "status": "approved",
    "scans": [
        {
            "date": "December 13, 2024 at 1:16:02 p.m. GMT",
            "authority": "https://gitlab.eclipse.org/eclipsefdn/emo-team/iplab/-/issues/17863",
            "scancode-version": "31.2.1",
            "licenses-discovered": [
            ],
            "copyrights": [
            ],
            "file-count": 6,
            "sha256": "23f83a73e7dd35a20c22e0db98dcceaf1be3ab1118d78f0ee3d4cb06904ad981",
            "source": "https://repo1.maven.org/maven2/io/quarkus/quarkus-jsonp/3.17.4/quarkus-jsonp-3.17.4-sources.jar",
            "status": "restricted"
        }
    ]
}