{
    "id": "npm/npmjs/@pnpm/npm-resolver/18.1.1",
    "license": "MIT",
    "authority": "https://gitlab.eclipse.org/eclipsefdn/emo-team/iplab/-/issues/13835",
    "source": "https://github.com/pnpm/pnpm/pull/18.1.1.patch",
    "status": "approved",
    "scans": [
        {
            "date": "March 18, 2024 at 3:19:58 a.m. GMT",
            "authority": "https://gitlab.eclipse.org/eclipsefdn/emo-team/iplab/-/issues/13835",
            "scancode-version": "31.2.1",
            "licenses-discovered": [
            ],
            "copyrights": [
            ],
            "file-count": 1,
            "sha256": "6f5a256efc28e09be0b144a700d63bbe32da81bd6889982c87b77a2ab619d8c9",
            "source": "https://github.com/pnpm/pnpm/pull/18.1.1.patch",
            "status": "restricted"
        }
    ]
}
