{
    "id": "maven/mavencentral/com.github.multiformats/java-multibase/1.1.1",
    "license": "Apache-2.0",
    "authority": "https://gitlab.eclipse.org/eclipsefdn/emo-team/iplab/-/issues/19457",
    "source": "https://jitpack.io/com/github/multiformats/java-multibase/1.1.1/java-multibase-1.1.1-sources.jar",
    "status": "approved",
    "scans": [
        {
            "date": "February 13, 2025 at 1:30:11 p.m. GMT",
            "authority": "https://gitlab.eclipse.org/eclipsefdn/emo-team/iplab/-/issues/19457",
            "scancode-version": "31.2.1",
            "licenses-discovered": [
                "Apache-2.0"
            ],
            "copyrights": [
                "Copyright 2011 Google Inc.",
                "Copyright 2018 Andreas Schildbach"
            ],
            "file-count": 17,
            "sha256": "656fa85ff0142d3e887c5473e14abf2b6abbbe2b36455fb6cffab6e6b6a50dde",
            "source": "https://jitpack.io/com/github/multiformats/java-multibase/1.1.1/java-multibase-1.1.1-sources.jar",
            "status": "approved"
        }
    ]
}