{
    "id": "npm/npmjs/@discoveryjs/json-ext/0.6.3",
    "license": "MIT",
    "authority": "https://gitlab.eclipse.org/eclipsefdn/emo-team/iplab/-/issues/17984",
    "source": "https://github.com/discoveryjs/json-ext/archive/refs/tags/v0.6.3.zip",
    "status": "approved",
    "scans": [
        {
            "date": "December 20, 2024 at 10:18:07 a.m. GMT",
            "authority": "https://gitlab.eclipse.org/eclipsefdn/emo-team/iplab/-/issues/17984",
            "scancode-version": "31.2.1",
            "licenses-discovered": [
                "MIT"
            ],
            "copyrights": [
                "Copyright (c) 2020-2024 Roman Dvornov <rdvornov@gmail.com>"
            ],
            "file-count": 42,
            "sha256": "0b11f5bac2da9b03139acbe7a4f8ae2335ba73a5ee804dccb7483c2c00c0ba3d",
            "source": "https://github.com/discoveryjs/json-ext/archive/refs/tags/v0.6.3.zip",
            "status": "approved"
        }
    ]
}