{
    "id": "npm/npmjs/@lerna/create/6.0.1",
    "license": "MIT AND ISC",
    "licenses-discovered": [
        "MIT",
        "ISC"
    ],
    "copyrights": [
        "Copyright (c) 2015-present Lerna"
    ],
    "file-count": 8,
    "scancode-version": "31.2.1",
    "authority": "https://gitlab.eclipse.org/eclipsefdn/emo-team/iplab/-/issues/4298",
    "source": "https://registry.npmjs.org/@lerna/create/-/create-6.0.1.tgz",
    "status": "approved"
}