{
    "id": "project/eclipse.pde/-/eclipse.pdePR1168/0.0",
    "license": "EPL-2.0",
    "authority": "https://gitlab.eclipse.org/eclipsefdn/emo-team/iplab/-/issues/13813",
    "source": "https://github.com/eclipse-pde/eclipse.pde/pull/1168.patch",
    "status": "approved",
    "scans": [
        {
            "date": "March 17, 2024 at 11:50:09 a.m. GMT",
            "authority": "https://gitlab.eclipse.org/eclipsefdn/emo-team/iplab/-/issues/13813",
            "scancode-version": "31.2.1",
            "licenses-discovered": [
                "EPL-2.0"
            ],
            "copyrights": [
                "Copyright (c) 2010, 2019 bndtools project and others",
                "Copyright (c) 2010, 2020 bndtools project and others",
                "Copyright (c) 2010, 2021 bndtools project and others",
                "Copyright (c) 2010, 2023 bndtools project and others",
                "Copyright (c) 2010, 2024 bndtools project and others",
                "Copyright (c) 2012, 2019 bndtools project and others",
                "Copyright (c) 2012, 2021 bndtools project and others",
                "Copyright (c) 2012, 2024 bndtools project and others",
                "Copyright (c) 2013, 2019 bndtools project and others",
                "Copyright (c) 2013, 2020 bndtools project and others",
                "Copyright (c) 2013, 2021 bndtools project and others",
                "Copyright (c) 2013, 2022 bndtools project and others",
                "Copyright (c) 2013, 2024 bndtools project and others",
                "Copyright (c) 2014, 2019 bndtools project and others",
                "Copyright (c) 2015, 2019 bndtools project and others",
                "Copyright (c) 2015, 2020 bndtools project and others",
                "Copyright (c) 2015, 2021 bndtools project and others",
                "Copyright (c) 2015, 2023 bndtools project and others",
                "Copyright (c) 2015, 2024 bndtools project and others",
                "Copyright (c) 2016, 2019 bndtools project and others",
                "Copyright (c) 2016, 2024 bndtools project and others",
                "Copyright (c) 2017, 2019 bndtools project and others",
                "Copyright (c) 2020 bndtools project and others",
                "Copyright (c) 2020, 2020 bndtools project and others",
                "Copyright (c) 2020, 2021 bndtools project and others",
                "Copyright (c) 2020, 2024 bndtools project and others",
                "Copyright (c) 2023 Christoph Laubrich and others",
                "Copyright (c) 2023 bndtools project and others",
                "Copyright (c) 2023, 2023 bndtools project and others",
                "Copyright (c) 2023, 2024 Christoph Laubrich and others",
                "Copyright (c) 2024 Christoph Laubrich and others"
            ],
            "file-count": 1,
            "sha256": "eed82c144f9fc9747e563d99324431cb0fd2ec9e8ad9304c1bd9cfeda484adfe",
            "source": "https://github.com/eclipse-pde/eclipse.pde/pull/1168.patch",
            "status": "restricted"
        }
    ]
}
