{
    "id": "maven/mavencentral/org.apache.maven.shared/maven-dependency-analyzer/1.14.1",
    "license": "Apache-2.0",
    "authority": "https://gitlab.eclipse.org/eclipsefdn/emo-team/iplab/-/issues/15833",
    "source": "https://repo1.maven.org/maven2/org/apache/maven/shared/maven-dependency-analyzer/1.14.1/maven-dependency-analyzer-1.14.1-sources.jar",
    "status": "approved",
    "scans": [
        {
            "date": "August 6, 2024 at 4:51:08 a.m. GMT",
            "authority": "https://gitlab.eclipse.org/eclipsefdn/emo-team/iplab/-/issues/15833",
            "scancode-version": "31.2.1",
            "licenses-discovered": [
                "Apache-2.0"
            ],
            "copyrights": [
            ],
            "file-count": 25,
            "sha256": "b4d58058f6d4262434a0e9fc39e6bcae048f477bdb1402a59ff7a425a861ca61",
            "source": "https://repo1.maven.org/maven2/org/apache/maven/shared/maven-dependency-analyzer/1.14.1/maven-dependency-analyzer-1.14.1-sources.jar",
            "status": "approved"
        }
    ]
}