{
    "id": "maven/mavencentral/org.mariadb.jdbc/mariadb-java-client/3.0.10",
    "license": "LGPL-2.1-only AND LGPL-2.1-or-later AND CC0-1.0",
    "authority": "https://gitlab.eclipse.org/eclipsefdn/emo-team/iplab/-/issues/7406",
    "source": "https://search.maven.org/remotecontent?filepath=org/mariadb/jdbc/mariadb-java-client/3.0.10/mariadb-java-client-3.0.10-sources.jar",
    "status": "approved",
    "scans": [
        {
            "date": "March 15, 2023 at 4:26:04 p.m. GMT",
            "authority": "https://gitlab.eclipse.org/eclipsefdn/emo-team/iplab/-/issues/7406",
            "scancode-version": "31.2.1",
            "licenses-discovered": [
                "LGPL-2.1-only",
                "LGPL-2.1-or-later",
                "CC0-1.0"
            ],
            "copyrights": [
                "Copyright (c) 2012-2014 Monty Program Ab",
                "Copyright (c) 2015-2021 MariaDB Corporation Ab"
            ],
            "file-count": 216,
            "sha256": "79d1533f366bf8296e8f360b0aa311974965edd024843b0ec88885d7075f7961",
            "source": "https://search.maven.org/remotecontent?filepath=org/mariadb/jdbc/mariadb-java-client/3.0.10/mariadb-java-client-3.0.10-sources.jar",
            "status": "approved"
        }
    ]
}