{
    "id": "nuget/nuget/-/FakeItEasy/7.4.0",
    "license": "MIT",
    "authority": "https://gitlab.eclipse.org/eclipsefdn/emo-team/iplab/-/issues/10080",
    "source": "https://github.com/FakeItEasy/FakeItEasy/archive/refs/tags/7.4.0.zip",
    "status": "approved",
    "scans": [
        {
            "date": "August 17, 2023 at 3:46:09 a.m. GMT",
            "authority": "https://gitlab.eclipse.org/eclipsefdn/emo-team/iplab/-/issues/10080",
            "scancode-version": "31.2.1",
            "licenses-discovered": [
                "MIT"
            ],
            "copyrights": [
                "Copyright (c) FakeItEasy contributors. (fakeiteasy@hagne.se)",
                "Copyright (c) FakeItEasy contributors. (fakeiteasyfx@gmail.com) https://fakeiteasy.github.io"
            ],
            "file-count": 504,
            "sha256": "e239ce31f9985a60868a36062bd1be302010e7e2b9979af02a88d4814a1e19d2",
            "source": "https://github.com/FakeItEasy/FakeItEasy/archive/refs/tags/7.4.0.zip",
            "status": "approved"
        }
    ]
}