{
    "id": "maven/mavencentral/org.jobrunr/jobrunr-bom/v6.2.0",
    "license": "LGPL-3.0-or-later",
    "authority": "https://gitlab.eclipse.org/eclipsefdn/emo-team/iplab/-/issues/9627",
    "source": "https://repo.maven.apache.org/maven2/org/jobrunr/jobrunr-bom/v6.2.0/jobrunr-bom-v6.2.0.pom",
    "status": "approved",
    "scans": [
        {
            "date": "July 19, 2023 at 1:13:34 p.m. GMT",
            "authority": "https://gitlab.eclipse.org/eclipsefdn/emo-team/iplab/-/issues/9627",
            "scancode-version": "31.2.1",
            "licenses-discovered": [
                "LGPL-3.0-only AND LGPL-3.0-or-later AND LicenseRef-scancode-unknown"
            ],
            "copyrights": [
            ],
            "file-count": 1,
            "sha256": "bdee89a7c59bbbcb51d76262cd987bf254ae7a6d4374148916394cf9b608c6bd",
            "source": "https://repo.maven.apache.org/maven2/org/jobrunr/jobrunr-bom/v6.2.0/jobrunr-bom-v6.2.0.pom",
            "status": "restricted"
        },
        {
            "date": "July 24, 2023 at 4:02:33 a.m. GMT",
            "authority": "https://gitlab.eclipse.org/eclipsefdn/emo-team/iplab/-/issues/9627",
            "scancode-version": "31.2.1",
            "licenses-discovered": [
                "LGPL-3.0-only AND LGPL-3.0-or-later AND LicenseRef-scancode-unknown"
            ],
            "copyrights": [
            ],
            "file-count": 1,
            "sha256": "bdee89a7c59bbbcb51d76262cd987bf254ae7a6d4374148916394cf9b608c6bd",
            "source": "https://repo.maven.apache.org/maven2/org/jobrunr/jobrunr-bom/v6.2.0/jobrunr-bom-v6.2.0.pom",
            "status": "restricted"
        }
    ]
}
