{
    "id": "maven/mavencentral/org.opensearch/opensearch-geo/2.5.0",
    "license": "Apache-2.0",
    "authority": "https://gitlab.eclipse.org/eclipsefdn/emo-team/iplab/-/issues/6994",
    "source": "https://search.maven.org/remotecontent?filepath=org/opensearch/opensearch-geo/2.5.0/opensearch-geo-2.5.0-sources.jar",
    "status": "approved",
    "scans": [
        {
            "date": "February 3, 2023 at 6:57:55 p.m. GMT",
            "authority": "https://gitlab.eclipse.org/eclipsefdn/emo-team/iplab/-/issues/6994",
            "scancode-version": "31.2.1",
            "licenses-discovered": [
                "Apache-2.0"
            ],
            "copyrights": [
                "Copyright OpenSearch Contributors"
            ],
            "file-count": 22,
            "sha256": "7669acc20dfa3412e2e9ad5beb757086784ac7716f2cf1bcc2ca277608820a18",
            "source": "https://search.maven.org/remotecontent?filepath=org/opensearch/opensearch-geo/2.5.0/opensearch-geo-2.5.0-sources.jar",
            "status": "approved"
        }
    ]
}