{
    "id": "maven/mavencentral/com.google.cloud/google-cloud-core-http/2.44.1",
    "license": "Apache-2.0",
    "authority": "https://gitlab.eclipse.org/eclipsefdn/emo-team/iplab/-/issues/16729",
    "source": "https://repo1.maven.org/maven2/com/google/cloud/google-cloud-core-http/2.44.1/google-cloud-core-http-2.44.1-sources.jar",
    "status": "approved",
    "scans": [
        {
            "date": "October 15, 2024, 5:58:21 p.m. GMT",
            "authority": "https://gitlab.eclipse.org/eclipsefdn/emo-team/iplab/-/issues/16729",
            "scancode-version": "31.2.1",
            "licenses-discovered": [
                "Apache-2.0"
            ],
            "copyrights": [
                "Copyright 2016 Google LLC",
                "Copyright 2017 Google LLC",
                "Copyright 2018 Google LLC"
            ],
            "file-count": 6,
            "sha256": "139a38918e24f6006a265ebdd4029cc02ee4d519a913bd6d5993e233a32b0526",
            "source": "https://repo1.maven.org/maven2/com/google/cloud/google-cloud-core-http/2.44.1/google-cloud-core-http-2.44.1-sources.jar",
            "status": "approved"
        }
    ]
}