{
    "id": "maven/mavencentral/org.apache.thrift/libthrift/0.19.0",
    "license": "Apache-2.0",
    "authority": "https://gitlab.eclipse.org/eclipsefdn/emo-team/iplab/-/issues/15687",
    "source": "https://repo1.maven.org/maven2/org/apache/thrift/libthrift/0.19.0/libthrift-0.19.0-sources.jar",
    "status": "approved",
    "scans": [
        {
            "date": "July 11, 2024 at 8:26:10 a.m. GMT",
            "authority": "https://gitlab.eclipse.org/eclipsefdn/emo-team/iplab/-/issues/15687",
            "scancode-version": "31.2.1",
            "licenses-discovered": [
                "Apache-2.0"
            ],
            "copyrights": [
            ],
            "file-count": 148,
            "sha256": "93334310686b6594800b431db134b5f37c3a02ad8dda71a9ea93d999389fc721",
            "source": "https://repo1.maven.org/maven2/org/apache/thrift/libthrift/0.19.0/libthrift-0.19.0-sources.jar",
            "status": "approved"
        }
    ]
}