{
    "id": "maven/mavencentral/org.apache.activemq/activemq-branding/2.33.0",
    "license": "Apache-2.0",
    "authority": "https://gitlab.eclipse.org/eclipsefdn/emo-team/iplab/-/issues/14971",
    "source": "https://repo1.maven.org/maven2/org/apache/activemq/activemq-branding/2.33.0/activemq-branding-2.33.0-sources.jar",
    "status": "approved",
    "scans": [
        {
            "date": "May 29, 2024 at 11:48:56 a.m. GMT",
            "authority": "https://gitlab.eclipse.org/eclipsefdn/emo-team/iplab/-/issues/14971",
            "scancode-version": "31.2.1",
            "licenses-discovered": [
                "Apache-2.0"
            ],
            "copyrights": [
            ],
            "file-count": 6,
            "sha256": "5eec2c25fcf18d3b737e53861150ee6b84270c381161abff1f56be0c1aee2577",
            "source": "https://repo1.maven.org/maven2/org/apache/activemq/activemq-branding/2.33.0/activemq-branding-2.33.0-sources.jar",
            "status": "approved"
        }
    ]
}