{
    "id": "maven/mavencentral/com.vaadin/flow-server/24.3.7",
    "license": "Apache-2.0 AND MIT",
    "authority": "https://gitlab.eclipse.org/eclipsefdn/emo-team/iplab/-/issues/13774",
    "source": "https://repo1.maven.org/maven2/com/vaadin/flow-server/24.3.7/flow-server-24.3.7-sources.jar",
    "status": "approved",
    "scans": [
        {
            "date": "March 15, 2024 at 1:24:54 p.m. GMT",
            "authority": "https://gitlab.eclipse.org/eclipsefdn/emo-team/iplab/-/issues/13774",
            "scancode-version": "31.2.1",
            "licenses-discovered": [
                "Apache-2.0",
                "Apache-2.0 AND LicenseRef-scancode-proprietary-license",
                "MIT"
            ],
            "copyrights": [
                "Copyright (c) 2019 Umberto Pepato",
                "Copyright 2000-2022 Vaadin Ltd.",
                "Copyright 2000-2023 Vaadin Ltd.",
                "Copyright 2000-2024 Vaadin Ltd."
            ],
            "file-count": 741,
            "sha256": "51633108b5ad57c0219063104f16a5c1d2c9717933e267582fe61b0481ea10b2",
            "source": "https://repo1.maven.org/maven2/com/vaadin/flow-server/24.3.7/flow-server-24.3.7-sources.jar",
            "status": "restricted"
        }
    ]
}
