{
    "id": "git/github/zserge/jsmn/25647e692c7906b96ffd2b05ca54c097948e879c",
    "license": "MIT",
    "authority": "https://gitlab.eclipse.org/eclipsefdn/emo-team/iplab/-/issues/16196",
    "source": "https://github.com/zserge/jsmn/archive/25647e692c7906b96ffd2b05ca54c097948e879c.zip",
    "status": "approved",
    "scans": [
        {
            "date": "September 18, 2024, 9:35:00 p.m. GMT",
            "authority": "https://gitlab.eclipse.org/eclipsefdn/emo-team/iplab/-/issues/16196",
            "scancode-version": "31.2.1",
            "licenses-discovered": [
                "MIT"
            ],
            "copyrights": [
                "Copyright (c) 2010 Serge A. Zaitsev",
                "Copyright (c) 2010 Serge Zaitsev"
            ],
            "file-count": 12,
            "sha256": "d7288a62e8b24e130a05667f586c2e56396eefde8bf612289cf2e844a1dd5efa",
            "source": "https://github.com/zserge/jsmn/archive/25647e692c7906b96ffd2b05ca54c097948e879c.zip",
            "status": "approved"
        }
    ]
}