{
    "id": "maven/mavencentral/org.keycloak/keycloak-spring-boot-starter/20.0.3",
    "license": "Apache-2.0",
    "authority": "https://gitlab.eclipse.org/eclipsefdn/emo-team/iplab/-/issues/7103",
    "source": "https://search.maven.org/remotecontent?filepath=org/keycloak/keycloak-spring-boot-starter/20.0.3/keycloak-spring-boot-starter-20.0.3.jar",
    "status": "approved",
    "scans": [
        {
            "date": "March 9, 2023 at 8:51:17 p.m. GMT",
            "authority": "https://gitlab.eclipse.org/eclipsefdn/emo-team/iplab/-/issues/7103",
            "scancode-version": "31.2.1",
            "licenses-discovered": [
            ],
            "copyrights": [
            ],
            "file-count": 4,
            "sha256": "13b48314086b012c6b612b242208ed2fbbea9bdb5aa06076376a6051f7b58dd8",
            "source": "https://search.maven.org/remotecontent?filepath=org/keycloak/keycloak-spring-boot-starter/20.0.3/keycloak-spring-boot-starter-20.0.3.jar",
            "status": "restricted"
        }
    ]
}
