{
    "id": "npm/npmjs/-/schema-utils/4.2.0",
    "license": "MIT",
    "authority": "https://gitlab.eclipse.org/eclipsefdn/emo-team/iplab/-/issues/8986",
    "source": "https://registry.yarnpkg.com/schema-utils/-/schema-utils-4.2.0.tgz",
    "status": "approved",
    "scans": [
        {
            "date": "June 15, 2023 at 2:26:36 p.m. GMT",
            "authority": "https://gitlab.eclipse.org/eclipsefdn/emo-team/iplab/-/issues/8986",
            "scancode-version": "31.2.1",
            "licenses-discovered": [
                "MIT"
            ],
            "copyrights": [
                "Copyright JS Foundation and other contributors"
            ],
            "file-count": 19,
            "sha256": "b99f103b5c0e55af52aac77f135842cf99633f071de37ec8232aa24d9c57b586",
            "source": "https://registry.yarnpkg.com/schema-utils/-/schema-utils-4.2.0.tgz",
            "status": "approved"
        }
    ]
}