{
    "license": "EPL-2.0 or GPL-2.0-only WITH Classpath-exception-2.0",
    "file-count": 23,
    "authority": "https://gitlab.eclipse.org/eclipsefdn/emo-team/iplab/-/issues/1805",
    "scancode-version": "30.1.0",
    "licenses-discovered": [
        "CDDL-1.0 AND EPL-2.0 AND (GPL-2.0-only WITH Classpath-exception-2.0)",
        "EPL-2.0 AND (GPL-2.0-only WITH Classpath-exception-2.0)",
        "Classpath-exception-2.0",
        "EPL-2.0 AND (GPL-2.0-only WITH Classpath-exception-2.0) AND LicenseRef-scancode-generic-export-compliance"
    ],
    "id": "maven/mavencentral/org.jboss.spec.javax.annotation/jboss-annotations-api_1.3_spec/2.0.1.Final",
    "source": "https://search.maven.org/remotecontent?filepath=org/jboss/spec/javax/annotation/jboss-annotations-api_1.3_spec/2.0.1.Final/jboss-annotations-api_1.3_spec-2.0.1.Final-sources.jar",
    "status": "approved"
}
