{
    "id": "npm/npmjs/-/data-view-byte-length/1.0.2",
    "license": "MIT",
    "authority": "https://gitlab.eclipse.org/eclipsefdn/emo-team/iplab/-/issues/18392",
    "source": "https://github.com/inspect-js/data-view-byte-length/archive/refs/tags/v1.0.2.zip",
    "status": "approved",
    "scans": [
        {
            "date": "January 8, 2025 at 1:41:52 p.m. GMT",
            "authority": "https://gitlab.eclipse.org/eclipsefdn/emo-team/iplab/-/issues/18392",
            "scancode-version": "31.2.1",
            "licenses-discovered": [
                "MIT"
            ],
            "copyrights": [
                "Copyright (c) 2024 Jordan Harband"
            ],
            "file-count": 17,
            "sha256": "2d5b02a86aa3bba80a18f7bca0f34e108ae0be92a179d9460e04cd0c1262d816",
            "source": "https://github.com/inspect-js/data-view-byte-length/archive/refs/tags/v1.0.2.zip",
            "status": "approved"
        }
    ]
}