{
    "id": "maven/mavencentral/org.springframework.security/spring-security-oauth2-core/6.4.1",
    "license": "Apache-2.0",
    "authority": "https://gitlab.eclipse.org/eclipsefdn/emo-team/iplab/-/issues/17551",
    "source": "https://repo1.maven.org/maven2/org/springframework/security/spring-security-oauth2-core/6.4.1/spring-security-oauth2-core-6.4.1-sources.jar",
    "status": "approved",
    "scans": [
        {
            "date": "November 29, 2024 at 4:34:34 a.m. GMT",
            "authority": "https://gitlab.eclipse.org/eclipsefdn/emo-team/iplab/-/issues/17551",
            "scancode-version": "31.2.1",
            "licenses-discovered": [
                "Apache-2.0"
            ],
            "copyrights": [
                "Copyright 2002-2017 the original author or authors",
                "Copyright 2002-2018 the original author or authors",
                "Copyright 2002-2019 the original author or authors",
                "Copyright 2002-2020 the original author or authors",
                "Copyright 2002-2021 the original author or authors",
                "Copyright 2002-2022 the original author or authors",
                "Copyright 2002-2023 the original author or authors",
                "Copyright 2002-2024 the original author or authors"
            ],
            "file-count": 70,
            "sha256": "d812033d72c2cb8d83ee0c99a176a5e5fa5dbd18846a30e2e1663ce4c06f499b",
            "source": "https://repo1.maven.org/maven2/org/springframework/security/spring-security-oauth2-core/6.4.1/spring-security-oauth2-core-6.4.1-sources.jar",
            "status": "approved"
        }
    ]
}