{
    "id": "maven/mavencentral/org.codehaus.woodstox/stax2-api/4.2.1",
    "license": "BSD-2-Clause",
    "licenses-discovered": [
        "Apache-2.0 AND BSD-2-Clause AND BSD-2-Clause-Views AND BSD-3-Clause",
        "BSD-3-Clause",
        "Apache-2.0"
    ],
    "file-count": 98,
    "scancode-version": "30.1.0",
    "authority": "https://gitlab.eclipse.org/eclipsefdn/emo-team/iplab/-/issues/2670",
    "source": "https://search.maven.org/remotecontent?filepath=org/codehaus/woodstox/stax2-api/4.2.1/stax2-api-4.2.1-sources.jar",
    "status": "approved"
}
