{
    "id": "maven/mavencentral/org.springframework.boot/spring-boot-properties-migrator/3.1.3",
    "license": "Apache-2.0",
    "authority": "https://gitlab.eclipse.org/eclipsefdn/emo-team/iplab/-/issues/10675",
    "source": "https://repo.maven.apache.org/maven2/org/springframework/boot/spring-boot-properties-migrator/3.1.3/spring-boot-properties-migrator-3.1.3-sources.jar",
    "status": "approved",
    "scans": [
        {
            "date": "September 26, 2023 at 3:28:47 p.m. GMT",
            "authority": "https://gitlab.eclipse.org/eclipsefdn/emo-team/iplab/-/issues/10675",
            "scancode-version": "31.2.1",
            "licenses-discovered": [
                "Apache-2.0"
            ],
            "copyrights": [
                "Copyright 2012-2022 the original author or authors",
                "Copyright 2012-2023 the original author or authors"
            ],
            "file-count": 8,
            "sha256": "a565b8f7632c3757c1d223b2a80369feb30e3f6b2dfb41a5c09f33e68154e0ac",
            "source": "https://repo.maven.apache.org/maven2/org/springframework/boot/spring-boot-properties-migrator/3.1.3/spring-boot-properties-migrator-3.1.3-sources.jar",
            "status": "approved"
        }
    ]
}