{
    "id": "maven/mavencentral/io.opentelemetry/opentelemetry-exporter-logging/1.32.0",
    "license": "Apache-2.0",
    "authority": "https://gitlab.eclipse.org/eclipsefdn/emo-team/iplab/-/issues/11932",
    "source": "https://repo1.maven.org/maven2/io/opentelemetry/opentelemetry-exporter-logging/1.32.0/opentelemetry-exporter-logging-1.32.0-sources.jar",
    "status": "approved",
    "scans": [
        {
            "date": "December 13, 2023 at 5:30:09 a.m. GMT",
            "authority": "https://gitlab.eclipse.org/eclipsefdn/emo-team/iplab/-/issues/11932",
            "scancode-version": "31.2.1",
            "licenses-discovered": [
                "Apache-2.0"
            ],
            "copyrights": [
            ],
            "file-count": 11,
            "sha256": "a064ad18e16485258734dcc2c8ae5e5e35c59fd26a9a2b6e559522bc114ef00e",
            "source": "https://repo1.maven.org/maven2/io/opentelemetry/opentelemetry-exporter-logging/1.32.0/opentelemetry-exporter-logging-1.32.0-sources.jar",
            "status": "approved"
        }
    ]
}