{
    "id": "npm/npmjs/-/bl/0.8.2",
    "license": "MITNFA AND MIT",
    "authority": "https://gitlab.eclipse.org/eclipsefdn/emo-team/iplab/-/issues/7443",
    "source": "https://github.com/rvagg/bl/archive/v0.8.2.zip",
    "status": "restricted",
    "scans": [
        {
            "date": "March 22, 2023 at 10:25:31 a.m. GMT",
            "authority": "https://gitlab.eclipse.org/eclipsefdn/emo-team/iplab/-/issues/7443",
            "scancode-version": "31.2.1",
            "licenses-discovered": [
                "MITNFA",
                "MIT"
            ],
            "copyrights": [
                "Copyright (c) 2013 Rod Vagg rvagg (https://twitter.com/rvagg)",
                "Copyright 2013, Rod Vagg"
            ],
            "file-count": 9,
            "sha256": "d556e8be0c93d213d1ac1402878c8dbc2a8cae009281dce0e43b726423ee78b5",
            "source": "https://github.com/rvagg/bl/archive/v0.8.2.zip",
            "status": "restricted"
        }
    ]
}