{
    "id": "maven/mavencentral/org.apache.commons/commons-math3/3.4",
    "license": "Apache-2.0 AND BSD-3-Clause AND BSD-2-Clause AND Minpack",
    "authority": "https://gitlab.eclipse.org/eclipsefdn/emo-team/iplab/-/issues/19331",
    "source": "https://repo1.maven.org/maven2/org/apache/commons/commons-math3/3.4/commons-math3-3.4-sources.jar",
    "status": "approved",
    "scans": [
        {
            "date": "February 6, 2025 at 12:51:17 a.m. GMT",
            "authority": "https://gitlab.eclipse.org/eclipsefdn/emo-team/iplab/-/issues/19331",
            "scancode-version": "31.2.1",
            "licenses-discovered": [
                "Apache-2.0",
                "Apache-2.0 AND BSD-3-Clause AND Minpack",
                "Apache-2.0 AND BSD-2-Clause",
                "Apache-2.0 AND BSD-3-Clause",
                "Apache-2.0 AND Minpack"
            ],
            "copyrights": [
                "Copyright (c) 1997 - 2002, Makoto Matsumoto and Takuji Nishimura",
                "Copyright (c) 2001, 2002 Enthought, Inc.",
                "Copyright (c) 2003-2009 SciPy Developers",
                "Copyright (c) 2003-2013 SciPy Developers",
                "Copyright (c) 2004, Ernst Hairer",
                "Copyright (c) 2008, Frances Y. Kuo and Stephen Joe",
                "Copyright 2009 Google Inc."
            ],
            "file-count": 932,
            "sha256": "e521b5914e1372ac936080658e64d6cc99e762c50566cbfdcdd3d8a38014ca9e",
            "source": "https://repo1.maven.org/maven2/org/apache/commons/commons-math3/3.4/commons-math3-3.4-sources.jar",
            "status": "restricted"
        }
    ]
}