{
    "id": "npm/npmjs/-/chromatic/11.2.0",
    "license": "MIT",
    "authority": "https://gitlab.eclipse.org/eclipsefdn/emo-team/iplab/-/issues/14001",
    "source": "https://github.com/chromaui/chromatic-cli/archive/refs/tags/v11.2.0.zip",
    "status": "approved",
    "scans": [
        {
            "date": "March 22, 2024 at 3:12:54 p.m. GMT",
            "authority": "https://gitlab.eclipse.org/eclipsefdn/emo-team/iplab/-/issues/14001",
            "scancode-version": "31.2.1",
            "licenses-discovered": [
                "MIT"
            ],
            "copyrights": [
                "Copyright (c) Chroma Software Inc."
            ],
            "file-count": 398,
            "sha256": "ca1bca36de057dcaf7b0ffb2cb153b0b8621e1ef007361bcb0319e1b06cb8564",
            "source": "https://github.com/chromaui/chromatic-cli/archive/refs/tags/v11.2.0.zip",
            "status": "approved"
        }
    ]
}