{
    "id": "crate/cratesio/-/command-group/5.0.1",
    "license": "Apache-2.0 AND MIT AND Apache-2.0 AND MIT",
    "authority": "https://gitlab.eclipse.org/eclipsefdn/emo-team/iplab/-/issues/17793",
    "source": "https://crates.io/api/v1/crates/command-group/5.0.1/download",
    "status": "approved",
    "scans": [
        {
            "date": "December 10, 2024 at 9:46:11 p.m. GMT",
            "authority": "https://gitlab.eclipse.org/eclipsefdn/emo-team/iplab/-/issues/17793",
            "scancode-version": "31.2.1",
            "licenses-discovered": [
                "Apache-2.0 AND MIT",
                "Apache-2.0",
                "MIT"
            ],
            "copyrights": [
                "copyright ./COPYRIGHT docs https://docs.rs/command-group",
                "copyright Matt Green"
            ],
            "file-count": 41,
            "sha256": "a68fa787550392a9d58f44c21a3022cfb3ea3e2458b7f85d3b399d0ceeccf409",
            "source": "https://crates.io/api/v1/crates/command-group/5.0.1/download",
            "status": "approved"
        }
    ]
}