{
    "id": "maven/mavencentral/org.eclipse.dataspaceconnector/ids-spi/0.0.1-20220922.4-20230220.143048-1",
    "license": "Apache-2.0",
    "authority": "https://gitlab.eclipse.org/eclipsefdn/emo-team/iplab/-/issues/7657",
    "source": "https://search.maven.org/remotecontent?filepath=org/eclipse/dataspaceconnector/ids-spi/0.0.1-milestone-6/ids-spi-0.0.1-milestone-6-sources.jar",
    "status": "approved",
    "scans": [
        {
            "date": "March 28, 2023 at 9:40:35 p.m. GMT",
            "authority": "https://gitlab.eclipse.org/eclipsefdn/emo-team/iplab/-/issues/7657",
            "scancode-version": "31.2.1",
            "licenses-discovered": [
                "Apache-2.0"
            ],
            "copyrights": [
                "Copyright (c) 2020 - 2022 Microsoft Corporation",
                "Copyright (c) 2020, 2021 Microsoft Corporation",
                "Copyright (c) 2021 - 2022 Daimler TSS GmbH, Fraunhofer Institute for Software and Systems Engineering",
                "Copyright (c) 2021 Daimler TSS GmbH",
                "Copyright (c) 2021 Fraunhofer Institute for Software and Systems Engineering",
                "Copyright (c) 2021 Microsoft Corporation",
                "Copyright (c) 2022 Bayerische Motoren Werke Aktiengesellschaft"
            ],
            "file-count": 18,
            "sha256": "a26d05617cc65281debfe06883f8a5b6e7113a723c5864609b3d5e2f5a0b2b6a",
            "source": "https://search.maven.org/remotecontent?filepath=org/eclipse/dataspaceconnector/ids-spi/0.0.1-milestone-6/ids-spi-0.0.1-milestone-6-sources.jar",
            "status": "approved"
        }
    ]
}