{
    "id": "go/golang/github.com%2Fgo-playground%2Fvalidator/v10/v10.14.1",
    "license": "MIT",
    "authority": "https://gitlab.eclipse.org/eclipsefdn/emo-team/iplab/-/issues/12028",
    "source": "https://proxy.golang.org/github.com%2Fgo-playground%2Fvalidator/v10/@v/v10.14.1.zip",
    "status": "approved",
    "scans": [
        {
            "date": "December 14, 2023 at 11:07:39 a.m. GMT",
            "authority": "https://gitlab.eclipse.org/eclipsefdn/emo-team/iplab/-/issues/12028",
            "scancode-version": "31.2.1",
            "licenses-discovered": [
                "MIT"
            ],
            "copyrights": [
                "Copyright (c) 2015 Dean Karn"
            ],
            "file-count": 76,
            "sha256": "d7f87bf0679fa5e4157812a5c21fcd163c222fdd166addd539d6d58a6076c69f",
            "source": "https://proxy.golang.org/github.com%2Fgo-playground%2Fvalidator/v10/@v/v10.14.1.zip",
            "status": "approved"
        }
    ]
}