{
    "id": "maven/mavencentral/org.bouncycastle/bcprov-jdk18on/1.73",
    "license": "MIT AND CC0-1.0",
    "authority": "https://gitlab.eclipse.org/eclipsefdn/emo-team/iplab/-/issues/7893",
    "source": "https://search.maven.org/remotecontent?filepath=org/bouncycastle/bcprov-jdk18on/1.73/bcprov-jdk18on-1.73-sources.jar",
    "status": "approved",
    "scans": [
        {
            "date": "April 16, 2023 at 11:09:45 p.m. GMT",
            "authority": "https://gitlab.eclipse.org/eclipsefdn/emo-team/iplab/-/issues/7893",
            "scancode-version": "31.2.1",
            "licenses-discovered": [
                "MIT",
                "CC0-1.0"
            ],
            "copyrights": [
                "(c) ECFieldElement A1",
                "(c) Nat224.isOne",
                "Copyright (c) 2000-2022 The Legion Of The Bouncy Castle Inc. (https://www.bouncycastle.org)",
                "Copyright (c) 2000-2022 The Legion of the Bouncy Castle Inc. (https://www.bouncycastle.org)",
                "Copyright Dr B. R Gladman (gladman@seven77.demon.co.uk) and Sam Simpson (s.simpson@mia.co.uk)"
            ],
            "file-count": 2442,
            "sha256": "a712a9c0b5909501a13506b0b4eb9d89e6def9cd951259c85ad67c2f46280f9c",
            "source": "https://search.maven.org/remotecontent?filepath=org/bouncycastle/bcprov-jdk18on/1.73/bcprov-jdk18on-1.73-sources.jar",
            "status": "approved"
        }
    ]
}