{
    "id": "maven/mavencentral/org.jboss.shrinkwrap.resolver/shrinkwrap-resolver-api-maven-archive/3.3.2",
    "license": "Apache-2.0",
    "authority": "https://gitlab.eclipse.org/eclipsefdn/emo-team/iplab/-/issues/17291",
    "source": "https://repo1.maven.org/maven2/org/jboss/shrinkwrap/resolver/shrinkwrap-resolver-api-maven-archive/3.3.2/shrinkwrap-resolver-api-maven-archive-3.3.2-sources.jar",
    "status": "approved",
    "scans": [
        {
            "date": "November 19, 2024, 12:25:26 p.m. GMT",
            "authority": "https://gitlab.eclipse.org/eclipsefdn/emo-team/iplab/-/issues/17291",
            "scancode-version": "31.2.1",
            "licenses-discovered": [
                "Apache-2.0"
            ],
            "copyrights": [
                "Copyright 2012, Red Hat Middleware LLC, and individual contributors by the authors",
                "Copyright 2013, Red Hat Middleware LLC, and individual contributors by the authors"
            ],
            "file-count": 9,
            "sha256": "8dabbf48b7a8044f9469cdc181eec5ddd198820e5e2f59e4667410c9f6e00f38",
            "source": "https://repo1.maven.org/maven2/org/jboss/shrinkwrap/resolver/shrinkwrap-resolver-api-maven-archive/3.3.2/shrinkwrap-resolver-api-maven-archive-3.3.2-sources.jar",
            "status": "approved"
        }
    ]
}