{
    "id": "maven/mavencentral/io.micrometer/micrometer-registry-cloudwatch2/1.13.4",
    "license": "Apache-2.0",
    "authority": "https://gitlab.eclipse.org/eclipsefdn/emo-team/iplab/-/issues/16441",
    "source": "https://repo1.maven.org/maven2/io/micrometer/micrometer-registry-cloudwatch2/1.13.4/micrometer-registry-cloudwatch2-1.13.4-sources.jar",
    "status": "approved",
    "scans": [
        {
            "date": "September 30, 2024, 11:22:32 p.m. GMT",
            "authority": "https://gitlab.eclipse.org/eclipsefdn/emo-team/iplab/-/issues/16441",
            "scancode-version": "31.2.1",
            "licenses-discovered": [
                "Apache-2.0"
            ],
            "copyrights": [
                "Copyright 2017 VMware, Inc."
            ],
            "file-count": 8,
            "sha256": "466592d04fed96a49091c7af91f889f445a818dec6aa6ebf3eff16e8ea5abd4b",
            "source": "https://repo1.maven.org/maven2/io/micrometer/micrometer-registry-cloudwatch2/1.13.4/micrometer-registry-cloudwatch2-1.13.4-sources.jar",
            "status": "approved"
        }
    ]
}