{
    "id": "npm/npmjs/@ngx-translate/core/11.0.1",
    "license": "MIT",
    "licenses-discovered": [
        "MIT"
    ],
    "copyrights": [
        "Copyright (c) Olivier Combe"
    ],
    "file-count": 38,
    "scancode-version": "30.1.0",
    "authority": "https://gitlab.eclipse.org/eclipsefdn/emo-team/iplab/-/issues/2913",
    "source": "https://github.com/ngx-translate/core/archive/v11.0.1.zip",
    "status": "approved"
}