{
    "id": "maven/mavencentral/org.springframework.data/spring-data-commons/3.2.5",
    "license": "Apache-2.0",
    "authority": "https://gitlab.eclipse.org/eclipsefdn/emo-team/iplab/-/issues/15202",
    "source": "https://repo1.maven.org/maven2/org/springframework/data/spring-data-commons/3.2.5/spring-data-commons-3.2.5-sources.jar",
    "status": "approved",
    "scans": [
        {
            "date": "June 14, 2024 at 10:02:36 a.m. GMT",
            "authority": "https://gitlab.eclipse.org/eclipsefdn/emo-team/iplab/-/issues/15202",
            "scancode-version": "31.2.1",
            "licenses-discovered": [
                "Apache-2.0"
            ],
            "copyrights": [
                "Copyright (c) 2010-2021 Pivotal Software, Inc.",
                "Copyright 2008-2024 the original author or authors",
                "Copyright 2010-2024 the original author or authors",
                "Copyright 2011-2022.2017 the original author or authors",
                "Copyright 2011-2024 the original author or authors",
                "Copyright 2012-2024 the original author or authors",
                "Copyright 2013-2024 the original author or authors",
                "Copyright 2014-2024 the original author or authors",
                "Copyright 2015-2024 the original author or authors",
                "Copyright 2016-2024 the original author or authors",
                "Copyright 2017-2024 the original author or authors",
                "Copyright 2018-2024 the original author or authors",
                "Copyright 2019-2024 the original author or authors",
                "Copyright 2020-2024 the original author or authors",
                "Copyright 2021-2024 the original author or authors",
                "Copyright 2022-2024 the original author or authors",
                "Copyright 2022. the original author or authors",
                "Copyright 2023-2024 the original author or authors",
                "Copyright 2024 the original author or authors"
            ],
            "file-count": 587,
            "sha256": "e3435cf407dbb4726a4321c4bb846040e78a2adc81fa3f53d1f8252030fc13df",
            "source": "https://repo1.maven.org/maven2/org/springframework/data/spring-data-commons/3.2.5/spring-data-commons-3.2.5-sources.jar",
            "status": "approved"
        }
    ]
}