{
    "id": "pypi/pypi/-/debugpy/1.6.7",
    "license": "MIT AND Apache-2.0 AND BSD-3-Clause AND CC0-1.0 AND EPL-1.0 AND Python-2.0 AND MIT-CMU",
    "authority": "https://gitlab.eclipse.org/eclipsefdn/emo-team/iplab/-/issues/15003",
    "source": "https://files.pythonhosted.org/packages/92/d4/437fa53a5a0e5a04d77e12b7eeac1df003e33834f85ddd4513fe2df31e13/debugpy-1.6.7.zip",
    "status": "approved",
    "scans": [
        {
            "date": "May 29, 2024 at 3:25:43 p.m. GMT",
            "authority": "https://gitlab.eclipse.org/eclipsefdn/emo-team/iplab/-/issues/15003",
            "scancode-version": "31.2.1",
            "licenses-discovered": [
                "MIT",
                "EPL-2.0 AND MIT",
                "CC0-1.0",
                "Apache-2.0 AND BSD-3-Clause AND BSD-3-Clause-Clear AND EPL-1.0 AND GPL-2.0-only AND LicenseRef-scancode-intel-bsd AND LicenseRef-scancode-python-cwi AND LicenseRef-scancode-secret-labs-2011 AND MIT AND Python-2.0",
                "Apache-2.0",
                "BSD-2-Clause",
                "BSD-3-Clause"
            ],
            "copyrights": [
                "Copyright (c) 1995-2001 Corporation for National Research Initiatives",
                "Copyright (c) 1999-2002 by Fredrik Lundh",
                "Copyright (c) 1999-2002 by Secret Labs AB",
                "Copyright (c) 2001, 2002, 2003, 2004, 2005, 2006, 2007, 2008, 2009, 2010, 2011, 2012, 2013, 2014, 2015, 2016, 2017 Python Software Foundation",
                "Copyright (c) 2001, Janko Hauser <jhauser@zscout.de>",
                "Copyright (c) 2001, Nathaniel Gray <n8gray@caltech.edu>",
                "Copyright (c) 2001-2007, Fernando Perez. <fernando.perez@colorado.edu>",
                "Copyright (c) 2006-2010 Python Software Foundation",
                "Copyright (c) 2008-2010, IPython Development Team",
                "Copyright (c) 2008-2011 The IPython Development Team",
                "Copyright (c) 2009-2012 Pierre Raybaut",
                "Copyright (c) 2009-2014, Mario Vilas",
                "Copyright (c) 2010-2014 Benjamin Peterson",
                "Copyright (c) 2010-2018 Benjamin Peterson",
                "Copyright (c) 2011 The IPython Development Team",
                "Copyright (c) 2012, Ben Hoyt",
                "Copyright (c) 2012, the IPython Development Team",
                "Copyright (c) 2013 The IPython Development Team",
                "Copyright (c) 2016 Red Hat",
                "Copyright (c) Brainwy software Ltda",
                "Copyright (c) Microsoft Corporation",
                "Copyright (c) Yuli Fitterman",
                "Copyright Brainwy Software Ltda",
                "copyright Brainwy Software Ltda",
                "copyright Brainwy software Ltda",
                "copyright Microsoft Corporation"
            ],
            "file-count": 306,
            "sha256": "c4c2f0810fa25323abfdfa36cbbbb24e5c3b1a42cb762782de64439c575d67f2",
            "source": "https://files.pythonhosted.org/packages/92/d4/437fa53a5a0e5a04d77e12b7eeac1df003e33834f85ddd4513fe2df31e13/debugpy-1.6.7.zip",
            "status": "restricted"
        }
    ]
}