{
    "id": "git/github/Kernel-SU/binder_rs/6627342872bf62ddea05e2d8f98f4fda3120256d",
    "license": "Apache-2.0",
    "authority": "https://gitlab.eclipse.org/eclipsefdn/emo-team/iplab/-/issues/13710",
    "source": "https://github.com/Kernel-SU/binder_rs/archive/6627342872bf62ddea05e2d8f98f4fda3120256d.zip",
    "status": "approved",
    "scans": [
        {
            "date": "March 14, 2024 at 6:12:51 p.m. GMT",
            "authority": "https://gitlab.eclipse.org/eclipsefdn/emo-team/iplab/-/issues/13710",
            "scancode-version": "31.2.1",
            "licenses-discovered": [
                "Apache-2.0"
            ],
            "copyrights": [
                "Copyright (c) 2018 The Android Open Source Project",
                "Copyright (c) 2019 The Android Open Source Project",
                "Copyright (c) 2020 The Android Open Source Project",
                "Copyright (c) 2021 The Android Open Source Project"
            ],
            "file-count": 55,
            "sha256": "c803b426cd99bc1abc5337b3744d1a97b1c1723f79175378a1b754fbd25ad907",
            "source": "https://github.com/Kernel-SU/binder_rs/archive/6627342872bf62ddea05e2d8f98f4fda3120256d.zip",
            "status": "restricted"
        }
    ]
}
