{
    "id": "maven/mavencentral/org.slf4j/slf4j-simple/2.0.9",
    "license": "MIT",
    "authority": "https://gitlab.eclipse.org/eclipsefdn/emo-team/iplab/-/issues/10372",
    "source": "https://repo.maven.apache.org/maven2/org/slf4j/slf4j-simple/2.0.9/slf4j-simple-2.0.9-sources.jar",
    "status": "approved",
    "scans": [
        {
            "date": "September 11, 2023 at 8:03:10 a.m. GMT",
            "authority": "https://gitlab.eclipse.org/eclipsefdn/emo-team/iplab/-/issues/10372",
            "scancode-version": "31.2.1",
            "licenses-discovered": [
                "MIT"
            ],
            "copyrights": [
                "Copyright (c) 2004-2011 QOS.ch",
                "Copyright (c) 2004-2022 QOS.ch Sarl (Switzerland)"
            ],
            "file-count": 10,
            "sha256": "45423388e9fc51af94ac936842211353dbde78c29350d1ed97445ed3e37416cd",
            "source": "https://repo.maven.apache.org/maven2/org/slf4j/slf4j-simple/2.0.9/slf4j-simple-2.0.9-sources.jar",
            "status": "approved"
        }
    ]
}