{
    "id": "go/golang/github.com%2Fcheckpoint-restore%2Fgo-criu/v5/v5.0.0",
    "license": "Apache-2.0",
    "authority": "https://gitlab.eclipse.org/eclipsefdn/emo-team/iplab/-/issues/12284",
    "source": "https://proxy.golang.org/github.com%2Fcheckpoint-restore%2Fgo-criu/v5/@v/v5.0.0.zip",
    "status": "approved",
    "scans": [
        {
            "date": "December 21, 2023 at 3:35:08 a.m. GMT",
            "authority": "https://gitlab.eclipse.org/eclipsefdn/emo-team/iplab/-/issues/12284",
            "scancode-version": "31.2.1",
            "licenses-discovered": [
                "Apache-2.0"
            ],
            "copyrights": [
            ],
            "file-count": 20,
            "sha256": "2c0588503e6b07e6fc339e79f0f2b97986af506fbc6da14fd2c41d4d2a4ec2d3",
            "source": "https://proxy.golang.org/github.com%2Fcheckpoint-restore%2Fgo-criu/v5/@v/v5.0.0.zip",
            "status": "approved"
        }
    ]
}