{
    "id": "maven/mavencentral/org.jboss.errai/errai-marshalling/4.15.0.Final",
    "license": "Apache-2.0",
    "licenses-discovered": [
        "Apache-2.0"
    ],
    "file-count": 145,
    "scancode-version": "30.1.0",
    "authority": "https://gitlab.eclipse.org/eclipsefdn/emo-team/iplab/-/issues/2049",
    "source": "https://search.maven.org/remotecontent?filepath=org/jboss/errai/errai-marshalling/4.15.0.Final/errai-marshalling-4.15.0.Final-sources.jar",
    "status": "approved"
}