{
    "license": "EPL-2.0",
    "file-count": 66,
    "authority": "https://gitlab.eclipse.org/eclipsefdn/emo-team/iplab/-/issues/1218",
    "scancode-version": "21.3.31",
    "licenses-discovered": [
        "EPL-2.0"
    ],
    "id": "maven/mavencentral/org.junit.platform/junit-platform-launcher/1.7.2",
    "source": "https://search.maven.org/remotecontent?filepath=org/junit/platform/junit-platform-launcher/1.7.2/junit-platform-launcher-1.7.2-sources.jar",
    "status": "approved"
}