{
    "id": "crate/cratesio/-/jsonwebtoken/9.1.0",
    "license": "MIT",
    "authority": "https://gitlab.eclipse.org/eclipsefdn/emo-team/iplab/-/issues/11392",
    "source": "https://crates.io/api/v1/crates/jsonwebtoken/9.1.0/download",
    "status": "approved",
    "scans": [
        {
            "date": "November 1, 2023 at 12:28:46 a.m. GMT",
            "authority": "https://gitlab.eclipse.org/eclipsefdn/emo-team/iplab/-/issues/11392",
            "scancode-version": "31.2.1",
            "licenses-discovered": [
                "MIT"
            ],
            "copyrights": [
                "Copyright (c) 2015 Vincent Prouillet"
            ],
            "file-count": 56,
            "sha256": "155c4d7e39ad04c172c5e3a99c434ea3b4a7ba7960b38ecd562b270b097cce09",
            "source": "https://crates.io/api/v1/crates/jsonwebtoken/9.1.0/download",
            "status": "approved"
        }
    ]
}