{
    "id": "maven/mavencentral/org.apache.activemq/artemis-hqclient-protocol/2.31.0",
    "license": "Apache-2.0",
    "authority": "https://gitlab.eclipse.org/eclipsefdn/emo-team/iplab/-/issues/10619",
    "source": "https://repo.maven.apache.org/maven2/org/apache/activemq/artemis-hqclient-protocol/2.31.0/artemis-hqclient-protocol-2.31.0-sources.jar",
    "status": "approved",
    "scans": [
        {
            "date": "September 22, 2023 at 9:04:32 a.m. GMT",
            "authority": "https://gitlab.eclipse.org/eclipsefdn/emo-team/iplab/-/issues/10619",
            "scancode-version": "31.2.1",
            "licenses-discovered": [
                "Apache-2.0"
            ],
            "copyrights": [
            ],
            "file-count": 10,
            "sha256": "c561e335580c684743118b713ab1b2d81578cd3e49ca79f6988fa75158099c79",
            "source": "https://repo.maven.apache.org/maven2/org/apache/activemq/artemis-hqclient-protocol/2.31.0/artemis-hqclient-protocol-2.31.0-sources.jar",
            "status": "approved"
        }
    ]
}