{
    "id": "maven/mavencentral/org.graalvm.js/js/22.3.0",
    "license": "UPL-1.0 AND (UPL-1.0 AND BSD-3-Clause) AND (UPL-1.0 AND GPL-2.0 WITH classpath-exception-2.0) AND (MPL-2.0 AND LicenseRef-MIT-style) AND (UPL-1.0 AND LicenseRef-Public-Domain)",
    "licenses-discovered": [
        "UPL-1.0",
        "LicenseRef-scancode-sunpro AND UPL-1.0",
        "GPL-2.0-only WITH Classpath-exception-2.0 AND UPL-1.0",
        "BSD-3-Clause AND UPL-1.0",
        "LicenseRef-scancode-x11-lucent AND MPL-2.0"
    ],
    "copyrights": [
        "Copyright (c) 1991, 2000, 2001 by Lucent Technologies",
        "Copyright (c) 1993 by Sun Microsystems, Inc.",
        "Copyright (c) 1995, 2006, Oracle and/or its affiliates",
        "Copyright (c) 1998, 2006, 2015, Oracle and/or its affiliates",
        "Copyright (c) 2010, 2018, Oracle and/or its affiliates",
        "Copyright (c) 2010, 2019, Oracle and/or its affiliates",
        "Copyright (c) 2010, 2020, Oracle and/or its affiliates",
        "Copyright (c) 2010, 2022, Oracle and/or its affiliates",
        "Copyright (c) 2014, 2018, Oracle and/or its affiliates",
        "Copyright (c) 2014, 2020, Oracle and/or its affiliates",
        "Copyright (c) 2014, 2021, Oracle and/or its affiliates",
        "Copyright (c) 2014, 2022, Oracle and/or its affiliates",
        "Copyright (c) 2015, 2018, Oracle and/or its affiliates",
        "Copyright (c) 2015, 2022, Oracle and/or its affiliates",
        "Copyright (c) 2016, 2018, Oracle and/or its affiliates",
        "Copyright (c) 2016, 2022, Oracle and/or its affiliates",
        "Copyright (c) 2018, 2018, Oracle and/or its affiliates",
        "Copyright (c) 2018, 2019, Oracle and/or its affiliates",
        "Copyright (c) 2018, 2020, Oracle and/or its affiliates",
        "Copyright (c) 2018, 2021, Oracle and/or its affiliates",
        "Copyright (c) 2018, 2022, Oracle and/or its affiliates",
        "Copyright (c) 2019, 2019, Oracle and/or its affiliates",
        "Copyright (c) 2019, 2020, Oracle and/or its affiliates",
        "Copyright (c) 2019, 2021, Oracle and/or its affiliates",
        "Copyright (c) 2019, 2022, Oracle and/or its affiliates",
        "Copyright (c) 2020, 2020, Oracle and/or its affiliates",
        "Copyright (c) 2020, 2021, Oracle and/or its affiliates",
        "Copyright (c) 2020, 2022, Oracle and/or its affiliates",
        "Copyright (c) 2021, 2021, Oracle and/or its affiliates",
        "Copyright (c) 2021, 2022, Oracle and/or its affiliates",
        "Copyright (c) 2021, Oracle and/or its affiliates",
        "Copyright (c) 2022, 2022, Oracle and/or its affiliates",
        "Copyright (c) 2022, Oracle and/or its affiliates",
        "Copyright 2010 the V8 project authors",
        "Copyright 2011 the V8 project authors"
    ],
    "file-count": 1538,
    "scancode-version": "31.2.1",
    "authority": "https://gitlab.eclipse.org/eclipsefdn/emo-team/iplab/-/issues/4348",
    "source": "https://search.maven.org/remotecontent?filepath=org/graalvm/js/js/22.3.0/js-22.3.0-sources.jar",
    "status": "approved"
}
