{
    "id": "pypi/pypi/-/jsonschema/3.2.0",
    "license": "MIT AND Apache-2.0",
    "licenses-discovered": [
        "MIT",
        "Apache-2.0",
        "JSON"
    ],
    "copyrights": [
        "Copyright (c) 2012 Julian Berman",
        "Copyright (c) 2013 Julian Berman",
        "Copyright (c) Twisted Matrix Laboratories",
        "u'Julian Berman copyright u'2013"
    ],
    "file-count": 352,
    "scancode-version": "31.2.1",
    "authority": "https://gitlab.eclipse.org/eclipsefdn/emo-team/iplab/-/issues/6291",
    "source": "https://files.pythonhosted.org/packages/69/11/a69e2a3c01b324a77d3a7c0570faa372e8448b666300c4117a516f8b1212/jsonschema-3.2.0.tar.gz",
    "status": "approved",
    "scans": [
        {
            "date": "January 12, 2023 at 8:34:53 p.m. GMT",
            "authority": "https://gitlab.eclipse.org/eclipsefdn/emo-team/iplab/-/issues/6291",
            "scancode-version": "31.2.1",
            "licenses-discovered": [
                "MIT",
                "Apache-2.0",
                "JSON"
            ],
            "copyrights": [
                "Copyright (c) 2012 Julian Berman",
                "Copyright (c) 2013 Julian Berman",
                "Copyright (c) Twisted Matrix Laboratories",
                "u'Julian Berman copyright u'2013"
            ],
            "file-count": 352,
            "sha256": "c8a85b28d377cc7737e46e2d9f2b4f44ee3c0e1deac6bf46ddefc7187d30797a",
            "source": "https://files.pythonhosted.org/packages/69/11/a69e2a3c01b324a77d3a7c0570faa372e8448b666300c4117a516f8b1212/jsonschema-3.2.0.tar.gz",
            "status": "restricted"
        }
    ]
}
