{
    "id": "npm/npmjs/@storybook/addon-actions/7.2.1",
    "license": "MIT",
    "authority": "https://gitlab.eclipse.org/eclipsefdn/emo-team/iplab/-/issues/9934",
    "source": "https://github.com/storybookjs/storybook/archive/refs/tags/v7.2.1.zip",
    "status": "approved",
    "scans": [
        {
            "date": "August 11, 2023 at 12:18:46 a.m. GMT",
            "authority": "https://gitlab.eclipse.org/eclipsefdn/emo-team/iplab/-/issues/9934",
            "scancode-version": "31.2.1",
            "licenses-discovered": [
                "GPL-1.0-or-later",
                "MIT",
                "BSD-2-Clause AND ISC AND MIT",
                "OFL-1.1"
            ],
            "copyrights": [
                "(c) (c) (r) (R) (tm)",
                "(c) 2017-present Renaud Tertrais",
                "(c) Unknown J2 V",
                "(c) Unknown Ks",
                "(c) Unknown Wu",
                "(c) Unknown Xs",
                "Copyright (c) 2014-present, Jon Schlinkert",
                "Copyright (c) 2015-present, Facebook, Inc.",
                "Copyright (c) 2015-present, Jon Schlinkert",
                "Copyright (c) 2016 Oxyno-zeta (Havrileck Alexandre)",
                "Copyright (c) 2017 Kadira Inc. <hello@kadira.io>",
                "Copyright 2011-2020 Tilde Inc. and contributors",
                "Copyright 2020 The Rubik Filtered Project",
                "Gt qt (c) Component",
                "Portions Copyright 2006-2011 Strobe Inc.",
                "Portions Copyright 2008-2011 Apple Inc."
            ],
            "file-count": 5616,
            "sha256": "7551413d21f76275b8d7d261ed22eb52cf75571c06b0c90038edbccdd3dadd43",
            "source": "https://github.com/storybookjs/storybook/archive/refs/tags/v7.2.1.zip",
            "status": "restricted"
        }
    ]
}