{
    "id": "maven/mavencentral/org.jboss/jboss-dmr/1.5.1.Final",
    "license": "GPL-2.0-only AND LGPL-2.1-or-later",
    "licenses-discovered": [
        "GPL-2.0-only",
        "LGPL-2.1-or-later"
    ],
    "file-count": 44,
    "scancode-version": "30.1.0",
    "authority": "https://gitlab.eclipse.org/eclipsefdn/emo-team/iplab/-/issues/2052",
    "source": "https://search.maven.org/remotecontent?filepath=org/jboss/jboss-dmr/1.5.1.Final/jboss-dmr-1.5.1.Final-sources.jar",
    "status": "restricted"
}