{
    "id": "maven/mavencentral/net.sf.tweety/plugin/1.17",
    "license": "LGPL-3.0-or-later",
    "authority": "https://gitlab.eclipse.org/eclipsefdn/emo-team/iplab/-/issues/17229",
    "source": "https://repo1.maven.org/maven2/net/sf/tweety/plugin/1.17/plugin-1.17-sources.jar",
    "status": "approved",
    "scans": [
        {
            "date": "November 14, 2024, 8:28:24 p.m. GMT",
            "authority": "https://gitlab.eclipse.org/eclipsefdn/emo-team/iplab/-/issues/17229",
            "scancode-version": "31.2.1",
            "licenses-discovered": [
                "LGPL-3.0-or-later"
            ],
            "copyrights": [
                "Copyright 2016 The TweetyProject Team <http://tweetyproject.org/contact/>"
            ],
            "file-count": 11,
            "sha256": "9b8ad2651ac5b4ff47d0ccbf311952407a39de4c08883165e5dee5ee1d5d45a3",
            "source": "https://repo1.maven.org/maven2/net/sf/tweety/plugin/1.17/plugin-1.17-sources.jar",
            "status": "approved"
        }
    ]
}