{
    "id": "maven/mavencentral/org.openjfx/javafx-graphics/17",
    "license": "GPL-2.0-only WITH Classpath-exception-2.0",
    "authority": "https://gitlab.eclipse.org/eclipsefdn/emo-team/iplab/-/issues/6852",
    "source": "https://search.maven.org/remotecontent?filepath=org/openjfx/javafx-graphics/17/javafx-graphics-17-sources.jar",
    "status": "approved",
    "scans": [
        {
            "date": "January 27, 2023 at 8:51:53 p.m. GMT",
            "authority": "https://gitlab.eclipse.org/eclipsefdn/emo-team/iplab/-/issues/6852",
            "scancode-version": "31.2.1",
            "licenses-discovered": [
                "GPL-2.0-only WITH Classpath-exception-2.0",
                "GPL-2.0-only WITH Classpath-exception-2.0 AND LicenseRef-scancode-proprietary-license"
            ],
            "copyrights": [
                "Copyright (c) 1995, 2013, Oracle and/or its affiliates",
                "Copyright (c) 1996, 2013, Oracle and/or its affiliates",
                "Copyright (c) 1997, 2013, Oracle and/or its affiliates",
                "Copyright (c) 1998, 2013, Oracle and/or its affiliates",
                "Copyright (c) 1998, 2014, Oracle and/or its affiliates",
                "Copyright (c) 1998, 2015, Oracle and/or its affiliates",
                "Copyright (c) 2000, 2013, Oracle and/or its affiliates",
                "Copyright (c) 2000, 2016, Oracle and/or its affiliates",
                "Copyright (c) 2000, 2017, Oracle and/or its affiliates",
                "Copyright (c) 2000, 2018, Oracle and/or its affiliates",
                "Copyright (c) 2000, 2020, Oracle and/or its affiliates",
                "Copyright (c) 2000, 2021, Oracle and/or its affiliates",
                "Copyright (c) 2002, 2013, Oracle and/or its affiliates",
                "Copyright (c) 2002, 2021, Oracle and/or its affiliates",
                "Copyright (c) 2006, 2013, Oracle and/or its affiliates",
                "Copyright (c) 2006, 2016, Oracle and/or its affiliates",
                "Copyright (c) 2007, 2013, Oracle and/or its affiliates",
                "Copyright (c) 2007, 2014, Oracle and/or its affiliates",
                "Copyright (c) 2007, 2018, Oracle and/or its affiliates",
                "Copyright (c) 2007, 2019, Oracle and/or its affiliates",
                "Copyright (c) 2007, 2020, Oracle and/or its affiliates",
                "Copyright (c) 2007, 2021, Oracle and/or its affiliates",
                "Copyright (c) 2008, 2013, Oracle and/or its affiliates",
                "Copyright (c) 2008, 2014, Oracle and/or its affiliates",
                "Copyright (c) 2008, 2015, Oracle and/or its affiliates",
                "Copyright (c) 2008, 2016, Oracle and/or its affiliates",
                "Copyright (c) 2008, 2017, Oracle and/or its affiliates",
                "Copyright (c) 2008, 2018, Oracle and/or its affiliates",
                "Copyright (c) 2008, 2019, Oracle and/or its affiliates",
                "Copyright (c) 2008, 2020, Oracle and/or its affiliates",
                "Copyright (c) 2008, 2021, Oracle and/or its affiliates",
                "Copyright (c) 2009, 2013, Oracle and/or its affiliates",
                "Copyright (c) 2009, 2014, Oracle and/or its affiliates",
                "Copyright (c) 2009, 2015, Oracle and/or its affiliates",
                "Copyright (c) 2009, 2016, Oracle and/or its affiliates",
                "Copyright (c) 2009, 2017, Oracle and/or its affiliates",
                "Copyright (c) 2009, 2018, Oracle and/or its affiliates",
                "Copyright (c) 2009, 2019, Oracle and/or its affiliates",
                "Copyright (c) 2009, 2020, Oracle and/or its affiliates",
                "Copyright (c) 2009, 2021, Oracle and/or its affiliates",
                "Copyright (c) 2010, 2013, Oracle and/or its affiliates",
                "Copyright (c) 2010, 2014, Oracle and/or its affiliates",
                "Copyright (c) 2010, 2015, Oracle and/or its affiliates",
                "Copyright (c) 2010, 2016, Oracle and/or its affiliates",
                "Copyright (c) 2010, 2017, Oracle and/or its affiliates",
                "Copyright (c) 2010, 2018, Oracle and/or its affiliates",
                "Copyright (c) 2010, 2019, Oracle and/or its affiliates",
                "Copyright (c) 2010, 2020, Oracle and/or its affiliates",
                "Copyright (c) 2010, 2021, Oracle and/or its affiliates",
                "Copyright (c) 2011, 2013, Oracle and/or its affiliates",
                "Copyright (c) 2011, 2014, Oracle and/or its affiliates",
                "Copyright (c) 2011, 2015, Oracle and/or its affiliates",
                "Copyright (c) 2011, 2016, Oracle and/or its affiliates",
                "Copyright (c) 2011, 2017, Oracle and/or its affiliates",
                "Copyright (c) 2011, 2018, Oracle and/or its affiliates",
                "Copyright (c) 2011, 2019, Oracle and/or its affiliates",
                "Copyright (c) 2011, 2020, Oracle and/or its affiliates",
                "Copyright (c) 2011, 2021, Oracle and/or its affiliates",
                "Copyright (c) 2012, 2013, Oracle and/or its affiliates",
                "Copyright (c) 2012, 2014, Oracle and/or its affiliates",
                "Copyright (c) 2012, 2015, Oracle and/or its affiliates",
                "Copyright (c) 2012, 2016, Oracle and/or its affiliates",
                "Copyright (c) 2012, 2017, Oracle and/or its affiliates",
                "Copyright (c) 2012, 2018, Oracle and/or its affiliates",
                "Copyright (c) 2012, 2019, Oracle and/or its affiliates",
                "Copyright (c) 2012, 2020, Oracle and/or its affiliates",
                "Copyright (c) 2012, 2021, Oracle and/or its affiliates",
                "Copyright (c) 2013, 2014, Oracle and/or its affiliates",
                "Copyright (c) 2013, 2015, Oracle and/or its affiliates",
                "Copyright (c) 2013, 2016, Oracle and/or its affiliates",
                "Copyright (c) 2013, 2017, Oracle and/or its affiliates",
                "Copyright (c) 2013, 2018, Oracle and/or its affiliates",
                "Copyright (c) 2013, 2019, Oracle and/or its affiliates",
                "Copyright (c) 2013, 2020, Oracle and/or its affiliates",
                "Copyright (c) 2013, 2021, Oracle and/or its affiliates",
                "Copyright (c) 2013, Oracle and/or its affiliates",
                "Copyright (c) 2014, 2015, Oracle and/or its affiliates",
                "Copyright (c) 2014, 2017, Oracle and/or its affiliates",
                "Copyright (c) 2014, 2018, Oracle and/or its affiliates",
                "Copyright (c) 2014, 2020, Oracle and/or its affiliates",
                "Copyright (c) 2014, 2021, Oracle and/or its affiliates",
                "Copyright (c) 2014, Oracle and/or its affiliates",
                "Copyright (c) 2015, 2016, Oracle and/or its affiliates",
                "Copyright (c) 2015, 2017, Oracle and/or its affiliates",
                "Copyright (c) 2015, 2018, Oracle and/or its affiliates",
                "Copyright (c) 2015, 2020, Oracle and/or its affiliates",
                "Copyright (c) 2015, 2021, Oracle and/or its affiliates",
                "Copyright (c) 2015, Oracle and/or its affiliates",
                "Copyright (c) 2016, 2018, Oracle and/or its affiliates",
                "Copyright (c) 2016, 2020, Oracle and/or its affiliates",
                "Copyright (c) 2016, 2021, Oracle and/or its affiliates",
                "Copyright (c) 2016, Oracle and/or its affiliates",
                "Copyright (c) 2017, 2021, Oracle and/or its affiliates",
                "Copyright (c) 2017, Oracle and/or its affiliates",
                "Copyright (c) 2019, 2020, Oracle and/or its affiliates",
                "Copyright (c) 2019, 2021, Oracle and/or its affiliates",
                "Copyright (c) 2019, Oracle and/or its affiliates",
                "Copyright (c) 2020, 2021, Oracle and/or its affiliates",
                "Copyright (c) 2020, Oracle and/or its affiliates",
                "Copyright (c) 2021, Oracle and/or its affiliates"
            ],
            "file-count": 1422,
            "sha256": "645b04aad77b0630559741be46bd4d3db837fd8a6a21518c019a30d54fad2295",
            "source": "https://search.maven.org/remotecontent?filepath=org/openjfx/javafx-graphics/17/javafx-graphics-17-sources.jar",
            "status": "restricted"
        }
    ]
}
