{
    "id": "p2/orbit/p2.eclipse.plugin/org.apache.batik.util/1.15.0.v20221018-0736",
    "license": "Apache-2.0",
    "licenses-discovered": [
        "Apache-2.0"
    ],
    "copyrights": [
    ],
    "file-count": 60,
    "scancode-version": "31.2.1",
    "authority": "https://gitlab.eclipse.org/eclipsefdn/emo-team/iplab/-/issues/3797",
    "source": "https://search.maven.org/remotecontent?filepath=org/apache/xmlgraphics/batik-util/1.15/batik-util-1.15-sources.jar",
    "status": "approved"
}