{
    "license": "LGPL-2.0-or-later AND MIT",
    "file-count": 320,
    "authority": "https://gitlab.eclipse.org/eclipsefdn/emo-team/iplab/-/issues/1005",
    "scancode-version": "21.3.31",
    "licenses-discovered": [
        "MIT",
        "LGPL-2.0-or-later"
    ],
    "id": "npm/npmjs/-/jsdom/9.12.0",
    "source": "https://registry.npmjs.org/jsdom/-/jsdom-9.12.0.tgz",
    "status": "restricted",
    "workswith": [
        "iot.streamsheets"
    ]
}
