{
    "id": "maven/mavencentral/org.codelibs.elasticsearch.module/repository-url/7.15.2",
    "license": "Elastic-2.0 OR SSPL-1.0",
    "authority": "https://gitlab.eclipse.org/eclipsefdn/emo-team/iplab/-/issues/6417",
    "source": "https://maven.codelibs.org/org/codelibs/elasticsearch/module/repository-url/7.15.2/repository-url-7.15.2-sources.jar",
    "status": "approved",
    "scans": [
        {
            "date": "February 1, 2023 at 5:10:43 a.m. GMT",
            "authority": "https://gitlab.eclipse.org/eclipsefdn/emo-team/iplab/-/issues/6417",
            "scancode-version": "31.2.1",
            "licenses-discovered": [
                "Elastic-2.0 AND SSPL-1.0"
            ],
            "copyrights": [
                "Copyright Elasticsearch B.V."
            ],
            "file-count": 13,
            "sha256": "9a19e470fe7302a1244de2acb7339952313ad01e6adfed3720b78b86c8f3323a",
            "source": "https://maven.codelibs.org/org/codelibs/elasticsearch/module/repository-url/7.15.2/repository-url-7.15.2-sources.jar",
            "status": "approved"
        }
    ]
}
