{
    "license": "LGPL-2.1-only AND LGPL-2.1-or-later AND LGPL-2.0-or-later",
    "file-count": 29,
    "authority": "https://gitlab.eclipse.org/eclipsefdn/emo-team/iplab/-/issues/4732",
    "scancode-version": "30.1.0",
    "licenses-discovered": [
        "LGPL-2.1-only",
        "LGPL-2.0-or-later",
        "LGPL-2.1-or-later"
    ],
    "id": "pypi/pypi/-/pydbus/0.6.0",
    "source": "https://files.pythonhosted.org/packages/58/56/3e84f2c1f2e39b9ea132460183f123af41e3b9c8befe222a35636baa6a5a/pydbus-0.6.0.tar.gz",
    "status": "restricted",
    "scans": [
        {
            "date": "November 10, 2022 at 9:20:31 p.m. GMT",
            "authority": "https://gitlab.eclipse.org/eclipsefdn/emo-team/iplab/-/issues/4732",
            "scancode-version": "31.2.1",
            "licenses-discovered": [
                "LGPL-2.1-only",
                "LGPL-2.1-or-later",
                "LGPL-2.0-or-later"
            ],
            "copyrights": [
                "Copyright (c) 1991, 1999 Free Software Foundation, Inc.",
                "Copyright (c) 2014, 2015, 2016 Linus Lewandowski <linus@lew21.net>",
                "copyrighted by the Free Software Foundation"
            ],
            "file-count": 29,
            "sha256": "4207162eff54223822c185da06c1ba8a34137a9602f3da5a528eedf3f78d0f2c",
            "source": "https://files.pythonhosted.org/packages/58/56/3e84f2c1f2e39b9ea132460183f123af41e3b9c8befe222a35636baa6a5a/pydbus-0.6.0.tar.gz",
            "status": "restricted"
        }
    ]
}