{
    "id": "maven/mavencentral/org.apache.jena/jena-base/5.0.0",
    "license": "Apache-2.0",
    "authority": "https://gitlab.eclipse.org/eclipsefdn/emo-team/iplab/-/issues/15685",
    "source": "https://repo1.maven.org/maven2/org/apache/jena/jena-base/5.0.0/jena-base-5.0.0-sources.jar",
    "status": "approved",
    "scans": [
        {
            "date": "July 11, 2024 at 8:12:37 a.m. GMT",
            "authority": "https://gitlab.eclipse.org/eclipsefdn/emo-team/iplab/-/issues/15685",
            "scancode-version": "31.2.1",
            "licenses-discovered": [
                "Apache-2.0"
            ],
            "copyrights": [
            ],
            "file-count": 166,
            "sha256": "df2e9aab5dfe6e68fe720e6a69dd9bce0e2f02a3872e80c953487912d7d3840d",
            "source": "https://repo1.maven.org/maven2/org/apache/jena/jena-base/5.0.0/jena-base-5.0.0-sources.jar",
            "status": "approved"
        }
    ]
}