{
    "id": "p2/orbit/p2.eclipse.plugin/org.commonmark-ins/0.22.0.v20240316-0700",
    "license": "BSD-2-Clause",
    "authority": "https://gitlab.eclipse.org/eclipsefdn/emo-team/iplab/-/issues/13798",
    "source": "https://repo1.maven.org/maven2/org/commonmark/commonmark-ext-ins/0.22.0/commonmark-ext-ins-0.22.0-sources.jar",
    "status": "approved",
    "scans": [
        {
            "date": "March 16, 2024 at 7:28:53 a.m. GMT",
            "authority": "https://gitlab.eclipse.org/eclipsefdn/emo-team/iplab/-/issues/13798",
            "scancode-version": "31.2.1",
            "licenses-discovered": [
                "BSD-2-Clause"
            ],
            "copyrights": [
                "Copyright (c) 2015, Atlassian Pty Ltd"
            ],
            "file-count": 12,
            "sha256": "bc4efbc80323430861ed7377601f6a84b01fdead9a468e000c487f6ded02f8e4",
            "source": "https://repo1.maven.org/maven2/org/commonmark/commonmark-ext-ins/0.22.0/commonmark-ext-ins-0.22.0-sources.jar",
            "status": "approved"
        }
    ]
}