{
    "id": "npm/npmjs/@rollup/plugin-typescript/8.3.1",
    "license": "MIT AND 0BSD",
    "licenses-discovered": [
        "MIT",
        "0BSD"
    ],
    "copyrights": [
        "Copyright (c) Microsoft Corporation"
    ],
    "file-count": 6,
    "scancode-version": "30.1.0",
    "authority": "https://gitlab.eclipse.org/eclipsefdn/emo-team/iplab/-/issues/3005",
    "source": "https://registry.npmjs.org/@rollup/plugin-typescript/-/plugin-typescript-8.3.1.tgz",
    "status": "approved"
}