{
    "id": "npm/npmjs/-/sax/1.4.1",
    "license": "ISC AND MIT AND ISC",
    "authority": "https://gitlab.eclipse.org/eclipsefdn/emo-team/iplab/-/issues/14888",
    "source": "https://github.com/isaacs/sax-js/archive/refs/tags/v1.4.1.zip",
    "status": "approved",
    "scans": [
        {
            "date": "May 28, 2024 at 6:45:31 a.m. GMT",
            "authority": "https://gitlab.eclipse.org/eclipsefdn/emo-team/iplab/-/issues/14888",
            "scancode-version": "31.2.1",
            "licenses-discovered": [
                "ISC AND MIT",
                "ISC"
            ],
            "copyrights": [
                "Copyright (c) 2010-2024 Isaac Z. Schlueter and Contributors",
                "Copyright (c) 2010-2024 Mathias Bynens <https://mathiasbynens.be/>"
            ],
            "file-count": 83,
            "sha256": "bef8c69c9de54fc1d9e6025cfce8185eff9651ab1d26ff983f9e31433dcac1d8",
            "source": "https://github.com/isaacs/sax-js/archive/refs/tags/v1.4.1.zip",
            "status": "approved"
        }
    ]
}