{
    "id": "p2/orbit/p2.eclipse.plugin/org.apache.batik.dom/1.17.0.v20230917-1000",
    "license": "Apache-2.0 AND W3C",
    "authority": "https://gitlab.eclipse.org/eclipsefdn/emo-team/iplab/-/issues/10541",
    "source": "https://repo.maven.apache.org/maven2/org/apache/xmlgraphics/batik-dom/1.17/batik-dom-1.17-sources.jar",
    "status": "approved",
    "scans": [
        {
            "date": "September 17, 2023 at 3:26:35 p.m. GMT",
            "authority": "https://gitlab.eclipse.org/eclipsefdn/emo-team/iplab/-/issues/10541",
            "scancode-version": "31.2.1",
            "licenses-discovered": [
                "Apache-2.0",
                "W3C"
            ],
            "copyrights": [
                "Copyright (c) 2005 World Wide Web Consortium"
            ],
            "file-count": 84,
            "sha256": "6c256cb98895f45087f2e0ca2a42525da0ab03c3a5164d37c751010cb69c2cda",
            "source": "https://repo.maven.apache.org/maven2/org/apache/xmlgraphics/batik-dom/1.17/batik-dom-1.17-sources.jar",
            "status": "approved"
        }
    ]
}