{
    "id": "maven/mavencentral/org.geckoprojects.emf/org.gecko.emf.osgi.component/6.2.0",
    "license": "EPL-2.0 AND EPL-1.0",
    "authority": "https://gitlab.eclipse.org/eclipsefdn/emo-team/iplab/-/issues/15752",
    "source": "https://repo1.maven.org/maven2/org/geckoprojects/emf/org.gecko.emf.osgi.component/6.2.0/org.gecko.emf.osgi.component-6.2.0-sources.jar",
    "status": "approved",
    "scans": [
        {
            "date": "July 23, 2024 at 3:26:49 p.m. GMT",
            "authority": "https://gitlab.eclipse.org/eclipsefdn/emo-team/iplab/-/issues/15752",
            "scancode-version": "31.2.1",
            "licenses-discovered": [
                "EPL-2.0",
                "EPL-1.0"
            ],
            "copyrights": [
                "Copyright (c) 2012 - 2022 Data In Motion and others",
                "Copyright (c) 2012 - 2023 Data In Motion and others",
                "Copyright (c) 2012 - 2024 Data In Motion and others"
            ],
            "file-count": 65,
            "sha256": "70089d0ca946febdbb6362f51df498a7454e13818b7fccd27ff839f4a93048ca",
            "source": "https://repo1.maven.org/maven2/org/geckoprojects/emf/org.gecko.emf.osgi.component/6.2.0/org.gecko.emf.osgi.component-6.2.0-sources.jar",
            "status": "approved"
        }
    ]
}