{
    "id": "crate/cratesio/-/watchexec-supervisor/1.0.3",
    "license": "Apache-2.0 AND MIT AND Apache-2.0",
    "authority": "https://gitlab.eclipse.org/eclipsefdn/emo-team/iplab/-/issues/17809",
    "source": "https://crates.io/api/v1/crates/watchexec-supervisor/1.0.3/download",
    "status": "approved",
    "scans": [
        {
            "date": "December 10, 2024 at 10:03:27 p.m. GMT",
            "authority": "https://gitlab.eclipse.org/eclipsefdn/emo-team/iplab/-/issues/17809",
            "scancode-version": "31.2.1",
            "licenses-discovered": [
                "Apache-2.0 AND MIT",
                "Apache-2.0"
            ],
            "copyrights": [
            ],
            "file-count": 21,
            "sha256": "6214815382a9cadf1f0e521e3c28ae4e02541b96622d0e78053f03b730a1437f",
            "source": "https://crates.io/api/v1/crates/watchexec-supervisor/1.0.3/download",
            "status": "approved"
        }
    ]
}