{
    "id": "maven/mavencentral/org.tallison/metadata-extractor/2.17.1.0",
    "license": "Apache-2.0",
    "authority": "https://gitlab.eclipse.org/eclipsefdn/emo-team/iplab/-/issues/5244",
    "source": "https://search.maven.org/remotecontent?filepath=org/tallison/metadata-extractor/2.17.1.0/metadata-extractor-2.17.1.0-sources.jar",
    "status": "approved",
    "scans": [
        {
            "date": "November 29, 2022 at 5:14:19 p.m. GMT",
            "authority": "https://gitlab.eclipse.org/eclipsefdn/emo-team/iplab/-/issues/5244",
            "scancode-version": "31.2.1",
            "licenses-discovered": [
                "Apache-2.0",
                "Apache-2.0 AND LicenseRef-scancode-proprietary-license"
            ],
            "copyrights": [
                "Copyright (c) 1999 - 2007, Adobe Systems Incorporated",
                "Copyright (c) 2002-2020 Drew Noakes",
                "Copyright 2002-2011 Andreas Ziermann",
                "Copyright 2002-2015 Drew Noakes",
                "Copyright 2002-2019 Drew Noakes and contributors",
                "Copyright 2002-2020 Drew Noakes and contributors",
                "StuffIt (c) 1997"
            ],
            "file-count": 419,
            "sha256": "46f0221b752ef08b6a2c81dbebc18085901983920b7e5d8f60f4e5d65b68134e",
            "source": "https://search.maven.org/remotecontent?filepath=org/tallison/metadata-extractor/2.17.1.0/metadata-extractor-2.17.1.0-sources.jar",
            "status": "restricted"
        }
    ]
}
