{
    "id": "maven/mavencentral/org.dashbuilder/dashbuilder-dataset-editor/7.63.0-20211207.170754-15",
    "license": "Apache-2.0",
    "licenses-discovered": [
        "Apache-2.0"
    ],
    "copyrights": [
        "Copyright Red Hat, Inc. and/or its affiliates"
    ],
    "file-count": 30,
    "scancode-version": "30.1.0",
    "authority": "https://gitlab.eclipse.org/eclipsefdn/emo-team/iplab/-/issues/2818",
    "source": "https://search.maven.org/remotecontent?filepath=org/dashbuilder/dashbuilder-dataset-editor/7.63.0.Final/dashbuilder-dataset-editor-7.63.0.Final-sources.jar",
    "status": "approved"
}