{
    "id": "go/golang/github.com%2Faws%2Faws-sdk-go-v2/credentials/v1.3.0",
    "license": "Apache-2.0",
    "authority": "https://gitlab.eclipse.org/eclipsefdn/emo-team/iplab/-/issues/12341",
    "source": "https://proxy.golang.org/github.com%2Faws%2Faws-sdk-go-v2/credentials/@v/v1.3.0.zip",
    "status": "approved",
    "scans": [
        {
            "date": "December 20, 2023 at 2:04:53 p.m. GMT",
            "authority": "https://gitlab.eclipse.org/eclipsefdn/emo-team/iplab/-/issues/12341",
            "scancode-version": "31.2.1",
            "licenses-discovered": [
                "Apache-2.0"
            ],
            "copyrights": [
            ],
            "file-count": 38,
            "sha256": "a9e9be689c8c82444141fbd69b2ae73a9335839c3493426765ca31952ad816cd",
            "source": "https://proxy.golang.org/github.com%2Faws%2Faws-sdk-go-v2/credentials/@v/v1.3.0.zip",
            "status": "approved"
        }
    ]
}