{
    "id": "maven/mavencentral/org.webjars.npm/d3-drag/2.0.0-rc.1",
    "license": "BSD-3-Clause",
    "authority": "https://gitlab.eclipse.org/eclipsefdn/emo-team/iplab/-/issues/6818",
    "source": "https://search.maven.org/remotecontent?filepath=org/webjars/npm/d3-drag/2.0.0-rc.1/d3-drag-2.0.0-rc.1-sources.jar",
    "status": "approved",
    "scans": [
        {
            "date": "January 27, 2023 at 9:22:44 p.m. GMT",
            "authority": "https://gitlab.eclipse.org/eclipsefdn/emo-team/iplab/-/issues/6818",
            "scancode-version": "31.2.1",
            "licenses-discovered": [
            ],
            "copyrights": [
            ],
            "file-count": 0,
            "sha256": "8739c76e681f900923b900c9df0ef75cf421d39cabb54650c4b9ad19b6a76d85",
            "source": "https://search.maven.org/remotecontent?filepath=org/webjars/npm/d3-drag/2.0.0-rc.1/d3-drag-2.0.0-rc.1-sources.jar",
            "status": "restricted"
        }
    ]
}
