{
    "id": "npm/npmjs/-/js-tokens/4.0.0",
    "license": "MIT",
    "licenses-discovered": [
        "LicenseRef-scancode-unknown-license-reference AND MIT",
        "MIT"
    ],
    "file-count": 19,
    "scancode-version": "30.1.0",
    "authority": "https://gitlab.eclipse.org/eclipsefdn/emo-team/iplab/-/issues/2401",
    "source": "https://github.com/lydell/js-tokens/archive/v4.0.0.zip",
    "status": "approved"
}
