{
    "id": "npm/npmjs/@vue/language-service/1.7.0",
    "license": "MIT",
    "authority": "https://gitlab.eclipse.org/eclipsefdn/emo-team/iplab/-/issues/8785",
    "source": "https://github.com/vuejs/language-tools/archive/refs/tags/v1.7.0.zip",
    "status": "approved",
    "scans": [
        {
            "date": "June 11, 2023 at 11:17:58 p.m. GMT",
            "authority": "https://gitlab.eclipse.org/eclipsefdn/emo-team/iplab/-/issues/8785",
            "scancode-version": "31.2.1",
            "licenses-discovered": [
                "MIT"
            ],
            "copyrights": [
                "Copyright (c) 2021-present Johnson Chu",
                "Copyright (c) 2023-present Johnson Chu"
            ],
            "file-count": 361,
            "sha256": "eeae96ad06f005527cc623247812bd342dc1c8205d7bcba245a423c164b2df00",
            "source": "https://github.com/vuejs/language-tools/archive/refs/tags/v1.7.0.zip",
            "status": "approved"
        }
    ]
}