{
    "id": "go/golang/google.golang.org/protobuf/v1.30.0",
    "license": "BSD-3-Clause",
    "authority": "https://gitlab.eclipse.org/eclipsefdn/emo-team/iplab/-/issues/11076",
    "source": "https://proxy.golang.org/google.golang.org/protobuf/@v/v1.30.0.zip",
    "status": "approved",
    "scans": [
        {
            "date": "October 16, 2023 at 9:37:15 a.m. GMT",
            "authority": "https://gitlab.eclipse.org/eclipsefdn/emo-team/iplab/-/issues/11076",
            "scancode-version": "31.2.1",
            "licenses-discovered": [
                "BSD-3-Clause"
            ],
            "copyrights": [
                "Copyright (c) 2018 The Go Authors",
                "Copyright 2008 Google Inc.",
                "Copyright 2018 The Go Authors",
                "Copyright 2019 The Go Authors",
                "Copyright 2020 The Go Authors",
                "Copyright 2021 The Go Authors",
                "Copyright 2022 The Go Authors",
                "Copyright 2023 The Go Authors",
                "Copyright d d d d Google Inc",
                "Copyright d d d d The Go Authors"
            ],
            "file-count": 445,
            "sha256": "8fb83b4d6e898c75a8d305dd46d46bb975d0a7ebab1e0042acdf25e3273d50e4",
            "source": "https://proxy.golang.org/google.golang.org/protobuf/@v/v1.30.0.zip",
            "status": "approved"
        }
    ]
}