{
    "id": "npm/npmjs/-/update-browserslist-db/1.0.11",
    "license": "MIT",
    "authority": "https://gitlab.eclipse.org/eclipsefdn/emo-team/iplab/-/issues/8237",
    "source": "https://registry.yarnpkg.com/update-browserslist-db/-/update-browserslist-db-1.0.11.tgz",
    "status": "approved",
    "scans": [
        {
            "date": "May 4, 2023 at 11:40:10 p.m. GMT",
            "authority": "https://gitlab.eclipse.org/eclipsefdn/emo-team/iplab/-/issues/8237",
            "scancode-version": "31.2.1",
            "licenses-discovered": [
                "MIT"
            ],
            "copyrights": [
                "Copyright 2022 Andrey Sitnik <andrey@sitnik.ru> and other contributors"
            ],
            "file-count": 8,
            "sha256": "d9f1e6c00bbda45f4401ec8dcb081587978ddd8de85add2e2c0affbdc535d6f5",
            "source": "https://registry.yarnpkg.com/update-browserslist-db/-/update-browserslist-db-1.0.11.tgz",
            "status": "approved"
        }
    ]
}