{
    "id": "npm/npmjs/-/firefox-debugadapter/2.11.0",
    "license": "MIT",
    "authority": "https://gitlab.eclipse.org/eclipsefdn/emo-team/iplab/-/issues/17831",
    "source": "https://registry.yarnpkg.com/firefox-debugadapter/-/firefox-debugadapter-2.11.0.tgz",
    "status": "approved",
    "scans": [
        {
            "date": "December 12, 2024 at 3:46:25 p.m. GMT",
            "authority": "https://gitlab.eclipse.org/eclipsefdn/emo-team/iplab/-/issues/17831",
            "scancode-version": "31.2.1",
            "licenses-discovered": [
                "MIT"
            ],
            "copyrights": [
                "(c) 2014-2023 Denis Pushkarev",
                "Copyright (c) 2015-2017 Holger Benl <hbenl@evandor.de>"
            ],
            "file-count": 8,
            "sha256": "47f2771a36f993c1e5400dce33abe047b44185f0c1e44d1670fdb321ad696f14",
            "source": "https://registry.yarnpkg.com/firefox-debugadapter/-/firefox-debugadapter-2.11.0.tgz",
            "status": "approved"
        }
    ]
}