{
    "id": "npm/npmjs/-/eslint-utils/3.0.0",
    "license": "MIT",
    "licenses-discovered": [
        "MIT",
        "LicenseRef-scancode-unknown-license-reference"
    ],
    "file-count": 47,
    "scancode-version": "30.1.0",
    "authority": "https://gitlab.eclipse.org/eclipsefdn/emo-team/iplab/-/issues/2431",
    "source": "https://github.com/mysticatea/eslint-utils/archive/v3.0.0.zip",
    "status": "approved"
}
