{
    "id": "npm/npmjs/-/rc-tabs/14.0.0",
    "license": "MIT",
    "authority": "https://gitlab.eclipse.org/eclipsefdn/emo-team/iplab/-/issues/12763",
    "source": "https://registry.yarnpkg.com/rc-tabs/-/rc-tabs-14.0.0.tgz",
    "status": "approved",
    "scans": [
        {
            "date": "January 12, 2024 at 11:06:09 a.m. GMT",
            "authority": "https://gitlab.eclipse.org/eclipsefdn/emo-team/iplab/-/issues/12763",
            "scancode-version": "31.2.1",
            "licenses-discovered": [
                "MIT"
            ],
            "copyrights": [
                "Copyright (c) 2014-present yiminghe"
            ],
            "file-count": 84,
            "sha256": "175d63308c3c4071153211288605c67fcd55aafd399eb538a66bb0a19dd13d7f",
            "source": "https://registry.yarnpkg.com/rc-tabs/-/rc-tabs-14.0.0.tgz",
            "status": "approved"
        }
    ]
}