{
    "license": "MIT",
    "file-count": 258,
    "authority": "https://gitlab.eclipse.org/eclipsefdn/emo-team/iplab/-/issues/1104",
    "scancode-version": "21.3.31",
    "licenses-discovered": [
        "MIT"
    ],
    "id": "npm/npmjs/-/eslint-plugin-react/7.11.1",
    "source": "https://github.com/yannickcr/eslint-plugin-react/archive/v7.11.1.zip",
    "status": "approved"
}