{
    "id": "project/automotive.ambientlight/-/initialcontibution/0.0",
    "license": "Apache-2.0 AND (CC-BY-3.0 AND CC-BY-4.0 AND CC0-1.0) AND (CC-BY-4.0 AND MIT AND OFL-1.1) AND CC0-1.0 AND MIT",
    "authority": "https://gitlab.eclipse.org/eclipsefdn/emo-team/iplab/-/issues/5375",
    "source": "https://gitlab.eclipse.org/eclipse/ambientlight/ambient-light-services/-/archive/main/ambient-light-services-main.zip",
    "status": "approved",
    "scans": [
        {
            "date": "December 6, 2022 at 3:51:02 p.m. GMT",
            "authority": "https://gitlab.eclipse.org/eclipsefdn/emo-team/iplab/-/issues/5375",
            "scancode-version": "31.2.1",
            "licenses-discovered": [
                "Apache-2.0",
                "LicenseRef-scancode-commercial-license",
                "MIT",
                "CC-BY-4.0 AND MIT AND OFL-1.1",
                "CC-BY-4.0 AND CC0-1.0 AND MIT AND OFL-1.1",
                "CC0-1.0",
                "CC-BY-3.0 AND CC-BY-4.0 AND CC0-1.0 AND LicenseRef-scancode-proprietary-license"
            ],
            "copyrights": [
                "(c) 2016 Jaguar Land Rover",
                "(c) 2019 Denis Pushkarev",
                "(c) 2020 T-Systems",
                "(c) JS Foundation and other contributors",
                "Copyright (c) 2016 Federico Zivolo and contributors",
                "Copyright (c) 2019 - 2022 T-Systems International GmbH",
                "Copyright (c) 2020, Dmitrii Fedotov, T-Systems RUS",
                "Copyright (c) Federico Zivolo 2019",
                "Copyright (c) Font Awesome",
                "Copyright (c) Font Awesome Font Awesome",
                "Copyright 2011-2020 The Bootstrap Authors",
                "Copyright 2011-2020 The Bootstrap Authors (https://github.com/twbs/bootstrap/graphs/contributors)",
                "Copyright 2011-2020 Twitter, Inc.",
                "copyright (c) 2019 Denis Pushkarev",
                "copyright 2014 Waybury. https://useiconic.com/open"
            ],
            "file-count": 2078,
            "sha256": "ac8654fd3ccfbbd7b37643f169dc68b502bb6f3ad030c59999229304b87cb098",
            "source": "https://gitlab.eclipse.org/eclipse/ambientlight/ambient-light-services/-/archive/main/ambient-light-services-main.zip",
            "status": "restricted"
        }
    ]
}
