{
    "id": "nuget/nuget/-/MailKit/4.6.0",
    "license": "MIT AND LicenseRef-scancode-ietf AND LicenseRef-scancode-ietf-trust AND (BSD-3-Clause AND LicenseRef-scancode-ietf-trust)",
    "authority": "https://gitlab.eclipse.org/eclipsefdn/emo-team/iplab/-/issues/15672",
    "source": "https://github.com/jstedfast/MailKit/archive/refs/tags/4.6.0.zip",
    "status": "approved",
    "scans": [
        {
            "date": "July 9, 2024 at 11:25:10 p.m. GMT",
            "authority": "https://gitlab.eclipse.org/eclipsefdn/emo-team/iplab/-/issues/15672",
            "scancode-version": "31.2.1",
            "licenses-discovered": [
                "MIT",
                "AML",
                "LicenseRef-scancode-proprietary-license",
                "LicenseRef-scancode-ietf",
                "LicenseRef-scancode-ietf-trust",
                "BSD-3-Clause AND LicenseRef-scancode-ietf-trust"
            ],
            "copyrights": [
                "Copyright (c) 2003 Motus Technologies Inc. (http://www.motus.com)",
                "Copyright (c) 2004-2005, 2010 Novell, Inc (http://www.novell.com)",
                "Copyright (c) 2009 IETF Trust and the persons identified as the document authors",
                "Copyright (c) 2010 IETF Trust and the persons identified as the document authors",
                "Copyright (c) 2011 IETF Trust and the persons identified as the document authors",
                "Copyright (c) 2012 IETF Trust and the persons identified as the document authors",
                "Copyright (c) 2013 IETF Trust and the persons identified as the document authors",
                "Copyright (c) 2013-2017 .NET Foundation and Contributors",
                "Copyright (c) 2013-2019 Xamarin Inc. (www.xamarin.com)",
                "Copyright (c) 2013-2020 .NET Foundation and Contributors",
                "Copyright (c) 2013-2022 Jeffrey Stedfast",
                "Copyright (c) 2013-2023 .NET Foundation and Contributors",
                "Copyright (c) 2013-2024 .NET Foundation and Contributors",
                "Copyright (c) 2013-2024 Xamarin Inc. (www.xamarin.com)",
                "Copyright (c) 2014 IETF Trust and the persons identified as the document authors",
                "Copyright (c) 2014-2022 Jeffrey Stedfast",
                "Copyright (c) 2014-2024 Jeffrey Stedfast",
                "Copyright (c) 2015 IETF Trust and the persons identified as the document authors",
                "Copyright (c) 2016 IETF Trust and the persons identified as the document authors",
                "Copyright (c) 2018 IETF Trust and the persons identified as the document authors",
                "Copyright (c) 2019 IETF Trust and the persons identified as the document authors",
                "Copyright (c) 2020 IETF Trust and the persons identified as the document authors",
                "Copyright (c) 2021 IETF Trust and the persons identified as the document authors",
                "Copyright (c) 2022 IETF Trust and the persons identified as the document authors",
                "Copyright (c) 2023 IETF Trust and the persons identified as the document authors",
                "Copyright (c) Microsoft Corporation",
                "Copyright (c) The IETF Trust (2006)",
                "Copyright (c) The IETF Trust (2006). Abstract",
                "Copyright (c) The IETF Trust (2007)",
                "Copyright (c) The IETF Trust (2008)",
                "Copyright (c) The IETF Trust (2009)",
                "Copyright (c) The Internet Society (1997)",
                "Copyright (c) The Internet Society (1998)",
                "Copyright (c) The Internet Society (1999)",
                "Copyright (c) The Internet Society (2000)",
                "Copyright (c) The Internet Society (2001)",
                "Copyright (c) The Internet Society (2002)",
                "Copyright (c) The Internet Society (2003)",
                "Copyright (c) The Internet Society (2004)",
                "Copyright (c) The Internet Society (2005)",
                "Copyright (c) The Internet Society (2006)",
                "Copyright (c) The Internet Society 2003",
                "Copyright (c) Year CopyrightHolder",
                "Copyright 1998-2011 Double Precision, Inc."
            ],
            "file-count": 1073,
            "sha256": "e324259c0338e469e572a4aa750ace4f15969ddf9da3380b9d315f70aabe5dcc",
            "source": "https://github.com/jstedfast/MailKit/archive/refs/tags/4.6.0.zip",
            "status": "restricted"
        }
    ]
}