{
    "id": "maven/mavencentral/com.vaadin/vaadin-field-highlighter-flow/24.2.2",
    "license": "Apache-2.0",
    "authority": "https://gitlab.eclipse.org/eclipsefdn/emo-team/iplab/-/issues/12122",
    "source": "https://repo1.maven.org/maven2/com/vaadin/vaadin-field-highlighter-flow/24.2.2/vaadin-field-highlighter-flow-24.2.2-sources.jar",
    "status": "approved",
    "scans": [
        {
            "date": "December 18, 2023 at 8:46:12 a.m. GMT",
            "authority": "https://gitlab.eclipse.org/eclipsefdn/emo-team/iplab/-/issues/12122",
            "scancode-version": "31.2.1",
            "licenses-discovered": [
                "Apache-2.0"
            ],
            "copyrights": [
                "Copyright 2000-2023 Vaadin Ltd."
            ],
            "file-count": 4,
            "sha256": "0afc650f60eca558bde658d9361706c415f32d5bcfe3e1a3996ebc4250865f75",
            "source": "https://repo1.maven.org/maven2/com/vaadin/vaadin-field-highlighter-flow/24.2.2/vaadin-field-highlighter-flow-24.2.2-sources.jar",
            "status": "approved"
        }
    ]
}