{
    "id": "maven/mavencentral/org.apache.lucene/lucene-spatial-extras/9.4.2",
    "license": "Apache-2.0",
    "authority": "https://gitlab.eclipse.org/eclipsefdn/emo-team/iplab/-/issues/6991",
    "source": "https://search.maven.org/remotecontent?filepath=org/apache/lucene/lucene-spatial-extras/9.4.2/lucene-spatial-extras-9.4.2-sources.jar",
    "status": "approved",
    "scans": [
        {
            "date": "February 3, 2023 at 7:03:03 p.m. GMT",
            "authority": "https://gitlab.eclipse.org/eclipsefdn/emo-team/iplab/-/issues/6991",
            "scancode-version": "31.2.1",
            "licenses-discovered": [
                "Apache-2.0"
            ],
            "copyrights": [
            ],
            "file-count": 77,
            "sha256": "005e08f041408e8e099e972ea2f08bef2ce685ff70c6c3bf1ddb923c7b1a0478",
            "source": "https://search.maven.org/remotecontent?filepath=org/apache/lucene/lucene-spatial-extras/9.4.2/lucene-spatial-extras-9.4.2-sources.jar",
            "status": "approved"
        }
    ]
}