{
    "id": "npm/npmjs/-/eslint-plugin-vue/9.1.1",
    "license": "MIT",
    "authority": "https://gitlab.eclipse.org/eclipsefdn/emo-team/iplab/-/issues/5872",
    "source": "https://registry.npmjs.org/eslint-plugin-vue/-/eslint-plugin-vue-9.1.1.tgz",
    "status": "approved",
    "scans": [
        {
            "date": "December 16, 2022 at 10:31:52 a.m. GMT",
            "authority": "https://gitlab.eclipse.org/eclipsefdn/emo-team/iplab/-/issues/5872",
            "scancode-version": "31.2.1",
            "licenses-discovered": [
                "MIT"
            ],
            "copyrights": [
                "Copyright (c) 2014 Yannick Croissant",
                "Copyright (c) 2017 Toru Nagashima",
                "copyright 2016 Toru Nagashima",
                "copyright 2017 Toru Nagashima",
                "copyright 2020 Flo Edelmann",
                "copyright 2021 Flo Edelmann",
                "copyright 2021 Yosuke Ota"
            ],
            "file-count": 266,
            "sha256": "bd47a7a1e531703ad9df0bf4918bb66ce0b5c93e0e21f3116f41fa942960e334",
            "source": "https://registry.npmjs.org/eslint-plugin-vue/-/eslint-plugin-vue-9.1.1.tgz",
            "status": "approved"
        }
    ]
}