{
    "id": "nuget/nuget/-/Testcontainers.PostgreSql/3.10.0",
    "license": "MIT",
    "authority": "https://gitlab.eclipse.org/eclipsefdn/emo-team/iplab/-/issues/16241",
    "source": "https://github.com/testcontainers/testcontainers-dotnet/archive/refs/tags/3.10.0.zip",
    "status": "approved",
    "scans": [
        {
            "date": "September 20, 2024, 12:04:07 p.m. GMT",
            "authority": "https://gitlab.eclipse.org/eclipsefdn/emo-team/iplab/-/issues/16241",
            "scancode-version": "31.2.1",
            "licenses-discovered": [
                "MIT"
            ],
            "copyrights": [
                "Copyright (c) 2016-2023 Martin Donath <martin.donath@squidfunk.com>",
                "Copyright (c) 2019 - 2024 Andre Hofmeister"
            ],
            "file-count": 833,
            "sha256": "cec9b56e0056a3554de3232a8c376842e12f5784e0c954716d09d315e1fee67c",
            "source": "https://github.com/testcontainers/testcontainers-dotnet/archive/refs/tags/3.10.0.zip",
            "status": "approved"
        }
    ]
}