{
    "id": "maven/mavencentral/org.apache.activemq/artemis-selector/2.31.0",
    "license": "Apache-2.0",
    "authority": "https://gitlab.eclipse.org/eclipsefdn/emo-team/iplab/-/issues/10624",
    "source": "https://repo.maven.apache.org/maven2/org/apache/activemq/artemis-selector/2.31.0/artemis-selector-2.31.0-sources.jar",
    "status": "approved",
    "scans": [
        {
            "date": "September 22, 2023 at 7:54:28 a.m. GMT",
            "authority": "https://gitlab.eclipse.org/eclipsefdn/emo-team/iplab/-/issues/10624",
            "scancode-version": "31.2.1",
            "licenses-discovered": [
                "Apache-2.0"
            ],
            "copyrights": [
            ],
            "file-count": 35,
            "sha256": "3448c0ce36f054171841969e7435da55a78923d2dccb1eaf3321eb20ddc13b58",
            "source": "https://repo.maven.apache.org/maven2/org/apache/activemq/artemis-selector/2.31.0/artemis-selector-2.31.0-sources.jar",
            "status": "approved"
        }
    ]
}