{
    "id": "npm/npmjs/@nx/nx-win32-arm64-msvc/20.3.1",
    "license": "MIT",
    "authority": "https://gitlab.eclipse.org/eclipsefdn/emo-team/iplab/-/issues/18685",
    "source": "https://github.com/nrwl/nx/archive/refs/tags/20.3.1.zip",
    "status": "approved",
    "scans": [
        {
            "date": "January 14, 2025 at 4:49:06 p.m. GMT",
            "authority": "https://gitlab.eclipse.org/eclipsefdn/emo-team/iplab/-/issues/18685",
            "scancode-version": "31.2.1",
            "licenses-discovered": [
                "MIT",
                "TMate",
                "ISC",
                "LicenseRef-scancode-commercial-license AND MIT",
                "LicenseRef-scancode-commercial-license",
                "Apache-2.0",
                "GPL-3.0-only AND JSON AND MIT",
                "JSON AND MIT",
                "LicenseRef-scancode-commercial-license AND LicenseRef-scancode-proprietary-license",
                "MIT AND Unlicense",
                "JSON"
            ],
            "copyrights": [
                "(c) 2024 made with",
                "Copyright (c) 2014 The Android Open Source Project",
                "Copyright (c) 2015-2021 the original",
                "Copyright (c) 2017-2024 Narwhal Technologies Inc.",
                "Copyright (c) 2022 Mohammad Ataei",
                "Copyright 2015 the original author or authors",
                "Copyright Apple Inc., 2024",
                "Copyright Google Inc."
            ],
            "file-count": 8239,
            "sha256": "a05a14dfce637a89fcf037e631d21524f681c99f1267718f7341587f2f5fa8c9",
            "source": "https://github.com/nrwl/nx/archive/refs/tags/20.3.1.zip",
            "status": "restricted"
        }
    ]
}