{
    "id": "maven/mavencentral/org.geotools/gt-app-schema/22.1",
    "license": "LGPL-2.1-only",
    "authority": "https://gitlab.eclipse.org/eclipsefdn/emo-team/iplab/-/issues/4889",
    "source": "https://repo.osgeo.org/repository/geotools-releases/org/geotools/gt-app-schema/22.1/gt-app-schema-22.1-sources.jar",
    "status": "approved",
    "scans": [
        {
            "date": "November 16, 2022 at 12:03:31 a.m. GMT",
            "authority": "https://gitlab.eclipse.org/eclipsefdn/emo-team/iplab/-/issues/4889",
            "scancode-version": "31.2.1",
            "licenses-discovered": [
                "LGPL-2.1-only"
            ],
            "copyrights": [
                "(c) 2004-2011, Open Source Geospatial Foundation",
                "(c) 2005-2015, Open Source Geospatial Foundation",
                "(c) 2006-2011, Open Source Geospatial Foundation",
                "(c) 2007-2011, Open Source Geospatial Foundation",
                "(c) 2008-2011, Open Source Geospatial Foundation",
                "(c) 2008-2015, Open Source Geospatial Foundation",
                "(c) 2009-2011, Open Source Geospatial Foundation",
                "(c) 2009-2015, Open Source Geospatial Foundation",
                "(c) 2010-2011, Open Source Geospatial Foundation",
                "(c) 2011, Open Source Geospatial Foundation",
                "(c) 2016, Open Source Geospatial Foundation",
                "(c) 2017, Open Source Geospatial Foundation",
                "(c) 2018, Open Source Geospatial Foundation",
                "(c) 2019, Open Source Geospatial Foundation"
            ],
            "file-count": 89,
            "sha256": "4da4622ae1dfda75fad990e6d3adaa3996401f80766525da1dc7acdce37b0ae7",
            "source": "https://repo.osgeo.org/repository/geotools-releases/org/geotools/gt-app-schema/22.1/gt-app-schema-22.1-sources.jar",
            "status": "restricted"
        },
        {
            "date": "November 16, 2022 at 1:42:24 a.m. GMT",
            "authority": "https://gitlab.eclipse.org/eclipsefdn/emo-team/iplab/-/issues/4889",
            "scancode-version": "31.2.1",
            "licenses-discovered": [
                "LGPL-2.1-only"
            ],
            "copyrights": [
                "(c) 2004-2011, Open Source Geospatial Foundation",
                "(c) 2005-2015, Open Source Geospatial Foundation",
                "(c) 2006-2011, Open Source Geospatial Foundation",
                "(c) 2007-2011, Open Source Geospatial Foundation",
                "(c) 2008-2011, Open Source Geospatial Foundation",
                "(c) 2008-2015, Open Source Geospatial Foundation",
                "(c) 2009-2011, Open Source Geospatial Foundation",
                "(c) 2009-2015, Open Source Geospatial Foundation",
                "(c) 2010-2011, Open Source Geospatial Foundation",
                "(c) 2011, Open Source Geospatial Foundation",
                "(c) 2016, Open Source Geospatial Foundation",
                "(c) 2017, Open Source Geospatial Foundation",
                "(c) 2018, Open Source Geospatial Foundation",
                "(c) 2019, Open Source Geospatial Foundation"
            ],
            "file-count": 89,
            "sha256": "4da4622ae1dfda75fad990e6d3adaa3996401f80766525da1dc7acdce37b0ae7",
            "source": "https://repo.osgeo.org/repository/geotools-releases/org/geotools/gt-app-schema/22.1/gt-app-schema-22.1-sources.jar",
            "status": "approved"
        }
    ]
}