{
    "id": "maven/mavencentral/org.bouncycastle/bcprov-jdk18on/1.71.1",
    "license": "MIT",
    "licenses-discovered": [
        "MIT",
        "LicenseRef-scancode-ocb-open-source-2013"
    ],
    "copyrights": [
        "(c) ECFieldElement A1",
        "(c) Nat224.isOne",
        "Copyright (c) The Legion Of The Bouncy Castle Inc. (https://www.bouncycastle.org)",
        "Copyright Dr B. R Gladman (gladman@seven77.demon.co.uk) and Sam Simpson (s.simpson@mia.co.uk)"
    ],
    "file-count": 2081,
    "scancode-version": "30.1.0",
    "authority": "https://gitlab.eclipse.org/eclipsefdn/emo-team/iplab/-/issues/3475",
    "source": "https://search.maven.org/remotecontent?filepath=org/bouncycastle/bcprov-jdk18on/1.71.1/bcprov-jdk18on-1.71.1-sources.jar",
    "status": "approved"
}
