{
    "id": "npm/npmjs/-/eslint/8.46.0",
    "license": "MIT",
    "authority": "https://gitlab.eclipse.org/eclipsefdn/emo-team/iplab/-/issues/9912",
    "source": "https://registry.yarnpkg.com/eslint/-/eslint-8.46.0.tgz",
    "status": "approved",
    "scans": [
        {
            "date": "August 11, 2023 at 3:34:27 a.m. GMT",
            "authority": "https://gitlab.eclipse.org/eclipsefdn/emo-team/iplab/-/issues/9912",
            "scancode-version": "31.2.1",
            "licenses-discovered": [
                "MIT"
            ],
            "copyrights": [
                "Copyright 2013-2016 Dulin Marat and other contributors",
                "Copyright OpenJS Foundation and other contributors, <www.openjsf.org>"
            ],
            "file-count": 406,
            "sha256": "57a6999c35f738944da92439c1a72818559a9208d9c16924ace16c5228485b64",
            "source": "https://registry.yarnpkg.com/eslint/-/eslint-8.46.0.tgz",
            "status": "approved"
        }
    ]
}