{
    "id": "maven/mavencentral/org.apache.olingo/olingo-odata2-core/2.0.12",
    "license": "Apache-2.0",
    "licenses-discovered": [
        "Apache-2.0"
    ],
    "copyrights": [
        "Copyright The Apache Software Foundation"
    ],
    "file-count": 226,
    "scancode-version": "30.1.0",
    "authority": "https://gitlab.eclipse.org/eclipsefdn/emo-team/iplab/-/issues/3363",
    "source": "https://search.maven.org/remotecontent?filepath=org/apache/olingo/olingo-odata2-core/2.0.12/olingo-odata2-core-2.0.12-sources.jar",
    "status": "approved"
}