{
    "id": "maven/mavencentral/org.apache.jena/apache-jena-libs/4.8.0",
    "license": "Apache-2.0",
    "authority": "https://gitlab.eclipse.org/eclipsefdn/emo-team/iplab/-/issues/8904",
    "source": "https://search.maven.org/remotecontent?filepath=org/apache/jena/apache-jena-libs/4.8.0/apache-jena-libs-4.8.0.pom",
    "status": "approved",
    "scans": [
        {
            "date": "June 14, 2023 at 5:53:48 p.m. GMT",
            "authority": "https://gitlab.eclipse.org/eclipsefdn/emo-team/iplab/-/issues/8904",
            "scancode-version": "31.2.1",
            "licenses-discovered": [
                "Apache-2.0"
            ],
            "copyrights": [
            ],
            "file-count": 1,
            "sha256": "6a2f5eb7cff63230d5ae48d566715f0c580965c49d3a544def638ac790a468d4",
            "source": "https://search.maven.org/remotecontent?filepath=org/apache/jena/apache-jena-libs/4.8.0/apache-jena-libs-4.8.0.pom",
            "status": "approved"
        }
    ]
}