{
    "id": "go/golang/github.com%2Fgoogle/flatbuffers/v24.3.25",
    "license": "Apache-2.0 AND BSD-3-Clause",
    "authority": "https://gitlab.eclipse.org/eclipsefdn/emo-team/iplab/-/issues/15878",
    "source": "https://github.com/google/flatbuffers/archive/refs/tags/v24.3.25.zip",
    "status": "approved",
    "scans": [
        {
            "date": "August 14, 2024 at 1:29:22 p.m. GMT",
            "authority": "https://gitlab.eclipse.org/eclipsefdn/emo-team/iplab/-/issues/15878",
            "scancode-version": "31.2.1",
            "licenses-discovered": [
                "Apache-2.0",
                "BSD-3-Clause"
            ],
            "copyrights": [
                "Copyright $YEAR Google Inc.",
                "Copyright (c) 2014 Google Inc",
                "Copyright (c) 2015-2021 the original",
                "Copyright 2014 Google Inc.",
                "Copyright 2014 Stefan.Eilemann@epfl.ch",
                "Copyright 2015 Google Inc.",
                "Copyright 2015 The Chromium Authors",
                "Copyright 2015 gRPC",
                "Copyright 2015 the original author or authors",
                "Copyright 2016 Google Inc.",
                "Copyright 2017 Google Inc.",
                "Copyright 2018 Dan Field",
                "Copyright 2018 Google Inc.",
                "Copyright 2019 Google Inc.",
                "Copyright 2019 Google LLC",
                "Copyright 2020 Google Inc.",
                "Copyright 2020 Google LLC",
                "Copyright 2021 Google Inc.",
                "Copyright 2021 Google LLC",
                "Copyright 2022 Google Inc.",
                "Copyright 2022 Google LLC",
                "Copyright 2023 Google Inc.",
                "Copyright year Google Inc."
            ],
            "file-count": 1887,
            "sha256": "e706f5eb6ca8f78e237bf3f7eccffa1c5ec9a96d3c1c938f08dc09aab1884528",
            "source": "https://github.com/google/flatbuffers/archive/refs/tags/v24.3.25.zip",
            "status": "approved"
        }
    ]
}