{
    "license": "MIT",
    "file-count": 10,
    "authority": "https://gitlab.eclipse.org/eclipsefdn/emo-team/iplab/-/issues/1125",
    "scancode-version": "21.3.31",
    "licenses-discovered": [
        "MIT"
    ],
    "id": "npm/npmjs/-/console-browserify/1.1.0",
    "source": "https://github.com/Raynos/console-browserify/archive/v1.1.0.zip",
    "status": "approved"
}