{
    "id": "maven/mavencentral/io.kotest/kotest-framework-discovery-jvm/5.6.2",
    "license": "Apache-2.0",
    "authority": "https://gitlab.eclipse.org/eclipsefdn/emo-team/iplab/-/issues/10203",
    "source": "https://repo.maven.apache.org/maven2/io/kotest/kotest-framework-discovery-jvm/5.6.2/kotest-framework-discovery-jvm-5.6.2-sources.jar",
    "status": "approved",
    "scans": [
        {
            "date": "August 23, 2023 at 12:16:20 p.m. GMT",
            "authority": "https://gitlab.eclipse.org/eclipsefdn/emo-team/iplab/-/issues/10203",
            "scancode-version": "31.2.1",
            "licenses-discovered": [
            ],
            "copyrights": [
            ],
            "file-count": 5,
            "sha256": "7ecc9bd48cb0ed39b3c0eb1f643c2a44cfe9fb734afc8f2fbc5b40ef9578388a",
            "source": "https://repo.maven.apache.org/maven2/io/kotest/kotest-framework-discovery-jvm/5.6.2/kotest-framework-discovery-jvm-5.6.2-sources.jar",
            "status": "restricted"
        }
    ]
}
