{
    "id": "maven/mavencentral/com.vegardit.no-npe/no-npe-eea-all/1.2.0",
    "license": "EPL-2.0",
    "authority": "https://gitlab.eclipse.org/eclipsefdn/emo-team/iplab/-/issues/16555",
    "source": "https://github.com/vegardit/no-npe/archive/refs/tags/1.2.0.zip",
    "status": "approved",
    "scans": [
        {
            "date": "October 9, 2024, 12:58:22 p.m. GMT",
            "authority": "https://gitlab.eclipse.org/eclipsefdn/emo-team/iplab/-/issues/16555",
            "scancode-version": "31.2.1",
            "licenses-discovered": [
                "EPL-2.0"
            ],
            "copyrights": [
                "Copyright (c) Vegard IT GmbH (https://vegardit.com) and contributors"
            ],
            "file-count": 28901,
            "sha256": "3663f2c56bd6437c280550204c3868bdbbb2586c4dcd3adbf268390f5e90d28f",
            "source": "https://github.com/vegardit/no-npe/archive/refs/tags/1.2.0.zip",
            "status": "approved"
        }
    ]
}