{
    "id": "p2/orbit/p2.eclipse-plugin/org.objectweb.asm/8.0.1.v20200420-1007",
    "license": "BSD-3-Clause",
    "licenses-discovered": [
        "BSD-3-Clause"
    ],
    "file-count": 38,
    "scancode-version": "30.1.0",
    "authority": "https://gitlab.eclipse.org/eclipsefdn/emo-team/iplab/-/issues/1989",
    "source": "https://search.maven.org/remotecontent?filepath=org/ow2/asm/asm/8.0.1/asm-8.0.1-sources.jar",
    "status": "approved"
}