{
    "id": "maven/mavencentral/software.amazon.awssdk/protocol-core/2.23.12",
    "license": "Apache-2.0",
    "authority": "https://gitlab.eclipse.org/eclipsefdn/emo-team/iplab/-/issues/13133",
    "source": "https://repo1.maven.org/maven2/software/amazon/awssdk/protocol-core/2.23.12/protocol-core-2.23.12-sources.jar",
    "status": "approved",
    "scans": [
        {
            "date": "February 4, 2024 at 11:43:34 a.m. GMT",
            "authority": "https://gitlab.eclipse.org/eclipsefdn/emo-team/iplab/-/issues/13133",
            "scancode-version": "31.2.1",
            "licenses-discovered": [
                "Apache-2.0"
            ],
            "copyrights": [
                "Copyright Amazon.com, Inc. or its affiliates"
            ],
            "file-count": 16,
            "sha256": "986c7ae2edcdabe779564316915b0ac3ef0f20d0234502b91c45c9e4d2f67412",
            "source": "https://repo1.maven.org/maven2/software/amazon/awssdk/protocol-core/2.23.12/protocol-core-2.23.12-sources.jar",
            "status": "approved"
        }
    ]
}