{
    "id": "nuget/nuget/-/Laraue.EfCoreTriggers.PostgreSql/8.0.3",
    "license": "MIT",
    "authority": "https://gitlab.eclipse.org/eclipsefdn/emo-team/iplab/-/issues/13984",
    "source": "https://github.com/win7user10/Laraue.EfCoreTriggers/archive/refs/tags/8.0.3.zip",
    "status": "approved",
    "scans": [
        {
            "date": "March 21, 2024 at 5:00:31 p.m. GMT",
            "authority": "https://gitlab.eclipse.org/eclipsefdn/emo-team/iplab/-/issues/13984",
            "scancode-version": "31.2.1",
            "licenses-discovered": [
                "MIT"
            ],
            "copyrights": [
                "Copyright (c) 2020 Ilya Belyanskiy"
            ],
            "file-count": 284,
            "sha256": "23c28ddce077bff267528b986bb014b7dc5bc07897ebebe027efad11fe6f9546",
            "source": "https://github.com/win7user10/Laraue.EfCoreTriggers/archive/refs/tags/8.0.3.zip",
            "status": "approved"
        }
    ]
}