{
    "license": "BSD-2-Clause AND MIT",
    "file-count": 37,
    "authority": "https://gitlab.eclipse.org/eclipsefdn/emo-team/iplab/-/issues/875",
    "scancode-version": "21.3.31",
    "licenses-discovered": [
        "MIT",
        "BSD-2-Clause"
    ],
    "id": "npm/npmjs/@babel/parser/7.7.7",
    "source": "https://registry.npmjs.org/@babel/parser/-/parser-7.7.7.tgz",
    "status": "approved"
}