{
    "id": "maven/mavencentral/com.google.guava/guava/33.4.0-jre",
    "license": "Apache-2.0 AND CC0-1.0 AND CC-PDDC",
    "authority": "https://gitlab.eclipse.org/eclipsefdn/emo-team/iplab/-/issues/17939",
    "source": "https://repo1.maven.org/maven2/com/google/guava/guava/33.4.0-jre/guava-33.4.0-jre-sources.jar",
    "status": "approved",
    "scans": [
        {
            "date": "December 17, 2024 at 7:31:48 a.m. GMT",
            "authority": "https://gitlab.eclipse.org/eclipsefdn/emo-team/iplab/-/issues/17939",
            "scancode-version": "31.2.1",
            "licenses-discovered": [
                "Apache-2.0",
                "CC0-1.0",
                "Apache-2.0 AND CC0-1.0",
                "Apache-2.0 AND CC-PDDC"
            ],
            "copyrights": [
                "Copyright (c) 2005 The Guava Authors",
                "Copyright (c) 2006 The Guava Authors",
                "Copyright (c) 2007 The Guava Authors",
                "Copyright (c) 2008 The Guava Authors",
                "Copyright (c) 2009 The Guava Authors",
                "Copyright (c) 2010 The Guava Authors",
                "Copyright (c) 2011 The Guava Authors",
                "Copyright (c) 2012 The Guava Authors",
                "Copyright (c) 2013 The Guava Authors",
                "Copyright (c) 2014 The Guava Authors",
                "Copyright (c) 2015 The Guava Authors",
                "Copyright (c) 2016 The Guava Authors",
                "Copyright (c) 2017 The Guava Authors",
                "Copyright (c) 2018 The Guava Authors",
                "Copyright (c) 2019 The Guava Authors",
                "Copyright (c) 2020 The Guava Authors",
                "Copyright (c) 2021 The Guava Authors",
                "Copyright (c) 2023 The Guava Authors",
                "Copyright (c) 2024 The Guava Authors",
                "Copyright 2011 Google Inc.",
                "Copyright 2019 The Guava Authors"
            ],
            "file-count": 641,
            "sha256": "55ef6603b6ab1f6e3ae810b127561650ed682eb5f3fb50a212a658a74087b457",
            "source": "https://repo1.maven.org/maven2/com/google/guava/guava/33.4.0-jre/guava-33.4.0-jre-sources.jar",
            "status": "restricted"
        }
    ]
}