{
    "id": "maven/mavencentral/org.wildfly.security/wildfly-elytron-password-impl/2.6.0.Final",
    "license": "Apache-2.0",
    "authority": "https://gitlab.eclipse.org/eclipsefdn/emo-team/iplab/-/issues/16554",
    "source": "https://repo1.maven.org/maven2/org/wildfly/security/wildfly-elytron-password-impl/2.6.0.Final/wildfly-elytron-password-impl-2.6.0.Final-sources.jar",
    "status": "approved",
    "scans": [
        {
            "date": "October 9, 2024, 8:54:24 a.m. GMT",
            "authority": "https://gitlab.eclipse.org/eclipsefdn/emo-team/iplab/-/issues/16554",
            "scancode-version": "31.2.1",
            "licenses-discovered": [
                "Apache-2.0"
            ],
            "copyrights": [
                "Copyright 2013 Red Hat, Inc., and individual contributors",
                "Copyright 2014 Red Hat, Inc., and individual contributors",
                "Copyright 2015 Red Hat, Inc. and/or its affiliates",
                "Copyright 2015 Red Hat, Inc., and individual contributors",
                "Copyright 2016 Red Hat, Inc., and individual contributors",
                "Copyright 2018 Red Hat, Inc., and individual contributors",
                "Copyright 2024 Red Hat, Inc. and/or its affiliates"
            ],
            "file-count": 31,
            "sha256": "64924eff2e3e47fb230099819cb373ec181fc78752e6c099d5b5398b6893262c",
            "source": "https://repo1.maven.org/maven2/org/wildfly/security/wildfly-elytron-password-impl/2.6.0.Final/wildfly-elytron-password-impl-2.6.0.Final-sources.jar",
            "status": "approved"
        }
    ]
}