{
    "id": "npm/npmjs/-/typesafe-path/0.2.2",
    "license": "MIT",
    "authority": "https://gitlab.eclipse.org/eclipsefdn/emo-team/iplab/-/issues/8792",
    "source": "https://registry.yarnpkg.com/typesafe-path/-/typesafe-path-0.2.2.tgz",
    "status": "approved",
    "scans": [
        {
            "date": "June 11, 2023 at 11:12:12 p.m. GMT",
            "authority": "https://gitlab.eclipse.org/eclipsefdn/emo-team/iplab/-/issues/8792",
            "scancode-version": "31.2.1",
            "licenses-discovered": [
                "MIT"
            ],
            "copyrights": [
                "Copyright (c) 2022-present Johnson Chu"
            ],
            "file-count": 9,
            "sha256": "9d1f8c10cfc35ce186599e5b91606dc2c4787948592c086ef486fa0609283488",
            "source": "https://registry.yarnpkg.com/typesafe-path/-/typesafe-path-0.2.2.tgz",
            "status": "approved"
        }
    ]
}