{
    "id": "maven/mavencentral/org.springframework.cloud/spring-cloud-context/3.1.5",
    "license": "Apache-2.0",
    "licenses-discovered": [
        "Apache-2.0"
    ],
    "copyrights": [
        "Copyright 2012-2020 the original author or authors",
        "Copyright 2013-2020 the original author or authors",
        "Copyright 2013-2021 the original author or authors",
        "Copyright 2014-2021 the original author or authors",
        "Copyright 2020-2020 the original author or authors"
    ],
    "file-count": 68,
    "scancode-version": "31.2.1",
    "authority": "https://gitlab.eclipse.org/eclipsefdn/emo-team/iplab/-/issues/4722",
    "source": "https://search.maven.org/remotecontent?filepath=org/springframework/cloud/spring-cloud-context/3.1.5/spring-cloud-context-3.1.5-sources.jar",
    "status": "approved"
}