{
    "id": "maven/mavencentral/org.zalando/logbook-api/3.7.2",
    "license": "MIT",
    "authority": "https://gitlab.eclipse.org/eclipsefdn/emo-team/iplab/-/issues/12460",
    "source": "https://repo1.maven.org/maven2/org/zalando/logbook-api/3.7.2/logbook-api-3.7.2-sources.jar",
    "status": "approved",
    "scans": [
        {
            "date": "December 25, 2023 at 5:35:38 a.m. GMT",
            "authority": "https://gitlab.eclipse.org/eclipsefdn/emo-team/iplab/-/issues/12460",
            "scancode-version": "31.2.1",
            "licenses-discovered": [
            ],
            "copyrights": [
            ],
            "file-count": 45,
            "sha256": "1c0ab6f58fcb96d4b202c87669a79c05039fa88dddc0ac9c196c97f67e3343bc",
            "source": "https://repo1.maven.org/maven2/org/zalando/logbook-api/3.7.2/logbook-api-3.7.2-sources.jar",
            "status": "restricted"
        }
    ]
}
