{
    "id": "npm/npmjs/-/eslint-plugin-es-x/7.6.0",
    "license": "MIT",
    "authority": "https://gitlab.eclipse.org/eclipsefdn/emo-team/iplab/-/issues/14003",
    "source": "https://github.com/eslint-community/eslint-plugin-es-x/archive/refs/tags/v7.6.0.zip",
    "status": "approved",
    "scans": [
        {
            "date": "March 22, 2024 at 3:17:37 p.m. GMT",
            "authority": "https://gitlab.eclipse.org/eclipsefdn/emo-team/iplab/-/issues/14003",
            "scancode-version": "31.2.1",
            "licenses-discovered": [
                "MIT"
            ],
            "copyrights": [
                "Copyright (c) 2018 Toru Nagashima",
                "copyright 2015 Toru Nagashima",
                "copyright 2016 Toru Nagashima"
            ],
            "file-count": 767,
            "sha256": "48fba41c0ad88349821e49fc474f575f94de054dbf6ea91a648af8c96e3d5718",
            "source": "https://github.com/eslint-community/eslint-plugin-es-x/archive/refs/tags/v7.6.0.zip",
            "status": "approved"
        }
    ]
}