{
    "id": "npm/npmjs/@babel/plugin-syntax-typescript/7.22.5",
    "license": "MIT",
    "authority": "https://gitlab.eclipse.org/eclipsefdn/emo-team/iplab/-/issues/8994",
    "source": "https://registry.npmjs.org/@babel/plugin-syntax-typescript/-/plugin-syntax-typescript-7.22.5.tgz",
    "status": "approved",
    "scans": [
        {
            "date": "June 15, 2023 at 2:22:45 p.m. GMT",
            "authority": "https://gitlab.eclipse.org/eclipsefdn/emo-team/iplab/-/issues/8994",
            "scancode-version": "31.2.1",
            "licenses-discovered": [
                "MIT"
            ],
            "copyrights": [
                "Copyright (c) 2014-present Sebastian McKenzie and other contributors"
            ],
            "file-count": 5,
            "sha256": "fd25af611d8c8ad9b2bb85bc027d3146322c2b12e4ce484a37c467e8aecf35d5",
            "source": "https://registry.npmjs.org/@babel/plugin-syntax-typescript/-/plugin-syntax-typescript-7.22.5.tgz",
            "status": "approved"
        }
    ]
}