{
    "id": "npm/npmjs/-/postcss-clamp/4.1.0",
    "license": "MIT",
    "licenses-discovered": [
        "MIT"
    ],
    "copyrights": [
        "Copyright Ivan Menshykov <ivan.menshykov@gmail.com>"
    ],
    "file-count": 6,
    "scancode-version": "30.1.0",
    "authority": "https://gitlab.eclipse.org/eclipsefdn/emo-team/iplab/-/issues/3013",
    "source": "https://registry.npmjs.org/postcss-clamp/-/postcss-clamp-4.1.0.tgz",
    "status": "approved"
}