{
    "id": "maven/mavencentral/net.sf.tweety.arg/dung/1.12",
    "license": "LGPL-3.0-or-later",
    "authority": "https://gitlab.eclipse.org/eclipsefdn/emo-team/iplab/-/issues/17234",
    "source": "https://repo1.maven.org/maven2/net/sf/tweety/arg/dung/1.12/dung-1.12-sources.jar",
    "status": "approved",
    "scans": [
        {
            "date": "November 14, 2024, 8:34:11 p.m. GMT",
            "authority": "https://gitlab.eclipse.org/eclipsefdn/emo-team/iplab/-/issues/17234",
            "scancode-version": "31.2.1",
            "licenses-discovered": [
                "LGPL-3.0-or-later"
            ],
            "copyrights": [
                "Copyright 2016 The TweetyProject Team <http://tweetyproject.org/contact/>",
                "Copyright 2018 The TweetyProject Team <http://tweetyproject.org/contact/>"
            ],
            "file-count": 77,
            "sha256": "687934c6a3292bb8da1884c7f8c7e66881ce975f4ba1de03498cddaad7550de8",
            "source": "https://repo1.maven.org/maven2/net/sf/tweety/arg/dung/1.12/dung-1.12-sources.jar",
            "status": "approved"
        }
    ]
}