{
    "id": "npm/npmjs/-/sass/1.66.1",
    "license": "Apache-2.0 AND BSD-3-Clause AND MIT AND MIT",
    "authority": "https://gitlab.eclipse.org/eclipsefdn/emo-team/iplab/-/issues/10091",
    "source": "https://registry.yarnpkg.com/sass/-/sass-1.66.1.tgz",
    "status": "approved",
    "scans": [
        {
            "date": "August 20, 2023 at 11:25:35 p.m. GMT",
            "authority": "https://gitlab.eclipse.org/eclipsefdn/emo-team/iplab/-/issues/10091",
            "scancode-version": "31.2.1",
            "licenses-discovered": [
                "Apache-2.0 AND BSD-3-Clause AND MIT",
                "MIT"
            ],
            "copyrights": [
                "Copyright (c) 2000 - 2019 The Legion of the Bouncy Castle Inc. (https://www.bouncycastle.org)",
                "Copyright (c) 2006, Kirill Simonov",
                "Copyright (c) 2006-2012 The Authors",
                "Copyright (c) 2006-2023 Lukas Renggli",
                "Copyright (c) 2013-2021 Brendan Duncan",
                "Copyright (c) 2014, the Dart project",
                "Copyright (c) 2015 Michael Bullington",
                "Copyright (c) 2015, Anders Holmgren",
                "Copyright (c) 2016, Google Inc.",
                "Copyright (c) 2017, Anatoly Pulyaevskiy",
                "Copyright (c) 2018, Jennifer Thakar",
                "Copyright (c) 2020 Leo Farias",
                "Copyright 2012, the Dart project",
                "Copyright 2012, the Dart project authors",
                "Copyright 2013, Google Inc.",
                "Copyright 2013, the Dart project",
                "Copyright 2013, the Dart project authors",
                "Copyright 2014, the Dart project",
                "Copyright 2014, the Dart project authors",
                "Copyright 2015, the Dart project",
                "Copyright 2016, the Dart project",
                "Copyright 2017, the Dart project",
                "Copyright 2017, the Dart project authors",
                "Copyright 2018, the Dart project",
                "Copyright 2019, the Dart project",
                "Copyright 2019, the Dart project authors",
                "Copyright 2020, the Dart project",
                "Copyright 2021, the Dart project"
            ],
            "file-count": 34,
            "sha256": "c5712f0c9713b25c869d8c4971d1ef60ef193fcc89f5081cc5b124526991d0bd",
            "source": "https://registry.yarnpkg.com/sass/-/sass-1.66.1.tgz",
            "status": "approved"
        }
    ]
}