{
    "id": "npm/npmjs/-/chromedriver/112.0.1",
    "license": "Apache-2.0",
    "authority": "https://gitlab.eclipse.org/eclipsefdn/emo-team/iplab/-/issues/8307",
    "source": "https://registry.yarnpkg.com/chromedriver/-/chromedriver-112.0.1.tgz",
    "status": "approved",
    "scans": [
        {
            "date": "May 4, 2023 at 5:40:50 p.m. GMT",
            "authority": "https://gitlab.eclipse.org/eclipsefdn/emo-team/iplab/-/issues/8307",
            "scancode-version": "31.2.1",
            "licenses-discovered": [
                "Apache-2.0"
            ],
            "copyrights": [
                "Copyright 2014 Giovanni Bassi and Elemar Jr"
            ],
            "file-count": 6,
            "sha256": "955357ad8c93c92be2f635479a982721fad7f3e39dc9fc342694b921a441d57a",
            "source": "https://registry.yarnpkg.com/chromedriver/-/chromedriver-112.0.1.tgz",
            "status": "approved"
        }
    ]
}