{
    "id": "npm/npmjs/-/browserslist/4.24.0",
    "license": "MIT",
    "authority": "https://gitlab.eclipse.org/eclipsefdn/emo-team/iplab/-/issues/16285",
    "source": "https://github.com/browserslist/browserslist/archive/refs/tags/4.24.0.zip",
    "status": "approved",
    "scans": [
        {
            "date": "September 26, 2024, 1:21:43 p.m. GMT",
            "authority": "https://gitlab.eclipse.org/eclipsefdn/emo-team/iplab/-/issues/16285",
            "scancode-version": "31.2.1",
            "licenses-discovered": [
                "MIT"
            ],
            "copyrights": [
                "Copyright 2014 Andrey Sitnik <andrey@sitnik.ru> and other contributors"
            ],
            "file-count": 88,
            "sha256": "a73ccf113dd873ec922f3bd7bea0a386a4bf009d23ad5674f2890e79170b9ce4",
            "source": "https://github.com/browserslist/browserslist/archive/refs/tags/4.24.0.zip",
            "status": "approved"
        }
    ]
}