{
    "id": "maven/mavencentral/org.opensearch/opensearch-secure-sm/2.5.0",
    "license": "Apache-2.0",
    "authority": "https://gitlab.eclipse.org/eclipsefdn/emo-team/iplab/-/issues/6990",
    "source": "https://search.maven.org/remotecontent?filepath=org/opensearch/opensearch-secure-sm/2.5.0/opensearch-secure-sm-2.5.0-sources.jar",
    "status": "approved",
    "scans": [
        {
            "date": "February 3, 2023 at 7:04:38 p.m. GMT",
            "authority": "https://gitlab.eclipse.org/eclipsefdn/emo-team/iplab/-/issues/6990",
            "scancode-version": "31.2.1",
            "licenses-discovered": [
                "Apache-2.0"
            ],
            "copyrights": [
                "Copyright OpenSearch Contributors"
            ],
            "file-count": 5,
            "sha256": "762c019d329fe06736fa6002fe16dd6a8539feaf39743d50e735e48f6247bf0d",
            "source": "https://search.maven.org/remotecontent?filepath=org/opensearch/opensearch-secure-sm/2.5.0/opensearch-secure-sm-2.5.0-sources.jar",
            "status": "approved"
        }
    ]
}