{
    "id": "maven/mavencentral/io.netty/netty-resolver/4.2.0.Alpha4",
    "license": "Apache-2.0",
    "authority": "https://gitlab.eclipse.org/eclipsefdn/emo-team/iplab/-/issues/16126",
    "source": "https://repo1.maven.org/maven2/io/netty/netty-resolver/4.2.0.Alpha4/netty-resolver-4.2.0.Alpha4-sources.jar",
    "status": "approved",
    "scans": [
        {
            "date": "September 12, 2024, 12:10:23 a.m. GMT",
            "authority": "https://gitlab.eclipse.org/eclipsefdn/emo-team/iplab/-/issues/16126",
            "scancode-version": "31.2.1",
            "licenses-discovered": [
                "Apache-2.0"
            ],
            "copyrights": [
                "Copyright 2014 The Netty Project",
                "Copyright 2015 The Netty Project",
                "Copyright 2016 The Netty Project",
                "Copyright 2017 The Netty Project",
                "Copyright 2021 The Netty Project",
                "Copyright 2024 The Netty Project"
            ],
            "file-count": 24,
            "sha256": "10f8aeb03d54047b54d4c10cb975908023a63239641afbd236859f6bea698728",
            "source": "https://repo1.maven.org/maven2/io/netty/netty-resolver/4.2.0.Alpha4/netty-resolver-4.2.0.Alpha4-sources.jar",
            "status": "approved"
        }
    ]
}