{
    "id": "p2/orbit/p2.eclipse.plugin/org.junit.platform.engine/1.9.1.v20221103-2317",
    "license": "EPL-2.0",
    "authority": "https://gitlab.eclipse.org/eclipsefdn/emo-team/iplab/-/issues/8778",
    "source": "https://repo.maven.apache.org/maven2/org/junit/platform/junit-platform-engine/1.9.0-M1/junit-platform-engine-1.9.0-M1-sources.jar",
    "status": "approved",
    "scans": [
        {
            "date": "June 10, 2023 at 2:45:50 a.m. GMT",
            "authority": "https://gitlab.eclipse.org/eclipsefdn/emo-team/iplab/-/issues/8778",
            "scancode-version": "31.2.1",
            "licenses-discovered": [
                "EPL-2.0"
            ],
            "copyrights": [
                "Copyright 2015-2021 the original author or authors",
                "Copyright 2015-2022 the original author or authors"
            ],
            "file-count": 98,
            "sha256": "d094020654f59085d02c50d17efb52dd3910f67fbac761a157c5b727c3ef366d",
            "source": "https://repo.maven.apache.org/maven2/org/junit/platform/junit-platform-engine/1.9.0-M1/junit-platform-engine-1.9.0-M1-sources.jar",
            "status": "approved"
        }
    ]
}