{
    "id": "maven/mavencentral/org.apache.xmlbeans/xmlbeans/5.3.0",
    "license": "Apache-2.0 AND W3C-19980720",
    "authority": "https://gitlab.eclipse.org/eclipsefdn/emo-team/iplab/-/issues/17930",
    "source": "https://repo1.maven.org/maven2/org/apache/xmlbeans/xmlbeans/5.3.0/xmlbeans-5.3.0-sources.jar",
    "status": "approved",
    "scans": [
        {
            "date": "December 14, 2024 at 8:26:57 a.m. GMT",
            "authority": "https://gitlab.eclipse.org/eclipsefdn/emo-team/iplab/-/issues/17930",
            "scancode-version": "31.2.1",
            "licenses-discovered": [
                "Apache-2.0 AND W3C-19980720",
                "Apache-2.0",
                "Apache-2.0 AND LicenseRef-scancode-proprietary-license"
            ],
            "copyrights": [
                "Copyright (c) 1994-2002 World Wide Web Consortium, (Massachusetts Institute of Technology, Institut National de Recherche en Informatique et en Automatique, Keio University)",
                "Copyright (c) 2002-2023 EPFL",
                "Copyright (c) 2011-2023 Lightbend, Inc.",
                "Copyright (c) 2015-2021 the original",
                "Copyright (c) World Wide Web Consortium, (Massachusetts Institute of Technology, Institut National de Recherche en Informatique et en Automatique, Keio University)",
                "Copyright 2004 The Apache Software Foundation",
                "Copyright 2004-2018 The Apache Software Foundation",
                "Copyright 2017, 2018 The Apache Software Foundation",
                "Copyright 2019 The Apache Software Foundation",
                "SchemaAnnotationImpl (c) Retrieving",
                "SchemaAttributeGroupImpl (c) SchemaAnnotationImpl",
                "SchemaModelGroupImpl (c) SchemaAnnotationImpl"
            ],
            "file-count": 1265,
            "sha256": "2f874ef122023114633ca093352188aebef849218c04b3fc8e46c2107709dbc4",
            "source": "https://repo1.maven.org/maven2/org/apache/xmlbeans/xmlbeans/5.3.0/xmlbeans-5.3.0-sources.jar",
            "status": "restricted"
        }
    ]
}