{
    "id": "npm/npmjs/@parcel/watcher-darwin-x64/2.5.0",
    "license": "MIT",
    "authority": "https://gitlab.eclipse.org/eclipsefdn/emo-team/iplab/-/issues/17038",
    "source": "https://github.com/parcel-bundler/watcher/archive/refs/tags/v2.5.0.zip",
    "status": "approved",
    "scans": [
        {
            "date": "November 5, 2024, 11:29:09 a.m. GMT",
            "authority": "https://gitlab.eclipse.org/eclipsefdn/emo-team/iplab/-/issues/17038",
            "scancode-version": "31.2.1",
            "licenses-discovered": [
                "MIT"
            ],
            "copyrights": [
                "Copyright (c) 2017-present Devon Govett",
                "Copyright 2012-2020 Facebook, Inc.",
                "Copyright Node.js contributors"
            ],
            "file-count": 62,
            "sha256": "f9098209bd308919b791898da4f2ef886a52a5d233ff93426b0fa301744892ba",
            "source": "https://github.com/parcel-bundler/watcher/archive/refs/tags/v2.5.0.zip",
            "status": "approved"
        }
    ]
}