{
    "id": "pypi/pypi/-/pillow/11.1.0",
    "license": "LicenseRef-scancode-secret-labs-2011 AND MIT-CMU AND (LicenseRef-scancode-free-unknown AND MIT-CMU) AND MIT-CMU AND LicenseRef-scancode-secret-labs-2011 AND CC0-1.0 AND GPL-3.0-only AND GPL-3.0-or-later AND MIT AND 0BSD AND MIT-Modern-Variant AND TCL AND OFL-1.1 AND (Font-exception-2.0 AND GPL-3.0-or-later) AND (Apache-2.0 AND Font-exception-2.0 AND GPL-3.0-only AND LGPL-2.1-only AND MIT AND OFL-1.1) AND Apache-2.0 AND Bitstream-Vera AND LicenseRef-scancode-srgb AND (HPND AND LicenseRef-scancode-other-permissive) AND (GPL-1.0-or-later AND LGPL-2.0-or-later) AND (GPL-2.0-only AND LGPL-2.0-or-later)",
    "authority": "https://gitlab.eclipse.org/eclipsefdn/emo-team/iplab/-/issues/19890",
    "source": "https://files.pythonhosted.org/packages/f3/af/c097e544e7bd278333db77933e535098c259609c4eb3b85381109602fb5b/pillow-11.1.0.tar.gz",
    "status": "restricted",
    "scans": [
        {
            "date": "March 4, 2025 at 11:36:48 a.m. GMT",
            "authority": "https://gitlab.eclipse.org/eclipsefdn/emo-team/iplab/-/issues/19890",
            "scancode-version": "31.2.1",
            "licenses-discovered": [
                "LicenseRef-scancode-secret-labs-2011 AND MIT-CMU",
                "LicenseRef-scancode-free-unknown AND MIT-CMU",
                "MIT-CMU",
                "LicenseRef-scancode-secret-labs-2011",
                "CC0-1.0",
                "GPL-3.0-only",
                "GPL-3.0-or-later",
                "MIT",
                "0BSD",
                "MIT-Modern-Variant",
                "TCL",
                "OFL-1.1",
                "Font-exception-2.0 AND GPL-3.0-or-later",
                "Apache-2.0 AND Font-exception-2.0 AND GPL-3.0-only AND LGPL-2.1-only AND MIT AND OFL-1.1",
                "Apache-2.0",
                "Bitstream-Vera",
                "LicenseRef-scancode-srgb",
                "HPND AND LicenseRef-scancode-other-permissive",
                "GPL-1.0-or-later AND LGPL-2.0-or-later",
                "GPL-2.0-only AND LGPL-2.0-or-later"
            ],
            "copyrights": [
                "(c) Tavmjung Bah",
                "Copyright (c) 1987 Adobe Systems, Inc.",
                "Copyright (c) 1987-1994 The Regents of the University of California",
                "Copyright (c) 1993-1996 Lucent Technologies",
                "Copyright (c) 1994-1998 Sun Microsystems, Inc.",
                "Copyright (c) 1995 by Fredrik Lundh",
                "Copyright (c) 1995-1996 by Fredrik Lundh",
                "Copyright (c) 1995-1997 by Fredrik Lundh",
                "Copyright (c) 1995-2001 by Fredrik Lundh",
                "Copyright (c) 1995-2001 by Secret Labs AB",
                "Copyright (c) 1995-2002 by Fredrik Lundh",
                "Copyright (c) 1995-2003 by Fredrik Lundh",
                "Copyright (c) 1995-2004 by Fredrik Lundh",
                "Copyright (c) 1995-2005 by Fredrik Lundh",
                "Copyright (c) 1995-2006 by Fredrik Lundh",
                "Copyright (c) 1995-2009 by Fredrik Lundh",
                "Copyright (c) 1995-2011 by Fredrik Lundh and contributors",
                "Copyright (c) 1995-96 by Fredrik Lundh",
                "Copyright (c) 1996 by Fredrik Lundh",
                "Copyright (c) 1996-1997 by Fredrik Lundh",
                "Copyright (c) 1996-2000 Fredrik Lundh",
                "Copyright (c) 1996-2000 by Fredrik Lundh",
                "Copyright (c) 1996-2003 by Fredrik Lundh",
                "Copyright (c) 1996-2004 by Fredrik Lundh",
                "Copyright (c) 1996-2006 by Fredrik Lundh",
                "Copyright (c) 1997 by Fredrik Lundh",
                "Copyright (c) 1997 by Secret Labs AB.",
                "Copyright (c) 1997-1998 by Fredrik Lundh",
                "Copyright (c) 1997-1998 by Secret Labs AB",
                "Copyright (c) 1997-1999 by Secret Labs AB",
                "Copyright (c) 1997-2000 by Secret Labs AB",
                "Copyright (c) 1997-2001 by Secret Labs AB",
                "Copyright (c) 1997-2001 by Secret Labs AB.",
                "Copyright (c) 1997-2002 by Secret Labs AB.",
                "Copyright (c) 1997-2003 by Fredrik Lundh",
                "Copyright (c) 1997-2003 by Secret Labs AB",
                "Copyright (c) 1997-2003 by Secret Labs AB.",
                "Copyright (c) 1997-2004 by Secret Labs AB",
                "Copyright (c) 1997-2004 by Secret Labs AB.",
                "Copyright (c) 1997-2005 by Fredrik Lundh",
                "Copyright (c) 1997-2005 by Secret Labs AB",
                "Copyright (c) 1997-2005 by Secret Labs AB.",
                "Copyright (c) 1997-2006 by Secret Labs AB",
                "Copyright (c) 1997-2006 by Secret Labs AB.",
                "Copyright (c) 1997-2007 Adobe Systems, Inc.",
                "Copyright (c) 1997-2009 by Secret Labs AB",
                "Copyright (c) 1997-2009 by Secret Labs AB.",
                "Copyright (c) 1997-2011 by Secret Labs AB",
                "Copyright (c) 1997-98 by Secret Labs AB.",
                "Copyright (c) 1997-99 by Secret Labs AB.",
                "Copyright (c) 1998 by Secret Labs AB",
                "Copyright (c) 1998 by Toby J Sargeant",
                "Copyright (c) 1998-2000 Secret Labs AB",
                "Copyright (c) 1998-2000 by Scriptics Corporation",
                "Copyright (c) 1998-2001 Marti Maria",
                "Copyright (c) 1998-2003 by Fredrik Lundh",
                "Copyright (c) 1998-2003 by Secret Labs AB.",
                "Copyright (c) 1998-2004 by Secret Labs AB.",
                "Copyright (c) 1998-2005 by Secret Labs AB",
                "Copyright (c) 1998-2007 by Secret Labs AB",
                "Copyright (c) 1999 by Secret Labs AB.",
                "Copyright (c) 1999-2005 by Secret Labs AB",
                "Copyright (c) 2000-2003 by Fredrik Lundh",
                "Copyright (c) 2000-2006 Adobe Systems, Inc.",
                "Copyright (c) 2001-2002 by Fredrik Lundh",
                "Copyright (c) 2001-2002 by Secret Labs AB",
                "Copyright (c) 2001-2004 by Fredrik Lundh",
                "Copyright (c) 2001-2004 by Secret Labs AB",
                "Copyright (c) 2002 by Fredrik Lundh",
                "Copyright (c) 2002 by Kevin B. Kenny",
                "Copyright (c) 2002 by Secret Labs AB",
                "Copyright (c) 2002-2003 Kevin Cazabon",
                "Copyright (c) 2002-2003 Kevin Cazabon kevin@cazabon.com https://www.cazabon.com",
                "Copyright (c) 2002-2004 by Fredrik Lundh",
                "Copyright (c) 2002-2004 by Secret Labs AB",
                "Copyright (c) 2002-2017, and GNU",
                "Copyright (c) 2003 by Bitstream, Inc.",
                "Copyright (c) 2003 by Fredrik Lundh",
                "Copyright (c) 2003 by Secret Labs AB",
                "Copyright (c) 2003-2005 by Fredrik Lundh",
                "Copyright (c) 2003-2005 by Secret Labs AB",
                "Copyright (c) 2004 by Bob Ippolito",
                "Copyright (c) 2004 by Fredrik Lundh",
                "Copyright (c) 2004 by Health Research Inc.",
                "Copyright (c) 2004 by Secret Labs",
                "Copyright (c) 2004 by Secret Labs AB.",
                "Copyright (c) 2004 by William Baxter",
                "Copyright (c) 2005 by Fredrik Lundh",
                "Copyright (c) 2006 by Fredrik Lundh",
                "Copyright (c) 2006 by Secret Labs AB",
                "Copyright (c) 2006 by Secret Labs AB.",
                "Copyright (c) 2006 by Tavmjong Bah",
                "Copyright (c) 2008 by Karsten Hiddemann",
                "Copyright (c) 2009 Fredrik Lundh",
                "Copyright (c) 2009 by Fredrik Lundh",
                "Copyright (c) 2010 Oliver Tonnhofer <olt@bogosoft.com>",
                "Copyright (c) 2010 by Jeffrey A. Clark and contributors",
                "Copyright (c) 2011 Google, Inc.",
                "Copyright (c) 2012 by Brian Crowell",
                "Copyright (c) 2013 Eric Soroos",
                "Copyright (c) 2013 by Eric Soroos",
                "Copyright (c) 2014 Alastair Houghton",
                "Copyright (c) 2014 Coriolis Systems Limited",
                "Copyright (c) 2014 Dov Grobgeld <dov.grobgeld@gmail.com>",
                "Copyright (c) 2014 by Alastair Houghton",
                "Copyright (c) 2014 by Coriolis Systems Limited",
                "Copyright (c) 2015 Information Technology",
                "Copyright (c) 2016 Marcin Kurczewski <rr-@sakuya.pl>",
                "Copyright (c) 2016 by Mickael Bonfill",
                "Copyright (c) 2016-2023 Khaled Hosny <khaled@aliftype.com>",
                "Copyright (c) 2018 Dimitar Toshkov Zhekov",
                "Copyright (c) 2018 Google LLC",
                "Copyright (c) 2018 Roel Nieskens, https://pixelambacht.nl",
                "Copyright (c) 2020 Free Software Foundation, Inc.",
                "Copyright (c) 2020 by Pan Jing",
                "Copyright (c) Eric Soroos 2016",
                "Copyright (c) Eric Soroos 2017",
                "Copyright (c) Fredrik Lundh 1994",
                "Copyright (c) Fredrik Lundh 1995",
                "Copyright (c) Fredrik Lundh 1995-1997",
                "Copyright (c) Fredrik Lundh 1995-2003",
                "Copyright (c) Fredrik Lundh 1995-96",
                "Copyright (c) Fredrik Lundh 1995-97",
                "Copyright (c) Fredrik Lundh 1996",
                "Copyright (c) Fredrik Lundh 1996-2001",
                "Copyright (c) Fredrik Lundh 1996-2003",
                "Copyright (c) Fredrik Lundh 1996-97",
                "Copyright (c) Fredrik Lundh 1997",
                "Copyright (c) Fredrik Lundh 1997-2004",
                "Copyright (c) Fredrik Lundh 1999",
                "Copyright (c) Fredrik Lundh 2009",
                "Copyright (c) Mickael Bonfill 2017",
                "Copyright (c) Secret Labs AB 1997",
                "Copyright (c) Secret Labs AB 1997-2001",
                "Copyright (c) Secret Labs AB 1997-2002",
                "Copyright (c) Secret Labs AB 1997-2003",
                "Copyright (c) Secret Labs AB 1997-2004",
                "Copyright (c) Secret Labs AB 1997-2005",
                "Copyright (c) Secret Labs AB 1997-98",
                "Copyright (c) Secret Labs AB 1997-99",
                "Copyright (c) Secret Labs AB 1998",
                "Copyright (c) Secret Labs AB 1999",
                "Copyright (c) Secret Labs AB 2002",
                "Copyright (c) Secret Labs AB 2002-2004",
                "Copyright (c) Secret Labs AB 2008",
                "Copyright 1984, 1987 Adobe Systems, Inc.",
                "Copyright 1987-2001 Adobe Systems Incorporated",
                "Copyright 1987-2004 Adobe Systems Incorporated",
                "Copyright 1987-2006 Adobe Systems Incorporated",
                "Copyright 1997-2006 Adobe Systems Incorporated",
                "Copyright 2002, 2003, 2005, 2008, 2009, 2010, 2012 GNU Freefont contributors",
                "Copyright 2002, 2003, 2005, 2008, 2009, 2010, 2012 GNU Freefont contributors. FreeMono FreeMono",
                "Copyright 2007 International Color Consortium",
                "Copyright 2008 The Bungee Project",
                "Copyright 2014 Google Inc.",
                "Copyright 2014, 2015 Adobe Systems Incorporated (http://www.adobe.com/).Noto Sans JP RegularRegular1.004 GOOG NotoSansJP-Regular ADOBEVersion",
                "Copyright 2016 Adobe (http://www.adobe.com/).Adobe Variable Font PrototypeRegular1.004 ADBO AdobeVFPrototype-Default ADOBEVersion",
                "Copyright 2016 Google Inc.",
                "Copyright 2018 by Jack Halten Fahnestock",
                "Copyright 2020 Google LLC",
                "Copyright International Color Consortium, 2009",
                "Portions Copyright 1988 Digital Equipment Corp.",
                "Portions Copyright 1988 Digital Equipment Corporation",
                "Portions copyright 1997, 2009, 2011 American Mathematical Society <http://www.ams.org>",
                "Portions copyright 2015, Khaled Hosny",
                "copyright (c) 1991-1995, Thomas G. Lane",
                "copyright 1995-2011 Fredrik Lundh and contributors, 2010 Jeffrey A. Clark and contributors",
                "copyright 2003 kevin_cazabon@hotmail.com kevin@cazabon.com",
                "copyright 2010-2011, Google Corporation.Open Sans Condensed LightItalic1.10 1ASC OpenSansCondensed-LightItalicOpen Sans Condensed Light ItalicVersion",
                "copyrighted by the Regents of the University of California, Sun Microsystems, Inc., Scriptics Corporation"
            ],
            "file-count": 1679,
            "sha256": "368da70808b36d73b4b390a8ffac11069f8a5c85f29eff1f1b01bcf3ef5b2a20",
            "source": "https://files.pythonhosted.org/packages/f3/af/c097e544e7bd278333db77933e535098c259609c4eb3b85381109602fb5b/pillow-11.1.0.tar.gz",
            "status": "restricted"
        }
    ]
}