{
    "id": "maven/mavencentral/org.apache.kafka/kafka-metadata/2.8.2",
    "license": "Apache-2.0",
    "authority": "https://gitlab.eclipse.org/eclipsefdn/emo-team/iplab/-/issues/6521",
    "source": "https://search.maven.org/remotecontent?filepath=org/apache/kafka/kafka-metadata/2.8.2/kafka-metadata-2.8.2-sources.jar",
    "status": "approved",
    "scans": [
        {
            "date": "January 24, 2023 at 12:29:47 a.m. GMT",
            "authority": "https://gitlab.eclipse.org/eclipsefdn/emo-team/iplab/-/issues/6521",
            "scancode-version": "31.2.1",
            "licenses-discovered": [
                "Apache-2.0"
            ],
            "copyrights": [
            ],
            "file-count": 92,
            "sha256": "d50bbce91a755292683b2e45184c3c9f64cb4e6512e301c3415ccddc0fcac05f",
            "source": "https://search.maven.org/remotecontent?filepath=org/apache/kafka/kafka-metadata/2.8.2/kafka-metadata-2.8.2-sources.jar",
            "status": "approved"
        }
    ]
}