{
    "id": "maven/mavencentral/org.webjars.npm/d3-timer/1.0.9",
    "license": "BSD-3-Clause",
    "authority": "https://gitlab.eclipse.org/eclipsefdn/emo-team/iplab/-/issues/6826",
    "source": "https://search.maven.org/remotecontent?filepath=org/webjars/npm/d3-timer/1.0.9/d3-timer-1.0.9-sources.jar",
    "status": "approved",
    "scans": [
        {
            "date": "January 27, 2023 at 9:07:29 p.m. GMT",
            "authority": "https://gitlab.eclipse.org/eclipsefdn/emo-team/iplab/-/issues/6826",
            "scancode-version": "31.2.1",
            "licenses-discovered": [
            ],
            "copyrights": [
            ],
            "file-count": 0,
            "sha256": "8739c76e681f900923b900c9df0ef75cf421d39cabb54650c4b9ad19b6a76d85",
            "source": "https://search.maven.org/remotecontent?filepath=org/webjars/npm/d3-timer/1.0.9/d3-timer-1.0.9-sources.jar",
            "status": "restricted"
        }
    ]
}
