{
    "id": "npm/npmjs/@tanstack/query-core/5.20.5",
    "license": "MIT",
    "authority": "https://gitlab.eclipse.org/eclipsefdn/emo-team/iplab/-/issues/13326",
    "source": "https://github.com/TanStack/query/archive/refs/tags/v5.20.5.zip",
    "status": "approved",
    "scans": [
        {
            "date": "February 20, 2024 at 8:24:01 a.m. GMT",
            "authority": "https://gitlab.eclipse.org/eclipsefdn/emo-team/iplab/-/issues/13326",
            "scancode-version": "31.2.1",
            "licenses-discovered": [
                "MIT"
            ],
            "copyrights": [
                "Copyright (c) 2021-present Tanner Linsley"
            ],
            "file-count": 1261,
            "sha256": "8eae7979e89fb075f6d511725bcb1a2a359e8ca8add0ca705e38eaec1b8bdd42",
            "source": "https://github.com/TanStack/query/archive/refs/tags/v5.20.5.zip",
            "status": "approved"
        }
    ]
}