{
    "id": "maven/mavencentral/bouncycastle/bcprov-jdk15/136",
    "license": "MIT",
    "licenses-discovered": [
        "MIT",
        "LicenseRef-scancode-proprietary-license"
    ],
    "copyrights": [
        "Copyright (c) The Legion Of The Bouncy Castle (http://www.bouncycastle.org)",
        "Copyright Dr B. R Gladman (gladman@seven77.demon.co.uk) and Sam Simpson (s.simpson@mia.co.uk)"
    ],
    "file-count": 1597,
    "scancode-version": "30.1.0",
    "authority": "https://gitlab.eclipse.org/eclipsefdn/emo-team/iplab/-/issues/2739",
    "source": "https://search.maven.org/remotecontent?filepath=bouncycastle/bcprov-jdk15/136/bcprov-jdk15-136-sources.jar",
    "status": "approved"
}
