{
    "id": "project/technology.xfsc/eclipse-xfsc-tsa/task/489e4e947255443ef60dc6ebb4e4ccd5d9ad08a3",
    "license": "Apache-2.0 AND BSD-2-Clause AND BSD-3-Clause AND MIT AND ISC AND MPL-2.0 AND LicenseRef-google-patent-license-golang",
    "authority": "https://gitlab.eclipse.org/eclipsefdn/emo-team/iplab/-/issues/9585",
    "source": "https://gitlab.eclipse.org/api/v4/projects/eclipse%2Fxfsc%2Ftsa%2Ftask/repository/archive.zip?sha=489e4e947255443ef60dc6ebb4e4ccd5d9ad08a3",
    "status": "approved",
    "scans": [
        {
            "date": "July 18, 2023 at 7:56:38 a.m. GMT",
            "authority": "https://gitlab.eclipse.org/eclipsefdn/emo-team/iplab/-/issues/9585",
            "scancode-version": "31.2.1",
            "licenses-discovered": [
                "Apache-2.0 AND BSD-3-Clause AND MIT",
                "Apache-2.0",
                "Apache-2.0 AND BSD-3-Clause AND MIT AND MPL-2.0 AND Unlicense",
                "MIT",
                "BSD-3-Clause AND MIT",
                "ISC",
                "ISC AND MIT",
                "BSD-3-Clause",
                "BSD-2-Clause",
                "MPL-2.0",
                "Apache-2.0 AND MIT"
            ],
            "copyrights": [
                "(c) 2017 Joachim Wester",
                "(c) 2021 Denis Pushkarev",
                "(c) Cure53 and other contributors",
                "(c) Sindre Sorhus",
                "Copyright (c) 2006 Google Inc. http://code.google.com/p/google-diff-match-patch",
                "Copyright (c) 2006-2010 Kirill Simonov",
                "Copyright (c) 2006-2011 Kirill Simonov",
                "Copyright (c) 2009 The Go Authors",
                "Copyright (c) 2009,2014 Google Inc.",
                "Copyright (c) 2011 The Snappy-Go Authors",
                "Copyright (c) 2011, Open Knowledge Foundation Ltd.",
                "Copyright (c) 2011-2019 Canonical Ltd",
                "Copyright (c) 2012 The Go Authors",
                "Copyright (c) 2012-2013 TJ Holowaychuk",
                "Copyright (c) 2012-2014 Roman Shtylman",
                "Copyright (c) 2012-2016 Dave Collins <dave@davec.name>",
                "Copyright (c) 2012-2016 The go-diff Authors",
                "Copyright (c) 2012-2016 The go-diff authors",
                "Copyright (c) 2012-2020 Mat Ryer, Tyler Bunnell and contributors",
                "Copyright (c) 2013 Blake Mizerany",
                "Copyright (c) 2013 Julien Schmidt",
                "Copyright (c) 2013 Kelsey Hightower",
                "Copyright (c) 2013 The Gorilla WebSocket Authors",
                "Copyright (c) 2013, Patrick Mezard",
                "Copyright (c) 2013, Yann Collet",
                "Copyright (c) 2013-2014 The btcsuite",
                "Copyright (c) 2013-2016 Dave Collins <dave@davec.name>",
                "Copyright (c) 2013-2017 The btcsuite",
                "Copyright (c) 2013-2018 Viacheslav Lotsmanov",
                "Copyright (c) 2013-2022 Dave Collins",
                "Copyright (c) 2013-present, Facebook, Inc.",
                "Copyright (c) 2014 Cenk Alti",
                "Copyright (c) 2014 Chris Hines",
                "Copyright (c) 2014 youmark",
                "Copyright (c) 2014,2015 Daniel Imfeld",
                "Copyright (c) 2014-2015, Jon Schlinkert",
                "Copyright (c) 2014-present, Facebook, Inc.",
                "Copyright (c) 2015 Andreas Lubbe",
                "Copyright (c) 2015 Douglas Christopher Wilson",
                "Copyright (c) 2015 Klaus Post",
                "Copyright (c) 2015 Raphael Simon and goa Contributors",
                "Copyright (c) 2015 The btcsuite",
                "Copyright (c) 2015 Tiancheng Timothy Gu",
                "Copyright (c) 2015 lestrrat",
                "Copyright (c) 2015, Dave Cheney <dave@cheney.net>",
                "Copyright (c) 2015-2016 Dave Collins <dave@davec.name>",
                "Copyright (c) 2015-2016 The Decred developers",
                "Copyright (c) 2015-2020 The Decred developers",
                "Copyright (c) 2015-2022 The Decred developers",
                "Copyright (c) 2015-present, Facebook, Inc.",
                "Copyright (c) 2016 Caleb Spare",
                "Copyright (c) 2016 Kelsey Hightower and others",
                "Copyright (c) 2016 Michael Fellinger",
                "Copyright (c) 2016 Uber Technologies, Inc.",
                "Copyright (c) 2016-2017 Uber Technologies, Inc.",
                "Copyright (c) 2016-present, Facebook, Inc.",
                "Copyright (c) 2017 Evgeny Poberezkin",
                "Copyright (c) 2017 The Go Authors",
                "Copyright (c) 2017 The Lightning Network",
                "Copyright (c) 2017 Uber Technologies, Inc.",
                "Copyright (c) 2018 Jed Watson",
                "Copyright (c) 2018 The Go Authors",
                "Copyright (c) 2019 Klaus Post",
                "Copyright (c) 2019 The Go Authors",
                "Copyright (c) 2019 Uber Technologies, Inc.",
                "Copyright (c) 2020 Masaaki Goshima",
                "Copyright (c) 2020 The Decred developers",
                "Copyright (c) 2020 The Go Authors",
                "Copyright (c) 2020 Uber Technologies, Inc.",
                "Copyright (c) 2020 lestrrat-go",
                "Copyright (c) 2020-2022 The Decred developers",
                "Copyright (c) 2021 The Go Authors",
                "Copyright (c) 2021 Uber Technologies, Inc.",
                "Copyright (c) 2021 lestrrat-go",
                "Copyright (c) 2022 lestrrat",
                "Copyright (c) Facebook, Inc. and its affiliates",
                "Copyright (c) Microsoft Corporation",
                "Copyright (c) MongoDB, Inc. 2017-present",
                "Copyright (c) MongoDB, Inc. 2018-present",
                "Copyright (c) MongoDB, Inc. 2019-present",
                "Copyright (c) MongoDB, Inc. 2021-present",
                "Copyright (c) Uber Technologies, Inc.",
                "Copyright 2008 Google Inc.",
                "Copyright 2009 The Go Authors",
                "Copyright 2009,2010 The Go Authors",
                "Copyright 2010 - 2013 Sami Samhuri <sami@samhuri.net>",
                "Copyright 2010 The Go Authors",
                "Copyright 2011 Google Inc.",
                "Copyright 2011 The Go Authors",
                "Copyright 2011 The Snappy-Go Authors",
                "Copyright 2012 The Go Authors",
                "Copyright 2013 Julien Schmidt",
                "Copyright 2013 Matt T. Proud",
                "Copyright 2013 The Go Authors",
                "Copyright 2013 The Gorilla WebSocket Authors",
                "Copyright 2013 The Prometheus Authors",
                "Copyright 2013-2014 The btcsuite",
                "Copyright 2014 Google Inc.",
                "Copyright 2014 Prometheus Team",
                "Copyright 2014 The Go Authors",
                "Copyright 2014 The Prometheus Authors",
                "Copyright 2014 Zachary Klippenstein",
                "Copyright 2015 Google Inc.",
                "Copyright 2015 The Go Authors",
                "Copyright 2015 The Prometheus Authors",
                "Copyright 2015 The btcsuite",
                "Copyright 2015, Yahoo! Inc.",
                "Copyright 2015-2018 Gabor Lenard",
                "Copyright 2016 Google Inc.",
                "Copyright 2016 The Go Authors",
                "Copyright 2016 The Gorilla WebSocket Authors",
                "Copyright 2016 The Prometheus Authors",
                "Copyright 2016 The Snappy-Go Authors",
                "Copyright 2016 The filepathx",
                "Copyright 2016-2017 The New York Times Company",
                "Copyright 2017 Google Inc.",
                "Copyright 2017 Prometheus Team",
                "Copyright 2017 Roger Luethi",
                "Copyright 2017 The Go Authors",
                "Copyright 2017 The Gorilla WebSocket Authors",
                "Copyright 2017 The Prometheus Authors",
                "Copyright 2018 Google Inc.",
                "Copyright 2018 Google LLC.",
                "Copyright 2018 Klaus Post",
                "Copyright 2018 The Go Authors",
                "Copyright 2018 The Prometheus Authors",
                "Copyright 2018 by David A. Golden",
                "Copyright 2019 The Go Authors",
                "Copyright 2019 The Gorilla WebSocket Authors",
                "Copyright 2019 The Prometheus Authors",
                "Copyright 2020 The Go Authors",
                "Copyright 2020 The Prometheus Authors",
                "Copyright 2020+ Klaus Post",
                "Copyright 2020-2022 The Decred developers",
                "Copyright 2021 Google Inc.",
                "Copyright 2021 The Go Authors",
                "Copyright 2021 The Prometheus Authors",
                "Copyright 2021 by David A. Golden",
                "Copyright 2022 The Go Authors",
                "Copyright 2022 The Prometheus Authors",
                "Copyright 2022 Vereign AG",
                "Copyright Angel Marin, Paul Johnston 2000 - 2009. Other contributors Greg Holt, Andrew Kepert, Ydnar, Lostinet",
                "Copyright Jeremy Ashkenas, DocumentCloud and Investigative Reporters & Editors",
                "Copyright Joyent, Inc. and other Node contributors",
                "Copyright Paul Johnston 2000 - 2002. Other contributors Greg Holt, Andrew Kepert, Ydnar, Lostinet",
                "Copyright by its contributors",
                "Copyright jQuery Foundation and other contributors <https://jquery.org/>",
                "copyright (c) 2021 Denis Pushkarev"
            ],
            "file-count": 1855,
            "sha256": "d28c036e6d2d5ea240e63995ca0b4162805e88176e467439567e509db546bc33",
            "source": "https://gitlab.eclipse.org/api/v4/projects/eclipse%2Fxfsc%2Ftsa%2Ftask/repository/archive.zip?sha=489e4e947255443ef60dc6ebb4e4ccd5d9ad08a3",
            "status": "restricted"
        }
    ]
}
