{
    "id": "npm/npmjs/-/vscode-uri/3.1.0",
    "license": "MIT",
    "authority": "https://gitlab.eclipse.org/eclipsefdn/emo-team/iplab/-/issues/19347",
    "source": "https://github.com/microsoft/vscode-uri/archive/refs/tags/v3.1.0.zip",
    "status": "approved",
    "scans": [
        {
            "date": "February 6, 2025 at 8:22:35 a.m. GMT",
            "authority": "https://gitlab.eclipse.org/eclipsefdn/emo-team/iplab/-/issues/19347",
            "scancode-version": "31.2.1",
            "licenses-discovered": [
                "MIT"
            ],
            "copyrights": [
                "Copyright (c) Microsoft",
                "Copyright (c) Microsoft Corporation"
            ],
            "file-count": 22,
            "sha256": "40374f14d8f3481cdd7d5bc8d5b066963be63cc4b6bc0eda28f975d70db80baa",
            "source": "https://github.com/microsoft/vscode-uri/archive/refs/tags/v3.1.0.zip",
            "status": "approved"
        }
    ]
}