{
    "id": "npm/npmjs/@babel/generator/7.22.5",
    "license": "MIT",
    "authority": "https://gitlab.eclipse.org/eclipsefdn/emo-team/iplab/-/issues/9002",
    "source": "https://registry.npmjs.org/@babel/generator/-/generator-7.22.5.tgz",
    "status": "approved",
    "scans": [
        {
            "date": "June 15, 2023 at 2:19:28 p.m. GMT",
            "authority": "https://gitlab.eclipse.org/eclipsefdn/emo-team/iplab/-/issues/9002",
            "scancode-version": "31.2.1",
            "licenses-discovered": [
                "MIT"
            ],
            "copyrights": [
                "Copyright (c) 2014-present Sebastian McKenzie and other contributors"
            ],
            "file-count": 41,
            "sha256": "b481994547024371d95b3fdc9325fa3c0660699dcf9045284777a603061b3cec",
            "source": "https://registry.npmjs.org/@babel/generator/-/generator-7.22.5.tgz",
            "status": "approved"
        }
    ]
}