{
    "id": "maven/mavencentral/org.apache.camel/camel-controlbus/3.21.1",
    "license": "Apache-2.0",
    "authority": "https://gitlab.eclipse.org/eclipsefdn/emo-team/iplab/-/issues/11312",
    "source": "https://repo.maven.apache.org/maven2/org/apache/camel/camel-controlbus/3.21.1/camel-controlbus-3.21.1-sources.jar",
    "status": "approved",
    "scans": [
        {
            "date": "October 26, 2023 at 7:33:57 p.m. GMT",
            "authority": "https://gitlab.eclipse.org/eclipsefdn/emo-team/iplab/-/issues/11312",
            "scancode-version": "31.2.1",
            "licenses-discovered": [
                "Apache-2.0"
            ],
            "copyrights": [
            ],
            "file-count": 16,
            "sha256": "17fe270e8bdccd3aa4e322ddd458bbddd12bac62acd15f311e88ae51cde862d1",
            "source": "https://repo.maven.apache.org/maven2/org/apache/camel/camel-controlbus/3.21.1/camel-controlbus-3.21.1-sources.jar",
            "status": "approved"
        }
    ]
}