{
    "id": "maven/mavencentral/com.vaadin/hilla-parser-jvm-plugin-nonnull/24.6.5",
    "license": "Apache-2.0",
    "authority": "https://gitlab.eclipse.org/eclipsefdn/emo-team/iplab/-/issues/19795",
    "source": "https://repo1.maven.org/maven2/com/vaadin/hilla-parser-jvm-plugin-nonnull/24.6.5/hilla-parser-jvm-plugin-nonnull-24.6.5-sources.jar",
    "status": "approved",
    "scans": [
        {
            "date": "March 1, 2025 at 3:22:27 a.m. GMT",
            "authority": "https://gitlab.eclipse.org/eclipsefdn/emo-team/iplab/-/issues/19795",
            "scancode-version": "31.2.1",
            "licenses-discovered": [
                "Apache-2.0"
            ],
            "copyrights": [
            ],
            "file-count": 7,
            "sha256": "f78469193350e8f7da2911003ee7b327c0070c3c3b5ab4db4175b826122a1593",
            "source": "https://repo1.maven.org/maven2/com/vaadin/hilla-parser-jvm-plugin-nonnull/24.6.5/hilla-parser-jvm-plugin-nonnull-24.6.5-sources.jar",
            "status": "approved"
        }
    ]
}