{
    "id": "maven/mavencentral/com.google.api.grpc/proto-google-cloud-secretmanager-v1/2.24.0",
    "license": "Apache-2.0",
    "authority": "https://gitlab.eclipse.org/eclipsefdn/emo-team/iplab/-/issues/10571",
    "source": "https://repo.maven.apache.org/maven2/com/google/api/grpc/proto-google-cloud-secretmanager-v1/2.24.0/proto-google-cloud-secretmanager-v1-2.24.0-sources.jar",
    "status": "approved",
    "scans": [
        {
            "date": "September 18, 2023 at 11:09:57 a.m. GMT",
            "authority": "https://gitlab.eclipse.org/eclipsefdn/emo-team/iplab/-/issues/10571",
            "scancode-version": "31.2.1",
            "licenses-discovered": [
                "Apache-2.0"
            ],
            "copyrights": [
                "Copyright 2021 Google LLC",
                "Copyright 2023 Google LLC"
            ],
            "file-count": 58,
            "sha256": "4303a7faa5b50d35df172a20c8b9b696729fba190e581898e211fefbd278c927",
            "source": "https://repo.maven.apache.org/maven2/com/google/api/grpc/proto-google-cloud-secretmanager-v1/2.24.0/proto-google-cloud-secretmanager-v1-2.24.0-sources.jar",
            "status": "approved"
        }
    ]
}