{
    "id": "maven/mavencentral/org.apache.derby/derbyshared/10.17.1.0",
    "license": "Apache-2.0",
    "authority": "https://gitlab.eclipse.org/eclipsefdn/emo-team/iplab/-/issues/11510",
    "source": "https://gitlab.eclipse.org/eclipsefdn/emo-team/iplab/uploads/1aa252dd454922bbbda25957f205759e/org.apache.derby.commons-v10.17.1.zip",
    "status": "approved",
    "scans": [
        {
            "date": "December 1, 2023 at 7:58:25 p.m. GMT",
            "authority": "https://gitlab.eclipse.org/eclipsefdn/emo-team/iplab/-/issues/11510",
            "scancode-version": "31.2.1",
            "licenses-discovered": [
                "Apache-2.0"
            ],
            "copyrights": [
            ],
            "file-count": 46,
            "sha256": "5dc45ebb365d47c14c8d65e7812b3a1cdf1c2691a42733cd81122df73c78f8c6",
            "source": "https://gitlab.eclipse.org/eclipsefdn/emo-team/iplab/uploads/1aa252dd454922bbbda25957f205759e/org.apache.derby.commons-v10.17.1.zip",
            "status": "approved"
        }
    ]
}