{
    "id": "npm/npmjs/-/allure-commandline/2.25.0",
    "license": "Apache-2.0",
    "authority": "https://gitlab.eclipse.org/eclipsefdn/emo-team/iplab/-/issues/12180",
    "source": "https://github.com/allure-framework/allure-npm/archive/refs/tags/2.25.0.zip",
    "status": "approved",
    "scans": [
        {
            "date": "December 20, 2023 at 4:24:45 a.m. GMT",
            "authority": "https://gitlab.eclipse.org/eclipsefdn/emo-team/iplab/-/issues/12180",
            "scancode-version": "31.2.1",
            "licenses-discovered": [
                "Apache-2.0"
            ],
            "copyrights": [
                "Copyright 2021 Qameta Software"
            ],
            "file-count": 15,
            "sha256": "ae819f2c75ee54479998b84d4a58d1f6d099deb25712fc3910e0a2d4c150f35f",
            "source": "https://github.com/allure-framework/allure-npm/archive/refs/tags/2.25.0.zip",
            "status": "approved"
        }
    ]
}