{
    "id": "pypi/pypi/-/extractcode/31.0.0",
    "license": "Apache-2.0 AND (Apache-2.0 AND BSD-3-Clause AND GPL-1.0-or-later AND LGPL-2.0-or-later) AND MIT AND (BSD-2-Clause-Views AND MIT) AND (Apache-2.0 AND GPL-3.0-only AND MIT) AND GPL-3.0-only AND Zlib AND GPL-1.0-or-later AND GPL-2.0-only AND LGPL-2.0-or-later AND GPL-2.0-or-later AND NIST-PD AND (BSD-3-Clause AND BSD-4-Clause AND LicenseRef-scancode-bsd-simplified-darwin) AND (GPL-1.0-or-later AND LGPL-2.1-or-later) AND EPL-1.0 AND AGPL-3.0-or-later AND (AGPL-3.0-only AND GPL-3.0-only) AND (AGPL-3.0-or-later AND ISC) AND (BSD-3-Clause AND GPL-2.0-only) AND (FSFUL AND GPL-2.0-only AND LGPL-2.0-or-later AND LicenseRef-scancode-autoconf-simple-exception-2.0 AND LicenseRef-scancode-other-copyleft AND LicenseRef-scancode-other-permissive) AND PSF-2.0 AND Python-2.0 AND LicenseRef-scancode-other-permissive AND (GPL-2.0-or-later AND LicenseRef-scancode-autoconf-simple-exception-2.0 AND LicenseRef-scancode-free-unknown) AND FSFUL AND NTP AND BSD-3-Clause AND (BSD-3-Clause AND DOC) AND LicenseRef-scancode-svndiff AND LGPL-2.0-only AND (GPL-2.0-or-later AND LicenseRef-scancode-other-permissive) AND MIT-Modern-Variant AND CC-PDDC AND LicenseRef-scancode-ms-net-library AND (BSD-3-Clause AND LicenseRef-scancode-proprietary-license) AND (Apache-2.0 AND BSD-3-Clause AND CC-BY-4.0 AND EPL-1.0 AND GPL-1.0-or-later AND LGPL-2.0-or-later AND LicenseRef-scancode-proprietary-license AND SPL-1.0) AND (OSL-2.1 AND OSL-3.0) AND (Apache-1.1 AND Apache-2.0 AND ZPL-2.0 AND ZPL-2.1) AND CDDL-1.0 AND (GPL-2.0-only AND GPL-3.0-only AND LicenseRef-scancode-other-permissive) AND LicenseRef-scancode-other-copyleft AND (BSD-3-Clause AND GPL-2.0-only AND LGPL-2.1-only) AND LicenseRef-scancode-unknown",
    "authority": "https://gitlab.eclipse.org/eclipsefdn/emo-team/iplab/-/issues/4793",
    "source": "https://files.pythonhosted.org/packages/58/24/40848587ae0f03ec6da2ae8a28b7ace7219fcbad0bc74e84c582324208ed/extractcode-31.0.0.tar.gz",
    "status": "restricted",
    "scans": [
        {
            "date": "November 10, 2022 at 8:12:21 p.m. GMT",
            "authority": "https://gitlab.eclipse.org/eclipsefdn/emo-team/iplab/-/issues/4793",
            "scancode-version": "31.2.1",
            "licenses-discovered": [
                "Apache-2.0",
                "Apache-2.0 AND BSD-3-Clause AND GPL-1.0-or-later AND LGPL-2.0-or-later",
                "MIT",
                "BSD-2-Clause-Views AND MIT",
                "Apache-2.0 AND GPL-3.0-only AND MIT",
                "GPL-3.0-only",
                "Zlib",
                "GPL-1.0-or-later",
                "GPL-2.0-only",
                "LGPL-2.0-or-later",
                "GPL-2.0-or-later",
                "NIST-PD",
                "BSD-3-Clause AND BSD-4-Clause AND LicenseRef-scancode-bsd-simplified-darwin",
                "GPL-1.0-or-later AND LGPL-2.1-or-later",
                "EPL-1.0",
                "AGPL-3.0-or-later",
                "AGPL-3.0-only AND GPL-3.0-only",
                "AGPL-3.0-or-later AND ISC",
                "BSD-3-Clause AND GPL-2.0-only",
                "FSFUL AND GPL-2.0-only AND LGPL-2.0-or-later AND LicenseRef-scancode-autoconf-simple-exception-2.0 AND LicenseRef-scancode-other-copyleft AND LicenseRef-scancode-other-permissive",
                "PSF-2.0",
                "Python-2.0",
                "LicenseRef-scancode-other-permissive",
                "GPL-2.0-or-later AND LicenseRef-scancode-autoconf-simple-exception-2.0 AND LicenseRef-scancode-free-unknown",
                "FSFUL",
                "NTP",
                "BSD-3-Clause",
                "BSD-3-Clause AND DOC",
                "LicenseRef-scancode-svndiff",
                "LGPL-2.0-only",
                "GPL-2.0-or-later AND LicenseRef-scancode-other-permissive",
                "MIT-Modern-Variant",
                "CC-PDDC",
                "LicenseRef-scancode-ms-net-library",
                "BSD-3-Clause AND LicenseRef-scancode-proprietary-license",
                "Apache-2.0 AND BSD-3-Clause AND CC-BY-4.0 AND EPL-1.0 AND GPL-1.0-or-later AND LGPL-2.0-or-later AND LicenseRef-scancode-proprietary-license AND SPL-1.0",
                "OSL-2.1 AND OSL-3.0",
                "Apache-1.1 AND Apache-2.0 AND ZPL-2.0 AND ZPL-2.1",
                "CDDL-1.0",
                "GPL-2.0-only AND GPL-3.0-only AND LicenseRef-scancode-other-permissive",
                "LicenseRef-scancode-other-copyleft",
                "BSD-3-Clause AND GPL-2.0-only AND LGPL-2.1-only",
                "LicenseRef-scancode-unknown"
            ],
            "copyrights": [
                "(c) 1985-1995 Ian F. Darwin",
                "(c) 1987, 88, 89, 90, 91, 92, 93, 94 Free Software Foundation",
                "(c) 1990 The Regents of the University of California",
                "(c) 1994-2008 Christos Zoulas <christos@zoulas.com>",
                "(c) 1995-2004 Jean-loup Gailly and Mark Adler",
                "(c) 1996 Ignatios Souvatzis",
                "(c) 1997-2001",
                "(c) 2000 Frank Strauss <strauss@ibr.cs.tu-bs.de>",
                "(c) 2004 Marc Haber and Joerg Hoh",
                "(c) 2004 Marc Haber e Joerg Hoh. Este",
                "(c) 2004 Marc Haber e Joerg Hoh. Questa",
                "(c) 2004 Marc Haber et Joerg Hoh. Cette",
                "(c) 2004 Marc Haber i Joerg Hoh. Ta",
                "(c) 2004 Marc Haber och Joerg Hoh. Denna",
                "(c) 2004 Marc Haber og Joerg Hoh. Denne",
                "(c) 2004 Marc Haber und Joerg Hoh. Diese Handbuchseite und das Programm",
                "(c) 2004 Marc Haber y Joerg Hoh. Esta",
                "(c) 2004 Marc Haber. E Joerg Hoh. uOA ODOAxIThIAN OOOAIEAA",
                "(c) 2004 Marc Haber. i Joerg Hoh. Eta",
                "(c) 2007-2008 Daniel Baumann <daniel@debian.org>",
                "(c) 2008-2010 Josue Abarca <jmaslibre@debian.org.gt>",
                "(c) Apple Computer 1990",
                "(c) CERN 1990, 1991",
                "(c) CERN WorldWideWeb project 1990,91",
                "(c) Copyright CERN 1991",
                "(c) Microsoft Corporation",
                "(c) caLYedi*e (c) A I",
                "COPYRIGHT (c) 1987 Kamal Al-Yahya",
                "Carnegie Mellon University Copyright 1989 TGV",
                "Copyright (2003) Private Company",
                "Copyright (c) 1983 Regents of the University of California",
                "Copyright (c) 1983 Regents of the University of California. X",
                "Copyright (c) 1984, 1989, 1990 Bob Corbett and Richard Stallman X X",
                "Copyright (c) 1985, 1992, 1993, 1994 Free Software Foundation, Inc.",
                "Copyright (c) 1985, 89, 90, 91, 92, 93, 95 Free Software Foundation, Inc.",
                "Copyright (c) 1987, 88, 89, 90, 91, 92, 1993, 1994 X Free Software Foundation, Inc.",
                "Copyright (c) 1987, 88, 89, 90, 91, 92, 93, 94 X Free Software Foundation, Inc.",
                "Copyright (c) 1988, 1990 Free Software Foundation, Inc.",
                "Copyright (c) 1988, 1992 Free Software Foundation, Inc.",
                "Copyright (c) 1988, 1992, 1993, 1994 Free Software Foundation, Inc.",
                "Copyright (c) 1988, 1992, 1994 Free Software Foundation, Inc.",
                "Copyright (c) 1988, 1994 Free Software Foundation, Inc.",
                "Copyright (c) 1989, 1990 Free Software Foundation",
                "Copyright (c) 1989, 1990 Free Software Foundation, Inc.",
                "Copyright (c) 1989, 1991 Free Software Foundation, Inc.",
                "Copyright (c) 1989, 1991, 1993, 1994, 1995 Aladdin Enterprises",
                "Copyright (c) 1989, 90, 91, 92, 93, 94 Free Software Foundation, Inc.",
                "Copyright (c) 1990 Free Software Foundation, Inc.",
                "Copyright (c) 1990, 91, 92, 93, 94 Free Software Foundation, Inc.",
                "Copyright (c) 1990-1993 The Regents of the University of California",
                "Copyright (c) 1991 Free Software Foundation, Inc.",
                "Copyright (c) 1991, 1992 Free Software Foundation, Inc.",
                "Copyright (c) 1991, 1992, 1993 Free Software Foundation, Inc.",
                "Copyright (c) 1991, 1992, 1993, 1994 Free Software Foundation, Inc.",
                "Copyright (c) 1991, 1992, Free Software Foundation, Inc.",
                "Copyright (c) 1991, 1993, 1994 Free Software Foundation, Inc.",
                "Copyright (c) 1991, 1994, 1995 Free Software Foundation, Inc. Process",
                "Copyright (c) 1991-1993 The Regents of the University of California",
                "Copyright (c) 1992 Free Software Foundation",
                "Copyright (c) 1992 Free Software Foundation, Inc.",
                "Copyright (c) 1992 Joseph Wang (joe@athena.mit.edu)",
                "Copyright (c) 1992, 1993 + The Regents of the University of California",
                "Copyright (c) 1992, 1993 Free Software Foundation, Inc.",
                "Copyright (c) 1992, 1993', + The Regents of the University of California",
                "Copyright (c) 1992, 1993, 1994 Free Software Foundation, Inc.",
                "Copyright (c) 1992, 1993, 1994, 1995 Free Software Foundation, Inc.",
                "Copyright (c) 1992, 1993, 1994, 1995, 1996, 1997, 1998, 1999, 2000, 2001, 2002, 2003, 2004, 2005 Free Software Foundation, Inc.",
                "Copyright (c) 1992, 1994, 1995 Free Software Foundation, Inc.",
                "Copyright (c) 1992-1993 Globewide Network Academy Macvicar Institue for Educational Software Development",
                "Copyright (c) 1992-1993 Globewide Network Academy Macvicar Institute for Educational Software Development",
                "Copyright (c) 1992-1993 The Regents of the University of California",
                "Copyright (c) 1992-1994 Globewide Network Academy Macvicar Institute for Educational Software Development",
                "Copyright (c) 1993 Globewide Network Academy MacVicar Institute for Educational Software Development",
                "Copyright (c) 1993 Globewide Network Academy Macvicar Institute for Educational Software Development",
                "Copyright (c) 1993, 1994, 1995 Free Software Foundation, Inc.",
                "Copyright (c) 1993-1994 Globewide Network Academy Macvicar Institute for Educational Software Development",
                "Copyright (c) 1994 Free Software Foundation, Inc.",
                "Copyright (c) 1994 Ian Murdock",
                "Copyright (c) 1994, 1995 Free Software Foundation, Inc.",
                "Copyright (c) 1995 Free Software Foundation, Inc.",
                "Copyright (c) 1995 Free Software Foundation, Inc. Ulrich Drepper <drepper@gnu.ai.mit.edu> , 1995",
                "Copyright (c) 1995 Ian Murdock",
                "Copyright (c) 1995 Software Foundation, Inc.",
                "Copyright (c) 1995 Ted Hajek",
                "Copyright (c) 1995 Ted Hajek <tedhajek@boombox.micro.umn.edu>",
                "Copyright (c) 1995 Ted Hajek <tedhajek@boombox.micro.umn.edu> Ian A. Murdock <imurdock@gnu.ai.mit.edu>",
                "Copyright (c) 1995 Ted Hajek, O IIOUEIE UAEIOOxIxAIENIE EU IOECEIAIOIICI Debian",
                "Copyright (c) 1995 Ted Hajek. Er",
                "Copyright (c) 1995-2005 Jean-loup Gailly",
                "Copyright (c) 1995-2005 Jean-loup Gailly (jloup@gzip.org) and Mark Adler (madler@alumni.caltech.edu)",
                "Copyright (c) 1995-2005 Jean-loup Gailly and Mark Adler",
                "Copyright (c) 1997, 1998, 1999 Guy Maor",
                "Copyright (c) 1997, 1998, 1999 Guy Maor <maor@debian.org>",
                "Copyright (c) 1997, 1998, 1999 Guy Maor. Izmeneniia Ronal'da Bauershmitta (Roland Bauerschmidt)",
                "Copyright (c) 1997, 1998, 1999 Guy Maor. Modificacoes por Roland Bauerschmidt",
                "Copyright (c) 1997, 1998, 1999 Guy Maor. Modifiche di Roland Bauerschmidt e Marc Haber. Ulteriori",
                "Copyright (c) 1997, 1998, 1999 Guy Maor. Modifieringar av Roland Bauerschmidt",
                "Copyright (c) 1997, 1998, 1999 Guy Maor. Modyfikowany przez Rolanda Bauerschmidta",
                "Copyright (c) 1997, 1998, 1999 Guy Maor. Veranderungen durch Roland Bauerschmidt und Marc Haber. Zusatzliche Patches von Joerg Hoh und Stephen Gran",
                "Copyright (c) 1997-2006, International Business Machines + Corporation and others",
                "Copyright (c) 1997-2006, International Business Machines', + Corporation and others",
                "Copyright (c) 1999-2004, John Zaitseff",
                "Copyright (c) 1999-2009 Igor Pavlov",
                "Copyright (c) 1999-2014 Igor Pavlov 2015-01-03",
                "Copyright (c) 1999-2016 Igor Pavlov",
                "Copyright (c) 2000 Roland Bauerschmidt",
                "Copyright (c) 2000 Roland Bauerschmidt <rb@debian.org>",
                "Copyright (c) 2000 Roland Bauerschmidt. Izmeneniia",
                "Copyright (c) 2000 Roland Bauerschmidt. Modificaciones",
                "Copyright (c) 2000 Roland Bauerschmidt. Modificacoes",
                "Copyright (c) 2000 Roland Bauerschmidt. Modifiche",
                "Copyright (c) 2000 Roland Bauerschmidt. Modifieringar",
                "Copyright (c) 2000 Roland Bauerschmidt. Modifikationen",
                "Copyright (c) 2000 Roland Bauerschmidt. Modyfikacje",
                "Copyright (c) 2000-2012 Simon",
                "Copyright (c) 2000-2012 Simon Kelley",
                "Copyright (c) 2001 Company Private Company",
                "Copyright (c) 2001, 2002 Masayuki Ataka <ataka@milk.freemail.ne.jp>",
                "Copyright (c) 2001, 2002, 2003, 2004 Masayuki Ataka <ataka@milk.freemail.ne.jp>",
                "Copyright (c) 2001, 2002, 2003, 2004, 2005, 2006, 2007, 2008 Python Software Foundation",
                "Copyright (c) 2002 Aleph One Ltd. + for Toby Churchill Ltd and Brightstar Engineering",
                "Copyright (c) 2002 Aleph One Ltd.', + for Toby Churchill Ltd and Brightstar",
                "Copyright (c) 2002, 2003, 2004 Masayuki Ataka <ataka@milk.freemail.ne.jp>",
                "Copyright (c) 2002, 2003, 2004, 2005, 2006, 2007 - Phillip Lougher <phillip@lougher.demon.co.uk>",
                "Copyright (c) 2002, 2003, 2004, 2005, 2006, 2007', - Phillip Lougher <phillip@lougher.demon.co.uk>",
                "Copyright (c) 2002, 2003, 2004, 2005, 2006, 2007, 2008 + Phillip Lougher <phillip@lougher.demon.co.uk>",
                "Copyright (c) 2002, 2003, 2004, 2005, 2006, 2007, 2008', + Phillip Lougher <phillip@lougher.demon.co.uk>",
                "Copyright (c) 2002, 2004 Masayuki Ataka <ataka@milk.freemail.ne.jp>",
                "Copyright (c) 2002-2007 Aleph One Ltd. + for Toby Churchill Ltd and Brightstar Engineering",
                "Copyright (c) 2002-2007 Aleph One Ltd.', + for Toby Churchill Ltd and Brightstar",
                "Copyright (c) 2003 Free Software Foundation, Inc.",
                "Copyright (c) 2003 Harikesavan",
                "Copyright (c) 2003 Harikesavan Krishnan",
                "Copyright (c) 2003 Puja",
                "Copyright (c) 2003 Puja Gupta",
                "Copyright (c) 2003, 2004, 2005, 2006 Apple Computer",
                "Copyright (c) 2003, 2004, 2005, 2006 Apple Computer, Inc.",
                "Copyright (c) 2003-2004 Mohammad Nayyer",
                "Copyright (c) 2003-2004 Mohammad Nayyer Zubair",
                "Copyright (c) 2003-2005 Frederico Caldeira Knabben",
                "Copyright (c) 2003-2006 Charles P.",
                "Copyright (c) 2003-2006 Charles P. Wright",
                "Copyright (c) 2003-2008 by nexB, Inc. http://www.nexb.com",
                "Copyright (c) 2003-2009 Erez",
                "Copyright (c) 2003-2009 Erez Zadok",
                "Copyright (c) 2003-2009 Stony Brook",
                "Copyright (c) 2003-2009 Stony Brook University",
                "Copyright (c) 2003-2009 The Research Foundation",
                "Copyright (c) 2003-2009 The Research Foundation of SUNY",
                "Copyright (c) 2004 Akira TAGOH <tagoh@debian.org>",
                "Copyright (c) 2004 Rob Braun",
                "Copyright (c) 2004 USAGI/WIDE Project",
                "Copyright (c) 2004, Rodrigo B. de Oliveira (rbo@acm.org)",
                "Copyright (c) 2004-2006 David P.",
                "Copyright (c) 2004-2006 David P. Quigley",
                "Copyright (c) 2005 Arun M.",
                "Copyright (c) 2005 Arun M. Krishnakumar",
                "Copyright (c) 2005 Jason Evans <jasone@canonware.com>",
                "Copyright (c) 2005 Rob Braun",
                "Copyright (c) 2005-2006 Junjiro",
                "Copyright (c) 2005-2006 Junjiro Okajima",
                "Copyright (c) 2005-2007 Josef Jeff",
                "Copyright (c) 2005-2007 Josef Jeff Sipek",
                "Copyright (c) 2006 - 2008 STMicroelectronics",
                "Copyright (c) 2006 - 2008 STMicroelectronics',",
                "Copyright (c) 2006 </p> , 'JavaToBin.java',",
                "Copyright (c) 2006 Charles P.",
                "Copyright (c) 2006 Charles P. Wright",
                "Copyright (c) 2006 David P.",
                "Copyright (c) 2006 David P. Quigley",
                "Copyright (c) 2006 Junjiro",
                "Copyright (c) 2006 Junjiro Okajima",
                "Copyright (c) 2006 Shaya",
                "Copyright (c) 2006 Shaya Potter",
                "Copyright (c) 2006 VALUE OriginalFilename', abc.exe VALUE ProductName', abc",
                "Copyright (c) 2006, 2007, 2008 STMicroelectronics",
                "Copyright (c) 2006, 2007, 2008 STMicroelectronics', Author Francesco Virlinzi <francesco.virlinzi@st.com>",
                "Copyright (c) 2006-2007 Josef Jeff",
                "Copyright (c) 2006-2007 Josef Jeff Sipek",
                "Copyright (c) 2006-2009 Erez",
                "Copyright (c) 2006-2009 Erez Zadok",
                "Copyright (c) 2006-2009 Stony Brook",
                "Copyright (c) 2006-2009 Stony Brook University",
                "Copyright (c) 2006-2009 The Research Foundation",
                "Copyright (c) 2006-2009 The Research Foundation of SUNY",
                "Copyright (c) 2006-2009 by Cisco Systems",
                "Copyright (c) 2006-2009 by Cisco Systems, Inc.",
                "Copyright (c) 2007 Arno Pahler",
                "Copyright (c) 2007 Free Software Foundation, Inc. <http://fsf.org/>",
                "Copyright (c) 2007-2008 Gokhan Sozmen",
                "Copyright (c) 2007-2009 by Cisco Systems",
                "Copyright (c) 2007-2009 by Cisco Systems, Inc.",
                "Copyright (c) 2008 Ashok Shankar Das ashok.s.das@gmail.com",
                "Copyright (c) 2008 Motorola",
                "Copyright (c) 2008 Motorola, Inc.",
                "Copyright (c) 2008 Motorola, Inc. + Motorola VIP19x3",
                "Copyright (c) 2008 STMicroelectronics Limited",
                "Copyright (c) 2008 by nexB, Inc. http://www.nexb.com",
                "Copyright (c) 2008, Herman Meyer",
                "Copyright (c) 2008, Xavier Basty",
                "Copyright (c) 2008-2009 by nexB, Inc. http://www.nexb.com",
                "Copyright (c) 2008-2010 by nexB, Inc. http://www.nexb.com",
                "Copyright (c) 2008-2011 Motorola",
                "Copyright (c) 2008-2011 Motorola, Inc.",
                "Copyright (c) 2008-2020 The pip",
                "Copyright (c) 2009 Motorola",
                "Copyright (c) 2009 Motorola Inc.",
                "Copyright (c) 2009 Motorola, Inc.",
                "Copyright (c) 2009, International Business Machines",
                "Copyright (c) 2009-2010 sv",
                "Copyright (c) 2009-2010, International Business Machines Corporation and others",
                "Copyright (c) 2009-2011 Motorola",
                "Copyright (c) 2009-2011 Motorola, Inc.",
                "Copyright (c) 2010 David Wolever <david@wolever.net>",
                "Copyright (c) 2010 Kamil Paral",
                "Copyright (c) 2014 Michael Kropat",
                "Copyright (c) 2019 Giovanni Bussi",
                "Copyright (c) 2020 kyp",
                "Copyright (c) Ericsson AB, 2004-2007",
                "Copyright (c) Giovanni Bussi",
                "Copyright (c) William M. Perry (wmperry@indiana.edu)",
                "Copyright (c) by 1987 Kamal Al-Yahya",
                "Copyright (c) http://sublicpse.tigris.org and others",
                "Copyright (c) nexB Inc.",
                "Copyright (c) nexB Inc. and others",
                "Copyright (c) nexB. Inc. and others",
                "Copyright 1983 by the Regents of the University of California",
                "Copyright 1989 TGV, Incorporated",
                "Copyright 1989-1990 PKWARE Inc.",
                "Copyright 1989-1990 PKWARE Inc. Self-extracting PKZIP",
                "Copyright 1990, 1991, 1992 Free Software Foundation",
                "Copyright 1990, 1991, 1992, 1993 Free Software Foundation, Inc.",
                "Copyright 1990, 1991, 1992, 1993, 1994 Free Software Foundation",
                "Copyright 1990, 1991, 1992, 1993, 1994 Free Software Foundation, Inc.",
                "Copyright 1991 SRI International",
                "Copyright 1991 by the Massachusetts Institute of Technology",
                "Copyright 1992, 1994, 1995 Free Software Foundation, Inc.",
                "Copyright 1994,1995 by Ian",
                "Copyright 1994,1995 by Ian Jackson",
                "Copyright 1995-2005 Jean-loup Gailly",
                "Copyright 1995-2005 Jean-loup Gailly GCC",
                "Copyright 1995-2005 Mark Adler",
                "Copyright 1995-2005 Mark Adler +3 CScs GCC",
                "Copyright 1997, 1998 by Sun Microsystems, Inc., 901 San Antonio Road, Palo Alto, California, 94303, U.S.A.",
                "Copyright 1997, 1998, 1999 Guy Maor. Adduser",
                "Copyright 1997-2007 Sun Microsystems, Inc.",
                "Copyright 1999 Cornell University",
                "Copyright 1999-2005 The Apache Software Foundation",
                "Copyright 2000 Jon Doe",
                "Copyright 2001 by Robert Olsson <robert.olsson@its.uu.se> Uppsala University, Sweden",
                "Copyright 2001-2011 by Simon",
                "Copyright 2001-2011 by Simon Kelley",
                "Copyright 2003 Sun Microsystems, Inc.",
                "Copyright 2004-2005 Sun Microsystems, Inc.",
                "Copyright 251 1992-1993 Globewide Network Academy (GNA) Macvicar Institute for Educational Software Development Under",
                "Copyright DotNetWise 2014",
                "Copyright Grame 1999-2005",
                "Copyright Masayuki Ataka <ataka@milk.freemail.ne.jp>",
                "Copyright Microsoft 2013",
                "Copyright Private Company (PC) Property of Private Company",
                "Copyright xa9 2003 Sun Microsystems, Inc.",
                "Copyright~1999 A.N.Kuznetsov",
                "I. Felix <ifelix@redhat.com> 2010",
                "Portions copyright 2003, Apple Computer, Inc.",
                "Private Company, (c) 2005",
                "Private Company, (c) 2005 Copyright Private Company (PC) Property of Private Company",
                "copyright 0' u'1997, 1998 by Sun Microsystems, Inc., 901 San Antonio Road, Palo Alto, California, 94303, U.S.A.",
                "copyright 0' u'1999 Cornell University",
                "copyright 0' u'2005",
                "copyright 1994 by Ian Murdock",
                "copyright 1995 by Ted Hajek",
                "copyright 1995 by Ted Hajek, With",
                "copyright 2 u'(2003) Private Company",
                "copyright 2008, Xavier Basty <xbasty@gmail.com>",
                "copyright 2010 David Wolever <david@wolever.net>",
                "copyright Aacute Acircumflex",
                "copyright Norwegian Telecom Research",
                "copyright nexB Inc. 2025",
                "copyright nexB Inc. and others",
                "copyrighted by the Free Software Foundation",
                "copyrights Copyright (c) 1989, 1991 Free Software Foundation",
                "portions Copyright (c) 1994 Debian Association, Inc.",
                "u'Copyright (c) 1987, 88, 89, 90, 91, 92, 93, 94 Free Software Foundation, Inc.",
                "u'Copyright (c) 1990 The Regents of the University of California",
                "u'Copyright (c) 2000 Frank Strauss <strauss@ibr.cs.tu-bs.de>",
                "u'Copyright (c) 2001 Company Private Company",
                "u'Copyright 1988, 1989 by Carnegie Mellon University",
                "u'Copyright 1989, 1991, 1992 by Carnegie Mellon University",
                "u'Copyright 1997, 1998 by Sun Microsystems, Inc., 901 San Antonio Road, Palo Alto, California, 94303, U.S.A.",
                "u'Copyright 1999 Cornell University",
                "u'Copyright 2003, 2004 Rickard E. Faith (faith@dict.org)"
            ],
            "file-count": 7129,
            "sha256": "80819392e9bcf8129f74d8904fe8a98c0dfed2782356842737282c0283113d88",
            "source": "https://files.pythonhosted.org/packages/58/24/40848587ae0f03ec6da2ae8a28b7ace7219fcbad0bc74e84c582324208ed/extractcode-31.0.0.tar.gz",
            "status": "restricted"
        }
    ]
}