{
    "id": "maven/mavencentral/org.jboss.byteman/byteman-install/4.0.20",
    "license": "LGPL-2.1-or-later",
    "authority": "https://gitlab.eclipse.org/eclipsefdn/emo-team/iplab/-/issues/5978",
    "source": "https://search.maven.org/remotecontent?filepath=org/jboss/byteman/byteman-install/4.0.20/byteman-install-4.0.20-sources.jar",
    "status": "approved",
    "scans": [
        {
            "date": "December 22, 2022 at 4:52:28 p.m. GMT",
            "authority": "https://gitlab.eclipse.org/eclipsefdn/emo-team/iplab/-/issues/5978",
            "scancode-version": "31.2.1",
            "licenses-discovered": [
                "LGPL-2.1-or-later"
            ],
            "copyrights": [
                "(c) 2010",
                "Copyright 2010 Red Hat and individual contributors by the authors"
            ],
            "file-count": 3,
            "sha256": "be246e0e01a014ff283018de78ae84b3515536316a81a0f271387e3434b0f683",
            "source": "https://search.maven.org/remotecontent?filepath=org/jboss/byteman/byteman-install/4.0.20/byteman-install-4.0.20-sources.jar",
            "status": "approved"
        }
    ]
}