{
    "id": "maven/mavencentral/software.amazon.awssdk/apache-client/2.23.12",
    "license": "Apache-2.0",
    "authority": "https://gitlab.eclipse.org/eclipsefdn/emo-team/iplab/-/issues/13142",
    "source": "https://repo1.maven.org/maven2/software/amazon/awssdk/apache-client/2.23.12/apache-client-2.23.12-sources.jar",
    "status": "approved",
    "scans": [
        {
            "date": "February 4, 2024 at 11:30:46 a.m. GMT",
            "authority": "https://gitlab.eclipse.org/eclipsefdn/emo-team/iplab/-/issues/13142",
            "scancode-version": "31.2.1",
            "licenses-discovered": [
                "Apache-2.0"
            ],
            "copyrights": [
                "Copyright Amazon.com, Inc. or its affiliates"
            ],
            "file-count": 30,
            "sha256": "7cc7fd8e08d8244acd4087016c611ab4bb3a649ca007dd8813e2f27faaf31d7c",
            "source": "https://repo1.maven.org/maven2/software/amazon/awssdk/apache-client/2.23.12/apache-client-2.23.12-sources.jar",
            "status": "approved"
        }
    ]
}