{
    "id": "maven/mavencentral/software.amazon.awssdk/aws-json-protocol/2.24.10",
    "license": "Apache-2.0",
    "authority": "https://gitlab.eclipse.org/eclipsefdn/emo-team/iplab/-/issues/13445",
    "source": "https://repo1.maven.org/maven2/software/amazon/awssdk/aws-json-protocol/2.24.10/aws-json-protocol-2.24.10-sources.jar",
    "status": "approved",
    "scans": [
        {
            "date": "February 26, 2024 at 6:57:47 a.m. GMT",
            "authority": "https://gitlab.eclipse.org/eclipsefdn/emo-team/iplab/-/issues/13445",
            "scancode-version": "31.2.1",
            "licenses-discovered": [
                "Apache-2.0"
            ],
            "copyrights": [
                "Copyright Amazon.com, Inc. or its affiliates"
            ],
            "file-count": 43,
            "sha256": "18edf6a7e78194e44a696e63630c9ee6874f58afa6595745d9759d743e45b03b",
            "source": "https://repo1.maven.org/maven2/software/amazon/awssdk/aws-json-protocol/2.24.10/aws-json-protocol-2.24.10-sources.jar",
            "status": "approved"
        }
    ]
}