{
    "id": "p2/orbit/p2.eclipse-plugin/org.python.pydev.shared_core/9.3.0.202203051235",
    "license": "EPL-1.0 AND Apache-2.0",
    "licenses-discovered": [
        "EPL-1.0",
        "LicenseRef-scancode-proprietary-license",
        "Apache-2.0"
    ],
    "copyrights": [
        "(c) VeriSign, Inc.",
        "Copyright (c) Brainwy Software Ltda",
        "Copyright (c) Fabio Zadrozny",
        "Copyright (c) Fabio Zadrozny and others",
        "Copyright (c) IBM Corporation and others",
        "Copyright (c) Jeremy Carroll",
        "Copyright (c) QNX Software Systems and others",
        "Copyright (c) by Appcelerator, Inc.",
        "Copyright (c) by Brainwy Software Ltda",
        "Copyright (c) by Fabio Zadrozny",
        "Copyright Bytecode Pty Ltd.",
        "Copyright The Apache Software Foundation",
        "Copyright The diff-match-patch"
    ],
    "file-count": 182,
    "scancode-version": "30.1.0",
    "authority": "https://gitlab.eclipse.org/eclipsefdn/emo-team/iplab/-/issues/3201",
    "source": "https://github.com/fabioz/Pydev/releases/download/pydev_9_3_0/org.python.pydev.shared_core.source_9.3.0.202203051235.jar",
    "status": "approved"
}
