{
    "id": "npm/npmjs/-/paho-mqtt/1.1.0",
    "license": "BSD-3-Clause AND EPL-1.0 AND BSD-3-Clause AND EPL-1.0",
    "licenses-discovered": [
        "BSD-3-Clause AND EPL-1.0",
        "BSD-3-Clause",
        "EPL-1.0"
    ],
    "copyrights": [
        "Copyright (c) 2007, Eclipse Foundation, Inc.",
        "Copyright (c) 2013 IBM Corp.",
        "Copyright (c) 2013, 2016 IBM Corp."
    ],
    "file-count": 11,
    "scancode-version": "31.2.1",
    "authority": "https://gitlab.eclipse.org/eclipsefdn/emo-team/iplab/-/issues/4525",
    "source": "https://registry.npmjs.org/paho-mqtt/-/paho-mqtt-1.1.0.tgz",
    "status": "approved"
}