{
    "id": "npm/npmjs/-/hast-util-parse-selector/3.1.1",
    "license": "MIT",
    "authority": "https://gitlab.eclipse.org/eclipsefdn/emo-team/iplab/-/issues/6631",
    "source": "https://registry.yarnpkg.com/hast-util-parse-selector/-/hast-util-parse-selector-3.1.1.tgz",
    "status": "approved",
    "scans": [
        {
            "date": "January 25, 2023 at 1:47:10 p.m. GMT",
            "authority": "https://gitlab.eclipse.org/eclipsefdn/emo-team/iplab/-/issues/6631",
            "scancode-version": "31.2.1",
            "licenses-discovered": [
                "MIT"
            ],
            "copyrights": [
                "(c) Titus Wormer",
                "Copyright (c) 2016 Titus Wormer <tituswormer@gmail.com>"
            ],
            "file-count": 10,
            "sha256": "249631bc6af2f9e3c7149364beb83e2cc1dffd9de9c51cd1c53c477e949459bf",
            "source": "https://registry.yarnpkg.com/hast-util-parse-selector/-/hast-util-parse-selector-3.1.1.tgz",
            "status": "approved"
        }
    ]
}