{
    "id": "maven/mavencentral/org.bouncycastle/bcprov-jdk18on/1.78.1",
    "license": "MIT AND CC0-1.0",
    "authority": "https://gitlab.eclipse.org/eclipsefdn/emo-team/iplab/-/issues/14433",
    "source": "https://repo1.maven.org/maven2/org/bouncycastle/bcprov-jdk18on/1.78.1/bcprov-jdk18on-1.78.1-sources.jar",
    "status": "approved",
    "scans": [
        {
            "date": "April 18, 2024 at 4:05:28 p.m. GMT",
            "authority": "https://gitlab.eclipse.org/eclipsefdn/emo-team/iplab/-/issues/14433",
            "scancode-version": "31.2.1",
            "licenses-discovered": [
                "MIT",
                "CC0-1.0"
            ],
            "copyrights": [
                "(c) ECFieldElement A1",
                "(c) Nat224.isOne",
                "Copyright (c) 2000-2023 The Legion Of The Bouncy Castle Inc. (https://www.bouncycastle.org)",
                "Copyright (c) 2000-2023 The Legion of the Bouncy Castle Inc. (https://www.bouncycastle.org)",
                "Copyright Dr B. R Gladman (gladman@seven77.demon.co.uk) and Sam Simpson (s.simpson@mia.co.uk)"
            ],
            "file-count": 2452,
            "sha256": "be87a544d921152cedcef4b740155047ef2f402544d47382b8c0b15dec11a642",
            "source": "https://repo1.maven.org/maven2/org/bouncycastle/bcprov-jdk18on/1.78.1/bcprov-jdk18on-1.78.1-sources.jar",
            "status": "approved"
        }
    ]
}