{
    "id": "maven/mavencentral/org.geotools/gt-process-feature/32.0",
    "license": "LGPL-2.1-only",
    "authority": "https://gitlab.eclipse.org/eclipsefdn/emo-team/iplab/-/issues/16223",
    "source": "https://repo.osgeo.org/repository/geotools-releases/org/geotools/gt-process-feature/32.0/gt-process-feature-32.0-sources.jar",
    "status": "approved",
    "scans": [
        {
            "date": "September 19, 2024, 3:07:12 p.m. GMT",
            "authority": "https://gitlab.eclipse.org/eclipsefdn/emo-team/iplab/-/issues/16223",
            "scancode-version": "31.2.1",
            "licenses-discovered": [
                "LGPL-2.1-only"
            ],
            "copyrights": [
                "(c) 2001-2007 TOPP - www.openplans.org",
                "(c) 2007-2011 Refractions Research",
                "(c) 2008, Open Source Geospatial Foundation",
                "(c) 2008-2011 TOPP - www.openplans.org",
                "(c) 2008-2011, Open Source Geospatial Foundation",
                "(c) 2011, Open Source Geospatial Foundation",
                "(c) 2011-2016, Open Source Geospatial Foundation",
                "(c) 2012, Open Source Geospatial Foundation",
                "(c) 2016, Open Source Geospatial Foundation",
                "(c) 2017, Open Source Geospatial Foundation",
                "(c) 2019, Open Source Geospatial Foundation",
                "(c) 2020, Open Source Geospatial Foundation"
            ],
            "file-count": 51,
            "sha256": "11358408d92b9a4ec9052847f9065811b983dd06426f367278937ec017b9fe3a",
            "source": "https://repo.osgeo.org/repository/geotools-releases/org/geotools/gt-process-feature/32.0/gt-process-feature-32.0-sources.jar",
            "status": "approved"
        }
    ]
}