{
    "id": "maven/mavencentral/org.kie.workbench.screens/kie-wb-common-workbench-backend/7.63.0-20211208.124751-26",
    "license": "Apache-2.0",
    "licenses-discovered": [
        "Apache-2.0"
    ],
    "copyrights": [
        "Copyright Red Hat, Inc. and/or its affiliates"
    ],
    "file-count": 15,
    "scancode-version": "30.1.0",
    "authority": "https://gitlab.eclipse.org/eclipsefdn/emo-team/iplab/-/issues/2792",
    "source": "https://search.maven.org/remotecontent?filepath=org/kie/workbench/screens/kie-wb-common-workbench-backend/7.63.0.Final/kie-wb-common-workbench-backend-7.63.0.Final-sources.jar",
    "status": "approved"
}