{
    "license": "Apache-2.0 AND CC-PDDC AND LGPL-2.1-only AND LGPL-2.1-or-later",
    "file-count": 766,
    "authority": "https://gitlab.eclipse.org/eclipsefdn/emo-team/iplab/-/issues/1893",
    "scancode-version": "30.1.0",
    "licenses-discovered": [
        "LGPL-2.1-only",
        "LGPL-2.1-or-later",
        "Apache-2.0",
        "CC-PDDC"
    ],
    "id": "maven/mavencentral/org.hibernate/hibernate-search-engine/5.11.2.Final",
    "source": "https://search.maven.org/remotecontent?filepath=org/hibernate/hibernate-search-engine/5.11.2.Final/hibernate-search-engine-5.11.2.Final-sources.jar",
    "status": "restricted",
    "board_exception": [
        {
            "rule": "all"
        }
    ]
}
