{
    "id": "project/dt.slm/eclipse-slm/slm-dc-k8s/374c3922dd9a1aa5913f8160a6f7d37ca814130b",
    "license": "MIT AND BSD-3-Clause",
    "authority": "https://gitlab.eclipse.org/eclipsefdn/emo-team/iplab/-/issues/8522",
    "source": "https://github.com/eclipse-slm/slm-dc-k8s/archive/374c3922dd9a1aa5913f8160a6f7d37ca814130b.zip",
    "status": "approved",
    "scans": [
        {
            "date": "May 23, 2023 at 9:53:39 p.m. GMT",
            "authority": "https://gitlab.eclipse.org/eclipsefdn/emo-team/iplab/-/issues/8522",
            "scancode-version": "31.2.1",
            "licenses-discovered": [
                "MIT",
                "BSD-3-Clause"
            ],
            "copyrights": [
                "Copyright (c) 2022 Lukas Rauh, Fraunhofer Institute for Manufacturing Engineering and Automation"
            ],
            "file-count": 134,
            "sha256": "7b9775eff74d6a3381636a024737adc9382997ffaeb6bd2a7d55804c87708b50",
            "source": "https://github.com/eclipse-slm/slm-dc-k8s/archive/374c3922dd9a1aa5913f8160a6f7d37ca814130b.zip",
            "status": "restricted"
        }
    ]
}
