{
    "id": "maven/mavencentral/org.apache.activemq/activemq-stomp/5.16.7",
    "license": "Apache-2.0",
    "authority": "https://gitlab.eclipse.org/eclipsefdn/emo-team/iplab/-/issues/11506",
    "source": "https://repo1.maven.org/maven2/org/apache/activemq/activemq-stomp/5.16.7/activemq-stomp-5.16.7-sources.jar",
    "status": "approved",
    "scans": [
        {
            "date": "November 10, 2023 at 3:35:04 p.m. GMT",
            "authority": "https://gitlab.eclipse.org/eclipsefdn/emo-team/iplab/-/issues/11506",
            "scancode-version": "31.2.1",
            "licenses-discovered": [
                "Apache-2.0"
            ],
            "copyrights": [
            ],
            "file-count": 44,
            "sha256": "40772a49444a7bdeb97cca31ffe0acb2e9883012ce9dcd1aa908ffc8dfd536fa",
            "source": "https://repo1.maven.org/maven2/org/apache/activemq/activemq-stomp/5.16.7/activemq-stomp-5.16.7-sources.jar",
            "status": "approved"
        }
    ]
}