{
    "id": "git/github/xeipuuv/gojsonschema/v1.2.0",
    "license": "Apache-2.0",
    "licenses-discovered": [
        "Apache-2.0"
    ],
    "copyrights": [
        "Copyright MongoDB, Inc.",
        "Copyright johandorland https://github.com/johandorland",
        "Copyright xeipuuv",
        "Copyright xeipuuv https://github.com/xeipuuv"
    ],
    "file-count": 160,
    "scancode-version": "30.1.0",
    "authority": "https://gitlab.eclipse.org/eclipsefdn/emo-team/iplab/-/issues/3718",
    "source": "https://github.com/xeipuuv/gojsonschema/archive/refs/tags/v1.2.0.zip",
    "status": "approved"
}