{
    "id": "npm/npmjs/-/mocha-json-output-reporter/2.1.0",
    "license": "MIT",
    "authority": "https://gitlab.eclipse.org/eclipsefdn/emo-team/iplab/-/issues/8315",
    "source": "https://registry.yarnpkg.com/mocha-json-output-reporter/-/mocha-json-output-reporter-2.1.0.tgz",
    "status": "approved",
    "scans": [
        {
            "date": "May 4, 2023 at 5:24:35 p.m. GMT",
            "authority": "https://gitlab.eclipse.org/eclipsefdn/emo-team/iplab/-/issues/8315",
            "scancode-version": "31.2.1",
            "licenses-discovered": [
                "MIT"
            ],
            "copyrights": [
            ],
            "file-count": 3,
            "sha256": "b6e53d5cc3662940207e6a5fc42bea294f21933317b865fc9fa5b96643d0ce0f",
            "source": "https://registry.yarnpkg.com/mocha-json-output-reporter/-/mocha-json-output-reporter-2.1.0.tgz",
            "status": "approved"
        }
    ]
}