{
    "id": "project/technology.xfsc/eclipse-xfsc/orc/dd394b3f09ee313e0195aceb244a8dbd5ee2212b",
    "license": "Apache-2.0 AND MPL-2.0",
    "authority": "https://gitlab.eclipse.org/eclipsefdn/emo-team/iplab/-/issues/9529",
    "source": "https://gitlab.eclipse.org/api/v4/projects/eclipse%2Fxfsc%2Forc/repository/archive.zip?sha=dd394b3f09ee313e0195aceb244a8dbd5ee2212b",
    "status": "approved",
    "scans": [
        {
            "date": "July 17, 2023 at 8:32:52 p.m. GMT",
            "authority": "https://gitlab.eclipse.org/eclipsefdn/emo-team/iplab/-/issues/9529",
            "scancode-version": "31.2.1",
            "licenses-discovered": [
                "Apache-2.0",
                "MPL-2.0",
                "Apache-2.0 AND MPL-2.0"
            ],
            "copyrights": [
                "Copyright 2022 Gaia-X / Data-Infrastructure Federation Services",
                "copyright u'2022, XLAB d.o.o., Gaia-X team"
            ],
            "file-count": 256,
            "sha256": "f7c76623c9ae8acf331cccf0678928c0546538fecc4b74b78b570bc72d2d5be8",
            "source": "https://gitlab.eclipse.org/api/v4/projects/eclipse%2Fxfsc%2Forc/repository/archive.zip?sha=dd394b3f09ee313e0195aceb244a8dbd5ee2212b",
            "status": "restricted"
        }
    ]
}
