{
    "id": "pypi/pypi/-/cffi/1.15.1",
    "license": "MIT",
    "authority": "https://gitlab.eclipse.org/eclipsefdn/emo-team/iplab/-/issues/15032",
    "source": "https://files.pythonhosted.org/packages/2b/a8/050ab4f0c3d4c1b8aaa805f70e26e84d0e27004907c5b8ecc1d31815f92a/cffi-1.15.1.tar.gz",
    "status": "approved",
    "scans": [
        {
            "date": "May 29, 2024 at 4:49:33 p.m. GMT",
            "authority": "https://gitlab.eclipse.org/eclipsefdn/emo-team/iplab/-/issues/15032",
            "scancode-version": "31.2.1",
            "licenses-discovered": [
                "JSON AND MIT",
                "MIT"
            ],
            "copyrights": [
                "Copyright (c) 1996 Red Hat, Inc.",
                "Copyright (c) 1996, 1998 Red Hat, Inc.",
                "Copyright (c) 1996, 1998, 1999, 2001 Red Hat, Inc.",
                "Copyright (c) 1996, 1998, 2001, 2002 Red Hat, Inc.",
                "Copyright (c) 1996-2003 Red Hat, Inc.",
                "Copyright (c) 1996-2003, 2007, 2008 Red Hat, Inc.",
                "Copyright (c) 2001 John Beniton",
                "Copyright (c) 2002 Bo Thorsen",
                "Copyright (c) 2002 Ranjit Mathew",
                "Copyright (c) 2002 Roger Sayle",
                "Copyright (c) 2009, 2010, 2011, 2012 ARM Ltd.",
                "Copyright (c) 2011, 2014, 2019, 2021 Anthony Green",
                "copyright u'2012-2018, Armin Rigo, Maciej Fijalkowski"
            ],
            "file-count": 206,
            "sha256": "d400bfb9a37b1351253cb402671cea7e89bdecc294e8016a707f6d1d8ac934f9",
            "source": "https://files.pythonhosted.org/packages/2b/a8/050ab4f0c3d4c1b8aaa805f70e26e84d0e27004907c5b8ecc1d31815f92a/cffi-1.15.1.tar.gz",
            "status": "restricted"
        }
    ]
}