{
    "id": "git/github/peaceiris/actions-hugo/v2",
    "license": "MIT AND Apache-2.0",
    "authority": "https://gitlab.eclipse.org/eclipsefdn/emo-team/iplab/-/issues/8002",
    "source": "https://github.com/peaceiris/actions-hugo/archive/refs/tags/v2.zip",
    "status": "approved",
    "scans": [
        {
            "date": "April 27, 2023 at 1:22:25 p.m. GMT",
            "authority": "https://gitlab.eclipse.org/eclipsefdn/emo-team/iplab/-/issues/8002",
            "scancode-version": "31.2.1",
            "licenses-discovered": [
                "MIT",
                "Apache-2.0"
            ],
            "copyrights": [
                "Copyright (c) 2019 Shohei Ueda",
                "Copyright Joyent, Inc. and other Node contributors"
            ],
            "file-count": 52,
            "sha256": "7b1324c7916d3e61cd1979f01cdb034f72933edf0801c1a8e407dde7213b3f8e",
            "source": "https://github.com/peaceiris/actions-hugo/archive/refs/tags/v2.zip",
            "status": "approved"
        }
    ]
}