{
    "id": "maven/mavencentral/org.bouncycastle/bcutil-jdk18on/1.78.1",
    "license": "MIT",
    "authority": "https://gitlab.eclipse.org/eclipsefdn/emo-team/iplab/-/issues/14435",
    "source": "https://repo1.maven.org/maven2/org/bouncycastle/bcutil-jdk18on/1.78.1/bcutil-jdk18on-1.78.1-sources.jar",
    "status": "approved",
    "scans": [
        {
            "date": "April 18, 2024 at 4:11:43 p.m. GMT",
            "authority": "https://gitlab.eclipse.org/eclipsefdn/emo-team/iplab/-/issues/14435",
            "scancode-version": "31.2.1",
            "licenses-discovered": [
            ],
            "copyrights": [
            ],
            "file-count": 514,
            "sha256": "667b6334ff25c4303d3b1af02599f8547fcc37d0d55393bcb17de4f179c78baa",
            "source": "https://repo1.maven.org/maven2/org/bouncycastle/bcutil-jdk18on/1.78.1/bcutil-jdk18on-1.78.1-sources.jar",
            "status": "restricted"
        }
    ]
}
