{
    "id": "maven/mavencentral/com.vaadin/vaadin-popover-flow/24.6.5",
    "license": "Apache-2.0",
    "authority": "https://gitlab.eclipse.org/eclipsefdn/emo-team/iplab/-/issues/19818",
    "source": "https://repo1.maven.org/maven2/com/vaadin/vaadin-popover-flow/24.6.5/vaadin-popover-flow-24.6.5-sources.jar",
    "status": "approved",
    "scans": [
        {
            "date": "March 1, 2025 at 3:39:59 a.m. GMT",
            "authority": "https://gitlab.eclipse.org/eclipsefdn/emo-team/iplab/-/issues/19818",
            "scancode-version": "31.2.1",
            "licenses-discovered": [
                "Apache-2.0"
            ],
            "copyrights": [
                "Copyright 2000-2024 Vaadin Ltd."
            ],
            "file-count": 7,
            "sha256": "7d0a7f68fd5fa0bfde6a4a70cd051c0ac9611c5e5f9cf579f397dacb0da9e7fa",
            "source": "https://repo1.maven.org/maven2/com/vaadin/vaadin-popover-flow/24.6.5/vaadin-popover-flow-24.6.5-sources.jar",
            "status": "approved"
        }
    ]
}