{
    "id": "npm/npmjs/-/typed-array-byte-length/1.0.0",
    "license": "MIT",
    "authority": "https://gitlab.eclipse.org/eclipsefdn/emo-team/iplab/-/issues/9659",
    "source": "https://registry.yarnpkg.com/typed-array-byte-length/-/typed-array-byte-length-1.0.0.tgz",
    "status": "approved",
    "scans": [
        {
            "date": "July 19, 2023 at 3:02:23 p.m. GMT",
            "authority": "https://gitlab.eclipse.org/eclipsefdn/emo-team/iplab/-/issues/9659",
            "scancode-version": "31.2.1",
            "licenses-discovered": [
                "MIT"
            ],
            "copyrights": [
                "Copyright (c) 2020 Inspect JS"
            ],
            "file-count": 8,
            "sha256": "e48859c8cc2aed3f536cefb5b74c42991533e9bb87b8c1b80272f83429a2deb7",
            "source": "https://registry.yarnpkg.com/typed-array-byte-length/-/typed-array-byte-length-1.0.0.tgz",
            "status": "approved"
        }
    ]
}