{
    "id": "maven/mavencentral/org.flywaydb/flyway-mysql/8.5.13",
    "license": "Apache-2.0",
    "authority": "https://gitlab.eclipse.org/eclipsefdn/emo-team/iplab/-/issues/7404",
    "source": "https://search.maven.org/remotecontent?filepath=org/flywaydb/flyway-mysql/8.5.13/flyway-mysql-8.5.13-sources.jar",
    "status": "approved",
    "scans": [
        {
            "date": "March 15, 2023 at 4:27:14 p.m. GMT",
            "authority": "https://gitlab.eclipse.org/eclipsefdn/emo-team/iplab/-/issues/7404",
            "scancode-version": "31.2.1",
            "licenses-discovered": [
                "Apache-2.0"
            ],
            "copyrights": [
                "Copyright (c) Red Gate Software Ltd 2010-2022"
            ],
            "file-count": 18,
            "sha256": "d0dd5cd428c2a7989fa04fa93ae8d3d85d6df5836cf0a47cac5c20efce412cc1",
            "source": "https://search.maven.org/remotecontent?filepath=org/flywaydb/flyway-mysql/8.5.13/flyway-mysql-8.5.13-sources.jar",
            "status": "approved"
        }
    ]
}