{
    "id": "maven/mavencentral/com.azure.resourcemanager/azure-resourcemanager-cosmos/2.43.0",
    "license": "MIT",
    "authority": "https://gitlab.eclipse.org/eclipsefdn/emo-team/iplab/-/issues/16710",
    "source": "https://repo1.maven.org/maven2/com/azure/resourcemanager/azure-resourcemanager-cosmos/2.43.0/azure-resourcemanager-cosmos-2.43.0-sources.jar",
    "status": "approved",
    "scans": [
        {
            "date": "October 15, 2024, 5:22:53 p.m. GMT",
            "authority": "https://gitlab.eclipse.org/eclipsefdn/emo-team/iplab/-/issues/16710",
            "scancode-version": "31.2.1",
            "licenses-discovered": [
                "MIT"
            ],
            "copyrights": [
                "Copyright (c) Microsoft Corporation"
            ],
            "file-count": 465,
            "sha256": "4bf92c2b7aa95cf708e27ae83a4c246ae753eb59540c9657e02fa11729b3c263",
            "source": "https://repo1.maven.org/maven2/com/azure/resourcemanager/azure-resourcemanager-cosmos/2.43.0/azure-resourcemanager-cosmos-2.43.0-sources.jar",
            "status": "approved"
        }
    ]
}