{
    "id": "maven/mavencentral/androidx.lifecycle/lifecycle-viewmodel-compose/2.7.0",
    "license": "Apache-2.0",
    "authority": "https://gitlab.eclipse.org/eclipsefdn/emo-team/iplab/-/issues/12878",
    "source": "https://dl.google.com/android/maven2/androidx/lifecycle/lifecycle-viewmodel-compose/2.7.0/lifecycle-viewmodel-compose-2.7.0-sources.jar",
    "status": "approved",
    "scans": [
        {
            "date": "January 24, 2024 at 2:01:14 p.m. GMT",
            "authority": "https://gitlab.eclipse.org/eclipsefdn/emo-team/iplab/-/issues/12878",
            "scancode-version": "31.2.1",
            "licenses-discovered": [
                "Apache-2.0"
            ],
            "copyrights": [
                "Copyright 2021 The Android Open Source Project",
                "Copyright 2022 The Android Open Source Project"
            ],
            "file-count": 5,
            "sha256": "e091fa0bde6b184a7cb7a8eec4f048b50ebb311cc026ab19852474467e4ef220",
            "source": "https://dl.google.com/android/maven2/androidx/lifecycle/lifecycle-viewmodel-compose/2.7.0/lifecycle-viewmodel-compose-2.7.0-sources.jar",
            "status": "approved"
        }
    ]
}