{
    "id": "npm/npmjs/-/cx-portal-shared-components/1.5.0",
    "license": "Apache-2.0 AND CC-BY-4.0 AND MIT AND OFL-1.1",
    "authority": "https://gitlab.eclipse.org/eclipsefdn/emo-team/iplab/-/issues/10235",
    "source": "https://github.com/eclipse-tractusx/portal-frontend/archive/refs/tags/v1.5.0.zip",
    "status": "approved",
    "scans": [
        {
            "date": "August 28, 2023 at 12:00:09 p.m. GMT",
            "authority": "https://gitlab.eclipse.org/eclipsefdn/emo-team/iplab/-/issues/10235",
            "scancode-version": "31.2.1",
            "licenses-discovered": [
                "Apache-2.0",
                "Apache-2.0 AND LicenseRef-scancode-unknown",
                "CC-BY-4.0",
                "OFL-1.1"
            ],
            "copyrights": [
                "Copyright (c) 2021, 2023 BMW Group AG",
                "Copyright (c) 2021, 2023 Contributors",
                "Copyright (c) 2021, 2023 Mercedes-Benz Group AG and BMW Group AG",
                "Copyright (c) 2021, 2023 T-Systems International GmbH and BMW Group AG",
                "Copyright (c) 2021,2022 BMW Group AG",
                "Copyright (c) 2021,2022 Contributors",
                "Copyright (c) Catena-X Automotive Network",
                "Copyright 2020 The LibreFranklin Project"
            ],
            "file-count": 921,
            "sha256": "590dff872d7e780206072aa1ee3981239300fa92a1a4ffab43773958424bd334",
            "source": "https://github.com/eclipse-tractusx/portal-frontend/archive/refs/tags/v1.5.0.zip",
            "status": "restricted"
        }
    ]
}
