{
    "id": "npm/npmjs/-/keyv/4.5.2",
    "license": "MIT",
    "licenses-discovered": [
        "MIT"
    ],
    "copyrights": [
        "(c) Jared Wray"
    ],
    "file-count": 4,
    "scancode-version": "31.2.1",
    "authority": "https://gitlab.eclipse.org/eclipsefdn/emo-team/iplab/-/issues/4674",
    "source": "https://registry.npmjs.org/keyv/-/keyv-4.5.2.tgz",
    "status": "approved"
}