{
    "license": "BSD-2-Clause AND MIT",
    "file-count": 5916,
    "authority": "https://gitlab.eclipse.org/eclipsefdn/emo-team/iplab/-/issues/1052",
    "scancode-version": "21.3.31",
    "licenses-discovered": [
        "MIT",
        "BSD-2-Clause"
    ],
    "id": "npm/npmjs/-/babylon/6.18.0",
    "source": "https://github.com/babel/babylon/archive/v6.18.0.zip",
    "status": "approved"
}