{
    "id": "npm/npmjs/-/react-player/2.16.0",
    "license": "MIT",
    "authority": "https://gitlab.eclipse.org/eclipsefdn/emo-team/iplab/-/issues/14388",
    "source": "https://github.com/cookpete/react-player/archive/refs/tags/v2.16.0.zip",
    "status": "approved",
    "scans": [
        {
            "date": "April 16, 2024 at 10:28:00 a.m. GMT",
            "authority": "https://gitlab.eclipse.org/eclipsefdn/emo-team/iplab/-/issues/14388",
            "scancode-version": "31.2.1",
            "licenses-discovered": [
                "MIT"
            ],
            "copyrights": [
                "(c) Sindre Sorhus",
                "Copyright (c) 2013-present, Facebook, Inc.",
                "Copyright (c) Facebook, Inc. and its affiliates",
                "Copyright (c) Pete Cook http://cookpete.com"
            ],
            "file-count": 93,
            "sha256": "88e8bbc99a1bf5647fffbc181d2160236fb6cb1ef6ea02872874219ef6941112",
            "source": "https://github.com/cookpete/react-player/archive/refs/tags/v2.16.0.zip",
            "status": "approved"
        }
    ]
}