{
    "id": "project/automotive.velocitas/eclipse-velocitas/velocitas-docs/0.0",
    "license": "Apache-2.0 AND MIT",
    "authority": "https://gitlab.eclipse.org/eclipsefdn/emo-team/iplab/-/issues/5221",
    "source": "https://github.com/eclipse-velocitas/velocitas-docs/archive/refs/heads/main.zip",
    "status": "restricted",
    "scans": [
        {
            "date": "November 28, 2022 at 10:40:52 p.m. GMT",
            "authority": "https://gitlab.eclipse.org/eclipsefdn/emo-team/iplab/-/issues/5221",
            "scancode-version": "31.2.1",
            "licenses-discovered": [
                "Apache-2.0",
                "MIT"
            ],
            "copyrights": [
                "(c) OpenJS Foundation and other contributors",
                "Copyright (c) 2020 Oliver Nightingale",
                "Copyright (c) 2022 Robert Bosch GmbH and Microsoft Corporation",
                "Copyright 2017, 2018 ACME Corporation",
                "copyright The Eclipse Velocitastm Project"
            ],
            "file-count": 117,
            "sha256": "8ead7a7e3e856e457cac0b87f936803a21fc292e76598bb5adc3719fcde5f70c",
            "source": "https://github.com/eclipse-velocitas/velocitas-docs/archive/refs/heads/main.zip",
            "status": "restricted"
        }
    ]
}