{
    "id": "maven/mavencentral/software.amazon.awssdk/sdk-core/2.20.77",
    "license": "Apache-2.0",
    "authority": "https://gitlab.eclipse.org/eclipsefdn/emo-team/iplab/-/issues/8611",
    "source": "https://repo.maven.apache.org/maven2/software/amazon/awssdk/sdk-core/2.20.0/sdk-core-2.20.0-sources.jar",
    "status": "approved",
    "scans": [
        {
            "date": "June 2, 2023 at 6:15:26 p.m. GMT",
            "authority": "https://gitlab.eclipse.org/eclipsefdn/emo-team/iplab/-/issues/8611",
            "scancode-version": "31.2.1",
            "licenses-discovered": [
                "Apache-2.0"
            ],
            "copyrights": [
                "Copyright Amazon.com, Inc. or its affiliates"
            ],
            "file-count": 328,
            "sha256": "9fce78f960aa473cd1efdf0496156ec5f3392e9b88284e5f768320b6692f251f",
            "source": "https://repo.maven.apache.org/maven2/software/amazon/awssdk/sdk-core/2.20.0/sdk-core-2.20.0-sources.jar",
            "status": "approved"
        }
    ]
}