{
    "id": "npm/npmjs/@sinonjs/commons/3.0.1",
    "license": "BSD-3-Clause",
    "authority": "https://gitlab.eclipse.org/eclipsefdn/emo-team/iplab/-/issues/12905",
    "source": "https://github.com/sinonjs/commons/archive/refs/tags/v3.0.1.zip",
    "status": "approved",
    "scans": [
        {
            "date": "January 25, 2024 at 8:55:20 a.m. GMT",
            "authority": "https://gitlab.eclipse.org/eclipsefdn/emo-team/iplab/-/issues/12905",
            "scancode-version": "31.2.1",
            "licenses-discovered": [
                "BSD-3-Clause"
            ],
            "copyrights": [
                "Copyright (c) 2018, Sinon.JS"
            ],
            "file-count": 45,
            "sha256": "65d4f91c245fdf76fece55f4d1b91ccd5817d2daa841b5d9d4d8b60fb111aef0",
            "source": "https://github.com/sinonjs/commons/archive/refs/tags/v3.0.1.zip",
            "status": "approved"
        }
    ]
}