{
    "id": "npm/npmjs/@mui/x-date-pickers/6.19.7",
    "license": "MIT AND ISC AND OFL-1.1",
    "authority": "https://gitlab.eclipse.org/eclipsefdn/emo-team/iplab/-/issues/13929",
    "source": "https://github.com/mui/mui-x/archive/refs/tags/v6.19.7.zip",
    "status": "approved",
    "scans": [
        {
            "date": "March 21, 2024 at 7:28:42 p.m. GMT",
            "authority": "https://gitlab.eclipse.org/eclipsefdn/emo-team/iplab/-/issues/13929",
            "scancode-version": "31.2.1",
            "licenses-discovered": [
                "MIT",
                "LicenseRef-scancode-commercial-license AND MIT",
                "LicenseRef-scancode-commercial-license AND LicenseRef-scancode-proprietary-license AND MIT",
                "OFL-1.1",
                "LicenseRef-scancode-unknown AND MIT",
                "ISC",
                "LicenseRef-scancode-proprietary-license",
                "LicenseRef-scancode-commercial-license"
            ],
            "copyrights": [
                "Copyright (c) 2017 Dmitriy Kovalenko",
                "Copyright (c) 2017 Evgeny Poberezkin",
                "Copyright (c) 2020 Material-UI SAS",
                "Copyright 2017-2021 Indian Type Foundry",
                "Copyright 2018 IBM Corp."
            ],
            "file-count": 3994,
            "sha256": "2f1ea420d354d036a3978a123da951986cb43712fbbc9cdad2753da8ce34b970",
            "source": "https://github.com/mui/mui-x/archive/refs/tags/v6.19.7.zip",
            "status": "restricted"
        }
    ]
}
