{
    "id": "npm/npmjs/-/side-channel-list/1.0.0",
    "license": "MIT",
    "authority": "https://gitlab.eclipse.org/eclipsefdn/emo-team/iplab/-/issues/18387",
    "source": "https://github.com/ljharb/side-channel-list/archive/refs/tags/v1.0.0.zip",
    "status": "approved",
    "scans": [
        {
            "date": "January 8, 2025 at 1:37:45 p.m. GMT",
            "authority": "https://gitlab.eclipse.org/eclipsefdn/emo-team/iplab/-/issues/18387",
            "scancode-version": "31.2.1",
            "licenses-discovered": [
                "MIT"
            ],
            "copyrights": [
                "Copyright (c) 2024 Jordan Harband"
            ],
            "file-count": 19,
            "sha256": "42a37e9c140668788e39b1a9bf1c140552633964b7cbbfef2856276b208be661",
            "source": "https://github.com/ljharb/side-channel-list/archive/refs/tags/v1.0.0.zip",
            "status": "approved"
        }
    ]
}