{
    "id": "crate/cratesio/-/libz-sys/1.1.11",
    "license": "Apache-2.0 AND BSL-1.0 AND MIT AND CC-BY-3.0 AND CC-BY-4.0 AND LicenseRef-Public-domain AND (GPL-2.0-or-later AND LicenseRef-scancode-ada-linking-exception) AND Info-ZIP AND NTP AND Zlib",
    "authority": "https://gitlab.eclipse.org/eclipsefdn/emo-team/iplab/-/issues/9763",
    "source": "https://crates.io/api/v1/crates/libz-sys/1.1.11/download",
    "status": "approved",
    "scans": [
        {
            "date": "July 26, 2023 at 9:27:55 a.m. GMT",
            "authority": "https://gitlab.eclipse.org/eclipsefdn/emo-team/iplab/-/issues/9763",
            "scancode-version": "31.2.1",
            "licenses-discovered": [
                "Apache-2.0 AND MIT",
                "Apache-2.0",
                "MIT",
                "Zlib",
                "GPL-1.0-or-later",
                "GPL-2.0-or-later AND LicenseRef-scancode-ada-linking-exception",
                "BSD-3-Clause",
                "BSL-1.0",
                "LicenseRef-scancode-mit-old-style",
                "LicenseRef-scancode-other-permissive",
                "LicenseRef-scancode-info-zip-2009-01",
                "LicenseRef-scancode-peter-deutsch-document",
                "CC-BY-3.0 AND CC-BY-4.0 AND Zlib"
            ],
            "copyrights": [
                "(c) \u0010 u E2OroCIyV \u0014 C.au",
                "(c) \u0010',AE\u0015G.2oDS'x c v KDC(r)xOE@5wZ'\u000eyH+c@\u0001P6| bV",
                "(c) 1995-2013 Jean-loup Gailly & Mark Adler",
                "(c) 1995-2013 Jean-loup Gailly and Mark Adler",
                "(c) 1995-2017 Jean-loup Gailly & Mark Adler",
                "(c) 1995-2017 Jean-loup Gailly and Mark Adler",
                "(c) 1995-2022 Jean-loup Gailly & Mark Adler",
                "(c) 2007-2021 Mark Adler <madler@alumni.caltech.edu>",
                "(c) A AEZaO5",
                "(c) Copyright Henrik Ravn 2004",
                "(c) Ei El",
                "(c) H2 (c)",
                "(c) I UuE",
                "(c) OOUA UuUS1a OEviy",
                "(c) UiL (c)",
                "Copyright (c) 1990-2000 Info-ZIP.",
                "Copyright (c) 1995-1996 Jean-loup Gailly, Brian Raiter and Gilles Vollant",
                "Copyright (c) 1995-1998 Jean-loup Gailly",
                "Copyright (c) 1995-2003 Jean-loup Gailly",
                "Copyright (c) 1995-2003 Jean-loup Gailly and Mark Adler",
                "Copyright (c) 1995-2003 Mark Adler",
                "Copyright (c) 1995-2003 by Jean-loup Gailly",
                "Copyright (c) 1995-2003, 2010 Mark Adler",
                "Copyright (c) 1995-2003, 2010, 2014, 2016 Jean-loup Gailly, Mark Adler",
                "Copyright (c) 1995-2005, 2010 Mark Adler",
                "Copyright (c) 1995-2005, 2014, 2016 Jean-loup Gailly, Mark Adler",
                "Copyright (c) 1995-2006, 2010, 2011, 2012 Mark Adler",
                "Copyright (c) 1995-2006, 2010, 2011, 2012, 2016 Mark Adler",
                "Copyright (c) 1995-2006, 2010, 2011, 2016 Jean-loup Gailly",
                "Copyright (c) 1995-2006, 2011, 2016 Jean-loup Gailly",
                "Copyright (c) 1995-2008 Mark Adler",
                "Copyright (c) 1995-2010 Jean-loup Gailly, Brian Raiter and Gilles Vollant",
                "Copyright (c) 1995-2011 Mark Adler",
                "Copyright (c) 1995-2011, 2016 Mark Adler",
                "Copyright (c) 1995-2013 Jean-loup Gailly and Mark Adler",
                "Copyright (c) 1995-2013 Jean-loup Gailly, Mark Adler",
                "Copyright (c) 1995-2016 Jean-loup Gailly",
                "Copyright (c) 1995-2016 Jean-loup Gailly and Mark Adler",
                "Copyright (c) 1995-2016 Jean-loup Gailly, Mark Adler",
                "Copyright (c) 1995-2016 Mark Adler",
                "Copyright (c) 1995-2017 Jean-Loup Gailly, Mark Adler",
                "Copyright (c) 1995-2017 Jean-loup Gailly",
                "Copyright (c) 1995-2017 Jean-loup Gailly and Mark Adler",
                "Copyright (c) 1995-2017 Jean-loup Gailly, Mark Adler",
                "Copyright (c) 1995-2017 Mark Adler",
                "Copyright (c) 1995-2019 Mark Adler",
                "Copyright (c) 1995-2021 Jean-loup Gailly",
                "Copyright (c) 1995-2022 Jean-loup Gailly and Mark Adler",
                "Copyright (c) 1995-2022 Jean-loup Gailly, Mark Adler",
                "Copyright (c) 1995-2022 Mark Adler",
                "Copyright (c) 1996 L. Peter Deutsch",
                "Copyright (c) 1996 L. Peter Deutsch and Jean-Loup Gailly",
                "Copyright (c) 1997 Christian Michelsen Research AS Advanced Computing",
                "Copyright (c) 1997,99 Borland Corp.",
                "Copyright (c) 1997,99 Borland Corporation",
                "Copyright (c) 1998 - 2010 Gilles Vollant, Even Rouault, Mathias Svensson",
                "Copyright (c) 1998 Brian Raiter <breadbox@muppetlabs.com>",
                "Copyright (c) 1998 by Andreas R. Kleinert",
                "Copyright (c) 1998 by Bob Dellaca",
                "Copyright (c) 1998 by Jacques Nomssi Nzali",
                "Copyright (c) 1998, 2007 Brian Raiter <breadbox@muppetlabs.com>",
                "Copyright (c) 1998,1999,2000 by Jacques Nomssi Nzali",
                "Copyright (c) 1998-2005 Gilles Vollant",
                "Copyright (c) 1998-2010 - by Gilles Vollant",
                "Copyright (c) 1998-2010 Gilles Vollant (minizip) http://www.winimage.com/zLibDll/minizip.html",
                "Copyright (c) 2002-2003 Dmitriy Anisimkov",
                "Copyright (c) 2002-2004 Dmitriy Anisimkov",
                "Copyright (c) 2002-2013 Mark Adler",
                "Copyright (c) 2003 Chris Anderson <christop@charm.net>",
                "Copyright (c) 2003 Cosmin Truta",
                "Copyright (c) 2003 Mark Adler",
                "Copyright (c) 2003 by Cosmin Truta",
                "Copyright (c) 2003, 2005, 2008, 2010, 2012 Mark Adler",
                "Copyright (c) 2003, 2012 Mark Adler",
                "Copyright (c) 2003, 2012, 2013 Mark Adler",
                "Copyright (c) 2003-2010 Mark Adler",
                "Copyright (c) 2004 by Henrik Ravn",
                "Copyright (c) 2004, 2005 Mark Adler",
                "Copyright (c) 2004, 2005 by Mark Adler",
                "Copyright (c) 2004, 2005, 2010, 2011, 2012, 2013, 2016 Mark Adler",
                "Copyright (c) 2004, 2005, 2012 Mark Adler",
                "Copyright (c) 2004, 2008, 2012 Mark Adler",
                "Copyright (c) 2004, 2008, 2012, 2016 Mark Adler",
                "Copyright (c) 2004, 2010 Mark Adler",
                "Copyright (c) 2004-2017 Mark Adler",
                "Copyright (c) 2004-2019 Mark Adler",
                "Copyright (c) 2005, 2012 Mark Adler",
                "Copyright (c) 2007, 2008, 2012 Mark Adler",
                "Copyright (c) 2007-2008 Even Rouault",
                "Copyright (c) 2007-2021 Mark Adler",
                "Copyright (c) 2007-2021 Mark Adler <madler@alumni.caltech.edu>",
                "Copyright (c) 2008, 2011, 2012, 2015, 2018, 2019, 2020 Mark Adler",
                "Copyright (c) 2009-2010 Mathias Svensson http://result42.com",
                "Copyright (c) 2011, 2016 Mark Adler",
                "Copyright (c) 2013 Intel Corporation",
                "Copyright (c) 2013 Intel Corporation Jim Kukunas",
                "Copyright (c) 2013, 2015 Mark Adler",
                "Copyright (c) 2014 Alex Crichton",
                "Copyright (c) 2016 12Sided Technology, LLC.",
                "Copyright (c) 2016 Marian Beermann (support for initial value) Authors Wajdi Feghali <wajdi.k.feghali@intel.com> Jim Guilford <james.guilford@intel.com>",
                "Copyright (c) 2016 Yang Zhang",
                "Copyright (c) 2017 ARM Holdings Inc.",
                "Copyright (c) 2017 Hans Kristian Rosbach",
                "Copyright (c) 2017 Intel Corporation",
                "Copyright (c) 2017-2020 Mika T. Lindqvist",
                "Copyright (c) 2017-2021 Mika T. Lindqvist <postmaster@raasu.org>",
                "Copyright (c) 2017-2023 Mika T. Lindqvist <postmaster@raasu.org>",
                "Copyright (c) 2019 Hans Kristian Rosbach",
                "Copyright (c) 2019 Matheus Castanho <msc@linux.ibm.com> , IBM",
                "Copyright (c) 2019-2020 IBM Corporation",
                "Copyright (c) 2019-2021 IBM Corporation",
                "Copyright (c) 2020 IBM Corporation",
                "Copyright (c) 2020 Josh Triplett",
                "Copyright (c) 2020 Matheus Castanho <msc@linux.ibm.com> , IBM",
                "Copyright (c) 2020 Nathan Moinvaziri",
                "Copyright (c) 2021 Adam Stylinski <kungfujesus06@gmail.com>",
                "Copyright (c) 2021 Hans Kristian Rosbach",
                "Copyright (c) 2021 IBM Corporation",
                "Copyright (c) 2021 Mika T. Lindqvist <postmaster@raasu.org>",
                "Copyright (c) 2021 Nathan Moinvaziri",
                "Copyright (c) 2021-2022 Mika T. Lindqvist <postmaster@raasu.org>",
                "Copyright (c) 2022 Adam Stylinski",
                "Copyright (c) 2022 Adam Stylinski, Nathan Moinvaziri",
                "Copyright (c) 2022 Nathan Moinvaziri",
                "Copyright (c) 2022 Nathan Moinvaziri, Adam Stylinski",
                "Copyright (c) 2023 SiFive, Inc.",
                "Copyright (c) Henrik Ravn 2004",
                "Copyright 1995-2017 Jean-loup Gailly and Mark Adler",
                "Copyright 1995-2017 Mark Adler",
                "Copyright 1995-2022 Jean-loup Gailly and Mark Adler",
                "Copyright 1995-2022 Mark Adler",
                "Copyright 1998-2004 Gilles Vollant - http://www.winimage.com/zLibDll",
                "Copyright 2011 Google Inc.",
                "Copyright 2013 Steinar H. Gunderson",
                "Copyright 2015, Daniel Axtens, IBM Corporation",
                "Copyright 2016 Google Inc.",
                "Copyright Adam Stylinski <kungfujesus06@gmail.com>",
                "Copyright Depository of Electronic Materials",
                "Copyright Issues Marybeth Peters",
                "Copyright Jean-loup Gailly Osma Ahvenlampi <Osma.Ahvenlampi@hut.fi>",
                "Copyright Mika T. Lindqvist <postmaster@raasu.org>",
                "Copyright Wangyang Guo (wangyang.guo@intel.com)",
                "Portions copyright (c) 2014-2021 Konstantin Nosov Fast-zlib",
                "copyright (c) 1995-2006 Jean-loup Gailly and Mark Adler",
                "copyright (c) 1995-2017 Jean-loup Gailly and Mark Adler",
                "copyright by Cornell University"
            ],
            "file-count": 619,
            "sha256": "121f7402cc6ab5821dad08d1b9d11618a9ea4da992343909fecf8e430e86364c",
            "source": "https://crates.io/api/v1/crates/libz-sys/1.1.11/download",
            "status": "restricted"
        }
    ]
}
