{
    "id": "maven/mavencentral/org.apache.commons/commons-math3/3.2",
    "license": "Apache-2.0 AND BSD-2-Clause AND BSD-3-Clause AND Minpack",
    "authority": "https://gitlab.eclipse.org/eclipsefdn/emo-team/iplab/-/issues/15951",
    "source": "https://repo1.maven.org/maven2/org/apache/commons/commons-math3/3.2/commons-math3-3.2-sources.jar",
    "status": "approved",
    "scans": [
        {
            "date": "August 15, 2024 at 9:18:48 a.m. GMT",
            "authority": "https://gitlab.eclipse.org/eclipsefdn/emo-team/iplab/-/issues/15951",
            "scancode-version": "31.2.1",
            "licenses-discovered": [
                "Apache-2.0",
                "Apache-2.0 AND BSD-2-Clause AND BSD-3-Clause AND Minpack",
                "Apache-2.0 AND BSD-2-Clause",
                "Apache-2.0 AND BSD-3-Clause",
                "Apache-2.0 AND Minpack"
            ],
            "copyrights": [
                "Copyright (c) 1992-2008 The University of Tennessee",
                "Copyright (c) 1997 - 2002, Makoto Matsumoto and Takuji Nishimura",
                "Copyright (c) 2004, Ernst Hairer",
                "Copyright 2010 CS Communication & Systemes"
            ],
            "file-count": 791,
            "sha256": "b62d60712ea06fb6259506269b3a0ed73a7da5ee11f891c0eb0399eb9bc71e3f",
            "source": "https://repo1.maven.org/maven2/org/apache/commons/commons-math3/3.2/commons-math3-3.2-sources.jar",
            "status": "restricted"
        }
    ]
}