{
    "id": "maven/mavencentral/org.springframework/spring-core/4.1.6.RELEASE",
    "license": "BSD-3-Clause AND Apache-2.0",
    "authority": "https://gitlab.eclipse.org/eclipsefdn/emo-team/iplab/-/issues/17340",
    "source": "https://repo1.maven.org/maven2/org/springframework/spring-core/4.1.6.RELEASE/spring-core-4.1.6.RELEASE-sources.jar",
    "status": "approved",
    "scans": [
        {
            "date": "November 19, 2024, 8:00:42 p.m. GMT",
            "authority": "https://gitlab.eclipse.org/eclipsefdn/emo-team/iplab/-/issues/17340",
            "scancode-version": "31.2.1",
            "licenses-discovered": [
                "BSD-3-Clause",
                "Apache-2.0"
            ],
            "copyrights": [
                "Copyright (c) 2000-2011 INRIA, France Telecom",
                "Copyright (c) 2000-2013 INRIA, France Telecom",
                "Copyright 2002-2007 the original author or authors",
                "Copyright 2002-2008 the original author or authors",
                "Copyright 2002-2009 the original author or authors",
                "Copyright 2002-2010 the original author or authors",
                "Copyright 2002-2011 the original author or authors",
                "Copyright 2002-2012 the original author or authors",
                "Copyright 2002-2013 the original author or authors",
                "Copyright 2002-2014 the original author or authors",
                "Copyright 2002-2015 the original author or authors"
            ],
            "file-count": 345,
            "sha256": "4e24a0e4b769f06397abb3667b1db31f4a2d0f781c92faa11e2fe2724bd75036",
            "source": "https://repo1.maven.org/maven2/org/springframework/spring-core/4.1.6.RELEASE/spring-core-4.1.6.RELEASE-sources.jar",
            "status": "approved"
        }
    ]
}