{
    "id": "maven/mavencentral/com.auth0/java-jwt/4.2.1",
    "license": "MIT",
    "licenses-discovered": [
    ],
    "copyrights": [
    ],
    "file-count": 49,
    "scancode-version": "31.2.1",
    "authority": "https://gitlab.eclipse.org/eclipsefdn/emo-team/iplab/-/issues/4346",
    "source": "https://search.maven.org/remotecontent?filepath=com/auth0/java-jwt/4.2.1/java-jwt-4.2.1-sources.jar",
    "status": "approved"
}
