{
    "id": "maven/mavencentral/org.jboss.shrinkwrap.resolver/shrinkwrap-resolver-api-maven-embedded/3.1.4",
    "license": "Apache-2.0",
    "licenses-discovered": [
        "Apache-2.0"
    ],
    "copyrights": [
        "Copyright 2014, Red Hat Middleware LLC, and individual contributors by the authors"
    ],
    "file-count": 22,
    "scancode-version": "31.2.1",
    "authority": "https://gitlab.eclipse.org/eclipsefdn/emo-team/iplab/-/issues/4530",
    "source": "https://search.maven.org/remotecontent?filepath=org/jboss/shrinkwrap/resolver/shrinkwrap-resolver-api-maven-embedded/3.1.4/shrinkwrap-resolver-api-maven-embedded-3.1.4-sources.jar",
    "status": "approved"
}