{
    "id": "maven/mavencentral/io.undertow/undertow-core/2.3.0.Final",
    "license": "Apache-2.0 AND (Apache-2.0 AND CC0-1.0)",
    "authority": "https://gitlab.eclipse.org/eclipsefdn/emo-team/iplab/-/issues/17344",
    "source": "https://repo1.maven.org/maven2/io/undertow/undertow-core/2.3.0.Final/undertow-core-2.3.0.Final-sources.jar",
    "status": "approved",
    "scans": [
        {
            "date": "November 19, 2024, 8:18:36 p.m. GMT",
            "authority": "https://gitlab.eclipse.org/eclipsefdn/emo-team/iplab/-/issues/17344",
            "scancode-version": "31.2.1",
            "licenses-discovered": [
                "Apache-2.0",
                "Apache-2.0 AND LicenseRef-scancode-proprietary-license",
                "Apache-2.0 AND CC0-1.0"
            ],
            "copyrights": [
                "(c) 2013 Red Hat Inc.",
                "Copyright 2012 Red Hat, Inc., and individual contributors",
                "Copyright 2014 Red Hat, Inc., and individual contributors",
                "Copyright 2015 Red Hat, Inc., and individual contributors",
                "Copyright 2018 Red Hat, Inc., and individual contributors",
                "Copyright 2019 Red Hat, Inc., and individual contributors",
                "Copyright 2020 Red Hat, Inc., and individual contributors",
                "Copyright 2022 Red Hat, Inc., and individual contributors"
            ],
            "file-count": 672,
            "sha256": "a226b8471bbbf545f38e857b9ccb67c76d2608c10d2934b863c4d5b46a393476",
            "source": "https://repo1.maven.org/maven2/io/undertow/undertow-core/2.3.0.Final/undertow-core-2.3.0.Final-sources.jar",
            "status": "restricted"
        }
    ]
}