{
    "id": "npm/npmjs/@typescript-eslint/typescript-estree/7.15.0",
    "license": "BSD-2-Clause AND MIT AND (BSD-2-Clause AND ISC AND MIT)",
    "authority": "https://gitlab.eclipse.org/eclipsefdn/emo-team/iplab/-/issues/15505",
    "source": "https://github.com/typescript-eslint/typescript-eslint/archive/refs/tags/v7.15.0.zip",
    "status": "approved",
    "scans": [
        {
            "date": "July 2, 2024 at 8:38:42 a.m. GMT",
            "authority": "https://gitlab.eclipse.org/eclipsefdn/emo-team/iplab/-/issues/15505",
            "scancode-version": "31.2.1",
            "licenses-discovered": [
                "BSD-2-Clause",
                "MIT",
                "BSD-2-Clause AND ISC AND MIT"
            ],
            "copyrights": [
                "Copyright (c) 2016 unional",
                "Copyright (c) 2019 typescript-eslint and other contributors",
                "Copyright (c) 2021 typescript-eslint and other contributors",
                "Copyright (c) 2023 typescript-eslint and other contributors",
                "Copyright JS Foundation and other contributors, https://js.foundation",
                "Copyright Joyent, Inc. and other Node contributors",
                "Pp (c) Ac",
                "Tv (c) Gn"
            ],
            "file-count": 7182,
            "sha256": "2e26f05c92fce3e2884dd358ae00ea421f7750ecceed2164bf058dcad98d9bbf",
            "source": "https://github.com/typescript-eslint/typescript-eslint/archive/refs/tags/v7.15.0.zip",
            "status": "approved"
        }
    ]
}