{
    "id": "maven/mavencentral/org.apache.camel/camel-core-languages/3.21.0",
    "license": "Apache-2.0",
    "authority": "https://gitlab.eclipse.org/eclipsefdn/emo-team/iplab/-/issues/10322",
    "source": "https://repo.maven.apache.org/maven2/org/apache/camel/camel-core-languages/3.21.0/camel-core-languages-3.21.0-sources.jar",
    "status": "approved",
    "scans": [
        {
            "date": "September 6, 2023 at 10:51:00 a.m. GMT",
            "authority": "https://gitlab.eclipse.org/eclipsefdn/emo-team/iplab/-/issues/10322",
            "scancode-version": "31.2.1",
            "licenses-discovered": [
                "Apache-2.0"
            ],
            "copyrights": [
            ],
            "file-count": 82,
            "sha256": "e6890c44f63e7e6bc2c5e8e2d537aa6c846c17bb2ac64e3e9f4f8ad0b99c543d",
            "source": "https://repo.maven.apache.org/maven2/org/apache/camel/camel-core-languages/3.21.0/camel-core-languages-3.21.0-sources.jar",
            "status": "approved"
        }
    ]
}