{
    "id": "maven/mavencentral/org.codehaus.groovy/groovy-groovysh/3.0.21",
    "license": "Apache-2.0",
    "authority": "https://gitlab.eclipse.org/eclipsefdn/emo-team/iplab/-/issues/14491",
    "source": "https://repo1.maven.org/maven2/org/codehaus/groovy/groovy-groovysh/3.0.21/groovy-groovysh-3.0.21-sources.jar",
    "status": "approved",
    "scans": [
        {
            "date": "April 23, 2024 at 6:59:54 a.m. GMT",
            "authority": "https://gitlab.eclipse.org/eclipsefdn/emo-team/iplab/-/issues/14491",
            "scancode-version": "31.2.1",
            "licenses-discovered": [
                "Apache-2.0"
            ],
            "copyrights": [
            ],
            "file-count": 180,
            "sha256": "6f274302fc4b2cf7e3098b85d72de70a70622ef4f2b6e97fb29a0fde550423aa",
            "source": "https://repo1.maven.org/maven2/org/codehaus/groovy/groovy-groovysh/3.0.21/groovy-groovysh-3.0.21-sources.jar",
            "status": "approved"
        }
    ]
}