{
    "id": "p2/orbit/p2.eclipse-plugin/org.apache.jmeter.ApacheJMeter_core/3.2",
    "license": "Apache-2.0 AND BSD-3-Clause AND Apache-2.0 AND (Apache-2.0 AND BSD-2-Clause AND LicenseRef-scancode-unknown) AND MIT AND (Apache-2.0 AND CC-BY-SA-2.5) AND (Apache-2.0 AND LicenseRef-scancode-free-unknown) AND (CC-BY-3.0 AND MIT) AND GPL-3.0-only AND (GPL-2.0-only AND MIT) AND (GPL-3.0-only AND MIT) AND OFL-1.1 AND (MIT AND OFL-1.1) AND (LicenseRef-scancode-unknown-license-reference AND MIT) AND LicenseRef-scancode-unknown-license-reference AND BSD-2-Clause AND (Apache-2.0 AND MIT) AND (BSD-3-Clause AND MIT) AND (Apache-1.1 AND Apache-2.0) AND BSD-3-Clause AND (LGPL-2.0-or-later AND LicenseRef-scancode-unknown-license-reference AND SPL-1.0) AND (Apache-2.0 AND LicenseRef-scancode-freemarker) AND (CDDL-1.0 AND (GPL-2.0-only WITH Classpath-exception-2.0)) AND LicenseRef-scancode-other-permissive AND HTMLTIDY AND MPL-2.0 AND LicenseRef-scancode-indiana-extreme AND (CC-BY-3.0 AND CC-BY-4.0 AND CC-BY-SA-3.0 AND LGPL-2.0-or-later AND LGPL-2.1-only) AND LGPL-2.1-only",
    "licenses-discovered": [
        "Apache-2.0 AND BSD-3-Clause",
        "Apache-2.0",
        "Apache-2.0 AND BSD-2-Clause AND LicenseRef-scancode-unknown",
        "MIT",
        "Apache-2.0 AND CC-BY-SA-2.5",
        "Apache-2.0 AND LicenseRef-scancode-free-unknown",
        "CC-BY-3.0 AND MIT",
        "GPL-3.0-only",
        "GPL-2.0-only AND MIT",
        "GPL-3.0-only AND MIT",
        "OFL-1.1",
        "MIT AND OFL-1.1",
        "LicenseRef-scancode-unknown-license-reference AND MIT",
        "LicenseRef-scancode-unknown-license-reference",
        "BSD-2-Clause",
        "Apache-2.0 AND MIT",
        "BSD-3-Clause AND MIT",
        "Apache-1.1 AND Apache-2.0",
        "BSD-3-Clause",
        "LGPL-2.0-or-later AND LicenseRef-scancode-unknown-license-reference AND SPL-1.0",
        "Apache-2.0 AND LicenseRef-scancode-freemarker",
        "CDDL-1.0 AND (GPL-2.0-only WITH Classpath-exception-2.0)",
        "LicenseRef-scancode-other-permissive",
        "HTMLTIDY",
        "MPL-2.0",
        "LicenseRef-scancode-indiana-extreme",
        "CC-BY-3.0 AND CC-BY-4.0 AND CC-BY-SA-3.0 AND LGPL-2.0-or-later AND LGPL-2.1-only",
        "LGPL-2.1-only"
    ],
    "file-count": 3191,
    "scancode-version": "30.1.0",
    "authority": "https://gitlab.eclipse.org/eclipsefdn/emo-team/iplab/-/issues/2210",
    "source": "https://github.com/apache/jmeter/archive/refs/tags/v3_2.zip",
    "status": "restricted"
}