{
    "id": "maven/mavencentral/it.unibz.inf.ontop/ontop-model/5.0.2",
    "license": "Apache-2.0",
    "authority": "https://gitlab.eclipse.org/eclipsefdn/emo-team/iplab/-/issues/9817",
    "source": "https://repo.maven.apache.org/maven2/it/unibz/inf/ontop/ontop-model/5.0.2/ontop-model-5.0.2-sources.jar",
    "status": "approved",
    "scans": [
        {
            "date": "July 27, 2023 at 1:27:40 p.m. GMT",
            "authority": "https://gitlab.eclipse.org/eclipsefdn/emo-team/iplab/-/issues/9817",
            "scancode-version": "31.2.1",
            "licenses-discovered": [
                "Apache-2.0",
                "OGC-1.0"
            ],
            "copyrights": [
                "Copyright (c) 2009 - 2014 Free University of Bozen-Bolzano"
            ],
            "file-count": 668,
            "sha256": "4c15e20f0c585124d0f275f3ad045fc61f3ac46f9fa1051802d626b5012b6925",
            "source": "https://repo.maven.apache.org/maven2/it/unibz/inf/ontop/ontop-model/5.0.2/ontop-model-5.0.2-sources.jar",
            "status": "restricted"
        }
    ]
}
