{
    "id": "maven/mavencentral/org.apache.kafka/kafka-streams-scala_2.12/2.8.2",
    "license": "Apache-2.0",
    "authority": "https://gitlab.eclipse.org/eclipsefdn/emo-team/iplab/-/issues/6483",
    "source": "https://search.maven.org/remotecontent?filepath=org/apache/kafka/kafka-streams-scala_2.12/2.8.2/kafka-streams-scala_2.12-2.8.2-sources.jar",
    "status": "approved",
    "scans": [
        {
            "date": "January 24, 2023 at 1:50:29 a.m. GMT",
            "authority": "https://gitlab.eclipse.org/eclipsefdn/emo-team/iplab/-/issues/6483",
            "scancode-version": "31.2.1",
            "licenses-discovered": [
                "Apache-2.0"
            ],
            "copyrights": [
            ],
            "file-count": 29,
            "sha256": "1b5e19eb5fbe8583cb8bc34764c92f4e28fd597f4f57c02ee6fa6f6957c14423",
            "source": "https://search.maven.org/remotecontent?filepath=org/apache/kafka/kafka-streams-scala_2.12/2.8.2/kafka-streams-scala_2.12-2.8.2-sources.jar",
            "status": "approved"
        }
    ]
}