{
    "id": "pypi/pypi/-/jupyterlab-pygments/0.2.2",
    "license": "BSD-3-Clause AND (Apache-2.0 AND BSD-3-Clause) AND MIT",
    "authority": "https://gitlab.eclipse.org/eclipsefdn/emo-team/iplab/-/issues/14993",
    "source": "https://files.pythonhosted.org/packages/69/8e/8ae01f052013ee578b297499d16fcfafb892927d8e41c1a0054d2f99a569/jupyterlab_pygments-0.2.2.tar.gz",
    "status": "approved",
    "scans": [
        {
            "date": "May 29, 2024 at 12:12:08 p.m. GMT",
            "authority": "https://gitlab.eclipse.org/eclipsefdn/emo-team/iplab/-/issues/14993",
            "scancode-version": "31.2.1",
            "licenses-discovered": [
                "BSD-3-Clause",
                "Apache-2.0 AND BSD-3-Clause",
                "MIT"
            ],
            "copyrights": [
                "Copyright (c) 2015 Project Jupyter Contributors",
                "Copyright (c) Jupyter Development Team",
                "Copyright JS Foundation and other contributors"
            ],
            "file-count": 31,
            "sha256": "7405d7fde60819d905a9fa8ce89e4cd830e318cdad22a0030f7a901da705585d",
            "source": "https://files.pythonhosted.org/packages/69/8e/8ae01f052013ee578b297499d16fcfafb892927d8e41c1a0054d2f99a569/jupyterlab_pygments-0.2.2.tar.gz",
            "status": "approved"
        }
    ]
}