{
    "id": "maven/mavencentral/org.geotools/gt-process-feature/28.1",
    "license": "LGPL-2.1-only",
    "authority": "https://gitlab.eclipse.org/eclipsefdn/emo-team/iplab/-/issues/6695",
    "source": "https://repo.osgeo.org/repository/geotools-releases/org/geotools/gt-process-feature/28.1/gt-process-feature-28.1-sources.jar",
    "status": "approved",
    "scans": [
        {
            "date": "January 26, 2023 at 3:05:25 p.m. GMT",
            "authority": "https://gitlab.eclipse.org/eclipsefdn/emo-team/iplab/-/issues/6695",
            "scancode-version": "31.2.1",
            "licenses-discovered": [
                "LGPL-2.1-only"
            ],
            "copyrights": [
                "(c) 2001-2007 TOPP - www.openplans.org",
                "(c) 2007-2011 Refractions Research",
                "(c) 2008, Open Source Geospatial Foundation",
                "(c) 2008-2011 TOPP - www.openplans.org",
                "(c) 2008-2011, Open Source Geospatial Foundation",
                "(c) 2011, Open Source Geospatial Foundation",
                "(c) 2011-2016, Open Source Geospatial Foundation",
                "(c) 2012, Open Source Geospatial Foundation",
                "(c) 2016, Open Source Geospatial Foundation",
                "(c) 2017, Open Source Geospatial Foundation",
                "(c) 2019, Open Source Geospatial Foundation",
                "(c) 2020, Open Source Geospatial Foundation"
            ],
            "file-count": 51,
            "sha256": "1b9ea596f2d6bd021c59e304dcd48c9fc3b5d6d100c91d5577ae92c9ecabdbfd",
            "source": "https://repo.osgeo.org/repository/geotools-releases/org/geotools/gt-process-feature/28.1/gt-process-feature-28.1-sources.jar",
            "status": "approved"
        }
    ]
}