{
    "id": "npm/npmjs/@babel/plugin-transform-spread/7.20.7",
    "license": "BSD-2-Clause AND MIT",
    "authority": "https://gitlab.eclipse.org/eclipsefdn/emo-team/iplab/-/issues/5982",
    "source": "https://github.com/babel/babel/archive/v7.20.7.zip",
    "status": "approved",
    "scans": [
        {
            "date": "December 23, 2022 at 4:52:16 p.m. GMT",
            "authority": "https://gitlab.eclipse.org/eclipsefdn/emo-team/iplab/-/issues/5982",
            "scancode-version": "31.2.1",
            "licenses-discovered": [
                "MIT",
                "BSD-2-Clause AND MIT",
                "BSD-2-Clause",
                "BSD-3-Clause AND LicenseRef-scancode-ecma-no-patent",
                "BSD-3-Clause"
            ],
            "copyrights": [
                "Copyright (c) 2011-2017 KARASZI Istvan <github@spam.raszi.hu>",
                "Copyright (c) 2012 Yusuke Suzuki <utatane.tea@gmail.com>",
                "Copyright (c) 2012-2013 Ecma International",
                "Copyright (c) 2012-2014 by various contributors",
                "Copyright (c) 2014-2015 Jason Quense <jason@quense.me>",
                "Copyright (c) 2014-present Sebastian McKenzie and other contributors",
                "Copyright (c) 2014-present, Facebook, Inc.",
                "Copyright (c) 2015 Jed Watson",
                "Copyright (c) jQuery Foundation, Inc. and Contributors",
                "Copyright 2013-2015, Facebook, Inc.",
                "Copyright 2020 Bloomberg Finance L.P.",
                "Copyright JS Foundation and other contributors",
                "Copyright OpenJS Foundation and other contributors",
                "copyright (c) 2014-2022 Denis Pushkarev"
            ],
            "file-count": 28167,
            "sha256": "53f780bddee47917f0e3d4ba76d22dd25fbe93f07de6f5e218d9b0400950d62a",
            "source": "https://github.com/babel/babel/archive/v7.20.7.zip",
            "status": "restricted"
        }
    ]
}
