{
    "id": "maven/mavencentral/com.sun.mail/jakarta.mail/2.0.1",
    "license": "EPL-2.0 OR (GPL-2.0 WITH Classpath-exception-2.0)",
    "authority": "https://gitlab.eclipse.org/eclipsefdn/emo-team/iplab/-/issues/10659",
    "source": "https://repo.maven.apache.org/maven2/com/sun/mail/jakarta.mail/2.0.1/jakarta.mail-2.0.1-sources.jar",
    "status": "approved",
    "scans": [
        {
            "date": "September 22, 2023 at 2:14:13 p.m. GMT",
            "authority": "https://gitlab.eclipse.org/eclipsefdn/emo-team/iplab/-/issues/10659",
            "scancode-version": "31.2.1",
            "licenses-discovered": [
                "EPL-2.0 AND (GPL-2.0-only WITH Classpath-exception-2.0)",
                "EPL-2.0 AND (GPL-2.0-only WITH Classpath-exception-2.0) AND LicenseRef-scancode-efsl-1.0",
                "EPL-2.0 AND (GPL-2.0-only WITH Classpath-exception-2.0) AND LicenseRef-scancode-generic-export-compliance"
            ],
            "copyrights": [
                "COPYRIGHT HOLDERS AND THE ECLIPSE FOUNDATION",
                "Copyright (c) 1989, 1991 Free Software Foundation, Inc.",
                "Copyright (c) 1997, 2018 Oracle and/or its affiliates",
                "Copyright (c) 1997, 2019 Oracle and/or its affiliates",
                "Copyright (c) 1997, 2020 Oracle and/or its affiliates",
                "Copyright (c) 1997, 2021 Oracle and/or its affiliates",
                "Copyright (c) 2005, 2019 Oracle and/or its affiliates",
                "Copyright (c) 2008, 2018 Oracle and/or its affiliates",
                "Copyright (c) 2009, 2018 Jason Mehrens",
                "Copyright (c) 2009, 2019 Jason Mehrens",
                "Copyright (c) 2009, 2019 Oracle and/or its affiliates",
                "Copyright (c) 2009, 2020 Jason Mehrens",
                "Copyright (c) 2009, 2020 Oracle and/or its affiliates",
                "Copyright (c) 2010, 2018 Oracle and/or its affiliates",
                "Copyright (c) 2010, 2019 Oracle and/or its affiliates",
                "Copyright (c) 2010, 2020 Oracle and/or its affiliates",
                "Copyright (c) 2012, 2020 Oracle and/or its affiliates",
                "Copyright (c) 2013, 2018 Jason Mehrens",
                "Copyright (c) 2013, 2018 Oracle and/or its affiliates",
                "Copyright (c) 2013, 2019 Jason Mehrens",
                "Copyright (c) 2013, 2019 Oracle and/or its affiliates",
                "Copyright (c) 2013, 2021 Oracle and/or its affiliates",
                "Copyright (c) 2014, 2019 Oracle and/or its affiliates",
                "Copyright (c) 2014, 2020 Oracle and/or its affiliates",
                "Copyright (c) 2015, 2018 Jason Mehrens",
                "Copyright (c) 2015, 2019 Oracle and/or its affiliates",
                "Copyright (c) 2018 Eclipse Foundation",
                "Copyright (c) 2019 Oracle and/or its affiliates",
                "Copyright (c) 2020 Oracle and/or its affiliates",
                "Copyright (c) 2021 Oracle and/or its affiliates",
                "Copyright (c) Eclipse Foundation, Inc.",
                "copyrighted by the Free Software Foundation"
            ],
            "file-count": 270,
            "sha256": "d12f58aa1aa928a1714eb34a3bb56d0a65317abdee8dafcf7c65a8ea6c84a59e",
            "source": "https://repo.maven.apache.org/maven2/com/sun/mail/jakarta.mail/2.0.1/jakarta.mail-2.0.1-sources.jar",
            "status": "restricted"
        }
    ]
}
