{
    "id": "npm/npmjs/@typescript-eslint/typescript-estree/7.7.0",
    "license": "BSD-2-Clause AND MIT AND (BSD-2-Clause AND ISC AND MIT)",
    "authority": "https://gitlab.eclipse.org/eclipsefdn/emo-team/iplab/-/issues/14390",
    "source": "https://github.com/typescript-eslint/typescript-eslint/archive/refs/tags/v7.7.0.zip",
    "status": "approved",
    "scans": [
        {
            "date": "April 16, 2024 at 11:19:46 a.m. GMT",
            "authority": "https://gitlab.eclipse.org/eclipsefdn/emo-team/iplab/-/issues/14390",
            "scancode-version": "31.2.1",
            "licenses-discovered": [
                "BSD-2-Clause",
                "MIT",
                "BSD-2-Clause AND ISC AND MIT"
            ],
            "copyrights": [
                "(c) Sindre Sorhus",
                "Copyright (c) 2016 unional",
                "Copyright (c) 2019 typescript-eslint and other contributors",
                "Copyright (c) 2021 typescript-eslint and other contributors",
                "Copyright (c) 2023 typescript-eslint and other contributors",
                "Copyright (c) Facebook, Inc. and its affiliates",
                "Copyright JS Foundation and other contributors, https://js.foundation",
                "Copyright Jeremy Ashkenas, DocumentCloud and Investigative Reporters & Editors",
                "Copyright Joyent, Inc. and other Node contributors",
                "Copyright OpenJS Foundation and other contributors <https://openjsf.org/>",
                "Pp (c) Ac",
                "Tv (c) Gn"
            ],
            "file-count": 7089,
            "sha256": "6afcfb289341eb616535b55a11b1692d3ba42f9e27ecab5a1c993e81aa6e3756",
            "source": "https://github.com/typescript-eslint/typescript-eslint/archive/refs/tags/v7.7.0.zip",
            "status": "approved"
        }
    ]
}