{
    "license": "GPL-2.0-or-later AND CC0-1.0 AND (HPND-sell-variant AND LicenseRef-scancode-proprietary-license) AND LicenseRef-scancode-proprietary-license AND Apache-2.0 AND (Apache-2.0 AND EPL-1.0) AND LGPL-2.1-or-later AND GPL-2.0-only AND (GPL-2.0-or-later AND LicenseRef-scancode-mit-xfig) AND (GPL-2.0-or-later AND LGPL-2.1-or-later) AND MIT AND (AGPL-3.0-or-later AND Apache-2.0 AND BSD-3-Clause AND EPL-1.0 AND GPL-2.0-or-later AND LGPL-2.1-or-later AND MIT) AND EPL-1.0 AND (GPL-2.0-or-later AND MIT) AND (LGPL-2.0-or-later AND LGPL-3.0-or-later) AND (BSD-3-Clause AND EPL-1.0) AND (Apache-2.0 AND GPL-2.0-or-later) AND (LGPL-2.1-only AND LicenseRef-scancode-other-copyleft) AND (Apache-2.0 AND BSD-3-Clause AND EPL-1.0 AND GPL-2.0-only AND GPL-3.0-or-later AND LGPL-2.1-or-later AND LicenseRef-scancode-other-copyleft AND LicenseRef-scancode-proprietary-license AND LicenseRef-scancode-unknown AND MIT) AND GPL-3.0-or-later",
    "file-count": 3251,
    "authority": "https://gitlab.eclipse.org/eclipsefdn/emo-team/iplab/-/issues/1574",
    "scancode-version": "30.1.0",
    "licenses-discovered": [
        "GPL-2.0-or-later",
        "CC0-1.0",
        "HPND-sell-variant AND LicenseRef-scancode-proprietary-license",
        "LicenseRef-scancode-proprietary-license",
        "Apache-2.0",
        "Apache-2.0 AND EPL-1.0",
        "LGPL-2.1-or-later",
        "GPL-2.0-only",
        "GPL-2.0-or-later AND LicenseRef-scancode-mit-xfig",
        "GPL-2.0-or-later AND LGPL-2.1-or-later",
        "MIT",
        "AGPL-3.0-or-later AND Apache-2.0 AND BSD-3-Clause AND EPL-1.0 AND GPL-2.0-or-later AND LGPL-2.1-or-later AND MIT",
        "EPL-1.0",
        "GPL-2.0-or-later AND MIT",
        "LGPL-2.0-or-later AND LGPL-3.0-or-later",
        "BSD-3-Clause AND EPL-1.0",
        "Apache-2.0 AND GPL-2.0-or-later",
        "LGPL-2.1-only AND LicenseRef-scancode-other-copyleft",
        "Apache-2.0 AND BSD-3-Clause AND EPL-1.0 AND GPL-2.0-only AND GPL-3.0-or-later AND LGPL-2.1-or-later AND LicenseRef-scancode-other-copyleft AND LicenseRef-scancode-proprietary-license AND LicenseRef-scancode-unknown AND MIT",
        "GPL-3.0-or-later"
    ],
    "id": "p2/orbit/p2.eclipse-plugin/net.sourceforge.plantuml.lib/1.2021.5",
    "source": "https://search.maven.org/remotecontent?filepath=net/sourceforge/plantuml/plantuml/1.2021.5/plantuml-1.2021.5-sources.jar",
    "status": "restricted",
    "copyrights": [
        "(c) Christian Treber, ct@ctreber.com",
        "(c) Copyright Arnaud Roques",
        "(c) Copyright Arnaud Roques Project",
        "(c) Copyright Arnaud Roques h.add h.add Project",
        "(c) David Lippman http://www.pierce.ctc.edu/dlippman",
        "(c) Peter Jipsen http://www.chapman.edu/~jipsen",
        "Copyright (c) AT&T Intellectual Property",
        "Copyright (c) Anthony Dekker",
        "Copyright (c) Christian Treber, ct@ctreber.com",
        "Copyright (c) David Beaumont",
        "Copyright (c) EclipseSource",
        "Copyright (c) Efstathios Sideris",
        "Copyright (c) Kirk Lauritz Johnson",
        "Copyright (c) Project",
        "Copyright (c) Robert Nystrom",
        "Copyright (c) The University of Edinburgh",
        "Copyright (c) by Jamie Zawinski <jwz@lucid.com>",
        "Copyright (c) by Jim Frost",
        "Copyright (c) the authors",
        "Copyright Christian d'Heureuse, Inventec Informatik AG, Zurich, Switzerland",
        "Copyright Franz-Josef Elmer",
        "Copyright Google Inc.",
        "Copyright Udo Klimaschewski",
        "Copyright ZXing",
        "David Beaumont,"
    ]
}