{
    "id": "maven/mavencentral/io.openmanufacturing/sds-aspect-model-aas-generator/2.1.1",
    "license": "MPL-2.0",
    "authority": "https://gitlab.eclipse.org/eclipsefdn/emo-team/iplab/-/issues/8163",
    "source": "https://search.maven.org/remotecontent?filepath=io/openmanufacturing/sds-aspect-model-aas-generator/2.1.1/sds-aspect-model-aas-generator-2.1.1-sources.jar",
    "status": "approved",
    "scans": [
        {
            "date": "May 3, 2023 at 8:34:17 a.m. GMT",
            "authority": "https://gitlab.eclipse.org/eclipsefdn/emo-team/iplab/-/issues/8156",
            "scancode-version": "31.2.1",
            "licenses-discovered": [
                "MPL-2.0"
            ],
            "copyrights": [
                "Copyright (c) 2021, 2022 Robert Bosch Manufacturing Solutions GmbH"
            ],
            "file-count": 4,
            "sha256": "78eca4a841345d46987a2204eb698e89ace0353388392db019c378408d360990",
            "source": "https://search.maven.org/remotecontent?filepath=io/openmanufacturing/sds-aspect-model-aas-generator/2.1.1/sds-aspect-model-aas-generator-2.1.1-sources.jar",
            "status": "approved"
        },
        {
            "date": "May 3, 2023 at 8:55:17 a.m. GMT",
            "authority": "https://gitlab.eclipse.org/eclipsefdn/emo-team/iplab/-/issues/8163",
            "scancode-version": "31.2.1",
            "licenses-discovered": [
                "MPL-2.0"
            ],
            "copyrights": [
                "Copyright (c) 2021, 2022 Robert Bosch Manufacturing Solutions GmbH"
            ],
            "file-count": 4,
            "sha256": "78eca4a841345d46987a2204eb698e89ace0353388392db019c378408d360990",
            "source": "https://search.maven.org/remotecontent?filepath=io/openmanufacturing/sds-aspect-model-aas-generator/2.1.1/sds-aspect-model-aas-generator-2.1.1-sources.jar",
            "status": "approved"
        }
    ]
}