{
    "id": "npm/npmjs/@vscode/vsce/2.22.0",
    "license": "MIT AND ISC",
    "authority": "https://gitlab.eclipse.org/eclipsefdn/emo-team/iplab/-/issues/12179",
    "source": "https://github.com/microsoft/vscode-vsce/archive/refs/tags/v2.22.0.zip",
    "status": "approved",
    "scans": [
        {
            "date": "December 20, 2023 at 4:26:39 a.m. GMT",
            "authority": "https://gitlab.eclipse.org/eclipsefdn/emo-team/iplab/-/issues/12179",
            "scancode-version": "31.2.1",
            "licenses-discovered": [
                "MIT",
                "ISC AND MIT",
                "ISC"
            ],
            "copyrights": [
                "Copyright (c) 2010 Benjamin Thomas, Robert Kieffer",
                "Copyright (c) 2011 TJ Holowaychuk <tj@vision-media.ca>",
                "Copyright (c) 2014 Josh Wolfe",
                "Copyright (c) 2014 KARASZI Istvan",
                "Copyright (c) 2015 Microsoft",
                "Copyright (c) Isaac Z. Schlueter and Contributors",
                "Copyright (c) Microsoft Corporation",
                "Copyright 2012-2015 The Dojo Foundation <http://dojofoundation.org/>",
                "copyright 2009-2015 Jeremy Ashkenas, DocumentCloud and Investigative Reporters & Editors <http://underscorejs.org/>"
            ],
            "file-count": 101,
            "sha256": "e58abf9f2e2ad2861c06f96b55d34f2c2a625aaabbd906f362bf0ce85815c8ff",
            "source": "https://github.com/microsoft/vscode-vsce/archive/refs/tags/v2.22.0.zip",
            "status": "approved"
        }
    ]
}
