{
    "id": "go/golang/google.golang.org/grpc/v1.31.0",
    "license": "Apache-2.0",
    "authority": "https://gitlab.eclipse.org/eclipsefdn/emo-team/iplab/-/issues/6059",
    "source": "https://proxy.golang.org/google.golang.org/grpc/@v/v1.31.0.zip",
    "status": "approved",
    "scans": [
        {
            "date": "January 6, 2023 at 5:33:09 p.m. GMT",
            "authority": "https://gitlab.eclipse.org/eclipsefdn/emo-team/iplab/-/issues/6059",
            "scancode-version": "31.2.1",
            "licenses-discovered": [
                "Apache-2.0"
            ],
            "copyrights": [
                "Copyright 2014 gRPC",
                "Copyright 2015 gRPC",
                "Copyright 2015-2016 gRPC",
                "Copyright 2016 gRPC",
                "Copyright 2017 gRPC",
                "Copyright 2018 gRPC",
                "Copyright 2019 gRPC",
                "Copyright 2020 gRPC"
            ],
            "file-count": 506,
            "sha256": "09c274a0b4cce25dc9b5da59cd9c0801b36322963c4caedd44ccddffba5de470",
            "source": "https://proxy.golang.org/google.golang.org/grpc/@v/v1.31.0.zip",
            "status": "approved"
        }
    ]
}