{
    "id": "project/technology.xfsc/eclipse-xfsc-cat/fc-service/6c6148f5416f0287e83777853a73e84f588a0c23",
    "license": "Apache-2.0 AND (Apache-2.0 OR BSD-2-Clause) AND BSD-3-Clause AND (EPL-2.0 OR GPL-2.0-only WITH Classpath-exception-2.0) AND LGPL-2.1-or-later AND LicenseRef-MIT-style AND MIT",
    "authority": "https://gitlab.eclipse.org/eclipsefdn/emo-team/iplab/-/issues/9535",
    "source": "https://gitlab.eclipse.org/api/v4/projects/eclipse%2Fxfsc%2Fcat%2Ffc-service/repository/archive.zip?sha=6c6148f5416f0287e83777853a73e84f588a0c23",
    "status": "restricted",
    "scans": [
        {
            "date": "July 18, 2023 at 9:06:29 a.m. GMT",
            "authority": "https://gitlab.eclipse.org/eclipsefdn/emo-team/iplab/-/issues/9535",
            "scancode-version": "31.2.1",
            "licenses-discovered": [
                "Apache-2.0",
                "MIT",
                "CC-BY-4.0",
                "EPL-2.0 AND (GPL-2.0-only WITH Classpath-exception-2.0)",
                "EPL-2.0 AND GPL-2.0-only",
                "EPL-2.0 OR GPL-2.0-only WITH Classpath-exception-2.0",
                "LGPL-2.1-or-later",
                "BSD-3-Clause",
                "Python-2.0",
                "Apache-2.0 AND BSD-2-Clause AND BSD-3-Clause",
                "Apache-2.0 AND BSD-3-Clause",
                "LicenseRef-scancode-unknown"
            ],
            "copyrights": [
                "(c) 1999 Entrust.net Limited",
                "(c) 1999 Entrust.net Limited Label Entrust.net Premium 2048 Secure Server CA Serial",
                "(c) 2006 Entrust, Inc.",
                "(c) 2006 Entrust, Inc. Label Entrust Root Certification",
                "(c) 2006-2022 by Georg Brandl, Matthaus Chajdas and contributors",
                "(c) 2008-2018 SpryMedia Ltd - datatables.net/license",
                "(c) 2009 Entrust, Inc. - for",
                "(c) 2012 Entrust, Inc. - for",
                "(c) 2015 Entrust, Inc. - for",
                "(c) JS Foundation and other contributors",
                "(c) OpenJS Foundation and other contributors",
                "Copyright (c) 1989, 1991 Free Software Foundation, Inc.",
                "Copyright (c) 1998 the Initial Developer",
                "Copyright (c) 2000-2021 The Legion of the Bouncy Castle Inc. (https://www.bouncycastle.org)",
                "Copyright (c) 2001 the Initial Developer",
                "Copyright (c) 2003-2022 Paul T. McGuire",
                "Copyright (c) 2005 the Initial Developer",
                "Copyright (c) 2005-2010 ActiveState Software Inc.",
                "Copyright (c) 2008-2016 The pip",
                "Copyright (c) 2008-present The pip",
                "Copyright (c) 2010-2020 Benjamin Peterson",
                "Copyright (c) 2011, 2020 Oracle and/or its affiliates",
                "Copyright (c) 2012 The Python Software Foundation",
                "Copyright (c) 2012-2013 Python Software Foundation",
                "Copyright (c) 2012-2015 Vinay Sajip",
                "Copyright (c) 2012-2017 The Python Software Foundation",
                "Copyright (c) 2012-2017 Vinay Sajip",
                "Copyright (c) 2012-2021 The Python Software Foundation",
                "Copyright (c) 2012-2022 Vinay Sajip",
                "Copyright (c) 2013 Eddy Petrisor",
                "Copyright (c) 2013 Vinay Sajip",
                "Copyright (c) 2013, 2020 Oracle and/or its affiliates",
                "Copyright (c) 2013-2015 Vinay Sajip",
                "Copyright (c) 2013-2017 Vinay Sajip",
                "Copyright (c) 2013-2020 Vinay Sajip",
                "Copyright (c) 2015-2016 Will Bond <will@wbond.net>",
                "Copyright (c) 2018, 2020 Oracle and/or its affiliates",
                "Copyright (c) 2019, 2020 Eclipse Foundation",
                "Copyright (c) Simple Launcher",
                "Copyright (c) Sindre Sorhus <sindresorhus@gmail.com> (sindresorhus.com)",
                "Copyright 1991-1995 SMC.",
                "Copyright 1995-2001 CNRI.",
                "Copyright 2000 BeOpen.com",
                "Copyright 2001-2016 Python Software Foundation",
                "Copyright 2006-2022 by the Pygments team",
                "Copyright 2011-2021 The Bootstrap Authors",
                "Copyright 2011-2021 The Bootstrap Authors (https://github.com/twbs/bootstrap/graphs/contributors)",
                "Copyright 2011-2021 Twitter, Inc.",
                "Copyright 2011-2022 The Bootstrap Authors",
                "Copyright 2011-2022 Twitter, Inc.",
                "Copyright 2012 Facebook",
                "Copyright 2012 by Simon Sapin",
                "Copyright 2013-2014 Ray",
                "Copyright 2013-2022 Start Bootstrap",
                "Copyright 2015 Eric Larson",
                "Copyright 2015,2016,2017 Nir Cohen",
                "Copyright 2016 Etienne Bersac",
                "Copyright 2016 Joshua Harlow",
                "Copyright 2016 Julien Danjou",
                "Copyright 2016-2018 Julien Danjou",
                "Copyright 2016-2021 Julien Danjou",
                "Copyright 2017 Elisey Zanko",
                "Copyright 2021 Taneli Hukkinen",
                "Copyright 2022 Gaia-X / Data-Infrastructure Federation Services",
                "Copyright 2022 Kenneth Reitz",
                "Copyright Jason R. Coombs",
                "Copyright Jonathan Hartley 2013",
                "Copyright jQuery Foundation and other contributors",
                "copyright (c) 2012 by Kenneth Reitz",
                "copyright (c) 2017 by Kenneth Reitz",
                "copyright 2014-2019 s",
                "copyrighted by the Free Software Foundation"
            ],
            "file-count": 7234,
            "sha256": "307cd0cc2995e3c994f7f814dbd544ecc5043f5f93c6c5c41b63dc3472ce865f",
            "source": "https://gitlab.eclipse.org/api/v4/projects/eclipse%2Fxfsc%2Fcat%2Ffc-service/repository/archive.zip?sha=6c6148f5416f0287e83777853a73e84f588a0c23",
            "status": "restricted"
        }
    ]
}
