{
    "id": "git/github/hashicorp/go-version/v1.2.0",
    "license": "MPL-2.0",
    "licenses-discovered": [
        "MPL-2.0"
    ],
    "copyrights": [
    ],
    "file-count": 10,
    "scancode-version": "30.1.0",
    "authority": "https://gitlab.eclipse.org/eclipsefdn/emo-team/iplab/-/issues/3605",
    "source": "https://github.com/hashicorp/go-version/archive/refs/tags/v1.2.0.zip",
    "status": "approved"
}