{
    "id": "maven/mavencentral/com.goterl/resource-loader/2.0.2",
    "license": "MPL-2.0",
    "authority": "https://gitlab.eclipse.org/eclipsefdn/emo-team/iplab/-/issues/19461",
    "source": "https://repo1.maven.org/maven2/com/goterl/resource-loader/2.0.2/resource-loader-2.0.2-sources.jar",
    "status": "approved",
    "scans": [
        {
            "date": "February 13, 2025 at 1:33:20 p.m. GMT",
            "authority": "https://gitlab.eclipse.org/eclipsefdn/emo-team/iplab/-/issues/19461",
            "scancode-version": "31.2.1",
            "licenses-discovered": [
                "MPL-2.0"
            ],
            "copyrights": [
                "Copyright (c) Terl Tech Ltd"
            ],
            "file-count": 6,
            "sha256": "9b88f057e833ee2c94ea0497b5279ab924ec5a3e2f79e605329fc6c9dd278e36",
            "source": "https://repo1.maven.org/maven2/com/goterl/resource-loader/2.0.2/resource-loader-2.0.2-sources.jar",
            "status": "approved"
        }
    ]
}