{
    "id": "go/golang/github.com%2Fgoogle/certificate-transparency-go/v1.1.1",
    "license": "Apache-2.0 AND BSD-3-Clause",
    "authority": "https://gitlab.eclipse.org/eclipsefdn/emo-team/iplab/-/issues/12211",
    "source": "https://proxy.golang.org/github.com%2Fgoogle/certificate-transparency-go/@v/v1.1.1.zip",
    "status": "approved",
    "scans": [
        {
            "date": "December 21, 2023 at 4:14:31 p.m. GMT",
            "authority": "https://gitlab.eclipse.org/eclipsefdn/emo-team/iplab/-/issues/12211",
            "scancode-version": "31.2.1",
            "licenses-discovered": [
                "Apache-2.0",
                "BSD-3-Clause"
            ],
            "copyrights": [
                "Copyright (c) 2000, 2017, Oracle, MariaDB Corporation Ab and others",
                "Copyright 2009 The Go Authors",
                "Copyright 2011 The Go Authors",
                "Copyright 2012 The Go Authors",
                "Copyright 2013 The Go Authors",
                "Copyright 2014 Google LLC.",
                "Copyright 2014 The Go Authors",
                "Copyright 2015 Google LLC.",
                "Copyright 2015 The Go Authors",
                "Copyright 2016 Google LLC.",
                "Copyright 2017 Google LLC.",
                "Copyright 2017 The Go Authors",
                "Copyright 2018 Google LLC.",
                "Copyright 2018 The Go Authors",
                "Copyright 2019 Google LLC."
            ],
            "file-count": 386,
            "sha256": "43abc25efa5e981a6b6a15f04a11c03bc925359c67cad5f4227733fbe51ae491",
            "source": "https://proxy.golang.org/github.com%2Fgoogle/certificate-transparency-go/@v/v1.1.1.zip",
            "status": "approved"
        }
    ]
}