{
    "id": "crate/cratesio/-/quote/1.0.37",
    "license": "Apache-2.0 AND MIT AND Apache-2.0 AND MIT",
    "authority": "https://gitlab.eclipse.org/eclipsefdn/emo-team/iplab/-/issues/17177",
    "source": "https://crates.io/api/v1/crates/quote/1.0.37/download",
    "status": "approved",
    "scans": [
        {
            "date": "November 13, 2024, 3:40:40 p.m. GMT",
            "authority": "https://gitlab.eclipse.org/eclipsefdn/emo-team/iplab/-/issues/17177",
            "scancode-version": "31.2.1",
            "licenses-discovered": [
                "Apache-2.0 AND MIT",
                "Apache-2.0",
                "MIT"
            ],
            "copyrights": [
            ],
            "file-count": 32,
            "sha256": "b5b9d34b8991d19d98081b46eacdd8eb58c6f2b201139f7c5f643cc155a633af",
            "source": "https://crates.io/api/v1/crates/quote/1.0.37/download",
            "status": "approved"
        }
    ]
}