{
    "id": "maven/mavencentral/com.vaadin/vaadin-side-nav-flow/24.3.7",
    "license": "Apache-2.0",
    "authority": "https://gitlab.eclipse.org/eclipsefdn/emo-team/iplab/-/issues/13760",
    "source": "https://repo1.maven.org/maven2/com/vaadin/vaadin-side-nav-flow/24.3.7/vaadin-side-nav-flow-24.3.7-sources.jar",
    "status": "approved",
    "scans": [
        {
            "date": "March 15, 2024 at 1:40:42 p.m. GMT",
            "authority": "https://gitlab.eclipse.org/eclipsefdn/emo-team/iplab/-/issues/13760",
            "scancode-version": "31.2.1",
            "licenses-discovered": [
                "Apache-2.0"
            ],
            "copyrights": [
                "Copyright 2000-2023 Vaadin Ltd."
            ],
            "file-count": 6,
            "sha256": "01c07b8fb1b5017e99b430283ca435ca25f1ab2f6751983041327eaef0547793",
            "source": "https://repo1.maven.org/maven2/com/vaadin/vaadin-side-nav-flow/24.3.7/vaadin-side-nav-flow-24.3.7-sources.jar",
            "status": "approved"
        }
    ]
}