{
    "id": "npm/npmjs/-/cosmiconfig/8.1.3",
    "license": "MIT",
    "authority": "https://gitlab.eclipse.org/eclipsefdn/emo-team/iplab/-/issues/7589",
    "source": "https://github.com/cosmiconfig/cosmiconfig/archive/v8.1.3.zip",
    "status": "approved",
    "scans": [
        {
            "date": "March 27, 2023 at 4:56:15 p.m. GMT",
            "authority": "https://gitlab.eclipse.org/eclipsefdn/emo-team/iplab/-/issues/7589",
            "scancode-version": "31.2.1",
            "licenses-discovered": [
                "MIT"
            ],
            "copyrights": [
                "Copyright (c) 2015 David Clark"
            ],
            "file-count": 34,
            "sha256": "9bb7af4bd790cdaf9d4143cd9c2ab43d8961f5c552708aeb93bc9ae1de9ddb8a",
            "source": "https://github.com/cosmiconfig/cosmiconfig/archive/v8.1.3.zip",
            "status": "approved"
        }
    ]
}