{
    "id": "maven/mavencentral/org.junit.jupiter/junit-jupiter/5.9.2",
    "license": "EPL-2.0",
    "authority": "https://gitlab.eclipse.org/eclipsefdn/emo-team/iplab/-/issues/6972",
    "source": "https://search.maven.org/remotecontent?filepath=org/junit/jupiter/junit-jupiter/5.9.2/junit-jupiter-5.9.2-sources.jar",
    "status": "approved",
    "scans": [
        {
            "date": "February 3, 2023 at 7:38:16 p.m. GMT",
            "authority": "https://gitlab.eclipse.org/eclipsefdn/emo-team/iplab/-/issues/6972",
            "scancode-version": "31.2.1",
            "licenses-discovered": [
                "EPL-2.0"
            ],
            "copyrights": [
                "Copyright 2015-2021 the original author or authors"
            ],
            "file-count": 4,
            "sha256": "2d0cfc6150ce624fe19b039a483ef0a0ba54620916282b0e35ea78f7626abb50",
            "source": "https://search.maven.org/remotecontent?filepath=org/junit/jupiter/junit-jupiter/5.9.2/junit-jupiter-5.9.2-sources.jar",
            "status": "approved"
        }
    ]
}