{
    "id": "npm/npmjs/-/undici/6.21.0",
    "license": "MIT",
    "authority": "https://gitlab.eclipse.org/eclipsefdn/emo-team/iplab/-/issues/17414",
    "source": "https://registry.yarnpkg.com/undici/-/undici-6.21.0.tgz",
    "status": "approved",
    "scans": [
        {
            "date": "November 23, 2024, 5:16:09 a.m. GMT",
            "authority": "https://gitlab.eclipse.org/eclipsefdn/emo-team/iplab/-/issues/17414",
            "scancode-version": "31.2.1",
            "licenses-discovered": [
                "MIT"
            ],
            "copyrights": [
                "Copyright (c) 2011 Einar Otto Stangvik <einaros@gmail.com>",
                "Copyright (c) 2013 Arnout Kazemier and contributors",
                "Copyright (c) 2016 Luigi Pinca and contributors",
                "Copyright (c) 2020 Ethan Arrowood",
                "Copyright (c) Matteo Collina and Undici contributors"
            ],
            "file-count": 175,
            "sha256": "3aa7df5476eeb26e7322dec54cc00f261e155ee9430018777d059d0962b6f665",
            "source": "https://registry.yarnpkg.com/undici/-/undici-6.21.0.tgz",
            "status": "restricted"
        }
    ]
}