{
    "id": "maven/mavencentral/org.eclipse.dataspaceconnector/transfer-process-store-sql/0.0.1-20220922.4-20230220.143048-1",
    "license": "Apache-2.0",
    "authority": "https://gitlab.eclipse.org/eclipsefdn/emo-team/iplab/-/issues/7635",
    "source": "https://search.maven.org/remotecontent?filepath=org/eclipse/dataspaceconnector/transfer-process-store-sql/0.0.1-milestone-6/transfer-process-store-sql-0.0.1-milestone-6-sources.jar",
    "status": "approved",
    "scans": [
        {
            "date": "March 28, 2023 at 9:51:10 p.m. GMT",
            "authority": "https://gitlab.eclipse.org/eclipsefdn/emo-team/iplab/-/issues/7635",
            "scancode-version": "31.2.1",
            "licenses-discovered": [
                "Apache-2.0"
            ],
            "copyrights": [
                "Copyright (c) 2020 - 2022 Microsoft Corporation",
                "Copyright (c) 2022 Microsoft Corporation"
            ],
            "file-count": 11,
            "sha256": "8a6dea6370bee84e89eb2bd2753ae016bcc666455b86775431fc4fa2cd657bf4",
            "source": "https://search.maven.org/remotecontent?filepath=org/eclipse/dataspaceconnector/transfer-process-store-sql/0.0.1-milestone-6/transfer-process-store-sql-0.0.1-milestone-6-sources.jar",
            "status": "approved"
        }
    ]
}