{
    "id": "maven/mavencentral/io.fabric8/openshift-model-operator/6.7.0",
    "license": "Apache-2.0",
    "authority": "https://gitlab.eclipse.org/eclipsefdn/emo-team/iplab/-/issues/8663",
    "source": "https://repo.maven.apache.org/maven2/io/fabric8/openshift-model-operator/6.7.0/openshift-model-operator-6.7.0-sources.jar",
    "status": "approved",
    "scans": [
        {
            "date": "June 5, 2023 at 11:36:42 a.m. GMT",
            "authority": "https://gitlab.eclipse.org/eclipsefdn/emo-team/iplab/-/issues/8663",
            "scancode-version": "31.2.1",
            "licenses-discovered": [
                "Apache-2.0"
            ],
            "copyrights": [
                "Copyright (c) 2015 Red Hat, Inc."
            ],
            "file-count": 672,
            "sha256": "9960aaa2cc2f712d701282b630b3da6f860d786cbfa7293b6ac84ecededcfbf0",
            "source": "https://repo.maven.apache.org/maven2/io/fabric8/openshift-model-operator/6.7.0/openshift-model-operator-6.7.0-sources.jar",
            "status": "approved"
        }
    ]
}