{
    "id": "crate/cratesio/-/pin-project-lite/0.2.14",
    "license": "Apache-2.0 or MIT",
    "authority": "https://gitlab.eclipse.org/eclipsefdn/emo-team/iplab/-/issues/14202",
    "source": "https://crates.io/api/v1/crates/pin-project-lite/0.2.14/download",
    "status": "approved",
    "scans": [
        {
            "date": "April 3, 2024 at 6:16:35 a.m. GMT",
            "authority": "https://gitlab.eclipse.org/eclipsefdn/emo-team/iplab/-/issues/14202",
            "scancode-version": "31.2.1",
            "licenses-discovered": [
                "Apache-2.0 AND MIT",
                "Apache-2.0",
                "MIT",
                "Apache-2.0 OR MIT"
            ],
            "copyrights": [
            ],
            "file-count": 73,
            "sha256": "bda66fc9667c18cb2758a2ac84d1167245054bcf85d5d1aaa6923f45801bdd02",
            "source": "https://crates.io/api/v1/crates/pin-project-lite/0.2.14/download",
            "status": "approved"
        }
    ]
}