{
    "id": "npm/npmjs/@types/postcss-modules-local-by-default/4.0.1",
    "license": "MIT",
    "authority": "https://gitlab.eclipse.org/eclipsefdn/emo-team/iplab/-/issues/11089",
    "source": "https://registry.yarnpkg.com/@types/postcss-modules-local-by-default/-/postcss-modules-local-by-default-4.0.1.tgz",
    "status": "approved",
    "scans": [
        {
            "date": "October 20, 2023 at 7:20:10 p.m. GMT",
            "authority": "https://gitlab.eclipse.org/eclipsefdn/emo-team/iplab/-/issues/11089",
            "scancode-version": "31.2.1",
            "licenses-discovered": [
                "MIT"
            ],
            "copyrights": [
                "Copyright (c) Microsoft Corporation"
            ],
            "file-count": 4,
            "sha256": "9025718a2735e08b6d48e673f4f92e6d38012bb1b7bdcafc745e5936c2326808",
            "source": "https://registry.yarnpkg.com/@types/postcss-modules-local-by-default/-/postcss-modules-local-by-default-4.0.1.tgz",
            "status": "approved"
        }
    ]
}