{
    "id": "maven/mavencentral/org.apache.camel/camel-stub/3.22.2",
    "license": "Apache-2.0",
    "authority": "https://gitlab.eclipse.org/eclipsefdn/emo-team/iplab/-/issues/14912",
    "source": "https://repo1.maven.org/maven2/org/apache/camel/camel-stub/3.22.2/camel-stub-3.22.2-sources.jar",
    "status": "approved",
    "scans": [
        {
            "date": "May 29, 2024 at 9:41:39 a.m. GMT",
            "authority": "https://gitlab.eclipse.org/eclipsefdn/emo-team/iplab/-/issues/14912",
            "scancode-version": "31.2.1",
            "licenses-discovered": [
                "Apache-2.0"
            ],
            "copyrights": [
            ],
            "file-count": 16,
            "sha256": "fb31637d17cfb862ec65cbde8f981797aa3793aff4ac379a28aa61535cca1a63",
            "source": "https://repo1.maven.org/maven2/org/apache/camel/camel-stub/3.22.2/camel-stub-3.22.2-sources.jar",
            "status": "approved"
        }
    ]
}