{
    "id": "maven/mavencentral/org.springframework.boot/spring-boot-actuator/3.4.0",
    "license": "Apache-2.0",
    "authority": "https://gitlab.eclipse.org/eclipsefdn/emo-team/iplab/-/issues/17574",
    "source": "https://repo1.maven.org/maven2/org/springframework/boot/spring-boot-actuator/3.4.0/spring-boot-actuator-3.4.0-sources.jar",
    "status": "approved",
    "scans": [
        {
            "date": "November 29, 2024 at 6:17:31 a.m. GMT",
            "authority": "https://gitlab.eclipse.org/eclipsefdn/emo-team/iplab/-/issues/17574",
            "scancode-version": "31.2.1",
            "licenses-discovered": [
                "Apache-2.0"
            ],
            "copyrights": [
                "Copyright 2012-2019 the original author or authors",
                "Copyright 2012-2020 the original author or authors",
                "Copyright 2012-2021 the original author or authors",
                "Copyright 2012-2022 the original author or authors",
                "Copyright 2012-2023 the original author or authors",
                "Copyright 2012-2024 the original author or authors"
            ],
            "file-count": 380,
            "sha256": "c9434dda195036f445782f1e175f16827fd1f7eddb07196f44e33fdec5574fbe",
            "source": "https://repo1.maven.org/maven2/org/springframework/boot/spring-boot-actuator/3.4.0/spring-boot-actuator-3.4.0-sources.jar",
            "status": "approved"
        }
    ]
}