{
    "id": "project/automotive/muto/liveui/0.0",
    "license": "Apache-2.0 AND MIT",
    "licenses-discovered": [
        "Apache-2.0",
        "Apache-2.0 AND MIT",
        "MIT"
    ],
    "copyrights": [
        "Copyright (c) Facebook, Inc.",
        "Copyright (c) Facebook, Inc. and its affiliates",
        "Copyright (c) https://composiv.ai",
        "Copyright Composiv Inc and its affiliates",
        "Copyright the original author or authors"
    ],
    "file-count": 132,
    "scancode-version": "30.1.0",
    "authority": "https://gitlab.eclipse.org/eclipsefdn/emo-team/iplab/-/issues/2748",
    "source": "https://github.com/composiv/liveui/archive/refs/heads/master.zip",
    "status": "approved"
}
