{
    "id": "maven/mavencentral/org.bytedeco/mkl-dnn/0.21.5-1.5.8",
    "license": "Apache-2.0 AND BSD-3-Clause AND (Apache-2.0 OR (GPL-2.0-or-later WITH Classpath-exception-2.0))",
    "authority": "https://gitlab.eclipse.org/eclipsefdn/emo-team/iplab/-/issues/6782",
    "source": "https://search.maven.org/remotecontent?filepath=org/bytedeco/mkl-dnn/0.21.5-1.5.8/mkl-dnn-0.21.5-1.5.8-sources.jar",
    "status": "approved",
    "scans": [
        {
            "date": "January 27, 2023 at 10:32:17 p.m. GMT",
            "authority": "https://gitlab.eclipse.org/eclipsefdn/emo-team/iplab/-/issues/6782",
            "scancode-version": "31.2.1",
            "licenses-discovered": [
                "Apache-2.0",
                "BSD-3-Clause",
                "Apache-2.0 AND (GPL-2.0-or-later WITH Classpath-exception-2.0)"
            ],
            "copyrights": [
                "Copyright (c) 1999-2019, Intel Corporation",
                "Copyright (c) 2007-2019, Intel Corporation",
                "Copyright (c) 2015-2019, Intel Corporation",
                "Copyright (c) 2018 Samuel Audet",
                "Copyright (c) 2018-2019, Intel Corporation",
                "Copyright (c) 2018-2021 Samuel Audet",
                "Copyright 2016-2018 Intel Corporation"
            ],
            "file-count": 77,
            "sha256": "966f0ebc1530c0831d2a4dcc9a58edda330285ef737ed67147d770fa455bdd93",
            "source": "https://search.maven.org/remotecontent?filepath=org/bytedeco/mkl-dnn/0.21.5-1.5.8/mkl-dnn-0.21.5-1.5.8-sources.jar",
            "status": "restricted"
        }
    ]
}
