{
    "id": "npm/npmjs/-/eslint-plugin-es/3.0.1",
    "license": "MIT",
    "authority": "https://gitlab.eclipse.org/eclipsefdn/emo-team/iplab/-/issues/7721",
    "source": "https://github.com/mysticatea/eslint-plugin-es/archive/v3.0.1.zip",
    "status": "approved",
    "scans": [
        {
            "date": "March 31, 2023 at 12:55:45 p.m. GMT",
            "authority": "https://gitlab.eclipse.org/eclipsefdn/emo-team/iplab/-/issues/7721",
            "scancode-version": "31.2.1",
            "licenses-discovered": [
                "MIT"
            ],
            "copyrights": [
                "Copyright (c) 2018 Toru Nagashima"
            ],
            "file-count": 340,
            "sha256": "f35a705f27bea838e45bcecbfac7ab316dd47931bc3cc35da7c0b7c2943593b2",
            "source": "https://github.com/mysticatea/eslint-plugin-es/archive/v3.0.1.zip",
            "status": "approved"
        }
    ]
}