{
    "id": "maven/mavencentral/com.sun.xml.fastinfoset/FastInfoset/2.0.0",
    "license": "Apache-2.0",
    "licenses-discovered": [
        "Apache-2.0",
        "Apache-1.1",
        "Apache-2.0 AND LicenseRef-scancode-proprietary-license",
        "BSD-3-Clause"
    ],
    "file-count": 129,
    "scancode-version": "30.1.0",
    "authority": "https://gitlab.eclipse.org/eclipsefdn/emo-team/iplab/-/issues/2668",
    "source": "https://search.maven.org/remotecontent?filepath=com/sun/xml/fastinfoset/FastInfoset/2.0.0/FastInfoset-2.0.0-sources.jar",
    "status": "approved"
}
