{
    "id": "maven/mavencentral/com.vaadin/vaadin-themes/8.8.3",
    "license": "Apache-2.0",
    "authority": "https://gitlab.eclipse.org/eclipsefdn/emo-team/iplab/-/issues/8465",
    "source": "https://search.maven.org/remotecontent?filepath=com/vaadin/vaadin-themes/8.8.3/vaadin-themes-8.8.3-sources.jar",
    "status": "approved",
    "scans": [
        {
            "date": "May 17, 2023 at 3:02:00 p.m. GMT",
            "authority": "https://gitlab.eclipse.org/eclipsefdn/emo-team/iplab/-/issues/8465",
            "scancode-version": "31.2.1",
            "licenses-discovered": [
                "Apache-2.0"
            ],
            "copyrights": [
                "Copyright 2000-2018 Vaadin Ltd."
            ],
            "file-count": 4,
            "sha256": "a5ffa80ec43ab648f9aae22bf41f453f4ce05c5aaba3cd2796ac38e99d9f5272",
            "source": "https://search.maven.org/remotecontent?filepath=com/vaadin/vaadin-themes/8.8.3/vaadin-themes-8.8.3-sources.jar",
            "status": "approved"
        }
    ]
}