{
    "id": "npm/npmjs/-/co-bluebird/1.1.0",
    "license": "MIT",
    "licenses-discovered": [
        "MIT"
    ],
    "file-count": 11,
    "scancode-version": "30.1.0",
    "authority": "https://gitlab.eclipse.org/eclipsefdn/emo-team/iplab/-/issues/2094",
    "source": "https://github.com/overlookmotel/co-bluebird/archive/v1.1.0.zip",
    "status": "approved"
}