{
    "id": "p2/orbit/p2.eclipse-plugin/io.swagger.core.v3.swagger-core/2.1.12",
    "license": "Apache-2.0",
    "licenses-discovered": [
    ],
    "file-count": 53,
    "scancode-version": "30.1.0",
    "authority": "https://gitlab.eclipse.org/eclipsefdn/emo-team/iplab/-/issues/2075",
    "source": "https://search.maven.org/remotecontent?filepath=io/swagger/core/v3/swagger-core/2.1.12/swagger-core-2.1.12-sources.jar",
    "status": "approved"
}
