{
    "id": "maven/mavencentral/io.confluent/kafka-schema-serializer/7.8.0",
    "license": "Apache-2.0",
    "authority": "https://gitlab.eclipse.org/eclipsefdn/emo-team/iplab/-/issues/18185",
    "source": "https://packages.confluent.io/maven/io/confluent/kafka-schema-serializer/7.8.0/kafka-schema-serializer-7.8.0-sources.jar",
    "status": "approved",
    "scans": [
        {
            "date": "January 2, 2025 at 4:34:46 p.m. GMT",
            "authority": "https://gitlab.eclipse.org/eclipsefdn/emo-team/iplab/-/issues/18185",
            "scancode-version": "31.2.1",
            "licenses-discovered": [
                "Apache-2.0"
            ],
            "copyrights": [
                "Copyright 2018 Confluent Inc.",
                "Copyright 2020 Confluent Inc.",
                "Copyright 2021 Confluent Inc.",
                "Copyright 2023 Confluent Inc."
            ],
            "file-count": 23,
            "sha256": "3ed555f5937698de16892906cc1bb0dfba8ca32d2c9220c7feeb4fe6740a5ac6",
            "source": "https://packages.confluent.io/maven/io/confluent/kafka-schema-serializer/7.8.0/kafka-schema-serializer-7.8.0-sources.jar",
            "status": "approved"
        }
    ]
}