{
    "id": "maven/mavencentral/io.openmanufacturing/sds-aspect-model-document-generators/2.1.3",
    "license": "Apache-2.0 AND MPL-2.0 AND MIT",
    "authority": "https://gitlab.eclipse.org/eclipsefdn/emo-team/iplab/-/issues/9769",
    "source": "https://repo.maven.apache.org/maven2/io/openmanufacturing/sds-aspect-model-document-generators/2.1.3/sds-aspect-model-document-generators-2.1.3-sources.jar",
    "status": "approved",
    "scans": [
        {
            "date": "July 26, 2023 at 10:46:35 a.m. GMT",
            "authority": "https://gitlab.eclipse.org/eclipsefdn/emo-team/iplab/-/issues/9769",
            "scancode-version": "31.2.1",
            "licenses-discovered": [
                "Apache-2.0",
                "MPL-2.0",
                "MIT"
            ],
            "copyrights": [
                "Copyright (c) 2016 - 2021 Andrei Kashcha",
                "Copyright (c) 2016 Tim Scanlin",
                "Copyright (c) 2021 Robert Bosch Manufacturing Solutions GmbH",
                "Copyright (c) 2022 Robert Bosch Manufacturing Solutions GmbH",
                "Copyright (c) 2023 Robert Bosch Manufacturing Solutions GmbH",
                "Copyright (c) Adam Wathan <adam.wathan@gmail.com>",
                "Copyright (c) Jonathan Reinink <jonathan@reinink.ca>",
                "copyright Google 2012Roboto"
            ],
            "file-count": 119,
            "sha256": "223d21b9d45febacd51065d16e11573f20bffe12f7dbdc92a15e3adb87e90dc6",
            "source": "https://repo.maven.apache.org/maven2/io/openmanufacturing/sds-aspect-model-document-generators/2.1.3/sds-aspect-model-document-generators-2.1.3-sources.jar",
            "status": "approved"
        }
    ]
}