{
    "id": "project/openhw.corev/openhwgroup/cva5/3239e20360993151f435fc2f5a567e09b3f185ad",
    "license": "Apache-2.0",
    "authority": "https://gitlab.eclipse.org/eclipsefdn/emo-team/iplab/-/issues/7903",
    "source": "https://github.com/openhwgroup/cva5/archive/3239e20360993151f435fc2f5a567e09b3f185ad.zip",
    "status": "approved",
    "scans": [
        {
            "date": "April 18, 2023 at 4:51:24 a.m. GMT",
            "authority": "https://gitlab.eclipse.org/eclipsefdn/emo-team/iplab/-/issues/7903",
            "scancode-version": "31.2.1",
            "licenses-discovered": [
                "Apache-2.0"
            ],
            "copyrights": [
                "Copyright (c) 2012 Avnet, Inc.",
                "Copyright (c) 2017 Eric Matthews, Lesley Shannon",
                "Copyright (c) 2017, 2018 Eric Matthews, Lesley Shannon",
                "Copyright (c) 2017, 2018, 2019 Eric Matthews, Lesley Shannon",
                "Copyright (c) 2017-2019 Eric Matthews, Lesley Shannon",
                "Copyright (c) 2017-2020 Eric Matthews, Lesley Shannon",
                "Copyright (c) 2018 Eric Matthews, Lesley Shannon",
                "Copyright (c) 2019 Eric Matthews, Lesley Shannon",
                "Copyright (c) 2019 Eric Matthews,Zavier Aguila Lesley Shannon",
                "Copyright (c) 2020 Eric Matthews, Lesley Shannon",
                "Copyright (c) 2020 Stuart Hoad, Lesley Shannon",
                "Copyright (c) 2021 Eric Matthews",
                "Copyright (c) 2021 Eric Matthews, Lesley Shannon",
                "Copyright (c) 2022 Eric Matthews, Lesley Shannon",
                "Copyright 1986-2019 Xilinx, Inc."
            ],
            "file-count": 135,
            "sha256": "e7ff8f6e6e000376e5a8cec8be3da29b819efc5934299ee600ad08a6e28c302f",
            "source": "https://github.com/openhwgroup/cva5/archive/3239e20360993151f435fc2f5a567e09b3f185ad.zip",
            "status": "restricted"
        }
    ]
}
