{
    "id": "maven/mavencentral/org.uberfire/uberfire-workbench-client-views-patternfly/7.63.0-20211207.163344-15",
    "license": "Apache-2.0 AND MIT",
    "licenses-discovered": [
        "Apache-2.0",
        "MIT"
    ],
    "copyrights": [
        "Copyright JBoss",
        "Copyright Red Hat, Inc. and/or its affiliates",
        "Copyright jQuery Foundation and other contributors"
    ],
    "file-count": 145,
    "scancode-version": "30.1.0",
    "authority": "https://gitlab.eclipse.org/eclipsefdn/emo-team/iplab/-/issues/2877",
    "source": "https://search.maven.org/remotecontent?filepath=org/uberfire/uberfire-workbench-client-views-patternfly/7.63.0.Final/uberfire-workbench-client-views-patternfly-7.63.0.Final-sources.jar",
    "status": "approved"
}