{
    "id": "maven/mavencentral/org.osgi/osgi.core/8.0.0",
    "license": "Apache-2.0",
    "authority": "https://gitlab.eclipse.org/eclipsefdn/emo-team/iplab/-/issues/17668",
    "source": "https://repo1.maven.org/maven2/org/osgi/osgi.core/8.0.0/osgi.core-8.0.0-sources.jar",
    "status": "approved",
    "scans": [
        {
            "date": "December 4, 2024 at 12:19:26 p.m. GMT",
            "authority": "https://gitlab.eclipse.org/eclipsefdn/emo-team/iplab/-/issues/17668",
            "scancode-version": "31.2.1",
            "licenses-discovered": [
                "Apache-2.0"
            ],
            "copyrights": [
                "Copyright (c) OSGi Alliance (2000, 2013)",
                "Copyright (c) OSGi Alliance (2000, 2014)",
                "Copyright (c) OSGi Alliance (2000, 2015)",
                "Copyright (c) OSGi Alliance (2000, 2016)",
                "Copyright (c) OSGi Alliance (2000, 2017)",
                "Copyright (c) OSGi Alliance (2000, 2018)",
                "Copyright (c) OSGi Alliance (2000, 2019)",
                "Copyright (c) OSGi Alliance (2000, 2020)",
                "Copyright (c) OSGi Alliance (2001, 2013)",
                "Copyright (c) OSGi Alliance (2001, 2014)",
                "Copyright (c) OSGi Alliance (2001, 2015)",
                "Copyright (c) OSGi Alliance (2001, 2016)",
                "Copyright (c) OSGi Alliance (2002, 2013)",
                "Copyright (c) OSGi Alliance (2002, 2015)",
                "Copyright (c) OSGi Alliance (2004, 2013)",
                "Copyright (c) OSGi Alliance (2004, 2015)",
                "Copyright (c) OSGi Alliance (2004, 2016)",
                "Copyright (c) OSGi Alliance (2004, 2019)",
                "Copyright (c) OSGi Alliance (2004, 2020)",
                "Copyright (c) OSGi Alliance (2005, 2013)",
                "Copyright (c) OSGi Alliance (2005, 2014)",
                "Copyright (c) OSGi Alliance (2005, 2015)",
                "Copyright (c) OSGi Alliance (2005, 2020)",
                "Copyright (c) OSGi Alliance (2006, 2019)",
                "Copyright (c) OSGi Alliance (2007, 2013)",
                "Copyright (c) OSGi Alliance (2007, 2014)",
                "Copyright (c) OSGi Alliance (2007, 2017)",
                "Copyright (c) OSGi Alliance (2008, 2013)",
                "Copyright (c) OSGi Alliance (2008, 2018)",
                "Copyright (c) OSGi Alliance (2008, 2020)",
                "Copyright (c) OSGi Alliance (2009, 2013)",
                "Copyright (c) OSGi Alliance (2009, 2019)",
                "Copyright (c) OSGi Alliance (2010, 2013)",
                "Copyright (c) OSGi Alliance (2010, 2015)",
                "Copyright (c) OSGi Alliance (2010, 2016)",
                "Copyright (c) OSGi Alliance (2010, 2017)",
                "Copyright (c) OSGi Alliance (2010, 2018)",
                "Copyright (c) OSGi Alliance (2010, 2019)",
                "Copyright (c) OSGi Alliance (2010, 2020)",
                "Copyright (c) OSGi Alliance (2011, 2013)",
                "Copyright (c) OSGi Alliance (2011, 2015)",
                "Copyright (c) OSGi Alliance (2011, 2016)",
                "Copyright (c) OSGi Alliance (2011, 2017)",
                "Copyright (c) OSGi Alliance (2011, 2020)",
                "Copyright (c) OSGi Alliance (2012, 2013)",
                "Copyright (c) OSGi Alliance (2012, 2014)",
                "Copyright (c) OSGi Alliance (2012, 2015)",
                "Copyright (c) OSGi Alliance (2012, 2016)",
                "Copyright (c) OSGi Alliance (2012, 2019)",
                "Copyright (c) OSGi Alliance (2012, 2020)",
                "Copyright (c) OSGi Alliance (2014)",
                "Copyright (c) OSGi Alliance (2016)",
                "Copyright (c) OSGi Alliance (2016, 2017)",
                "Copyright (c) OSGi Alliance (2016, 2018)",
                "Copyright (c) OSGi Alliance (2017)",
                "Copyright (c) OSGi Alliance (2019, 2020)",
                "Copyright (c) OSGi Alliance (2020)"
            ],
            "file-count": 159,
            "sha256": "df92374f65300db3b22927ef5d0cb654db2ba0cfba459c45917bf8735920b280",
            "source": "https://repo1.maven.org/maven2/org/osgi/osgi.core/8.0.0/osgi.core-8.0.0-sources.jar",
            "status": "approved"
        }
    ]
}