{
    "id": "maven/mavencentral/org.codehaus.groovy/groovy-macro/3.0.21",
    "license": "Apache-2.0",
    "authority": "https://gitlab.eclipse.org/eclipsefdn/emo-team/iplab/-/issues/14496",
    "source": "https://repo1.maven.org/maven2/org/codehaus/groovy/groovy-macro/3.0.21/groovy-macro-3.0.21-sources.jar",
    "status": "approved",
    "scans": [
        {
            "date": "April 23, 2024 at 7:04:39 a.m. GMT",
            "authority": "https://gitlab.eclipse.org/eclipsefdn/emo-team/iplab/-/issues/14496",
            "scancode-version": "31.2.1",
            "licenses-discovered": [
                "Apache-2.0"
            ],
            "copyrights": [
            ],
            "file-count": 24,
            "sha256": "97de0a1875ad3bf0c33a78bc0fb9c60c68273753e1d43a4e423bb25349d12c12",
            "source": "https://repo1.maven.org/maven2/org/codehaus/groovy/groovy-macro/3.0.21/groovy-macro-3.0.21-sources.jar",
            "status": "approved"
        }
    ]
}