{
    "id": "maven/mavencentral/org.uberfire/uberfire-workbench-client/7.63.0-20211207.162808-16",
    "license": "Apache-2.0",
    "licenses-discovered": [
        "Apache-2.0"
    ],
    "copyrights": [
        "Copyright Red Hat, Inc. and/or its affiliates"
    ],
    "file-count": 266,
    "scancode-version": "30.1.0",
    "authority": "https://gitlab.eclipse.org/eclipsefdn/emo-team/iplab/-/issues/2858",
    "source": "https://search.maven.org/remotecontent?filepath=org/uberfire/uberfire-workbench-client/7.63.0.Final/uberfire-workbench-client-7.63.0.Final-sources.jar",
    "status": "approved"
}