{
    "id": "maven/mavencentral/org.apache.camel/camel-tooling-model/3.22.2",
    "license": "Apache-2.0",
    "authority": "https://gitlab.eclipse.org/eclipsefdn/emo-team/iplab/-/issues/14957",
    "source": "https://repo1.maven.org/maven2/org/apache/camel/camel-tooling-model/3.22.2/camel-tooling-model-3.22.2-sources.jar",
    "status": "approved",
    "scans": [
        {
            "date": "May 29, 2024 at 11:34:16 a.m. GMT",
            "authority": "https://gitlab.eclipse.org/eclipsefdn/emo-team/iplab/-/issues/14957",
            "scancode-version": "31.2.1",
            "licenses-discovered": [
                "Apache-2.0"
            ],
            "copyrights": [
            ],
            "file-count": 22,
            "sha256": "5826111f83f7302e852789a376e412eba4011788a59e75ae691e0c5463a7e525",
            "source": "https://repo1.maven.org/maven2/org/apache/camel/camel-tooling-model/3.22.2/camel-tooling-model-3.22.2-sources.jar",
            "status": "approved"
        }
    ]
}