{
    "id": "maven/mavencentral/org.awaitility/awaitility-proxy/3.0.0",
    "license": "Apache-2.0",
    "authority": "https://gitlab.eclipse.org/eclipsefdn/emo-team/iplab/-/issues/11044",
    "source": "https://repo.maven.apache.org/maven2/org/awaitility/awaitility-proxy/3.0.0/awaitility-proxy-3.0.0-sources.jar",
    "status": "approved",
    "scans": [
        {
            "date": "October 11, 2023 at 11:32:14 a.m. GMT",
            "authority": "https://gitlab.eclipse.org/eclipsefdn/emo-team/iplab/-/issues/11044",
            "scancode-version": "31.2.1",
            "licenses-discovered": [
                "Apache-2.0"
            ],
            "copyrights": [
                "Copyright 2017 the original author or authors"
            ],
            "file-count": 11,
            "sha256": "802950b5971c9dd9f5d78c53d6633d89889e83a181254d24267b0e0cd67acb7a",
            "source": "https://repo.maven.apache.org/maven2/org/awaitility/awaitility-proxy/3.0.0/awaitility-proxy-3.0.0-sources.jar",
            "status": "approved"
        }
    ]
}