{
    "id": "maven/mavencentral/org.bytedeco/cpython-platform/3.10.8-1.5.8",
    "license": "Apache-2.0 AND (Apache-2.0 AND GPL-2.0 WITH Classpath-exception-2.0)",
    "authority": "https://gitlab.eclipse.org/eclipsefdn/emo-team/iplab/-/issues/6763",
    "source": "https://search.maven.org/remotecontent?filepath=org/bytedeco/cpython-platform/3.10.8-1.5.8/cpython-platform-3.10.8-1.5.8-sources.jar",
    "status": "approved",
    "scans": [
        {
            "date": "January 27, 2023 at 10:53:02 p.m. GMT",
            "authority": "https://gitlab.eclipse.org/eclipsefdn/emo-team/iplab/-/issues/6763",
            "scancode-version": "31.2.1",
            "licenses-discovered": [
            ],
            "copyrights": [
            ],
            "file-count": 3,
            "sha256": "d913a095b33c64aae3c6b5fc5908109fbb0067e0abc147fba08a4135f37ed555",
            "source": "https://search.maven.org/remotecontent?filepath=org/bytedeco/cpython-platform/3.10.8-1.5.8/cpython-platform-3.10.8-1.5.8-sources.jar",
            "status": "restricted"
        }
    ]
}
