{
    "id": "maven/mavencentral/commons-pool/commons-pool/1.5.4",
    "license": "Apache-2.0",
    "authority": "https://gitlab.eclipse.org/eclipsefdn/emo-team/iplab/-/issues/19709",
    "source": "https://repo1.maven.org/maven2/commons-pool/commons-pool/1.5.4/commons-pool-1.5.4-sources.jar",
    "status": "approved",
    "scans": [
        {
            "date": "March 7, 2025 at 2:00:10 p.m. GMT",
            "authority": "https://gitlab.eclipse.org/eclipsefdn/emo-team/iplab/-/issues/19709",
            "scancode-version": "31.2.1",
            "licenses-discovered": [
                "Apache-2.0"
            ],
            "copyrights": [
            ],
            "file-count": 27,
            "sha256": "e23cb39a3101562346c94bb4f9aef2cd1cbbe214cb382e34e9c812ed255977d3",
            "source": "https://repo1.maven.org/maven2/commons-pool/commons-pool/1.5.4/commons-pool-1.5.4-sources.jar",
            "status": "approved"
        }
    ]
}