{
    "id": "npm/npmjs/@typescript-eslint/typescript-estree/7.13.0",
    "license": "BSD-2-Clause AND MIT AND (BSD-2-Clause AND ISC AND MIT)",
    "authority": "https://gitlab.eclipse.org/eclipsefdn/emo-team/iplab/-/issues/15168",
    "source": "https://github.com/typescript-eslint/typescript-eslint/archive/refs/tags/v7.13.0.zip",
    "status": "approved",
    "scans": [
        {
            "date": "June 12, 2024 at 3:19:25 p.m. GMT",
            "authority": "https://gitlab.eclipse.org/eclipsefdn/emo-team/iplab/-/issues/15168",
            "scancode-version": "31.2.1",
            "licenses-discovered": [
                "BSD-2-Clause",
                "MIT",
                "BSD-2-Clause AND ISC AND MIT"
            ],
            "copyrights": [
                "Copyright (c) 2016 unional",
                "Copyright (c) 2019 typescript-eslint and other contributors",
                "Copyright (c) 2021 typescript-eslint and other contributors",
                "Copyright (c) 2023 typescript-eslint and other contributors",
                "Copyright JS Foundation and other contributors, https://js.foundation",
                "Copyright Joyent, Inc. and other Node contributors",
                "Pp (c) Ac",
                "Tv (c) Gn"
            ],
            "file-count": 7146,
            "sha256": "a4c7f0c374ba153963bbc817447c21f38182d0ea29c65939b5e5fa84e86a6fef",
            "source": "https://github.com/typescript-eslint/typescript-eslint/archive/refs/tags/v7.13.0.zip",
            "status": "approved"
        }
    ]
}