{
    "id": "maven/mavencentral/org.geckoprojects.jakartars/org.gecko.rest.jersey.config/6.0.0-20221122.132854-37",
    "license": "EPL-2.0",
    "authority": "https://gitlab.eclipse.org/eclipsefdn/emo-team/iplab/-/issues/5043",
    "source": "https://search.maven.org/remotecontent?filepath=org/geckoprojects/jakartars/org.gecko.rest.jersey.config/6.0.0.RC1/org.gecko.rest.jersey.config-6.0.0.RC1-sources.jar",
    "status": "approved",
    "scans": [
        {
            "date": "November 23, 2022 at 1:28:49 p.m. GMT",
            "authority": "https://gitlab.eclipse.org/eclipsefdn/emo-team/iplab/-/issues/5043",
            "scancode-version": "31.2.1",
            "licenses-discovered": [
            ],
            "copyrights": [
            ],
            "file-count": 1,
            "sha256": "04203c41965f8ce3863ef7ea4cf22446115271465a116e959dffe8372bb79a18",
            "source": "https://search.maven.org/remotecontent?filepath=org/geckoprojects/jakartars/org.gecko.rest.jersey.config/6.0.0.RC1/org.gecko.rest.jersey.config-6.0.0.RC1-sources.jar",
            "status": "restricted"
        }
    ]
}
