{
    "id": "maven/mavencentral/org.springdoc/springdoc-openapi-starter-webmvc-api/2.4.0",
    "license": "Apache-2.0",
    "authority": "https://gitlab.eclipse.org/eclipsefdn/emo-team/iplab/-/issues/13748",
    "source": "https://repo1.maven.org/maven2/org/springdoc/springdoc-openapi-starter-webmvc-api/2.4.0/springdoc-openapi-starter-webmvc-api-2.4.0-sources.jar",
    "status": "approved",
    "scans": [
        {
            "date": "March 15, 2024 at 1:55:31 p.m. GMT",
            "authority": "https://gitlab.eclipse.org/eclipsefdn/emo-team/iplab/-/issues/13748",
            "scancode-version": "31.2.1",
            "licenses-discovered": [
                "Apache-2.0"
            ],
            "copyrights": [
                "Copyright 2019-2022 the original author or authors"
            ],
            "file-count": 17,
            "sha256": "c6e885612515754124d6c80ab0a1337272db4dcd1338baf2f0c6a93041632604",
            "source": "https://repo1.maven.org/maven2/org/springdoc/springdoc-openapi-starter-webmvc-api/2.4.0/springdoc-openapi-starter-webmvc-api-2.4.0-sources.jar",
            "status": "approved"
        }
    ]
}