{
    "id": "npm/npmjs/@rc-component/async-validator/5.0.1",
    "license": "MIT",
    "authority": "https://gitlab.eclipse.org/eclipsefdn/emo-team/iplab/-/issues/14552",
    "source": "https://registry.yarnpkg.com/@rc-component/async-validator/-/async-validator-5.0.1.tgz",
    "status": "approved",
    "scans": [
        {
            "date": "April 24, 2024 at 4:52:34 a.m. GMT",
            "authority": "https://gitlab.eclipse.org/eclipsefdn/emo-team/iplab/-/issues/14552",
            "scancode-version": "31.2.1",
            "licenses-discovered": [
                "MIT"
            ],
            "copyrights": [
                "Copyright (c) 2014-present yiminghe"
            ],
            "file-count": 115,
            "sha256": "57abf9b0d70d8e83665c659da3dbca589776fd20bd96aeabe73b999f1f6c6532",
            "source": "https://registry.yarnpkg.com/@rc-component/async-validator/-/async-validator-5.0.1.tgz",
            "status": "approved"
        }
    ]
}