{
    "id": "maven/mavencentral/com.nimbusds/nimbus-jose-jwt/9.37",
    "license": "Apache-2.0",
    "authority": "https://gitlab.eclipse.org/eclipsefdn/emo-team/iplab/-/issues/11086",
    "source": "https://repo.maven.apache.org/maven2/com/nimbusds/nimbus-jose-jwt/9.37/nimbus-jose-jwt-9.37-sources.jar",
    "status": "approved",
    "scans": [
        {
            "date": "October 20, 2023 at 7:26:12 p.m. GMT",
            "authority": "https://gitlab.eclipse.org/eclipsefdn/emo-team/iplab/-/issues/11086",
            "scancode-version": "31.2.1",
            "licenses-discovered": [
                "Apache-2.0"
            ],
            "copyrights": [
                "Copyright 2012-2016, Connect2id Ltd and contributors",
                "Copyright 2012-2016, Connect2id Ltd.",
                "Copyright 2012-2018, Connect2id Ltd and contributors",
                "Copyright 2012-2018, Connect2id Ltd.",
                "Copyright 2012-2019, Connect2id Ltd and contributors",
                "Copyright 2012-2019, Connect2id Ltd.",
                "Copyright 2012-2020, Connect2id Ltd.",
                "Copyright 2012-2021, Connect2id Ltd and contributors",
                "Copyright 2012-2021, Connect2id Ltd.",
                "Copyright 2012-2022, Connect2id Ltd.",
                "Copyright 2012-2023, Connect2id Ltd and contributors",
                "Copyright 2012-2023, Connect2id Ltd."
            ],
            "file-count": 288,
            "sha256": "9377edc055fb1f6b9af4a44bcf34dc556f8f7e17ea7530732989918ac67269a0",
            "source": "https://repo.maven.apache.org/maven2/com/nimbusds/nimbus-jose-jwt/9.37/nimbus-jose-jwt-9.37-sources.jar",
            "status": "approved"
        }
    ]
}