{
    "id": "npm/npmjs/-/react-router-dom/6.11.1",
    "license": "MIT",
    "authority": "https://gitlab.eclipse.org/eclipsefdn/emo-team/iplab/-/issues/8399",
    "source": "https://registry.yarnpkg.com/react-router-dom/-/react-router-dom-6.11.1.tgz",
    "status": "approved",
    "scans": [
        {
            "date": "May 10, 2023 at 4:12:19 a.m. GMT",
            "authority": "https://gitlab.eclipse.org/eclipsefdn/emo-team/iplab/-/issues/8399",
            "scancode-version": "31.2.1",
            "licenses-discovered": [
                "MIT"
            ],
            "copyrights": [
                "Copyright (c) React Training LLC 2015-2019",
                "Copyright (c) Remix Software Inc.",
                "Copyright (c) Remix Software Inc. 2020-2021",
                "Copyright (c) Shopify Inc. 2022-2023"
            ],
            "file-count": 22,
            "sha256": "f80b76b295a2393571bdebc8b892acb7fe88cd493ef9f3d3f060abf9efbe7c98",
            "source": "https://registry.yarnpkg.com/react-router-dom/-/react-router-dom-6.11.1.tgz",
            "status": "approved"
        }
    ]
}