{
    "id": "maven/mavencentral/org.apache.maven.shared/maven-common-artifact-filters/3.4.0",
    "license": "Apache-2.0",
    "authority": "https://gitlab.eclipse.org/eclipsefdn/emo-team/iplab/-/issues/15444",
    "source": "https://repo1.maven.org/maven2/org/apache/maven/shared/maven-common-artifact-filters/3.4.0/maven-common-artifact-filters-3.4.0-sources.jar",
    "status": "approved",
    "scans": [
        {
            "date": "June 15, 2024 at 8:35:33 a.m. GMT",
            "authority": "https://gitlab.eclipse.org/eclipsefdn/emo-team/iplab/-/issues/15444",
            "scancode-version": "31.2.1",
            "licenses-discovered": [
                "Apache-2.0"
            ],
            "copyrights": [
            ],
            "file-count": 38,
            "sha256": "fb6c770c26143f44491d302eaf452a6cc64b7032af0fc8777e7aee5682a6030b",
            "source": "https://repo1.maven.org/maven2/org/apache/maven/shared/maven-common-artifact-filters/3.4.0/maven-common-artifact-filters-3.4.0-sources.jar",
            "status": "approved"
        }
    ]
}