{
    "id": "maven/mavencentral/com.puppycrawl.tools/checkstyle/10.12.3",
    "license": "LGPL-2.1-only AND Apache-2.0 AND LGPL-2.1-or-later AND ANTLR-PD AND LicenseRef-fossology-Non-commercial",
    "authority": "https://gitlab.eclipse.org/eclipsefdn/emo-team/iplab/-/issues/13190",
    "source": "https://github.com/checkstyle/checkstyle/archive/refs/tags/checkstyle-10.12.3.zip",
    "status": "approved",
    "scans": [
        {
            "date": "February 11, 2024 at 10:36:30 a.m. GMT",
            "authority": "https://gitlab.eclipse.org/eclipsefdn/emo-team/iplab/-/issues/13190",
            "scancode-version": "31.2.1",
            "licenses-discovered": [
                "LGPL-2.1-only",
                "Apache-2.0",
                "LGPL-2.1-or-later",
                "ANTLR-PD",
                "GPL-2.0-or-later",
                "LGPL-2.0-or-later",
                "Apache-2.0 AND LGPL-2.1-or-later",
                "LicenseRef-scancode-proprietary-license"
            ],
            "copyrights": [
                "(c) copyright 2002 ACME",
                "Copyright & 169 1995-1999, Sun Microsystems, Inc.",
                "Copyright (c) 1991, 1999 Free Software Foundation, Inc.",
                "Copyright (c) 1994-1999 Sun Microsystems, Inc. 901 San Antonio Road, Palo Alto, California, 94303, U.S.A.",
                "Copyright (c) 1995- 1999, Sun Microsystems, Inc.",
                "Copyright (c) 1995-1999, Sun Microsystems, Inc.",
                "Copyright (c) 2001 ACME",
                "Copyright (c) 2001-$CURR_YEAR the original author or authors",
                "Copyright (c) 2001-$PREV_YEAR the original author or authors",
                "Copyright (c) 2001-2018 XXXX",
                "Copyright (c) 2001-2020 the original author or authors",
                "Copyright (c) 2001-2023 the original author or authors",
                "Copyright (c) 2002 Oliver Burn",
                "Copyright (c) 2004 MyCompany",
                "Copyright (c) 2004 Oliver Burn",
                "Copyright 1995-1999 Sun Microsystems, Inc.",
                "Copyright 2006 The Apache Software Foundation",
                "JosA (c) Castro",
                "copyright 2002 ACME",
                "copyrighted (c) MyCompany",
                "copyrighted by the Free Software Foundation"
            ],
            "file-count": 6361,
            "sha256": "5fc4788403121dc60e4364bb40e2b45268673bd5ef13b5df49a7c531e9d8c162",
            "source": "https://github.com/checkstyle/checkstyle/archive/refs/tags/checkstyle-10.12.3.zip",
            "status": "restricted"
        }
    ]
}
