{
    "id": "npm/npmjs/@vue/server-renderer/3.3.8",
    "license": "MIT",
    "authority": "https://gitlab.eclipse.org/eclipsefdn/emo-team/iplab/-/issues/11464",
    "source": "https://github.com/vuejs/core/archive/refs/tags/v3.3.8.zip",
    "status": "approved",
    "scans": [
        {
            "date": "November 7, 2023 at 9:01:57 a.m. GMT",
            "authority": "https://gitlab.eclipse.org/eclipsefdn/emo-team/iplab/-/issues/11464",
            "scancode-version": "31.2.1",
            "licenses-discovered": [
                "MIT"
            ],
            "copyrights": [
                "Copyright (c) 2013-present, Yuxi",
                "Copyright (c) 2018-present, Yuxi"
            ],
            "file-count": 651,
            "sha256": "f56abd1235917be6ecb24a2654d6502a53c9a1baddfa4dc502567f8546650d19",
            "source": "https://github.com/vuejs/core/archive/refs/tags/v3.3.8.zip",
            "status": "approved"
        }
    ]
}