{
    "id": "go/golang/golang.org%2Fx/mod/v0.1.1-0.20191105210325-c90efee705ee",
    "license": "BSD-3-Clause",
    "authority": "https://gitlab.eclipse.org/eclipsefdn/emo-team/iplab/-/issues/5728",
    "source": "https://proxy.golang.org/golang.org%2Fx/mod/@v/v0.1.1-0.20191105210325-c90efee705ee.zip",
    "status": "approved",
    "scans": [
        {
            "date": "December 13, 2022 at 6:00:12 a.m. GMT",
            "authority": "https://gitlab.eclipse.org/eclipsefdn/emo-team/iplab/-/issues/5728",
            "scancode-version": "31.2.1",
            "licenses-discovered": [
                "BSD-3-Clause"
            ],
            "copyrights": [
                "Copyright (c) 2009 The Go Authors",
                "Copyright 2018 The Go Authors",
                "Copyright 2019 The Go Authors"
            ],
            "file-count": 98,
            "sha256": "b1e6cb975c69d29974b4f77fd8a0f2f7e916a1fa971bab60fdd45ffe80a29f32",
            "source": "https://proxy.golang.org/golang.org%2Fx/mod/@v/v0.1.1-0.20191105210325-c90efee705ee.zip",
            "status": "approved"
        }
    ]
}