{
    "id": "maven/mavencentral/org.springframework.plugin/spring-plugin-core/3.0.0",
    "license": "Apache-2.0",
    "authority": "https://gitlab.eclipse.org/eclipsefdn/emo-team/iplab/-/issues/7104",
    "source": "https://search.maven.org/remotecontent?filepath=org/springframework/plugin/spring-plugin-core/3.0.0/spring-plugin-core-3.0.0-sources.jar",
    "status": "approved",
    "scans": [
        {
            "date": "February 13, 2023 at 7:56:26 a.m. GMT",
            "authority": "https://gitlab.eclipse.org/eclipsefdn/emo-team/iplab/-/issues/7104",
            "scancode-version": "31.2.1",
            "licenses-discovered": [
                "Apache-2.0"
            ],
            "copyrights": [
                "Copyright (c) 2008-2019 Pivotal Software, Inc.",
                "Copyright 2008-2010 the original author or authors",
                "Copyright 2008-2012 the original author or authors",
                "Copyright 2008-2019 the original author or authors",
                "Copyright 2010-2022 the original author or authors",
                "Copyright 2012 the original author or authors",
                "Copyright 2012-2016 the original author or authors",
                "Copyright 2022 the original author or authors"
            ],
            "file-count": 27,
            "sha256": "043d86a6dd2a789e9cf03b07895d1acf29393781b0975b4aa65e68568f4821be",
            "source": "https://search.maven.org/remotecontent?filepath=org/springframework/plugin/spring-plugin-core/3.0.0/spring-plugin-core-3.0.0-sources.jar",
            "status": "approved"
        }
    ]
}