{
    "id": "p2/orbit/p2.eclipse-plugin/org.apache.batik.awt.util/1.16.0.v20221027-0840",
    "license": "Apache-2.0",
    "authority": "https://gitlab.eclipse.org/eclipsefdn/emo-team/iplab/-/issues/5325",
    "source": "https://repo1.maven.org/maven2/org/apache/xmlgraphics/batik-awt-util/1.16/batik-awt-util-1.16-sources.jar",
    "status": "approved",
    "scans": [
        {
            "date": "December 5, 2022 at 7:32:38 p.m. GMT",
            "authority": "https://gitlab.eclipse.org/eclipsefdn/emo-team/iplab/-/issues/5325",
            "scancode-version": "31.2.1",
            "licenses-discovered": [
                "Apache-2.0"
            ],
            "copyrights": [
            ],
            "file-count": 165,
            "sha256": "b810b8746d4796e3717c6461c410cd527b4e5905e99dc6fc570039fdcc0850f9",
            "source": "https://repo1.maven.org/maven2/org/apache/xmlgraphics/batik-awt-util/1.16/batik-awt-util-1.16-sources.jar",
            "status": "approved"
        }
    ]
}