{
    "id": "project/ecd.opensmartclide/eclipse-opensmartclide/smartclide-perftestgen-theia/847f6716834c7eb482786fa1323b6fa3413d267c",
    "license": "EPL-2.0",
    "authority": "https://gitlab.eclipse.org/eclipsefdn/emo-team/iplab/-/issues/6893",
    "source": "https://github.com/eclipse-opensmartclide/smartclide-perftestgen-theia/archive/847f6716834c7eb482786fa1323b6fa3413d267c.zip",
    "status": "approved",
    "scans": [
        {
            "date": "January 30, 2023 at 10:22:04 p.m. GMT",
            "authority": "https://gitlab.eclipse.org/eclipsefdn/emo-team/iplab/-/issues/6893",
            "scancode-version": "31.2.1",
            "licenses-discovered": [
                "EPL-2.0"
            ],
            "copyrights": [
                "Copyright (c) 2021-2022 KAIROS DS"
            ],
            "file-count": 23,
            "sha256": "8510d55dfe7799682b084cc4a2e22119d982d23798f372ad39b78a2b31fb02e8",
            "source": "https://github.com/eclipse-opensmartclide/smartclide-perftestgen-theia/archive/847f6716834c7eb482786fa1323b6fa3413d267c.zip",
            "status": "restricted"
        }
    ]
}
