{
    "id": "npm/npmjs/-/allure-commandline/2.23.1",
    "license": "Apache-2.0",
    "authority": "https://gitlab.eclipse.org/eclipsefdn/emo-team/iplab/-/issues/10099",
    "source": "https://github.com/allure-framework/allure-npm/archive/refs/tags/2.23.1.zip",
    "status": "approved",
    "scans": [
        {
            "date": "August 21, 2023 at 2:15:03 p.m. GMT",
            "authority": "https://gitlab.eclipse.org/eclipsefdn/emo-team/iplab/-/issues/10099",
            "scancode-version": "31.2.1",
            "licenses-discovered": [
                "Apache-2.0"
            ],
            "copyrights": [
                "Copyright 2021 Qameta Software"
            ],
            "file-count": 15,
            "sha256": "afd8d721133f7736da5f083c79ae99e4cbb8229f741f5c4d9ec55409a7b20be2",
            "source": "https://github.com/allure-framework/allure-npm/archive/refs/tags/2.23.1.zip",
            "status": "approved"
        }
    ]
}