{
    "id": "npm/npmjs/@volar/language-server/1.9.0",
    "license": "MIT",
    "authority": "https://gitlab.eclipse.org/eclipsefdn/emo-team/iplab/-/issues/9423",
    "source": "https://github.com/volarjs/volar.js/archive/refs/tags/v1.9.0.zip",
    "status": "approved",
    "scans": [
        {
            "date": "July 14, 2023 at 4:17:51 p.m. GMT",
            "authority": "https://gitlab.eclipse.org/eclipsefdn/emo-team/iplab/-/issues/9423",
            "scancode-version": "31.2.1",
            "licenses-discovered": [
                "MIT"
            ],
            "copyrights": [
                "Copyright (c) 2021-present Johnson Chu",
                "Copyright (c) 2023-present Johnson Chu"
            ],
            "file-count": 185,
            "sha256": "08af147cb572e5f357f30da8892c73bff63060c283e345688f4d8327a01776b8",
            "source": "https://github.com/volarjs/volar.js/archive/refs/tags/v1.9.0.zip",
            "status": "approved"
        }
    ]
}