{
    "id": "npm/npmjs/-/es6-promise/3.0.2",
    "license": "MIT",
    "licenses-discovered": [
        "MIT"
    ],
    "copyrights": [
        "Copyright (c) Yehuda Katz, Tom Dale, Stefan Penner and contributors"
    ],
    "file-count": 37,
    "scancode-version": "30.1.0",
    "authority": "https://gitlab.eclipse.org/eclipsefdn/emo-team/iplab/-/issues/2905",
    "source": "https://github.com/jakearchibald/ES6-Promises/archive/v3.0.2.zip",
    "status": "approved"
}