{
    "id": "p2/orbit/p2.eclipse-plugin/com.datastax.cassandra.cassandra-driver-mapping/3.0.0",
    "license": "Apache-2.0",
    "licenses-discovered": [
        "Apache-2.0"
    ],
    "file-count": 33,
    "scancode-version": "30.1.0",
    "authority": "https://gitlab.eclipse.org/eclipsefdn/emo-team/iplab/-/issues/2298",
    "source": "https://search.maven.org/remotecontent?filepath=com/datastax/cassandra/cassandra-driver-mapping/3.0.0/cassandra-driver-mapping-3.0.0-sources.jar",
    "status": "approved"
}