{
    "id": "maven/mavencentral/io.gitlab.arturbosch.detekt/detekt-api/1.23.1",
    "license": "Apache-2.0",
    "authority": "https://gitlab.eclipse.org/eclipsefdn/emo-team/iplab/-/issues/10124",
    "source": "https://repo.maven.apache.org/maven2/io/gitlab/arturbosch/detekt/detekt-api/1.23.1/detekt-api-1.23.1-sources.jar",
    "status": "approved",
    "scans": [
        {
            "date": "August 21, 2023 at 4:53:36 p.m. GMT",
            "authority": "https://gitlab.eclipse.org/eclipsefdn/emo-team/iplab/-/issues/10124",
            "scancode-version": "31.2.1",
            "licenses-discovered": [
            ],
            "copyrights": [
            ],
            "file-count": 55,
            "sha256": "d50fec42aa1c2bcc42f0f80cd97cec73e6724961073b331f692c4589beaddf89",
            "source": "https://repo.maven.apache.org/maven2/io/gitlab/arturbosch/detekt/detekt-api/1.23.1/detekt-api-1.23.1-sources.jar",
            "status": "restricted"
        }
    ]
}
