{
    "id": "maven/mavencentral/io.cucumber/cucumber-java/7.21.0",
    "license": "MIT",
    "authority": "https://gitlab.eclipse.org/eclipsefdn/emo-team/iplab/-/issues/19281",
    "source": "https://repo1.maven.org/maven2/io/cucumber/cucumber-java/7.21.0/cucumber-java-7.21.0-sources.jar",
    "status": "approved",
    "scans": [
        {
            "date": "February 4, 2025 at 8:12:18 a.m. GMT",
            "authority": "https://gitlab.eclipse.org/eclipsefdn/emo-team/iplab/-/issues/19281",
            "scancode-version": "31.2.1",
            "licenses-discovered": [
            ],
            "copyrights": [
            ],
            "file-count": 745,
            "sha256": "f5f651ef0e4e5213a3482b1c90c430e06cf3adfd21b7b25903dff3f4e3901d44",
            "source": "https://repo1.maven.org/maven2/io/cucumber/cucumber-java/7.21.0/cucumber-java-7.21.0-sources.jar",
            "status": "restricted"
        }
    ]
}