{
    "id": "project/modeling.syson/eclipse-syson/syson/a6bd4c1058880844a918e51c97afee9b185ee020",
    "license": "EPL-2.0 AND OFL-1.1",
    "authority": "https://gitlab.eclipse.org/eclipsefdn/emo-team/iplab/-/issues/11798",
    "source": "https://github.com/eclipse-syson/syson/archive/a6bd4c1058880844a918e51c97afee9b185ee020.zip",
    "status": "approved",
    "scans": [
        {
            "date": "December 4, 2023 at 5:11:55 p.m. GMT",
            "authority": "https://gitlab.eclipse.org/eclipsefdn/emo-team/iplab/-/issues/11798",
            "scancode-version": "31.2.1",
            "licenses-discovered": [
                "EPL-2.0",
                "OFL-1.1"
            ],
            "copyrights": [
                "(c) 2010-2011 by tyPoland Lukasz Dziedzic",
                "(c) 2010-2011 by tyPoland Lukasz Dziedzic (http://www.typoland.com/)",
                "(c) 2011-2011 by tyPoland Lukasz Dziedzic (http://www.typoland.com/)",
                "Copyright (c) 2010-2011 by tyPoland Lukasz Dziedzic",
                "Copyright (c) 2010-2014 by tyPoland Lukasz Dziedzic (team@latofonts.com)",
                "Copyright (c) 2019, 2020 Obeo",
                "Copyright (c) 2019, 2022 Obeo",
                "Copyright (c) 2019, 2022 Obeo and others",
                "Copyright (c) 2023 Obeo"
            ],
            "file-count": 955,
            "sha256": "8f54755b05b1b7b26820c34d07aa820ed9f2809b3aa4280c034ebef91777d722",
            "source": "https://github.com/eclipse-syson/syson/archive/a6bd4c1058880844a918e51c97afee9b185ee020.zip",
            "status": "restricted"
        }
    ]
}
