{
    "id": "npm/npmjs/-/math-intrinsics/1.1.0",
    "license": "MIT",
    "authority": "https://gitlab.eclipse.org/eclipsefdn/emo-team/iplab/-/issues/17964",
    "source": "https://github.com/es-shims/math-intrinsics/archive/refs/tags/v1.1.0.zip",
    "status": "approved",
    "scans": [
        {
            "date": "December 19, 2024 at 3:07:24 p.m. GMT",
            "authority": "https://gitlab.eclipse.org/eclipsefdn/emo-team/iplab/-/issues/17964",
            "scancode-version": "31.2.1",
            "licenses-discovered": [
                "MIT"
            ],
            "copyrights": [
                "Copyright (c) 2024 ECMAScript Shims"
            ],
            "file-count": 44,
            "sha256": "c2a47b4bb4079217ea20785887e1477789cb4a4eb7bb9597dc94ee5bc0939c1a",
            "source": "https://github.com/es-shims/math-intrinsics/archive/refs/tags/v1.1.0.zip",
            "status": "approved"
        }
    ]
}