{
    "id": "project/technology.xfsc/eclipse-xfsc-por/lcm-service/81873aefb72d27a8cb96edbd2fcb69e1077d755e",
    "license": "Apache-2.0",
    "authority": "https://gitlab.eclipse.org/eclipsefdn/emo-team/iplab/-/issues/9568",
    "source": "https://gitlab.eclipse.org/api/v4/projects/eclipse%2Fxfsc%2Fpor%2Flcm-service/repository/archive.zip?sha=81873aefb72d27a8cb96edbd2fcb69e1077d755e",
    "status": "approved",
    "scans": [
        {
            "date": "July 18, 2023 at 8:06:48 a.m. GMT",
            "authority": "https://gitlab.eclipse.org/eclipsefdn/emo-team/iplab/-/issues/9568",
            "scancode-version": "31.2.1",
            "licenses-discovered": [
                "Apache-2.0"
            ],
            "copyrights": [
            ],
            "file-count": 83,
            "sha256": "cf20e2f4c8bc18a4c17ac154172e6ab0342f5b1d8999b09c885de2e008e2a5d3",
            "source": "https://gitlab.eclipse.org/api/v4/projects/eclipse%2Fxfsc%2Fpor%2Flcm-service/repository/archive.zip?sha=81873aefb72d27a8cb96edbd2fcb69e1077d755e",
            "status": "restricted"
        }
    ]
}
