{
    "id": "npm/npmjs/-/get-proto/1.0.1",
    "license": "MIT",
    "authority": "https://gitlab.eclipse.org/eclipsefdn/emo-team/iplab/-/issues/18351",
    "source": "https://github.com/ljharb/get-proto/archive/refs/tags/v1.0.1.zip",
    "status": "approved",
    "scans": [
        {
            "date": "January 7, 2025 at 2:34:16 p.m. GMT",
            "authority": "https://gitlab.eclipse.org/eclipsefdn/emo-team/iplab/-/issues/18351",
            "scancode-version": "31.2.1",
            "licenses-discovered": [
                "MIT"
            ],
            "copyrights": [
                "Copyright (c) 2025 Jordan Harband"
            ],
            "file-count": 21,
            "sha256": "59c5d248b8b5fe39ca9894bdfc3036094cdab10fa2ecf2fcdb4a521988eaed2c",
            "source": "https://github.com/ljharb/get-proto/archive/refs/tags/v1.0.1.zip",
            "status": "approved"
        }
    ]
}