{
    "id": "p2/orbit/p2.eclipse.plugin/org.apache.lucene.core/9.10.0.v20240221-0830",
    "license": "Apache-2.0 AND MIT AND (Apache-2.0 AND BSD-3-Clause AND NCSA) AND (Apache-2.0 AND LicenseRef-Python) AND (Apache-2.0 AND ISC) AND (Apache-2.0 AND SunPro) AND (Apache-2.0 AND ICU AND LicenseRef-scancode-unicode-mappings) AND (GPL-2.0-only OR LGPL-2.1-only OR MPL-1.1 OR CC-BY-4.0 OR Apache-2.0) AND BSD-3-Clause AND (Apache-2.0 AND LicenseRef-BSD-style) AND BSD-2-Clause AND NAIST-2003",
    "authority": "https://gitlab.eclipse.org/eclipsefdn/emo-team/iplab/-/issues/13353",
    "source": "https://repo1.maven.org/maven2/org/apache/lucene/lucene-core/9.10.0/lucene-core-9.10.0-sources.jar",
    "status": "approved",
    "scans": [
        {
            "date": "February 21, 2024 at 9:47:14 a.m. GMT",
            "authority": "https://gitlab.eclipse.org/eclipsefdn/emo-team/iplab/-/issues/13353",
            "scancode-version": "31.2.1",
            "licenses-discovered": [
                "Apache-2.0",
                "Apache-2.0 AND BSD-3-Clause AND NCSA",
                "Apache-2.0 AND ISC",
                "Apache-2.0 AND LicenseRef-scancode-sunpro",
                "Apache-2.0 AND ICU AND LicenseRef-scancode-unicode-mappings",
                "BSD-3-Clause",
                "Apache-2.0 AND MIT",
                "BSD-2-Clause"
            ],
            "copyrights": [
                "Copyright (c) 1970-2003, Wm. Randolph Franklin",
                "Copyright (c) 1993 by Sun Microsystems, Inc.",
                "Copyright (c) 1999-2010, International Business Machines Corporation and others",
                "Copyright (c) 2001-2009 Anders Moeller",
                "Copyright (c) 2011-2016, Yann Collet",
                "Copyright (c) 2016, Mapbox",
                "Copyright 2001-2004 Unicode, Inc."
            ],
            "file-count": 1090,
            "sha256": "08fcb7ebc552ce5d1a344c0a1bb919c6f7ff2b0c1e3154ae506001ac17ecf408",
            "source": "https://repo1.maven.org/maven2/org/apache/lucene/lucene-core/9.10.0/lucene-core-9.10.0-sources.jar",
            "status": "restricted"
        }
    ]
}
