{
    "id": "maven/mavencentral/io.grpc/grpc-protobuf-lite/1.67.1",
    "license": "Apache-2.0",
    "authority": "https://gitlab.eclipse.org/eclipsefdn/emo-team/iplab/-/issues/16769",
    "source": "https://repo1.maven.org/maven2/io/grpc/grpc-protobuf-lite/1.67.1/grpc-protobuf-lite-1.67.1-sources.jar",
    "status": "approved",
    "scans": [
        {
            "date": "October 17, 2024, 4:02:00 a.m. GMT",
            "authority": "https://gitlab.eclipse.org/eclipsefdn/emo-team/iplab/-/issues/16769",
            "scancode-version": "31.2.1",
            "licenses-discovered": [
                "Apache-2.0"
            ],
            "copyrights": [
                "Copyright 2014 The gRPC",
                "Copyright 2017 The gRPC"
            ],
            "file-count": 4,
            "sha256": "c2316461d5e619c059394337bb1dc211281a4e27c518c688580e982ce39fced9",
            "source": "https://repo1.maven.org/maven2/io/grpc/grpc-protobuf-lite/1.67.1/grpc-protobuf-lite-1.67.1-sources.jar",
            "status": "approved"
        }
    ]
}