{
    "id": "maven/mavencentral/io.grpc/grpc-api/1.67.1",
    "license": "Apache-2.0",
    "authority": "https://gitlab.eclipse.org/eclipsefdn/emo-team/iplab/-/issues/16753",
    "source": "https://repo1.maven.org/maven2/io/grpc/grpc-api/1.67.1/grpc-api-1.67.1-sources.jar",
    "status": "approved",
    "scans": [
        {
            "date": "October 17, 2024, 3:23:54 a.m. GMT",
            "authority": "https://gitlab.eclipse.org/eclipsefdn/emo-team/iplab/-/issues/16753",
            "scancode-version": "31.2.1",
            "licenses-discovered": [
                "Apache-2.0"
            ],
            "copyrights": [
                "Copyright 2014 The gRPC",
                "Copyright 2015 The gRPC",
                "Copyright 2016 The gRPC",
                "Copyright 2017 The gRPC",
                "Copyright 2018 The gRPC",
                "Copyright 2018, gRPC",
                "Copyright 2019 The gRPC",
                "Copyright 2020 The gRPC",
                "Copyright 2021 The gRPC",
                "Copyright 2022 The gRPC",
                "Copyright 2023 The gRPC",
                "Copyright 2024 The gRPC"
            ],
            "file-count": 127,
            "sha256": "1b145cd8a01b31bd35d3ae300da987c3a00f49843d4fb65c82b5eaad11fab899",
            "source": "https://repo1.maven.org/maven2/io/grpc/grpc-api/1.67.1/grpc-api-1.67.1-sources.jar",
            "status": "approved"
        }
    ]
}