{
    "id": "p2/orbit/p2.eclipse-plugin/junit-vintage-engine/5.9.1",
    "license": "EPL-2.0",
    "authority": "https://gitlab.eclipse.org/eclipsefdn/emo-team/iplab/-/issues/5364",
    "source": "https://repo1.maven.org/maven2/org/junit/vintage/junit-vintage-engine/5.9.1/junit-vintage-engine-5.9.1.jar",
    "status": "approved",
    "scans": [
        {
            "date": "December 5, 2022 at 3:44:20 p.m. GMT",
            "authority": "https://gitlab.eclipse.org/eclipsefdn/emo-team/iplab/-/issues/5364",
            "scancode-version": "31.2.1",
            "licenses-discovered": [
                "EPL-2.0"
            ],
            "copyrights": [
            ],
            "file-count": 39,
            "sha256": "b97de493877c9ba5e4f03b44bd348a53e5fc9df2df5b1a048923e0204f7d7178",
            "source": "https://repo1.maven.org/maven2/org/junit/vintage/junit-vintage-engine/5.9.1/junit-vintage-engine-5.9.1.jar",
            "status": "approved"
        }
    ]
}