{
    "license": "Apache-2.0",
    "file-count": 41,
    "authority": "https://gitlab.eclipse.org/eclipsefdn/emo-team/iplab/-/issues/971",
    "scancode-version": "21.3.31",
    "licenses-discovered": [
        "Apache-2.0"
    ],
    "id": "maven/mavencentral/org.apache.hadoop/hadoop-yarn-client/3.2.0",
    "source": "https://search.maven.org/remotecontent?filepath=org/apache/hadoop/hadoop-yarn-client/3.2.0/hadoop-yarn-client-3.2.0-sources.jar",
    "status": "approved"
}
