{
    "id": "maven/mavencentral/com.google.code.findbugs/jsr305/1.3.9",
    "license": "Apache-2.0",
    "licenses-discovered": [
        "LGPL-2.0-or-later",
        "LicenseRef-scancode-unknown-license-reference",
        "AML",
        "BSD-3-Clause",
        "Apache-2.0",
        "CC-BY-2.5",
        "GPL-2.0-only",
        "LicenseRef-scancode-oracle-openjdk-classpath-exception-2.0",
        "GPL-1.0-or-later",
        "LGPL-2.1-only",
        "LGPL-2.1-or-later",
        "CC-PDDC",
        "CC-BY-NC-SA-1.0",
        "Plexus",
        "LicenseRef-scancode-proprietary-license"
    ],
    "file-count": 3856,
    "scancode-version": "30.1.0",
    "authority": "https://gitlab.eclipse.org/eclipsefdn/emo-team/iplab/-/issues/2146",
    "source": "https://sourceforge.net/projects/findbugs/files/findbugs/1.3.9/findbugs-1.3.9-source.zip",
    "status": "approved"
}
