{
    "id": "npm/npmjs/-/vite-plugin-vuetify/1.0.2",
    "license": "MIT",
    "authority": "https://gitlab.eclipse.org/eclipsefdn/emo-team/iplab/-/issues/7100",
    "source": "https://github.com/vuetifyjs/vuetify-loader/archive/v1.0.2.zip",
    "status": "approved",
    "scans": [
        {
            "date": "February 13, 2023 at 7:51:37 a.m. GMT",
            "authority": "https://gitlab.eclipse.org/eclipsefdn/emo-team/iplab/-/issues/7100",
            "scancode-version": "31.2.1",
            "licenses-discovered": [
                "MIT"
            ],
            "copyrights": [
            ],
            "file-count": 21,
            "sha256": "b52e1edf4f82abe0d9d410fd44d4262af751ef036fdc1201daaf12d9101613dd",
            "source": "https://github.com/vuetifyjs/vuetify-loader/archive/v1.0.2.zip",
            "status": "approved"
        }
    ]
}