{
    "id": "maven/mavencentral/org.apache.pekko/pekko-remote_2.13/1.1.3",
    "license": "Apache-2.0",
    "authority": "https://gitlab.eclipse.org/eclipsefdn/emo-team/iplab/-/issues/19536",
    "source": "https://repo1.maven.org/maven2/org/apache/pekko/pekko-remote_2.13/1.1.3/pekko-remote_2.13-1.1.3-sources.jar",
    "status": "approved",
    "scans": [
        {
            "date": "February 25, 2025 at 8:00:52 a.m. GMT",
            "authority": "https://gitlab.eclipse.org/eclipsefdn/emo-team/iplab/-/issues/19536",
            "scancode-version": "31.2.1",
            "licenses-discovered": [
                "Apache-2.0"
            ],
            "copyrights": [
                "Copyright (c) 2009-2022 Lightbend Inc. <https://www.lightbend.com>",
                "Copyright (c) 2016-2022 Lightbend Inc. <https://www.lightbend.com>",
                "Copyright (c) 2017-2022 Lightbend Inc. <https://www.lightbend.com>",
                "Copyright (c) 2018-2022 Lightbend Inc. <https://www.lightbend.com>",
                "Copyright (c) 2019-2022 Lightbend Inc. <https://www.lightbend.com>",
                "Copyright (c) 2020-2022 Lightbend Inc. <https://www.lightbend.com>",
                "Copyright (c) 2021-2022 Lightbend Inc. <https://www.lightbend.com>",
                "Copyright 2014 - 2016 Real Logic Ltd.",
                "Copyright 2016 AddThis"
            ],
            "file-count": 101,
            "sha256": "363863b43b9b90776f5ee86ca74c8d5719270874e5d8155253e9524b58545318",
            "source": "https://repo1.maven.org/maven2/org/apache/pekko/pekko-remote_2.13/1.1.3/pekko-remote_2.13-1.1.3-sources.jar",
            "status": "approved"
        }
    ]
}