{
    "license": "BSD-2-Clause",
    "file-count": 7,
    "authority": "https://gitlab.eclipse.org/eclipsefdn/emo-team/iplab/-/issues/947",
    "scancode-version": "21.3.31",
    "licenses-discovered": [
        "BSD-2-Clause"
    ],
    "id": "npm/npmjs/-/esprima/3.1.3",
    "source": "https://registry.npmjs.org/esprima/-/esprima-3.1.3.tgz",
    "status": "approved"
}