{
    "id": "maven/mavencentral/org.jetbrains.kotlinx/kotlinx-serialization-json/1.6.0-RC",
    "license": "Apache-2.0",
    "authority": "https://gitlab.eclipse.org/eclipsefdn/emo-team/iplab/-/issues/10382",
    "source": "https://repo.maven.apache.org/maven2/org/jetbrains/kotlinx/kotlinx-serialization-json/1.6.0-RC/kotlinx-serialization-json-1.6.0-RC-sources.jar",
    "status": "approved",
    "scans": [
        {
            "date": "September 11, 2023 at 3:17:40 p.m. GMT",
            "authority": "https://gitlab.eclipse.org/eclipsefdn/emo-team/iplab/-/issues/10382",
            "scancode-version": "31.2.1",
            "licenses-discovered": [
                "Apache-2.0"
            ],
            "copyrights": [
                "Copyright 2017-2019 JetBrains s.r.o.",
                "Copyright 2017-2020 JetBrains s.r.o.",
                "Copyright 2017-2021 JetBrains s.r.o.",
                "Copyright 2017-2022 JetBrains s.r.o.",
                "Copyright 2017-2023 JetBrains s.r.o."
            ],
            "file-count": 42,
            "sha256": "e20d15ce408e8c898d7847273a74c2508cdd47a75e9ae7c080b361e3f03a87d3",
            "source": "https://repo.maven.apache.org/maven2/org/jetbrains/kotlinx/kotlinx-serialization-json/1.6.0-RC/kotlinx-serialization-json-1.6.0-RC-sources.jar",
            "status": "approved"
        }
    ]
}