{
    "id": "maven/mavencentral/org.ow2.asm/asm-commons/9.7",
    "license": "BSD-3-Clause",
    "authority": "https://gitlab.eclipse.org/eclipsefdn/emo-team/iplab/-/issues/14075",
    "source": "https://repo1.maven.org/maven2/org/ow2/asm/asm-commons/9.7/asm-commons-9.7-sources.jar",
    "status": "approved",
    "scans": [
        {
            "date": "March 25, 2024 at 9:30:06 a.m. GMT",
            "authority": "https://gitlab.eclipse.org/eclipsefdn/emo-team/iplab/-/issues/14075",
            "scancode-version": "31.2.1",
            "licenses-discovered": [
                "BSD-3-Clause"
            ],
            "copyrights": [
                "Copyright (c) 2000-2011 INRIA, France Telecom"
            ],
            "file-count": 26,
            "sha256": "6b0092b5ee785c2406c75fbc43c0b9ec4bee3072b4bd1d919b84cf40b7254075",
            "source": "https://repo1.maven.org/maven2/org/ow2/asm/asm-commons/9.7/asm-commons-9.7-sources.jar",
            "status": "approved"
        }
    ]
}