{
    "id": "maven/mavencentral/com.azure.resourcemanager/azure-resourcemanager-appplatform/2.43.0",
    "license": "MIT",
    "authority": "https://gitlab.eclipse.org/eclipsefdn/emo-team/iplab/-/issues/16698",
    "source": "https://repo1.maven.org/maven2/com/azure/resourcemanager/azure-resourcemanager-appplatform/2.43.0/azure-resourcemanager-appplatform-2.43.0-sources.jar",
    "status": "approved",
    "scans": [
        {
            "date": "October 15, 2024, 4:10:31 p.m. GMT",
            "authority": "https://gitlab.eclipse.org/eclipsefdn/emo-team/iplab/-/issues/16698",
            "scancode-version": "31.2.1",
            "licenses-discovered": [
                "MIT"
            ],
            "copyrights": [
                "Copyright (c) Microsoft Corporation"
            ],
            "file-count": 396,
            "sha256": "500fb57022c53c212acfadd7a0fd28b780287727da733090262922877aa5480c",
            "source": "https://repo1.maven.org/maven2/com/azure/resourcemanager/azure-resourcemanager-appplatform/2.43.0/azure-resourcemanager-appplatform-2.43.0-sources.jar",
            "status": "approved"
        }
    ]
}