{
    "id": "maven/mavencentral/org.geotools.ogc/net.opengis.ows/28.1",
    "license": "LGPL-2.1-only",
    "authority": "https://gitlab.eclipse.org/eclipsefdn/emo-team/iplab/-/issues/6705",
    "source": "https://repo.osgeo.org/repository/geotools-releases/org/geotools/ogc/net.opengis.ows/28.1/net.opengis.ows-28.1-sources.jar",
    "status": "approved",
    "scans": [
        {
            "date": "January 26, 2023 at 2:43:17 p.m. GMT",
            "authority": "https://gitlab.eclipse.org/eclipsefdn/emo-team/iplab/-/issues/6705",
            "scancode-version": "31.2.1",
            "licenses-discovered": [
            ],
            "copyrights": [
                "Copyright (c) 2006 Open Geospatial Consortium, Inc.",
                "Copyright (c) 2009 Open Geospatial Consortium. To"
            ],
            "file-count": 414,
            "sha256": "3efdfbcf887d92b2ec755fb7c0a9dbf0ba33e5fa88bf3c80108e35246a13f0ca",
            "source": "https://repo.osgeo.org/repository/geotools-releases/org/geotools/ogc/net.opengis.ows/28.1/net.opengis.ows-28.1-sources.jar",
            "status": "restricted"
        }
    ]
}
