{
    "id": "project/iot.keypop/eclipse-keypop/keypop-calypso-crypto-asymmetric-java-api/93de304c7bda84a72de95409985e706a5a448936",
    "license": "MIT",
    "authority": "https://gitlab.eclipse.org/eclipsefdn/emo-team/iplab/-/issues/9992",
    "source": "https://github.com/eclipse-keypop/keypop-calypso-crypto-asymmetric-java-api/archive/93de304c7bda84a72de95409985e706a5a448936.zip",
    "status": "approved",
    "scans": [
        {
            "date": "August 9, 2023 at 5:04:12 p.m. GMT",
            "authority": "https://gitlab.eclipse.org/eclipsefdn/emo-team/iplab/-/issues/9992",
            "scancode-version": "31.2.1",
            "licenses-discovered": [
                "MIT",
                "BSD-3-Clause AND MIT",
                "BSD-3-Clause"
            ],
            "copyrights": [
                "Copyright (c) $YEAR Calypso Networks Association https://calypsonet.org",
                "Copyright (c) 2023 Calypso Networks Association",
                "Copyright (c) 2023 Calypso Networks Association https://calypsonet.org"
            ],
            "file-count": 11,
            "sha256": "580901a2a3c5be461ce3a36a43ed82a3c688f6ef7dcf7b7641482f20267cfbc6",
            "source": "https://github.com/eclipse-keypop/keypop-calypso-crypto-asymmetric-java-api/archive/93de304c7bda84a72de95409985e706a5a448936.zip",
            "status": "restricted"
        }
    ]
}
