{
    "id": "maven/mavencentral/com.fasterxml.jackson.module/jackson-module-kotlin/2.14.1",
    "license": "Apache-2.0",
    "authority": "https://gitlab.eclipse.org/eclipsefdn/emo-team/iplab/-/issues/5927",
    "source": "https://search.maven.org/remotecontent?filepath=com/fasterxml/jackson/module/jackson-module-kotlin/2.14.1/jackson-module-kotlin-2.14.1-sources.jar",
    "status": "approved",
    "scans": [
        {
            "date": "December 21, 2022 at 7:17:02 p.m. GMT",
            "authority": "https://gitlab.eclipse.org/eclipsefdn/emo-team/iplab/-/issues/5927",
            "scancode-version": "31.2.1",
            "licenses-discovered": [
                "Apache-2.0"
            ],
            "copyrights": [
            ],
            "file-count": 27,
            "sha256": "9be51a11a960b08f06c96d3073dad120510f479ce6c8be3555e38de7c71d3f1a",
            "source": "https://search.maven.org/remotecontent?filepath=com/fasterxml/jackson/module/jackson-module-kotlin/2.14.1/jackson-module-kotlin-2.14.1-sources.jar",
            "status": "approved"
        }
    ]
}