{
    "id": "npm/npmjs/@catena-x/portal-shared-components/3.4.0",
    "license": "Apache-2.0 AND CC-BY-4.0 AND OFL-1.1",
    "authority": "https://gitlab.eclipse.org/eclipsefdn/emo-team/iplab/-/issues/16027",
    "source": "https://github.com/eclipse-tractusx/portal-shared-components/archive/refs/tags/v3.4.0.zip",
    "status": "approved",
    "scans": [
        {
            "date": "August 28, 2024 at 11:06:36 a.m. GMT",
            "authority": "https://gitlab.eclipse.org/eclipsefdn/emo-team/iplab/-/issues/16027",
            "scancode-version": "31.2.1",
            "licenses-discovered": [
                "Apache-2.0",
                "CC-BY-4.0",
                "CC-BY-4.0 AND Apache-2.0",
                "OFL-1.1"
            ],
            "copyrights": [
                "Copyright (c) 2023 BMW Group AG",
                "Copyright (c) 2023 Contributors",
                "Copyright (c) 2023 Mercedes-Benz Group AG and BMW Group AG",
                "Copyright (c) 2024 BMW Group AG",
                "Copyright (c) 2024 Contributors",
                "Copyright (c) 2024 Mercedes-Benz Group AG and BMW Group AG",
                "Copyright 2020 The LibreFranklin Project",
                "Copyright 2024 Contributors - Source URL https://github.com/eclipse-tractusx/portal-shared-components"
            ],
            "file-count": 368,
            "sha256": "bfbc1a32dc03cdabe82b32c08f8ad7bfc995b7df4581ce845d411bd57448b1dd",
            "source": "https://github.com/eclipse-tractusx/portal-shared-components/archive/refs/tags/v3.4.0.zip",
            "status": "approved"
        }
    ]
}