{
    "id": "npm/npmjs/-/object.groupby/1.0.1",
    "license": "MIT",
    "authority": "https://gitlab.eclipse.org/eclipsefdn/emo-team/iplab/-/issues/10360",
    "source": "https://github.com/es-shims/Object.groupBy/archive/refs/tags/v1.0.1.zip",
    "status": "approved",
    "scans": [
        {
            "date": "September 8, 2023 at 1:32:23 p.m. GMT",
            "authority": "https://gitlab.eclipse.org/eclipsefdn/emo-team/iplab/-/issues/10360",
            "scancode-version": "31.2.1",
            "licenses-discovered": [
                "MIT"
            ],
            "copyrights": [
                "Copyright (c) 2023 ECMAScript Shims"
            ],
            "file-count": 23,
            "sha256": "a344c2aef449976a38bfafbeb41914e192d0b6f6cc63df3a61ce5e83c6dbea03",
            "source": "https://github.com/es-shims/Object.groupBy/archive/refs/tags/v1.0.1.zip",
            "status": "approved"
        }
    ]
}