{
    "id": "npm/npmjs/@nx/nx-darwin-arm64/16.5.1",
    "license": "MIT",
    "authority": "https://gitlab.eclipse.org/eclipsefdn/emo-team/iplab/-/issues/9374",
    "source": "https://github.com/nrwl/nx/archive/refs/tags/16.5.1.zip",
    "status": "approved",
    "scans": [
        {
            "date": "July 12, 2023 at 2:13:19 p.m. GMT",
            "authority": "https://gitlab.eclipse.org/eclipsefdn/emo-team/iplab/-/issues/9374",
            "scancode-version": "31.2.1",
            "licenses-discovered": [
                "MIT",
                "TMate",
                "MIT AND Unlicense",
                "ISC",
                "Apache-2.0",
                "Apache-2.0 AND BSD-3-Clause AND CDDL-1.0 AND CDDL-1.1 AND EPL-1.0 AND EPL-2.0 AND (GPL-2.0-only WITH Classpath-exception-2.0) AND MIT"
            ],
            "copyrights": [
                "(c) 2023 made with",
                "Copyright (c) 2014 The Android Open Source Project",
                "Copyright (c) 2015-2021 the original",
                "Copyright (c) 2017-2023 Narwhal Technologies Inc.",
                "Copyright (c) 2022 Mohammad Ataei",
                "Copyright (c) Meta Platforms, Inc. and affiliates",
                "Copyright 2015 the original author or authors",
                "Copyright Google Inc."
            ],
            "file-count": 5724,
            "sha256": "835a8c0d2e928cf0ca687471037207de9dc50ddea6a12f8127ce093e56bbf6ce",
            "source": "https://github.com/nrwl/nx/archive/refs/tags/16.5.1.zip",
            "status": "restricted"
        }
    ]
}
