{
    "id": "npm/npmjs/@typescript-eslint/eslint-plugin/7.5.0",
    "license": "BSD-2-Clause AND (BSD-2-Clause AND ISC AND MIT) AND MIT",
    "authority": "https://gitlab.eclipse.org/eclipsefdn/emo-team/iplab/-/issues/14222",
    "source": "https://github.com/typescript-eslint/typescript-eslint/archive/refs/tags/v7.5.0.zip",
    "status": "approved",
    "scans": [
        {
            "date": "April 4, 2024 at 9:57:17 a.m. GMT",
            "authority": "https://gitlab.eclipse.org/eclipsefdn/emo-team/iplab/-/issues/14222",
            "scancode-version": "31.2.1",
            "licenses-discovered": [
                "BSD-2-Clause",
                "BSD-2-Clause AND ISC AND MIT",
                "MIT"
            ],
            "copyrights": [
                "Copyright (c) 2016 unional",
                "Copyright (c) 2019 typescript-eslint and other contributors",
                "Copyright (c) 2021 typescript-eslint and other contributors",
                "Copyright (c) 2023 typescript-eslint and other contributors",
                "Copyright JS Foundation and other contributors, https://js.foundation",
                "Copyright Joyent, Inc. and other Node contributors"
            ],
            "file-count": 6968,
            "sha256": "032130dfe51cacdde6eb2af01476ac9360c48b6e0b23eb793470bab8f199b725",
            "source": "https://github.com/typescript-eslint/typescript-eslint/archive/refs/tags/v7.5.0.zip",
            "status": "approved"
        }
    ]
}