{
    "id": "p2/orbit/p2.eclipse.plugin/org.eclipse.emf.ecore.change/2.14.0.v20190528-0725",
    "license": "EPL-1.0 AND EPL-2.0 AND EPL-2.0",
    "licenses-discovered": [
        "EPL-1.0 AND EPL-2.0",
        "EPL-2.0"
    ],
    "copyrights": [
        "(c) 2008 VeriSign, Inc.",
        "Copyright (c) 2003-2004 IBM Corporation and others",
        "Copyright (c) 2003-2006 IBM Corporation and others",
        "Copyright (c) 2003-2011 IBM Corporation and others",
        "Copyright (c) 2005-2006 IBM Corporation and others",
        "Copyright (c) 2006-2011 IBM Corporation and others",
        "Copyright (c) 2007-2011 IBM Corporation and others"
    ],
    "file-count": 34,
    "scancode-version": "31.2.1",
    "authority": "https://gitlab.eclipse.org/eclipsefdn/emo-team/iplab/-/issues/3877",
    "source": "https://search.maven.org/remotecontent?filepath=org/eclipse/emf/org.eclipse.emf.ecore.change/2.14.0/org.eclipse.emf.ecore.change-2.14.0-sources.jar",
    "status": "approved"
}