{
    "id": "npm/npmjs/-/css-declaration-sorter/6.4.1",
    "license": "ISC",
    "authority": "https://gitlab.eclipse.org/eclipsefdn/emo-team/iplab/-/issues/9434",
    "source": "https://registry.yarnpkg.com/css-declaration-sorter/-/css-declaration-sorter-6.4.1.tgz",
    "status": "approved",
    "scans": [
        {
            "date": "July 17, 2023 at 7:29:49 a.m. GMT",
            "authority": "https://gitlab.eclipse.org/eclipsefdn/emo-team/iplab/-/issues/9434",
            "scancode-version": "31.2.1",
            "licenses-discovered": [
                "ISC"
            ],
            "copyrights": [
            ],
            "file-count": 11,
            "sha256": "1750bb40d68134d1fc3100748d2f06a45fdec0913b1f0705a0c64c0422fa2ccd",
            "source": "https://registry.yarnpkg.com/css-declaration-sorter/-/css-declaration-sorter-6.4.1.tgz",
            "status": "approved"
        }
    ]
}