{
    "id": "npm/npmjs/-/webpack-subresource-integrity/1.1.0-rc.6",
    "license": "MIT",
    "licenses-discovered": [
        "MIT"
    ],
    "copyrights": [
        "Copyright (c) Waysact Pty Ltd"
    ],
    "file-count": 136,
    "scancode-version": "30.1.0",
    "authority": "https://gitlab.eclipse.org/eclipsefdn/emo-team/iplab/-/issues/2901",
    "source": "https://github.com/waysact/webpack-subresource-integrity/archive/v1.1.0-rc.6.zip",
    "status": "approved"
}