{
    "id": "maven/mavencentral/org.springframework/spring-beans/6.2.0",
    "license": "Apache-2.0",
    "authority": "https://gitlab.eclipse.org/eclipsefdn/emo-team/iplab/-/issues/17528",
    "source": "https://repo1.maven.org/maven2/org/springframework/spring-beans/6.2.0/spring-beans-6.2.0-sources.jar",
    "status": "approved",
    "scans": [
        {
            "date": "November 29, 2024 at 3:34:25 a.m. GMT",
            "authority": "https://gitlab.eclipse.org/eclipsefdn/emo-team/iplab/-/issues/17528",
            "scancode-version": "31.2.1",
            "licenses-discovered": [
                "Apache-2.0"
            ],
            "copyrights": [
                "Copyright 2002-2007 the original author or authors",
                "Copyright 2002-2009 the original author or authors",
                "Copyright 2002-2011 the original author or authors",
                "Copyright 2002-2012 the original author or authors",
                "Copyright 2002-2013 the original author or authors",
                "Copyright 2002-2014 the original author or authors",
                "Copyright 2002-2015 the original author or authors",
                "Copyright 2002-2016 the original author or authors",
                "Copyright 2002-2017 the original author or authors",
                "Copyright 2002-2018 the original author or authors",
                "Copyright 2002-2019 the original author or authors",
                "Copyright 2002-2020 the original author or authors",
                "Copyright 2002-2021 the original author or authors",
                "Copyright 2002-2022 the original author or authors",
                "Copyright 2002-2023 the original author or authors",
                "Copyright 2002-2024 the original author or authors"
            ],
            "file-count": 346,
            "sha256": "066a709d2facef058315a41b7b0fd7b512dc50ce0af7d87db141c536ed84e2b7",
            "source": "https://repo1.maven.org/maven2/org/springframework/spring-beans/6.2.0/spring-beans-6.2.0-sources.jar",
            "status": "approved"
        }
    ]
}