{
    "id": "maven/mavencentral/com.ethlo.time/itu/1.9.0",
    "license": "Apache-2.0",
    "authority": "https://gitlab.eclipse.org/eclipsefdn/emo-team/iplab/-/issues/13026",
    "source": "https://repo1.maven.org/maven2/com/ethlo/time/itu/1.9.0/itu-1.9.0-sources.jar",
    "status": "approved",
    "scans": [
        {
            "date": "January 31, 2024 at 8:27:27 a.m. GMT",
            "authority": "https://gitlab.eclipse.org/eclipsefdn/emo-team/iplab/-/issues/13026",
            "scancode-version": "31.2.1",
            "licenses-discovered": [
                "Apache-2.0"
            ],
            "copyrights": [
                "Copyright (c) 2017 - 2024 Morten Haraldsen",
                "Copyright (c) 2017 Morten Haraldsen"
            ],
            "file-count": 21,
            "sha256": "41818af308d4ca3fa421bd7be8da6fd4d87fd1e8b275ed80a2e8a00468f6e238",
            "source": "https://repo1.maven.org/maven2/com/ethlo/time/itu/1.9.0/itu-1.9.0-sources.jar",
            "status": "approved"
        }
    ]
}