{
    "id": "maven/mavencentral/org.apache.xmlgraphics/batik-i18n/1.16",
    "license": "Apache-2.0",
    "licenses-discovered": [
        "Apache-2.0"
    ],
    "copyrights": [
    ],
    "file-count": 8,
    "scancode-version": "31.2.1",
    "authority": "https://gitlab.eclipse.org/eclipsefdn/emo-team/iplab/-/issues/4282",
    "source": "https://search.maven.org/remotecontent?filepath=org/apache/xmlgraphics/batik-i18n/1.16/batik-i18n-1.16-sources.jar",
    "status": "approved"
}