{
    "id": "maven/mavencentral/org.junit.platform/junit-platform-suite-engine/1.10.0",
    "license": "EPL-2.0",
    "authority": "https://gitlab.eclipse.org/eclipsefdn/emo-team/iplab/-/issues/9710",
    "source": "https://repo.maven.apache.org/maven2/org/junit/platform/junit-platform-suite-engine/1.10.0-M1/junit-platform-suite-engine-1.10.0-M1-sources.jar",
    "status": "approved",
    "scans": [
        {
            "date": "July 23, 2023 at 4:21:23 p.m. GMT",
            "authority": "https://gitlab.eclipse.org/eclipsefdn/emo-team/iplab/-/issues/9710",
            "scancode-version": "31.2.1",
            "licenses-discovered": [
                "EPL-2.0"
            ],
            "copyrights": [
                "Copyright 2015-2020 the original author or authors",
                "Copyright 2015-2023 the original author or authors"
            ],
            "file-count": 15,
            "sha256": "da79df61d98bb1f8345eccb9f1b4cc37a189a3988625552f3e97e673e17107f5",
            "source": "https://repo.maven.apache.org/maven2/org/junit/platform/junit-platform-suite-engine/1.10.0-M1/junit-platform-suite-engine-1.10.0-M1-sources.jar",
            "status": "approved"
        }
    ]
}