{
    "id": "maven/mavencentral/org.graphper/graph-support/1.2.3",
    "license": "Apache-2.0",
    "authority": "https://gitlab.eclipse.org/eclipsefdn/emo-team/iplab/-/issues/13169",
    "source": "https://repo1.maven.org/maven2/org/graphper/graph-support/1.2.3/graph-support-1.2.3-sources.jar",
    "status": "approved",
    "scans": [
        {
            "date": "February 7, 2024 at 9:45:03 a.m. GMT",
            "authority": "https://gitlab.eclipse.org/eclipsefdn/emo-team/iplab/-/issues/13169",
            "scancode-version": "31.2.1",
            "licenses-discovered": [
                "Apache-2.0"
            ],
            "copyrights": [
                "Copyright 2022 The graph-support project"
            ],
            "file-count": 262,
            "sha256": "197ce08633b6d30e8c257827fc9492ed7e11a33ad0820b53c6732af67513f353",
            "source": "https://repo1.maven.org/maven2/org/graphper/graph-support/1.2.3/graph-support-1.2.3-sources.jar",
            "status": "approved"
        }
    ]
}