{
    "id": "maven/mavencentral/biz.aQute.bnd/biz.aQute.bnd.util/6.3.0",
    "license": "Apache-2.0 and EPL-2.0",
    "licenses-discovered": [
        "Apache-2.0"
    ],
    "file-count": 131,
    "scancode-version": "30.1.0",
    "authority": "https://gitlab.eclipse.org/eclipsefdn/emo-team/iplab/-/issues/2672",
    "source": "https://search.maven.org/remotecontent?filepath=biz/aQute/bnd/biz.aQute.bnd.util/6.3.0/biz.aQute.bnd.util-6.3.0-sources.jar",
    "status": "approved"
}
