{
    "id": "maven/mavencentral/androidx.compose.ui/ui-unit/1.5.0",
    "license": "Apache-2.0",
    "authority": "https://gitlab.eclipse.org/eclipsefdn/emo-team/iplab/-/issues/10420",
    "source": "https://dl.google.com/android/maven2/androidx/compose/ui/ui-unit/1.5.0/ui-unit-1.5.0-sources.jar",
    "status": "approved",
    "scans": [
        {
            "date": "September 11, 2023 at 9:00:02 p.m. GMT",
            "authority": "https://gitlab.eclipse.org/eclipsefdn/emo-team/iplab/-/issues/10420",
            "scancode-version": "31.2.1",
            "licenses-discovered": [
                "Apache-2.0"
            ],
            "copyrights": [
                "Copyright 2018 The Android Open Source Project",
                "Copyright 2019 The Android Open Source Project",
                "Copyright 2020 The Android Open Source Project",
                "Copyright 2022 The Android Open Source Project"
            ],
            "file-count": 12,
            "sha256": "ab8ef8199da8372a628d31655e860ae08ea6f6ca374972a3371d60e3d0bcd666",
            "source": "https://dl.google.com/android/maven2/androidx/compose/ui/ui-unit/1.5.0/ui-unit-1.5.0-sources.jar",
            "status": "approved"
        }
    ]
}