{
    "id": "maven/mavencentral/org.springframework.hateoas/spring-hateoas/2.1.0",
    "license": "Apache-2.0",
    "authority": "https://gitlab.eclipse.org/eclipsefdn/emo-team/iplab/-/issues/9106",
    "source": "https://repo.maven.apache.org/maven2/org/springframework/hateoas/spring-hateoas/2.1.0/spring-hateoas-2.1.0-sources.jar",
    "status": "approved",
    "scans": [
        {
            "date": "June 20, 2023 at 11:23:36 a.m. GMT",
            "authority": "https://gitlab.eclipse.org/eclipsefdn/emo-team/iplab/-/issues/9106",
            "scancode-version": "31.2.1",
            "licenses-discovered": [
                "Apache-2.0"
            ],
            "copyrights": [
                "Copyright (c) 2012-2016 Pivotal Software, Inc.",
                "Copyright 2002-2022 the original author or authors",
                "Copyright 2011-2022 the original author or authors",
                "Copyright 2012-2023 the original author or authors",
                "Copyright 2013-2023 the original author or authors",
                "Copyright 2014-2023 the original author or authors",
                "Copyright 2015-2023 the original author or authors",
                "Copyright 2016-2023 the original author or authors",
                "Copyright 2017-2023 the original author or authors",
                "Copyright 2018-2023 the original author or authors",
                "Copyright 2019-2023 the original author or authors",
                "Copyright 2020-2022 the original author or authors",
                "Copyright 2020-2023 the original author or authors",
                "Copyright 2021-2023 the original author or authors",
                "Copyright 2022-2023 the original author or authors",
                "IanaLinkRelations"
            ],
            "file-count": 222,
            "sha256": "b5d6535e8431ce80836c24ba51c1bb5509357f9be41c5dad74215299d79aa878",
            "source": "https://repo.maven.apache.org/maven2/org/springframework/hateoas/spring-hateoas/2.1.0/spring-hateoas-2.1.0-sources.jar",
            "status": "approved"
        }
    ]
}