{
    "id": "maven/mavencentral/org.apache.activemq/artemis-jdbc-store/2.33.0",
    "license": "Apache-2.0",
    "authority": "https://gitlab.eclipse.org/eclipsefdn/emo-team/iplab/-/issues/14895",
    "source": "https://repo1.maven.org/maven2/org/apache/activemq/artemis-jdbc-store/2.33.0/artemis-jdbc-store-2.33.0-sources.jar",
    "status": "approved",
    "scans": [
        {
            "date": "May 29, 2024 at 9:22:13 a.m. GMT",
            "authority": "https://gitlab.eclipse.org/eclipsefdn/emo-team/iplab/-/issues/14895",
            "scancode-version": "31.2.1",
            "licenses-discovered": [
                "Apache-2.0"
            ],
            "copyrights": [
            ],
            "file-count": 30,
            "sha256": "9806ea187003350fa52e4888b7b1f7d42016b876053da40b111e3bd68664f8fb",
            "source": "https://repo1.maven.org/maven2/org/apache/activemq/artemis-jdbc-store/2.33.0/artemis-jdbc-store-2.33.0-sources.jar",
            "status": "approved"
        }
    ]
}