{
    "id": "npm/npmjs/-/postcss-modules-scope/3.1.0",
    "license": "ISC",
    "authority": "https://gitlab.eclipse.org/eclipsefdn/emo-team/iplab/-/issues/12449",
    "source": "https://github.com/css-modules/postcss-modules-scope/archive/refs/tags/v3.1.0.zip",
    "status": "approved",
    "scans": [
        {
            "date": "December 22, 2023 at 2:13:22 p.m. GMT",
            "authority": "https://gitlab.eclipse.org/eclipsefdn/emo-team/iplab/-/issues/12449",
            "scancode-version": "31.2.1",
            "licenses-discovered": [
                "ISC"
            ],
            "copyrights": [
                "Copyright (c) 2015, Glen Maddern"
            ],
            "file-count": 88,
            "sha256": "95815bc38c7d3992b238bba55f1f810ca05c6d33597132f4bef23edcffd5927d",
            "source": "https://github.com/css-modules/postcss-modules-scope/archive/refs/tags/v3.1.0.zip",
            "status": "approved"
        }
    ]
}