{
    "id": "maven/mavencentral/com.google.gwt/gwt-user/2.9.0",
    "license": "Apache-2.0 AND CC0-1.0",
    "authority": "https://gitlab.eclipse.org/eclipsefdn/emo-team/iplab/-/issues/7408",
    "source": "https://search.maven.org/remotecontent?filepath=com/google/gwt/gwt-user/2.9.0/gwt-user-2.9.0-sources.jar",
    "status": "approved",
    "scans": [
        {
            "date": "March 15, 2023 at 4:19:10 p.m. GMT",
            "authority": "https://gitlab.eclipse.org/eclipsefdn/emo-team/iplab/-/issues/7408",
            "scancode-version": "31.2.1",
            "licenses-discovered": [
                "Apache-2.0",
                "CC0-1.0"
            ],
            "copyrights": [
                "Copyright (c) 2009 The Guava Authors",
                "Copyright (c) 2011 The Guava Authors",
                "Copyright (c) 2012 The Guava Authors",
                "Copyright (c) 2015 The Guava Authors",
                "Copyright (c) 2017 The Guava Authors",
                "Copyright 2006 Google Inc.",
                "Copyright 2007 Google Inc.",
                "Copyright 2008 Google Inc.",
                "Copyright 2009 Google Inc.",
                "Copyright 2009, Red Hat, Inc.",
                "Copyright 2010 Google Inc.",
                "Copyright 2011 Google Inc.",
                "Copyright 2012 Google Inc.",
                "Copyright 2013 Google Inc.",
                "Copyright 2014 Google Inc.",
                "Copyright 2015 Google Inc.",
                "Copyright 2016 Google Inc.",
                "Copyright 2017 Google Inc.",
                "Copyright 2018 Google Inc.",
                "Copyright 2019 Google Inc."
            ],
            "file-count": 4123,
            "sha256": "ba6aae23211ac53ed4efe60b1cb3fd74a9fb1862d18142d6c526a04a8dbbe084",
            "source": "https://search.maven.org/remotecontent?filepath=com/google/gwt/gwt-user/2.9.0/gwt-user-2.9.0-sources.jar",
            "status": "approved"
        }
    ]
}