{
    "id": "npm/npmjs/-/app-builder-lib/24.4.0",
    "license": "BSD-3-Clause AND LGPL-2.1-or-later AND MIT",
    "authority": "https://gitlab.eclipse.org/eclipsefdn/emo-team/iplab/-/issues/11483",
    "source": "https://github.com/electron-userland/electron-builder/archive/refs/tags/v24.4.0.zip",
    "status": "approved",
    "scans": [
        {
            "date": "November 9, 2023 at 7:26:46 p.m. GMT",
            "authority": "https://gitlab.eclipse.org/eclipsefdn/emo-team/iplab/-/issues/11483",
            "scancode-version": "31.2.1",
            "licenses-discovered": [
                "MIT",
                "JSON",
                "LGPL-2.1-only",
                "LicenseRef-scancode-proprietary-license",
                "ISC",
                "BSD-3-Clause",
                "Apache-2.0 AND BSD-3-Clause AND MIT"
            ],
            "copyrights": [
                "Copyright (c) 2004-2018",
                "Copyright (c) 2011 TJ Holowaychuk <tj@vision-media.ca>",
                "Copyright (c) 2015 Loopline Systems",
                "Copyright (c) 2016 Alexey Prokhorov",
                "Copyright (c) 2016 Zeit, Inc.",
                "Copyright (c) 2017 Foo Ltd.",
                "Copyright (c) 2018",
                "Copyright (c) 2018 Foo Bar",
                "Copyright (c) 2018 Sentry (https://sentry.io) and individual contributors"
            ],
            "file-count": 715,
            "sha256": "67edf987adbe02184b8c9e8de1ee5aa4c980e8158b361235a87708e9e6799a20",
            "source": "https://github.com/electron-userland/electron-builder/archive/refs/tags/v24.4.0.zip",
            "status": "restricted"
        }
    ]
}
