{
    "id": "maven/mavencentral/io.springfox/springfox-swagger-ui/3.0.0",
    "license": "Apache-2.0",
    "licenses-discovered": [
    ],
    "copyrights": [
    ],
    "file-count": 2,
    "scancode-version": "31.2.1",
    "authority": "https://gitlab.eclipse.org/eclipsefdn/emo-team/iplab/-/issues/4712",
    "source": "https://search.maven.org/remotecontent?filepath=io/springfox/springfox-swagger-ui/3.0.0/springfox-swagger-ui-3.0.0-sources.jar",
    "status": "approved"
}
