{
    "id": "p2/orbit/p2.eclipse.plugin/org.eclipse.jdt.apt.ui/3.6.500.v20200828-1336",
    "license": "EPL-1.0 AND EPL-2.0 AND EPL-2.0",
    "licenses-discovered": [
        "EPL-1.0 AND EPL-2.0",
        "EPL-2.0"
    ],
    "copyrights": [
        "(c) 2008 VeriSign, Inc.",
        "Copyright (c) 2000, 2007 IBM Corporation, BEA Systems, Inc., and others",
        "Copyright (c) 2005 BEA Systems, Inc.",
        "Copyright (c) 2005, 2007 BEA Systems, Inc and others",
        "Copyright (c) 2005, 2007 BEA Systems, Inc.",
        "Copyright (c) 2005, 2007 BEA Systems, Inc. and others",
        "Copyright (c) 2005, 2015 BEA Systems, Inc.",
        "Copyright (c) 2005, 2018 BEA Systems, Inc and others",
        "Copyright (c) 2005, 2018 BEA Systems, Inc.",
        "Copyright (c) 2005, 2018 BEA Systems, Inc. and others",
        "Copyright (c) 2005, 2020 BEA Systems, Inc."
    ],
    "file-count": 22,
    "scancode-version": "31.2.1",
    "authority": "https://gitlab.eclipse.org/eclipsefdn/emo-team/iplab/-/issues/4024",
    "source": "https://search.maven.org/remotecontent?filepath=org/eclipse/jdt/org.eclipse.jdt.apt.ui/3.6.500/org.eclipse.jdt.apt.ui-3.6.500-sources.jar",
    "status": "approved"
}