{
    "id": "npm/npmjs/-/jscodeshift/0.14.0",
    "license": "MIT",
    "authority": "https://gitlab.eclipse.org/eclipsefdn/emo-team/iplab/-/issues/9032",
    "source": "https://registry.yarnpkg.com/jscodeshift/-/jscodeshift-0.14.0.tgz",
    "status": "approved",
    "scans": [
        {
            "date": "June 15, 2023 at 4:56:20 p.m. GMT",
            "authority": "https://gitlab.eclipse.org/eclipsefdn/emo-team/iplab/-/issues/9032",
            "scancode-version": "31.2.1",
            "licenses-discovered": [
                "MIT"
            ],
            "copyrights": [
                "Copyright (c) Facebook, Inc. and its affiliates"
            ],
            "file-count": 54,
            "sha256": "58cc5a6c1dca7f791f883fcdf5334347db00fa69ce759048c1bdfe984ff27d66",
            "source": "https://registry.yarnpkg.com/jscodeshift/-/jscodeshift-0.14.0.tgz",
            "status": "approved"
        }
    ]
}