{
    "id": "nuget/nuget/-/Aml.Engine.Resources/1.0.0",
    "license": "MIT AND MS-PL",
    "authority": "https://gitlab.eclipse.org/eclipsefdn/emo-team/iplab/-/issues/16002",
    "source": "https://github.com/AutomationML/AMLEngine2.1/archive/3cb253b7ac63f87a3883fa42437696c20e99f2a9.zip",
    "status": "approved",
    "scans": [
        {
            "date": "September 11, 2024, 5:38:58 a.m. GMT",
            "authority": "https://gitlab.eclipse.org/eclipsefdn/emo-team/iplab/-/issues/16002",
            "scancode-version": "31.2.1",
            "licenses-discovered": [
                "MIT",
                "MS-PL"
            ],
            "copyrights": [
                "(c) JS Foundation and other contributors",
                "(c) Zeno Rocha",
                "Copyright (c) 2021 Josef Prinz",
                "Copyright (c) AutomationML e.V. 2017-2022",
                "Copyright 2006-2022, Eric Woodruff",
                "Copyright 2006-2023, Eric Woodruff",
                "Copyright 2007-2022, Eric Woodruff",
                "Copyright 2014-2022, Eric Woodruff",
                "Copyright 2017 AutomationML e.V.",
                "Copyright Field Value https://docs.microsoft.com/dotnet/api/system.string",
                "Copyright Property Url",
                "Portions Copyright 2010-2022 Microsoft",
                "Portions Copyright 2014-2022 Sam Harwell"
            ],
            "file-count": 7299,
            "sha256": "cb31024b1a80e9b620ead1f3e70774a5086fe137f34dbfec60a12cf65e87b5a8",
            "source": "https://github.com/AutomationML/AMLEngine2.1/archive/3cb253b7ac63f87a3883fa42437696c20e99f2a9.zip",
            "status": "restricted"
        }
    ]
}