{
    "id": "p2/orbit/p2.eclipse-plugin/org.apiguardian.api.source/1.1.2",
    "license": "Apache-2.0",
    "authority": "https://gitlab.eclipse.org/eclipsefdn/emo-team/iplab/-/issues/5345",
    "source": "https://search.maven.org/remotecontent?filepath=org/apiguardian/apiguardian-api/1.1.2/apiguardian-api-1.1.2-sources.jar",
    "status": "approved",
    "scans": [
        {
            "date": "December 3, 2022 at 4:05:48 p.m. GMT",
            "authority": "https://gitlab.eclipse.org/eclipsefdn/emo-team/iplab/-/issues/5345",
            "scancode-version": "31.2.1",
            "licenses-discovered": [
                "Apache-2.0"
            ],
            "copyrights": [
                "Copyright 2002-2017 the original author or authors"
            ],
            "file-count": 4,
            "sha256": "277a7a4315412817beb6655b324dc7276621e95ebff00b8bf65e17a27b685e2d",
            "source": "https://search.maven.org/remotecontent?filepath=org/apiguardian/apiguardian-api/1.1.2/apiguardian-api-1.1.2-sources.jar",
            "status": "approved"
        }
    ]
}