{
    "id": "npm/npmjs/@types/yargs/17.0.22",
    "license": "MIT",
    "authority": "https://gitlab.eclipse.org/eclipsefdn/emo-team/iplab/-/issues/7054",
    "source": "https://registry.npmjs.org/@types/yargs/-/yargs-17.0.22.tgz",
    "status": "approved",
    "scans": [
        {
            "date": "February 7, 2023 at 5:33:08 p.m. GMT",
            "authority": "https://gitlab.eclipse.org/eclipsefdn/emo-team/iplab/-/issues/7054",
            "scancode-version": "31.2.1",
            "licenses-discovered": [
                "MIT"
            ],
            "copyrights": [
                "Copyright (c) Microsoft Corporation"
            ],
            "file-count": 8,
            "sha256": "022068ca869b73d4ec669081084e2e985a4d25e73712d8fed6ebbfad7d955b35",
            "source": "https://registry.npmjs.org/@types/yargs/-/yargs-17.0.22.tgz",
            "status": "approved"
        }
    ]
}