{
    "id": "crate/cratesio/-/subtle/2.6.1",
    "license": "BSD-3-Clause",
    "authority": "https://gitlab.eclipse.org/eclipsefdn/emo-team/iplab/-/issues/16076",
    "source": "https://crates.io/api/v1/crates/subtle/2.6.1/download",
    "status": "approved",
    "scans": [
        {
            "date": "September 5, 2024 at 7:20:03 a.m. GMT",
            "authority": "https://gitlab.eclipse.org/eclipsefdn/emo-team/iplab/-/issues/16076",
            "scancode-version": "31.2.1",
            "licenses-discovered": [
                "BSD-3-Clause"
            ],
            "copyrights": [
                "Copyright (c) 2016-2017 Isis Agora Lovecruft, Henry de Valence",
                "Copyright (c) 2016-2018 isis lovecruft, Henry de Valence",
                "Copyright (c) 2016-2024 Isis Agora Lovecruft"
            ],
            "file-count": 9,
            "sha256": "13c2bddecc57b384dee18652358fb23172facb8a2c51ccc10d74c157bdea3292",
            "source": "https://crates.io/api/v1/crates/subtle/2.6.1/download",
            "status": "approved"
        }
    ]
}