{
    "id": "npm/npmjs/-/prettier/2.7.1",
    "license": "MIT AND (0BSD AND Apache-2.0 AND BSD-2-Clause AND BSD-3-Clause AND CC-BY-SA-4.0 AND ISC AND MIT) AND BSD-2-Clause",
    "licenses-discovered": [
        "MIT",
        "0BSD AND Apache-2.0 AND BSD-2-Clause AND BSD-3-Clause AND CC-BY-SA-4.0 AND ISC AND MIT",
        "BSD-2-Clause"
    ],
    "copyrights": [
        "(c) FQr 0,r(g3) TQr",
        "(c) Go (c)",
        "(c) Tc (c)",
        "(c) Vr (c)",
        "(c) w (c) T",
        "Copyright (c) Alex Bell",
        "Copyright (c) Alexey Raspopov, Kostiantyn Denysov, Anton Verinov",
        "Copyright (c) Andrea Giammarchi",
        "Copyright (c) Andrew Bradley",
        "Copyright (c) Andrew Powell <andrew@shellscape.org>",
        "Copyright (c) Aseem Kishore, and others",
        "Copyright (c) Ben Briggs <beneb.info@gmail.com> (http://beneb.info)",
        "Copyright (c) Brian Donovan",
        "Copyright (c) Contributors",
        "Copyright (c) Dave Justice",
        "Copyright (c) David Clark",
        "Copyright (c) Denis Malinochkin",
        "Copyright (c) Denys Kniazevych <webschik@gmail.com>",
        "Copyright (c) Dmitry Ivanov",
        "Copyright (c) Dominic Tarr",
        "Copyright (c) EditorConfig Team",
        "Copyright (c) Elan Shanker",
        "Copyright (c) Elijah Insua",
        "Copyright (c) Evgeny Poberezkin",
        "Copyright (c) Facebook, Inc. and its affiliates",
        "Copyright (c) Feross Aboukhadijeh",
        "Copyright (c) GraphQL Contributors",
        "Copyright (c) Heather Arthur <fayearthur@gmail.com>",
        "Copyright (c) Ika <ikatyang@gmail.com> (https://github.com/ikatyang)",
        "Copyright (c) Isaac Z. Schlueter",
        "Copyright (c) Isaac Z. Schlueter and Contributors",
        "Copyright (c) Isaac Z. Schlueter, Ben Noordhuis, and Contributors",
        "Copyright (c) JD Ballard",
        "Copyright (c) James Halliday",
        "Copyright (c) James Halliday (mail@substack.net)",
        "Copyright (c) James Long and contributors",
        "Copyright (c) Javier Blanco",
        "Copyright (c) Jon Schlinkert",
        "Copyright (c) Josh Junon",
        "Copyright (c) Joshua Holbrook",
        "Copyright (c) Julian Gruber <julian@juliangruber.com>",
        "Copyright (c) Kael Zhang <i@kael.me> , contributors http://kael.me",
        "Copyright (c) Kevin Decker <kpdecker@gmail.com>",
        "Copyright (c) Kevin Martensson <kevinmartensson@gmail.com>",
        "Copyright (c) Liucw",
        "Copyright (c) Made With MOXY Lda",
        "Copyright (c) Martin Munoz and contributors",
        "Copyright (c) Matteo Collina",
        "Copyright (c) Matteo Collina <matteo.collina@gmail.com>",
        "Copyright (c) Open JS Foundation",
        "Copyright (c) Pat Sissons <patricksissons@gmail.com>",
        "Copyright (c) Paul Vorbach <paul@vorba.ch>",
        "Copyright (c) Permission",
        "Copyright (c) Raynos",
        "Copyright (c) Rebecca Turner <me@re-becca.org>",
        "Copyright (c) Roy Riojas",
        "Copyright (c) Sam Verschueren <sam.verschueren@gmail.com>",
        "Copyright (c) Sebastian McKenzie and other contributors",
        "Copyright (c) Simon Lydell",
        "Copyright (c) Sindre Sorhus <sindresorhus@gmail.com> (https://sindresorhus.com)",
        "Copyright (c) Sindre Sorhus <sindresorhus@gmail.com> (sindresorhus.com)",
        "Copyright (c) Stefan Thomas",
        "Copyright (c) Stephen Sugden <me@stephensugden.com> (stephensugden.com)",
        "Copyright (c) TJ Holowaychuk <tj@vision-media.ca>",
        "Copyright (c) Teambition",
        "Copyright (c) Thiago de Arruda",
        "Copyright (c) Thomas Watson Steen",
        "Copyright (c) Tilde, Inc.",
        "Copyright (c) Titus Wormer",
        "Copyright (c) Titus Wormer <tituswormer@gmail.com>",
        "Copyright (c) TypeScript ESLint and other contributors",
        "Copyright (c) Yehuda Katz and contributors",
        "Copyright (c) Zeit, Inc.",
        "Copyright (c) and later, KFlash and others",
        "Copyright (c) by Ingvar Stepanyan",
        "Copyright (c) by various contributors",
        "Copyright (c) these people",
        "Copyright Andrey Sitnik <andrey@sitnik.ru>",
        "Copyright JS Foundation and other contributors, https://js.foundation",
        "Copyright Joyent, Inc. and other Node contributors",
        "Copyright Kat Marchan",
        "Copyright Mathias Bynens <https://mathiasbynens.be/>",
        "Copyright Thorsten Lorenz",
        "Copyright ehmicky <ehmicky@gmail.com>",
        "Copyright npm, Inc.",
        "EQr 0,r (c) SQr",
        "copyright xA9 Denis Pushkarev"
    ],
    "file-count": 34,
    "scancode-version": "30.1.0",
    "authority": "https://gitlab.eclipse.org/eclipsefdn/emo-team/iplab/-/issues/3238",
    "source": "https://registry.npmjs.org/prettier/-/prettier-2.7.1.tgz",
    "status": "approved"
}