{
    "id": "project/automotive.velocitas/eclipse-velocitas/devcontainer-base-images/369be5e525d9f15c150f28ad31814ca6e4aa467b",
    "license": "Apache-2.0",
    "authority": "https://gitlab.eclipse.org/eclipsefdn/emo-team/iplab/-/issues/5238",
    "source": "https://github.com/eclipse-velocitas/devcontainer-base-images/archive/369be5e525d9f15c150f28ad31814ca6e4aa467b.zip",
    "status": "approved",
    "scans": [
        {
            "date": "November 29, 2022 at 2:18:14 a.m. GMT",
            "authority": "https://gitlab.eclipse.org/eclipsefdn/emo-team/iplab/-/issues/5238",
            "scancode-version": "31.2.1",
            "licenses-discovered": [
                "Apache-2.0",
                "Apache-2.0 AND BSD-2-Clause AND BSD-3-Clause AND Beerware AND GPL-2.0-only AND LGPL-2.0-only AND MIT AND MPL-2.0 AND Python-2.0"
            ],
            "copyrights": [
                "Copyright (c) 2022 Robert Bosch GmbH",
                "Copyright (c) 2022 Robert Bosch GmbH and Microsoft Corporation"
            ],
            "file-count": 19,
            "sha256": "232deb56a22b6bf065df5281c6a997167c073a8d7576b821fbea6cb08f2527c3",
            "source": "https://github.com/eclipse-velocitas/devcontainer-base-images/archive/369be5e525d9f15c150f28ad31814ca6e4aa467b.zip",
            "status": "restricted"
        }
    ]
}
