{
    "id": "maven/mavencentral/org.robolectric/shadowapi/4.14.1",
    "license": "MIT",
    "authority": "https://gitlab.eclipse.org/eclipsefdn/emo-team/iplab/-/issues/19850",
    "source": "https://repo1.maven.org/maven2/org/robolectric/shadowapi/4.14.1/shadowapi-4.14.1-sources.jar",
    "status": "approved",
    "scans": [
        {
            "date": "March 3, 2025 at 6:50:22 a.m. GMT",
            "authority": "https://gitlab.eclipse.org/eclipsefdn/emo-team/iplab/-/issues/19850",
            "scancode-version": "31.2.1",
            "licenses-discovered": [
            ],
            "copyrights": [
            ],
            "file-count": 8,
            "sha256": "e7cd70cffad61d1030cd5736f839bd8239c4cf9eb2cfc0311d2984772e21cfe7",
            "source": "https://repo1.maven.org/maven2/org/robolectric/shadowapi/4.14.1/shadowapi-4.14.1-sources.jar",
            "status": "restricted"
        }
    ]
}