{
    "id": "crate/cratesio/-/nix/0.29.0",
    "license": "MIT",
    "authority": "https://gitlab.eclipse.org/eclipsefdn/emo-team/iplab/-/issues/16991",
    "source": "https://crates.io/api/v1/crates/nix/0.29.0/download",
    "status": "approved",
    "scans": [
        {
            "date": "October 31, 2024, 4:37:04 p.m. GMT",
            "authority": "https://gitlab.eclipse.org/eclipsefdn/emo-team/iplab/-/issues/16991",
            "scancode-version": "31.2.1",
            "licenses-discovered": [
                "MIT",
                "GPL-2.0-or-later OR MIT"
            ],
            "copyrights": [
                "Copyright (c) 2015 Carl Lerche + nix-rust Authors",
                "Copyright 2014 The Rust Project"
            ],
            "file-count": 121,
            "sha256": "71e2746dc3a24dd78b3cfcb7be93368c6de9963d30f43a6a73998a9cf4b17b46",
            "source": "https://crates.io/api/v1/crates/nix/0.29.0/download",
            "status": "approved"
        }
    ]
}