{
    "id": "npm/npmjs/-/react-hook-form/7.51.1",
    "license": "MIT",
    "authority": "https://gitlab.eclipse.org/eclipsefdn/emo-team/iplab/-/issues/13909",
    "source": "https://github.com/react-hook-form/react-hook-form/archive/refs/tags/v7.51.1.zip",
    "status": "approved",
    "scans": [
        {
            "date": "March 22, 2024 at 3:00:29 a.m. GMT",
            "authority": "https://gitlab.eclipse.org/eclipsefdn/emo-team/iplab/-/issues/13909",
            "scancode-version": "31.2.1",
            "licenses-discovered": [
                "MIT"
            ],
            "copyrights": [
                "Copyright (c) 2019-present Beier(Bill) Luo"
            ],
            "file-count": 446,
            "sha256": "466c8ed0e75ceef269362e4493998460ee3be51c458beb28291b7c99ee707e62",
            "source": "https://github.com/react-hook-form/react-hook-form/archive/refs/tags/v7.51.1.zip",
            "status": "approved"
        }
    ]
}