{
    "id": "maven/mavencentral/io.fabric8/kubernetes-model-admissionregistration/6.4.0",
    "license": "Apache-2.0",
    "authority": "https://gitlab.eclipse.org/eclipsefdn/emo-team/iplab/-/issues/6603",
    "source": "https://search.maven.org/remotecontent?filepath=io/fabric8/kubernetes-model-admissionregistration/6.4.0/kubernetes-model-admissionregistration-6.4.0-sources.jar",
    "status": "approved",
    "scans": [
        {
            "date": "January 24, 2023 at 8:46:52 a.m. GMT",
            "authority": "https://gitlab.eclipse.org/eclipsefdn/emo-team/iplab/-/issues/6603",
            "scancode-version": "31.2.1",
            "licenses-discovered": [
                "Apache-2.0"
            ],
            "copyrights": [
                "Copyright (c) 2015 Red Hat, Inc."
            ],
            "file-count": 227,
            "sha256": "38ddd855b224e5df4e495557627139f8d848d50c70cbe5e47563b483f52ab447",
            "source": "https://search.maven.org/remotecontent?filepath=io/fabric8/kubernetes-model-admissionregistration/6.4.0/kubernetes-model-admissionregistration-6.4.0-sources.jar",
            "status": "approved"
        }
    ]
}