{
    "id": "maven/mavencentral/org.apache.hbase/hbase-procedure/2.5.2",
    "license": "Apache-2.0",
    "authority": "https://gitlab.eclipse.org/eclipsefdn/emo-team/iplab/-/issues/6495",
    "source": "https://search.maven.org/remotecontent?filepath=org/apache/hbase/hbase-procedure/2.5.2/hbase-procedure-2.5.2-sources.jar",
    "status": "approved",
    "scans": [
        {
            "date": "January 26, 2023 at 5:24:20 a.m. GMT",
            "authority": "https://gitlab.eclipse.org/eclipsefdn/emo-team/iplab/-/issues/6495",
            "scancode-version": "31.2.1",
            "licenses-discovered": [
                "Apache-2.0"
            ],
            "copyrights": [
            ],
            "file-count": 63,
            "sha256": "3922aa641892e0ddf5af466b683480d81acf8e1523ba4b56397e53b8852974f1",
            "source": "https://search.maven.org/remotecontent?filepath=org/apache/hbase/hbase-procedure/2.5.2/hbase-procedure-2.5.2-sources.jar",
            "status": "approved"
        }
    ]
}