{
    "id": "maven/mavencentral/org.kie.workbench.stunner/kie-wb-common-stunner-shapes-api/7.63.0-20211208.133002-25",
    "license": "Apache-2.0",
    "licenses-discovered": [
        "Apache-2.0"
    ],
    "copyrights": [
        "Copyright Red Hat, Inc. and/or its affiliates"
    ],
    "file-count": 17,
    "scancode-version": "30.1.0",
    "authority": "https://gitlab.eclipse.org/eclipsefdn/emo-team/iplab/-/issues/2805",
    "source": "https://search.maven.org/remotecontent?filepath=org/kie/workbench/stunner/kie-wb-common-stunner-shapes-api/7.63.0.Final/kie-wb-common-stunner-shapes-api-7.63.0.Final-sources.jar",
    "status": "approved"
}