{
    "id": "maven/mavencentral/org.wildfly.security/wildfly-elytron-sasl-scram/2.2.1.Final",
    "license": "Apache-2.0",
    "authority": "https://gitlab.eclipse.org/eclipsefdn/emo-team/iplab/-/issues/9443",
    "source": "https://repo.maven.apache.org/maven2/org/wildfly/security/wildfly-elytron-sasl-scram/2.2.1.Final/wildfly-elytron-sasl-scram-2.2.1.Final-sources.jar",
    "status": "approved",
    "scans": [
        {
            "date": "July 17, 2023 at 8:21:16 a.m. GMT",
            "authority": "https://gitlab.eclipse.org/eclipsefdn/emo-team/iplab/-/issues/9443",
            "scancode-version": "31.2.1",
            "licenses-discovered": [
                "Apache-2.0"
            ],
            "copyrights": [
                "Copyright 2014 Red Hat, Inc., and individual contributors",
                "Copyright 2018 Red Hat, Inc., and individual contributors"
            ],
            "file-count": 10,
            "sha256": "89708c07ce043833f6ea46219d0fe7c9afbc1fc04ad8eaccdbb5c169ccc1e071",
            "source": "https://repo.maven.apache.org/maven2/org/wildfly/security/wildfly-elytron-sasl-scram/2.2.1.Final/wildfly-elytron-sasl-scram-2.2.1.Final-sources.jar",
            "status": "approved"
        }
    ]
}