{
    "id": "maven/mavencentral/io.rest-assured/xml-path/5.4.0",
    "license": "Apache-2.0",
    "authority": "https://gitlab.eclipse.org/eclipsefdn/emo-team/iplab/-/issues/12038",
    "source": "https://repo1.maven.org/maven2/io/rest-assured/xml-path/5.4.0/xml-path-5.4.0-sources.jar",
    "status": "approved",
    "scans": [
        {
            "date": "December 14, 2023 at 10:59:02 a.m. GMT",
            "authority": "https://gitlab.eclipse.org/eclipsefdn/emo-team/iplab/-/issues/12038",
            "scancode-version": "31.2.1",
            "licenses-discovered": [
                "Apache-2.0"
            ],
            "copyrights": [
                "Copyright 2019 the original author or authors"
            ],
            "file-count": 32,
            "sha256": "8fa0142f29c688c4c981136ce8f5745c34c4b7059326b47acaedde89f9566eca",
            "source": "https://repo1.maven.org/maven2/io/rest-assured/xml-path/5.4.0/xml-path-5.4.0-sources.jar",
            "status": "approved"
        }
    ]
}