{
    "license": "(Apache-2.0 AND MIT) AND CC-BY-3.0",
    "file-count": 9,
    "authority": "https://gitlab.eclipse.org/eclipsefdn/emo-team/iplab/-/issues/15389",
    "scancode-version": "21.3.31",
    "licenses-discovered": [
        "Apache-2.0",
        "MIT",
        "CC-BY-3.0",
        "LicenseRef-scancode-unknown-license-reference"
    ],
    "id": "npm/npmjs/-/atob/2.1.2",
    "source": "https://registry.yarnpkg.com/atob/-/atob-2.1.2.tgz",
    "status": "approved",
    "scans": [
        {
            "date": "June 14, 2024 at 11:27:16 p.m. GMT",
            "authority": "https://gitlab.eclipse.org/eclipsefdn/emo-team/iplab/-/issues/15386",
            "scancode-version": "31.2.1",
            "licenses-discovered": [
                "Apache-2.0 AND MIT",
                "CC-BY-3.0",
                "Apache-2.0 AND LicenseRef-scancode-free-unknown AND MIT"
            ],
            "copyrights": [
                "Copyright (c) 2015 AJ ONeal",
                "Copyright 2015 AJ ONeal",
                "copyright 2012-2018 AJ ONeal"
            ],
            "file-count": 9,
            "sha256": "e52d2ad4b7dc244be956d0c3512b66bb3470c8e0762274494c49a5f7afb3b9da",
            "source": "https://registry.yarnpkg.com/atob/-/atob-2.1.2.tgz",
            "status": "restricted"
        },
        {
            "date": "June 14, 2024 at 11:30:12 p.m. GMT",
            "authority": "https://gitlab.eclipse.org/eclipsefdn/emo-team/iplab/-/issues/15389",
            "scancode-version": "31.2.1",
            "licenses-discovered": [
                "Apache-2.0 AND MIT",
                "CC-BY-3.0",
                "Apache-2.0 AND LicenseRef-scancode-free-unknown AND MIT"
            ],
            "copyrights": [
                "Copyright (c) 2015 AJ ONeal",
                "Copyright 2015 AJ ONeal",
                "copyright 2012-2018 AJ ONeal"
            ],
            "file-count": 9,
            "sha256": "e52d2ad4b7dc244be956d0c3512b66bb3470c8e0762274494c49a5f7afb3b9da",
            "source": "https://registry.yarnpkg.com/atob/-/atob-2.1.2.tgz",
            "status": "restricted"
        }
    ]
}