{
    "license": "Apache-2.0",
    "file-count": 242,
    "authority": "https://gitlab.eclipse.org/eclipsefdn/emo-team/iplab/-/issues/1690",
    "scancode-version": "30.1.0",
    "licenses-discovered": [
        "Apache-2.0",
        "CDDL-1.0",
        "Classpath-exception-2.0",
        "GPL-2.0-only",
        "MIT",
        "LicenseRef-scancode-unknown-license-reference",
        "LicenseRef-scancode-warranty-disclaimer"
    ],
    "id": "maven/mavencentral/org.apache.jena/jena-tdb/3.14.0",
    "source": "https://search.maven.org/remotecontent?filepath=org/apache/jena/jena-tdb/3.14.0/jena-tdb-3.14.0-sources.jar",
    "status": "approved"
}
