{
    "id": "crate/cratesio/-/filedescriptor/0.8.2",
    "license": "MIT",
    "authority": "https://gitlab.eclipse.org/eclipsefdn/emo-team/iplab/-/issues/17804",
    "source": "https://crates.io/api/v1/crates/filedescriptor/0.8.2/download",
    "status": "approved",
    "scans": [
        {
            "date": "December 10, 2024 at 10:01:36 p.m. GMT",
            "authority": "https://gitlab.eclipse.org/eclipsefdn/emo-team/iplab/-/issues/17804",
            "scancode-version": "31.2.1",
            "licenses-discovered": [
                "MIT"
            ],
            "copyrights": [
            ],
            "file-count": 7,
            "sha256": "7199d965852c3bac31f779ef99cbb4537f80e952e2d6aa0ffeb30cce00f4f46e",
            "source": "https://crates.io/api/v1/crates/filedescriptor/0.8.2/download",
            "status": "approved"
        }
    ]
}