{
    "id": "maven/mavencentral/org.springframework.boot/spring-boot-starter-tomcat/3.4.0",
    "license": "Apache-2.0",
    "authority": "https://gitlab.eclipse.org/eclipsefdn/emo-team/iplab/-/issues/17526",
    "source": "https://repo1.maven.org/maven2/org/springframework/boot/spring-boot-starter-tomcat/3.4.0/spring-boot-starter-tomcat-3.4.0-sources.jar",
    "status": "approved",
    "scans": [
        {
            "date": "November 29, 2024 at 3:29:21 a.m. GMT",
            "authority": "https://gitlab.eclipse.org/eclipsefdn/emo-team/iplab/-/issues/17526",
            "scancode-version": "31.2.1",
            "licenses-discovered": [
                "Apache-2.0"
            ],
            "copyrights": [
            ],
            "file-count": 2,
            "sha256": "1cff2ff55703fc57dc03867d63377126ba26922c8f8c2edeee5c29c9ead2a4b8",
            "source": "https://repo1.maven.org/maven2/org/springframework/boot/spring-boot-starter-tomcat/3.4.0/spring-boot-starter-tomcat-3.4.0-sources.jar",
            "status": "approved"
        }
    ]
}