{
    "id": "maven/mavencentral/org.apache.camel/camel-xml-jaxp/3.22.2",
    "license": "Apache-2.0",
    "authority": "https://gitlab.eclipse.org/eclipsefdn/emo-team/iplab/-/issues/14987",
    "source": "https://repo1.maven.org/maven2/org/apache/camel/camel-xml-jaxp/3.22.2/camel-xml-jaxp-3.22.2-sources.jar",
    "status": "approved",
    "scans": [
        {
            "date": "May 29, 2024 at 12:04:56 p.m. GMT",
            "authority": "https://gitlab.eclipse.org/eclipsefdn/emo-team/iplab/-/issues/14987",
            "scancode-version": "31.2.1",
            "licenses-discovered": [
                "Apache-2.0"
            ],
            "copyrights": [
            ],
            "file-count": 32,
            "sha256": "d76c5d1af2942dc0cee2615b6e5796df3b22132077a7efc3e44c210883b1de9f",
            "source": "https://repo1.maven.org/maven2/org/apache/camel/camel-xml-jaxp/3.22.2/camel-xml-jaxp-3.22.2-sources.jar",
            "status": "approved"
        }
    ]
}