{
    "id": "maven/mavencentral/org.apache.parquet/parquet-encoding/1.13.1",
    "license": "Apache-2.0",
    "authority": "https://gitlab.eclipse.org/eclipsefdn/emo-team/iplab/-/issues/19663",
    "source": "https://repo1.maven.org/maven2/org/apache/parquet/parquet-encoding/1.13.1/parquet-encoding-1.13.1-sources.jar",
    "status": "approved",
    "scans": [
        {
            "date": "February 28, 2025 at 11:36:21 p.m. GMT",
            "authority": "https://gitlab.eclipse.org/eclipsefdn/emo-team/iplab/-/issues/19663",
            "scancode-version": "31.2.1",
            "licenses-discovered": [
                "Apache-2.0"
            ],
            "copyrights": [
                "Copyright 2013 Daniel Lemire Home page http://lemire.me/en Project"
            ],
            "file-count": 19,
            "sha256": "aa5269df8aa587dd28250ae02f65594776d8762e53e7a7ffe8672770da851425",
            "source": "https://repo1.maven.org/maven2/org/apache/parquet/parquet-encoding/1.13.1/parquet-encoding-1.13.1-sources.jar",
            "status": "approved"
        }
    ]
}