{
    "id": "maven/mavencentral/org.hsqldb/hsqldb/2.4.1",
    "license": "BSD-3-Clause",
    "licenses-discovered": [
        "BSD-3-Clause"
    ],
    "copyrights": [
        "(c) 2004-2011 Blaine Simpson and the HSQL Development Group",
        "(c) 2004-2011 Blaine Simpson und die HSQL Development Group",
        "Copyright (c) 1995, 2008, Oracle and/or its affiliates",
        "Copyright (c) 1995-2000, The Hypersonic SQL Group",
        "Copyright (c) 2001-2007, The HSQL Development Group",
        "Copyright (c) 2001-2009, The HSQL Development Group",
        "Copyright (c) 2001-2010, The HSQL Development Group",
        "Copyright (c) 2001-2011, The HSQL Development Group",
        "Copyright (c) 2001-2014, The HSQL Development Group",
        "Copyright (c) 2001-2015, The HSQL Development Group",
        "Copyright (c) 2001-2016, The HSQL Development Group",
        "Copyright (c) 2001-2017, The HSQL Development Group",
        "Copyright (c) 2001-2018, The HSQL Development Group",
        "Copyright (c) 2001-2018, The HSQL Development Group. + http://hsqldb.org",
        "Copyright Calmetrics 2005 Project"
    ],
    "file-count": 614,
    "scancode-version": "31.2.1",
    "authority": "https://gitlab.eclipse.org/eclipsefdn/emo-team/iplab/-/issues/4473",
    "source": "https://search.maven.org/remotecontent?filepath=org/hsqldb/hsqldb/2.4.1/hsqldb-2.4.1-sources.jar",
    "status": "approved"
}