{
    "id": "maven/mavencentral/io.opentelemetry/opentelemetry-sdk-metrics/1.19.0",
    "license": "Apache-2.0",
    "authority": "https://gitlab.eclipse.org/eclipsefdn/emo-team/iplab/-/issues/5225",
    "source": "https://search.maven.org/remotecontent?filepath=io/opentelemetry/opentelemetry-sdk-metrics/1.19.0/opentelemetry-sdk-metrics-1.19.0-sources.jar",
    "status": "approved",
    "scans": [
        {
            "date": "November 28, 2022 at 11:58:27 p.m. GMT",
            "authority": "https://gitlab.eclipse.org/eclipsefdn/emo-team/iplab/-/issues/5225",
            "scancode-version": "31.2.1",
            "licenses-discovered": [
                "Apache-2.0"
            ],
            "copyrights": [
            ],
            "file-count": 160,
            "sha256": "a9d8e56932f9c51606c9e544c20559149b34db78f31870e33abf2ed883a09be2",
            "source": "https://search.maven.org/remotecontent?filepath=io/opentelemetry/opentelemetry-sdk-metrics/1.19.0/opentelemetry-sdk-metrics-1.19.0-sources.jar",
            "status": "approved"
        }
    ]
}