{
    "id": "p2/orbit/p2.eclipse-plugin/org.apache.batik.swing/1.9.1",
    "license": "Apache-2.0",
    "licenses-discovered": [
        "Apache-2.0"
    ],
    "copyrights": [
    ],
    "file-count": 52,
    "scancode-version": "31.2.1",
    "authority": "https://gitlab.eclipse.org/eclipsefdn/emo-team/iplab/-/issues/3947",
    "source": "https://search.maven.org/remotecontent?filepath=org/apache/xmlgraphics/batik-swing/1.9.1/batik-swing-1.9.1-sources.jar",
    "status": "approved"
}