{
    "id": "maven/mavencentral/com.sun.xml.ws/jaxws-rt/3.0.1",
    "license": "BSD-3-Clause",
    "licenses-discovered": [
        "BSD-3-Clause"
    ],
    "file-count": 1223,
    "scancode-version": "30.1.0",
    "authority": "https://gitlab.eclipse.org/eclipsefdn/emo-team/iplab/-/issues/2671",
    "source": "https://search.maven.org/remotecontent?filepath=com/sun/xml/ws/jaxws-rt/3.0.1/jaxws-rt-3.0.1-sources.jar",
    "status": "approved"
}