{
    "id": "maven/mavencentral/org.sonarsource.scanner.api/sonar-scanner-api/2.16.2.588",
    "license": "LGPL-3.0-or-later",
    "authority": "https://gitlab.eclipse.org/eclipsefdn/emo-team/iplab/-/issues/6945",
    "source": "https://search.maven.org/remotecontent?filepath=org/sonarsource/scanner/api/sonar-scanner-api/2.16.2.588/sonar-scanner-api-2.16.2.588-sources.jar",
    "status": "approved",
    "scans": [
        {
            "date": "February 3, 2023 at 8:42:43 p.m. GMT",
            "authority": "https://gitlab.eclipse.org/eclipsefdn/emo-team/iplab/-/issues/6945",
            "scancode-version": "31.2.1",
            "licenses-discovered": [
                "LGPL-2.1-or-later",
                "GPL-3.0-or-later",
                "LGPL-3.0-or-later"
            ],
            "copyrights": [
                "Copyright (c) 2011-2021 SonarSource SA"
            ],
            "file-count": 34,
            "sha256": "a3119455eb5deb9209c29a08360d02c1004c225acafd1a57cf0d2a2112693132",
            "source": "https://search.maven.org/remotecontent?filepath=org/sonarsource/scanner/api/sonar-scanner-api/2.16.2.588/sonar-scanner-api-2.16.2.588-sources.jar",
            "status": "restricted"
        }
    ]
}
