{
    "id": "project/technology.tm4e/-/vscode-syntax-files/1.91.1",
    "license": "MIT AND LicenseRef-BSL-style AND Apache-2.0 AND (Apache-2.0 OR MPL-2.0) AND BSD-2-Clause AND BSD-3-Clause",
    "authority": "https://gitlab.eclipse.org/eclipsefdn/emo-team/iplab/-/issues/15819",
    "source": "https://github.com/microsoft/vscode/archive/refs/tags/1.91.1.tar.gz",
    "status": "approved",
    "scans": [
        {
            "date": "July 25, 2024 at 6:57:14 p.m. GMT",
            "authority": "https://gitlab.eclipse.org/eclipsefdn/emo-team/iplab/-/issues/15819",
            "scancode-version": "31.2.1",
            "licenses-discovered": [
                "MIT",
                "Apache-2.0 AND ISC AND MIT AND OpenSSL AND Zlib",
                "BSD-3-Clause AND CC-BY-4.0 AND LGPL-2.1-only AND LicenseRef-scancode-inno-setup AND LicenseRef-scancode-proprietary-license AND MIT",
                "Apache-2.0 AND BSD-3-Clause AND CC-BY-4.0 AND ISC AND LicenseRef-scancode-proprietary-license AND LicenseRef-scancode-unicode AND LicenseRef-scancode-unknown AND MIT AND W3C-20150513",
                "Apache-2.0 WITH LLVM-exception AND BSD-3-Clause AND BSD-4-Clause AND BSL-1.0 AND ISC AND LGPL-2.1-or-later AND MIT AND MPL-2.0 AND Unlicense AND Zlib",
                "LicenseRef-scancode-free-unknown AND MIT",
                "Apache-2.0",
                "LicenseRef-scancode-boost-original AND MIT",
                "BSD-3-Clause",
                "LicenseRef-scancode-boost-original",
                "Apache-2.0 AND MIT AND W3C",
                "LicenseRef-scancode-boost-original AND LicenseRef-scancode-unknown AND MIT",
                "Apache-2.0 AND LicenseRef-scancode-unicode AND MIT AND W3C AND W3C-20150513",
                "CC-BY-NC-SA-1.0",
                "Apache-2.0 AND MPL-2.0",
                "ISC",
                "Apache-2.0 AND BSD-3-Clause AND JSON AND MIT",
                "BSD-2-Clause AND BSD-3-Clause"
            ],
            "copyrights": [
                "(c) 2016 Bertram Truong",
                "(c) 2019 Jeff",
                "(c) 2021 Kornel Lesinski",
                "(c) Cure53 and other contributors",
                "(c) Microsoft",
                "Copyright (c) .NET Foundation",
                "Copyright (c) .NET Foundation and Contributors",
                "Copyright (c) 1991, 1999 Free Software Foundation",
                "Copyright (c) 1991-2017 Unicode, Inc.",
                "Copyright (c) 1997-2020 Jordan Russell",
                "Copyright (c) 2002-2020 K.Kosako <kkosako0@gmail.com>",
                "Copyright (c) 2004, John Gruber http://daringfireball.net",
                "Copyright (c) 2007-2018 Einar Lielmanis, Liam Newman, and contributors",
                "Copyright (c) 2008 Microsoft Corporation",
                "Copyright (c) 2008 Tim",
                "Copyright (c) 2008 Tim Harper",
                "Copyright (c) 2009-2014 Jeremy Ashkenas",
                "Copyright (c) 2010 The Rust Project",
                "Copyright (c) 2010- Mark McGranaghan",
                "Copyright (c) 2011 Fabrice Bellard",
                "Copyright (c) 2011 Jxck",
                "Copyright (c) 2011-2014, Christopher Jeffrey (https://github.com/chjj/)",
                "Copyright (c) 2011-2018, Christopher Jeffrey (https://github.com/chjj/)",
                "Copyright (c) 2011-2022, Christopher Jeffrey. (MIT Licensed) https://github.com/markedjs/marked",
                "Copyright (c) 2012 Alex Sancho, http://alexsancho.name",
                "Copyright (c) 2012-2013 Mozilla Foundation",
                "Copyright (c) 2012-2013, Christopher Jeffrey (MIT License) https://github.com/chjj/term.js",
                "Copyright (c) 2013 Nathan Rajlich <nathan@tootallnate.net>",
                "Copyright (c) 2013 Nicolas Silva",
                "Copyright (c) 2013-2014 The Rust Project",
                "Copyright (c) 2013-2022 The rust-url",
                "Copyright (c) 2014 - present, Travis Webb <me@traviswebb.com>",
                "Copyright (c) 2014 2017, Kang Seonghoon and contributors",
                "Copyright (c) 2014 Alex Crichton",
                "Copyright (c) 2014 Carl Lerche and other MIO contributors",
                "Copyright (c) 2014 Chris Wong",
                "Copyright (c) 2014 GitHub",
                "Copyright (c) 2014 GitHub Inc.",
                "Copyright (c) 2014 Jesse Weed",
                "Copyright (c) 2014 Mathijs van de Nes",
                "Copyright (c) 2014 Nathan Rajlich <nathan@tootallnate.net>",
                "Copyright (c) 2014 The Rust Project",
                "Copyright (c) 2014 The xterm.js authors",
                "Copyright (c) 2014, Kang Seonghoon",
                "Copyright (c) 2014-2019 Sean McArthur",
                "Copyright (c) 2014-2020 The Rust Project",
                "Copyright (c) 2014-2021 Sean McArthur",
                "Copyright (c) 2015 - present Microsoft Corporation",
                "Copyright (c) 2015 Alice Maz",
                "Copyright (c) 2015 Andrew Gallant",
                "Copyright (c) 2015 Bartlomiej Kaminski",
                "Copyright (c) 2015 Carl Lerche + nix-rust Authors",
                "Copyright (c) 2015 Colorsublime.com",
                "Copyright (c) 2015 Danny Guo",
                "Copyright (c) 2015 David Owens",
                "Copyright (c) 2015 David Owens II",
                "Copyright (c) 2015 FichteFoll <fichtefoll2@googlemail.com>",
                "Copyright (c) 2015 Guillaume Gomez",
                "Copyright (c) 2015 Igor Shaula",
                "Copyright (c) 2015 Krzysztof Cieslak",
                "Copyright (c) 2015 Permission",
                "Copyright (c) 2015 Sebastian Thiel",
                "Copyright (c) 2015 Steven Allen",
                "Copyright (c) 2015 Steven Fackler",
                "Copyright (c) 2015 The Gimli Developers",
                "Copyright (c) 2015 The Rust Project",
                "Copyright (c) 2015 W3C(r) (MIT, ERCIM, Keio, Beihang)",
                "Copyright (c) 2015 W3C(r) (MIT, ERCIM, Keio, Beihang). Disclaimers",
                "Copyright (c) 2015 W3C(r) MIT, ERCIM, Keio",
                "Copyright (c) 2015 emilast",
                "Copyright (c) 2015 steffengy",
                "Copyright (c) 2015-2018 The winapi-rs",
                "Copyright (c) 2015-2020 Julien Cretin",
                "Copyright (c) 2015-2020 The rust-hex",
                "Copyright (c) 2015-2024 Sean McArthur",
                "Copyright (c) 2015-present MagicStack Inc. http://magic.io",
                "Copyright (c) 2016 - present Microsoft Corporation",
                "Copyright (c) 2016 .NET Foundation",
                "Copyright (c) 2016 2017 Permission",
                "Copyright (c) 2016 2023 Permission",
                "Copyright (c) 2016 Alex Crichton",
                "Copyright (c) 2016 Amanieu d'Antras",
                "Copyright (c) 2016 Anthony Ramine",
                "Copyright (c) 2016 David Rios",
                "Copyright (c) 2016 James Yu",
                "Copyright (c) 2016 Jason Housley",
                "Copyright (c) 2016 Joe Wilm",
                "Copyright (c) 2016 Martin Carton",
                "Copyright (c) 2016 Masaki Hara",
                "Copyright (c) 2016 Microsoft",
                "Copyright (c) 2016 Pyfisch",
                "Copyright (c) 2016 Sean McArthur",
                "Copyright (c) 2016 The Rust Project",
                "Copyright (c) 2016 The rust-native-tls",
                "Copyright (c) 2016 Titus Wormer <tituswormer@gmail.com>",
                "Copyright (c) 2016 Tomasz Miasko",
                "Copyright (c) 2016 Waylon",
                "Copyright (c) 2016 Waylon Flinn",
                "Copyright (c) 2016 keyring",
                "Copyright (c) 2016 secret-service",
                "Copyright (c) 2016-2017 Isis Agora Lovecruft, Henry de Valence",
                "Copyright (c) 2016-2018 The gimli",
                "Copyright (c) 2016-2019 Ulrik Sverdrup",
                "Copyright (c) 2016-2024 Isis Agora Lovecruft",
                "Copyright (c) 2017 Alexey Galakhov",
                "Copyright (c) 2017 Armin Ronacher <armin.ronacher@active-4.com>",
                "Copyright (c) 2017 Contributors",
                "Copyright (c) 2017 Daniel Abramov",
                "Copyright (c) 2017 Emmet.io",
                "Copyright (c) 2017 Evgeny Safronov",
                "Copyright (c) 2017 Gilad Naaman",
                "Copyright (c) 2017 Jim McGrath",
                "Copyright (c) 2017 John Kreitlow",
                "Copyright (c) 2017 Jose Narvaez",
                "Copyright (c) 2017 Nikolai Vazquez",
                "Copyright (c) 2017 Redox OS",
                "Copyright (c) 2017 Sean McArthur",
                "Copyright (c) 2017 Stanislav Tkach",
                "Copyright (c) 2017 The Tokio Authors",
                "Copyright (c) 2017 The foreign-types",
                "Copyright (c) 2017 Tim Jones",
                "Copyright (c) 2017 h2 authors",
                "Copyright (c) 2017 http-rs authors",
                "Copyright (c) 2017 tokio-jsonrpc",
                "Copyright (c) 2017-2018 Sergio Benitez",
                "Copyright (c) 2017-2020 Google Inc.",
                "Copyright (c) 2017-2023 Maik Klein, Maja Kadziolka",
                "Copyright (c) 2018 Akash Kurdekar",
                "Copyright (c) 2018 Ashley Mannix, Christopher Armstrong, Dylan DPC, Hunar Roop Kahlon",
                "Copyright (c) 2018 Benjamin Sago",
                "Copyright (c) 2018 Carl Lerche",
                "Copyright (c) 2018 Josh Stone",
                "Copyright (c) 2018 Sam Rijs, Alex Crichton and contributors",
                "Copyright (c) 2018 Takahiro Ethan Ikeuchi",
                "Copyright (c) 2018 The Servo Project",
                "Copyright (c) 2018 The pin-utils",
                "Copyright (c) 2018+, MarkedJS (https://github.com/markedjs/)",
                "Copyright (c) 2018-2019 Sean McArthur",
                "Copyright (c) 2018-2019 dirs-rs contributors",
                "Copyright (c) 2018-2023 Sean McArthur",
                "Copyright (c) 2018-2024 The rust-random Project",
                "Copyright (c) 2019 Borewit",
                "Copyright (c) 2019 Carl Lerche",
                "Copyright (c) 2019 Hyper",
                "Copyright (c) 2019 Jeff",
                "Copyright (c) 2019 Jeff Hykin",
                "Copyright (c) 2019 Nick Fitzgerald",
                "Copyright (c) 2019 The Crossbeam Project",
                "Copyright (c) 2019 The CryptoCorrosion Contributors",
                "Copyright (c) 2019 Tokio",
                "Copyright (c) 2019 Tower",
                "Copyright (c) 2019, Sebastien Crozet",
                "Copyright (c) 2020 - present Microsoft Corporation",
                "Copyright (c) 2020 Andrew D. Straw",
                "Copyright (c) 2020 Borewit",
                "Copyright (c) 2020 Dustin Pomerleau",
                "Copyright (c) 2020 Free Software Foundation, Inc.",
                "Copyright (c) 2020 Josh Triplett",
                "Copyright (c) 2020 Matias Rodriguez",
                "Copyright (c) 2020 Soveu",
                "Copyright (c) 2020 Yoshua Wuyts",
                "Copyright (c) 2021 Michael Mims",
                "Copyright (c) 2022 Jacob Pratt",
                "Copyright (c) 2022 Microsoft",
                "Copyright (c) 2022 REditorSupport",
                "Copyright (c) 2023 4lDO2",
                "Copyright (c) 2023 Furkan Ozalp",
                "Copyright (c) 2023 Jacob Pratt",
                "Copyright (c) 2023 Johan Walles <johan.walles@gmail.com>",
                "Copyright (c) 2023 Sean Larkin",
                "Copyright (c) 2023 The Rust Project",
                "Copyright (c) 2024 Jacob Pratt",
                "Copyright (c) 2024 Microsoft",
                "Copyright (c) 2024 Mullvad VPN AB",
                "Copyright (c) <2013> Permission",
                "Copyright (c) Individual contributors",
                "Copyright (c) Isaac Z. Schlueter",
                "Copyright (c) Isaac Z. Schlueter and Contributors",
                "Copyright (c) Isaac Z. Schlueter and Contributors https://github.com/npm/node-semver",
                "Copyright (c) Microsoft",
                "Copyright (c) Microsoft 2018",
                "Copyright (c) Microsoft Corporation",
                "Copyright (c) Tokio Contributors",
                "Copyright (c) daaain/Handlebars project",
                "Copyright (c) sumneko-lua.tmbundle project",
                "Copyright (c) textmate-asp.vb.net.tmbundle project",
                "Copyright (c) textmate-diff.tmbundle project",
                "Copyright (c) textmate-groovy.tmbundle project",
                "Copyright (c) textmate-html.tmbundle project",
                "Copyright (c) textmate-ini.tmbundle project",
                "Copyright (c) textmate-javascript.tmbundle project",
                "Copyright (c) textmate-make.tmbundle project",
                "Copyright (c) textmate-perl.tmbundle project",
                "Copyright (c) textmate-ruby.tmbundle project",
                "Copyright 2010 James Halliday",
                "Copyright 2011-2017 Google Inc. 2013 Jack Lloyd 2013-2014 Steven Fackler",
                "Copyright 2013-2018 Docker, Inc.",
                "Copyright 2015 Mario Heiderich",
                "Copyright 2015 The Chromium Authors",
                "Copyright 2015-2024 The md5",
                "Copyright 2017 Juniper Networks, Inc.",
                "Copyright 2018",
                "Copyright 2020, the Dart project",
                "Copyright 2021 NVIDIA Corporation",
                "Copyright 2021 Trond Snekvik",
                "Copyright 2023 Jacob Bandes-Storch",
                "Copyright Drifty Co. http://drifty.com/",
                "Copyright Joyent, Inc.",
                "Copyright Joyent, Inc. and other Node contributors",
                "Copyright Microsoft Corporation",
                "Copyright Mozilla Foundation",
                "Portions Copyright (c) 2000-2020 Martijn Laan",
                "copyrighted by Jordan",
                "copyrighted by the Free Software Foundation"
            ],
            "file-count": 7390,
            "sha256": "d2ed726dd34d2e8e71d40b09c0ea648bf9b37b15982b39dddcb70d0cbfcdb45e",
            "source": "https://github.com/microsoft/vscode/archive/refs/tags/1.91.1.tar.gz",
            "status": "restricted"
        }
    ]
}