{
    "id": "maven/mavencentral/org.springframework.boot/spring-boot-starter-data-rest/3.2.1",
    "license": "Apache-2.0",
    "authority": "https://gitlab.eclipse.org/eclipsefdn/emo-team/iplab/-/issues/12594",
    "source": "https://repo1.maven.org/maven2/org/springframework/boot/spring-boot-starter-data-rest/3.2.1/spring-boot-starter-data-rest-3.2.1-sources.jar",
    "status": "approved",
    "scans": [
        {
            "date": "January 2, 2024 at 2:12:17 p.m. GMT",
            "authority": "https://gitlab.eclipse.org/eclipsefdn/emo-team/iplab/-/issues/12594",
            "scancode-version": "31.2.1",
            "licenses-discovered": [
                "Apache-2.0"
            ],
            "copyrights": [
            ],
            "file-count": 2,
            "sha256": "5494f6838488ee69f53a5dff3a5785b45d096b351ba5e9d583d15a8df0f1dfee",
            "source": "https://repo1.maven.org/maven2/org/springframework/boot/spring-boot-starter-data-rest/3.2.1/spring-boot-starter-data-rest-3.2.1-sources.jar",
            "status": "approved"
        }
    ]
}