{
    "id": "npm/npmjs/-/picomatch/4.0.1",
    "license": "MIT",
    "authority": "https://gitlab.eclipse.org/eclipsefdn/emo-team/iplab/-/issues/13338",
    "source": "https://github.com/micromatch/picomatch/archive/refs/tags/4.0.1.zip",
    "status": "approved",
    "scans": [
        {
            "date": "February 20, 2024 at 7:56:48 a.m. GMT",
            "authority": "https://gitlab.eclipse.org/eclipsefdn/emo-team/iplab/-/issues/13338",
            "scancode-version": "31.2.1",
            "licenses-discovered": [
                "MIT"
            ],
            "copyrights": [
                "Copyright (c) 2017-present, Jon Schlinkert",
                "Copyright (c) 2017-present, Jon Schlinkert (https://github.com/jonschlinkert)"
            ],
            "file-count": 74,
            "sha256": "ac7e0b24b7222c31c59326b1c521b0da25597ddc394bd000d3e1dbee3475f587",
            "source": "https://github.com/micromatch/picomatch/archive/refs/tags/4.0.1.zip",
            "status": "approved"
        }
    ]
}