{
    "id": "maven/mavencentral/org.apache.kerby/kerb-common/1.0.1",
    "license": "Apache-2.0",
    "authority": "https://gitlab.eclipse.org/eclipsefdn/emo-team/iplab/-/issues/15523",
    "source": "https://repo1.maven.org/maven2/org/apache/kerby/kerb-common/1.0.1/kerb-common-1.0.1-sources.jar",
    "status": "approved",
    "scans": [
        {
            "date": "July 2, 2024 at 1:07:23 p.m. GMT",
            "authority": "https://gitlab.eclipse.org/eclipsefdn/emo-team/iplab/-/issues/15523",
            "scancode-version": "31.2.1",
            "licenses-discovered": [
                "Apache-2.0"
            ],
            "copyrights": [
            ],
            "file-count": 43,
            "sha256": "48d2f06b7079a5ae7521bac0c317f9a2e7655f36eee5ae62fb56607eecca61de",
            "source": "https://repo1.maven.org/maven2/org/apache/kerby/kerb-common/1.0.1/kerb-common-1.0.1-sources.jar",
            "status": "approved"
        }
    ]
}