{
    "license": "BSD-3-Clause AND LGPL-3.0-only AND MIT",
    "file-count": 59,
    "authority": "https://gitlab.eclipse.org/eclipsefdn/emo-team/iplab/-/issues/1379",
    "scancode-version": "30.1.0",
    "licenses-discovered": [
        "MIT",
        "BSD-3-Clause",
        "LGPL-3.0-only",
        "LicenseRef-scancode-free-unknown"
    ],
    "id": "npm/npmjs/-/node-notifier/8.0.2",
    "source": "https://github.com/mikaelbr/node-notifier/archive/v8.0.2.zip",
    "status": "approved"
}
