{
    "id": "npm/npmjs/-/antd/5.16.4",
    "license": "MIT",
    "authority": "https://gitlab.eclipse.org/eclipsefdn/emo-team/iplab/-/issues/14567",
    "source": "https://github.com/ant-design/ant-design/archive/refs/tags/5.16.4.zip",
    "status": "approved",
    "scans": [
        {
            "date": "April 24, 2024 at 6:38:42 a.m. GMT",
            "authority": "https://gitlab.eclipse.org/eclipsefdn/emo-team/iplab/-/issues/14567",
            "scancode-version": "31.2.1",
            "licenses-discovered": [
                "MIT",
                "LicenseRef-scancode-free-unknown"
            ],
            "copyrights": [
                "Ant Design (c) 2016",
                "Copyright (c) 2015-present Ant UED, https://xtech.antfin.com"
            ],
            "file-count": 3904,
            "sha256": "de26ece9eafb0cd5bd6d337fb958ea18ad02f801636b39ded2b7f8f2566beac5",
            "source": "https://github.com/ant-design/ant-design/archive/refs/tags/5.16.4.zip",
            "status": "restricted"
        }
    ]
}
