{
    "id": "maven/mavencentral/com.vaadin/vaadin-themes/8.20.0",
    "license": "None",
    "authority": "https://gitlab.eclipse.org/eclipsefdn/emo-team/iplab/-/issues/7522",
    "source": "https://search.maven.org/remotecontent?filepath=com/vaadin/vaadin-themes/8.20.0/vaadin-themes-8.20.0-sources.jar",
    "status": "restricted",
    "scans": [
        {
            "date": "March 24, 2023 at 1:42:52 p.m. GMT",
            "authority": "https://gitlab.eclipse.org/eclipsefdn/emo-team/iplab/-/issues/7522",
            "scancode-version": "31.2.1",
            "licenses-discovered": [
            ],
            "copyrights": [
                "Copyright (c) 2000-2023 Vaadin Ltd"
            ],
            "file-count": 4,
            "sha256": "7c5e0485f2d934369215357fc43c2ab33de580db9274d336c2079e64dfc66be7",
            "source": "https://search.maven.org/remotecontent?filepath=com/vaadin/vaadin-themes/8.20.0/vaadin-themes-8.20.0-sources.jar",
            "status": "restricted"
        }
    ]
}