{
    "id": "npm/npmjs/-/memfs/4.7.0",
    "license": "Apache-2.0",
    "authority": "https://gitlab.eclipse.org/eclipsefdn/emo-team/iplab/-/issues/13199",
    "source": "https://github.com/streamich/memfs/archive/refs/tags/v4.7.0.zip",
    "status": "approved",
    "scans": [
        {
            "date": "February 13, 2024 at 9:28:49 a.m. GMT",
            "authority": "https://gitlab.eclipse.org/eclipsefdn/emo-team/iplab/-/issues/13199",
            "scancode-version": "31.2.1",
            "licenses-discovered": [
                "Apache-2.0"
            ],
            "copyrights": [
                "Copyright 2023 Vadim streamich Dalecky <vadimsdaleckis@gmail.com> and other contributors"
            ],
            "file-count": 204,
            "sha256": "82f5891e8890953c2ffe6cddb4fc3e66963f6405a78b927a7424aad06fdf5681",
            "source": "https://github.com/streamich/memfs/archive/refs/tags/v4.7.0.zip",
            "status": "approved"
        }
    ]
}