{
    "id": "p2/orbit/p2.eclipse.plugin/org.apache.sshd.osgi/2.9.2.v20221117-1942",
    "license": "Apache-2.0 AND ISC",
    "authority": "https://gitlab.eclipse.org/eclipsefdn/emo-team/iplab/-/issues/5036",
    "source": "https://search.maven.org/remotecontent?filepath=org/apache/sshd/sshd-osgi/2.9.2/sshd-osgi-2.9.2-sources.jar",
    "status": "approved",
    "scans": [
        {
            "date": "November 23, 2022 at 1:40:04 p.m. GMT",
            "authority": "https://gitlab.eclipse.org/eclipsefdn/emo-team/iplab/-/issues/5036",
            "scancode-version": "31.2.1",
            "licenses-discovered": [
                "Apache-2.0",
                "ISC"
            ],
            "copyrights": [
                "Copyright (c) 2006 Damien Miller <djm@mindrot.org>"
            ],
            "file-count": 738,
            "sha256": "9d5f8c8fa50349d775e9b5045247a2e1ba31dc74dbf7b6933a48b98bb7fc7c95",
            "source": "https://search.maven.org/remotecontent?filepath=org/apache/sshd/sshd-osgi/2.9.2/sshd-osgi-2.9.2-sources.jar",
            "status": "approved"
        }
    ]
}