{
    "id": "project/technology.lmos/eclipse-lmos/arc-view/84002ae99f95bb4216acbd64d8f0757ff03d72de",
    "license": "Apache-2.0 AND CC-BY-4.0 AND CC0-1.0",
    "authority": "https://gitlab.eclipse.org/eclipsefdn/emo-team/iplab/-/issues/17954",
    "source": "https://github.com/eclipse-lmos/arc-view/archive/84002ae99f95bb4216acbd64d8f0757ff03d72de.zip",
    "status": "approved",
    "scans": [
        {
            "date": "December 18, 2024 at 6:08:09 p.m. GMT",
            "authority": "https://gitlab.eclipse.org/eclipsefdn/emo-team/iplab/-/issues/17954",
            "scancode-version": "31.2.1",
            "licenses-discovered": [
                "Apache-2.0",
                "CC-BY-4.0",
                "Apache-2.0 AND MPL-2.0",
                "Apache-2.0 AND CC0-1.0",
                "CC0-1.0"
            ],
            "copyrights": [
                "Copyright (c) 2024 Deutsche Telekom AG.",
                "Copyright (c) 2024 com.example",
                "Copyright 2022 Free Software Foundation Europe e.V. <https://fsfe.org>",
                "Copyright 2023 www.contributor-covenant.org",
                "Copyright 2024 Deutsche Telekom AG",
                "Copyright The original author or authors"
            ],
            "file-count": 261,
            "sha256": "fa7069cee79506458b06af1ad613bf5b3f442c20145f98b347b425e5ff17952d",
            "source": "https://github.com/eclipse-lmos/arc-view/archive/84002ae99f95bb4216acbd64d8f0757ff03d72de.zip",
            "status": "restricted"
        }
    ]
}