{
    "id": "npm/npmjs/@typescript-eslint/visitor-keys/7.0.2",
    "license": "BSD-2-Clause AND (BSD-2-Clause AND ISC AND MIT) AND MIT",
    "authority": "https://gitlab.eclipse.org/eclipsefdn/emo-team/iplab/-/issues/13310",
    "source": "https://github.com/typescript-eslint/typescript-eslint/archive/refs/tags/v7.0.2.zip",
    "status": "approved",
    "scans": [
        {
            "date": "February 20, 2024 at 10:38:27 a.m. GMT",
            "authority": "https://gitlab.eclipse.org/eclipsefdn/emo-team/iplab/-/issues/13310",
            "scancode-version": "31.2.1",
            "licenses-discovered": [
                "BSD-2-Clause",
                "BSD-2-Clause AND ISC AND MIT",
                "MIT"
            ],
            "copyrights": [
                "Copyright (c) 2016 unional",
                "Copyright (c) 2019 typescript-eslint and other contributors",
                "Copyright (c) 2021 typescript-eslint and other contributors",
                "Copyright (c) 2023 typescript-eslint and other contributors",
                "Copyright JS Foundation and other contributors, https://js.foundation",
                "Copyright Joyent, Inc. and other Node contributors"
            ],
            "file-count": 6982,
            "sha256": "9d0cc2fcc90eb1c5eb8ca2302dd4a18c6645675be1082e55a23d78188ad04e37",
            "source": "https://github.com/typescript-eslint/typescript-eslint/archive/refs/tags/v7.0.2.zip",
            "status": "approved"
        }
    ]
}