{
    "id": "npm/npmjs/@typescript-eslint/type-utils/5.60.0",
    "license": "MIT",
    "authority": "https://gitlab.eclipse.org/eclipsefdn/emo-team/iplab/-/issues/9135",
    "source": "https://registry.npmjs.org/@typescript-eslint/type-utils/-/type-utils-5.60.0.tgz",
    "status": "approved",
    "scans": [
        {
            "date": "June 22, 2023 at 3:12:03 a.m. GMT",
            "authority": "https://gitlab.eclipse.org/eclipsefdn/emo-team/iplab/-/issues/9135",
            "scancode-version": "31.2.1",
            "licenses-discovered": [
                "MIT"
            ],
            "copyrights": [
                "Copyright (c) 2021 typescript-eslint and other contributors"
            ],
            "file-count": 78,
            "sha256": "6955332c42fbc1f1a855193fbd2c2350e933e6c7aa7547e66724625d03217821",
            "source": "https://registry.npmjs.org/@typescript-eslint/type-utils/-/type-utils-5.60.0.tgz",
            "status": "approved"
        }
    ]
}