{
    "id": "npm/npmjs/@inquirer/core/10.1.2",
    "license": "MIT",
    "authority": "https://gitlab.eclipse.org/eclipsefdn/emo-team/iplab/-/issues/18891",
    "source": "https://github.com/SBoudrias/Inquirer.js/archive/refs/tags/inquirer@10.1.2.zip",
    "status": "approved",
    "scans": [
        {
            "date": "January 18, 2025 at 10:27:05 a.m. GMT",
            "authority": "https://gitlab.eclipse.org/eclipsefdn/emo-team/iplab/-/issues/18891",
            "scancode-version": "31.2.1",
            "licenses-discovered": [
                "MIT",
                "Apache-2.0",
                "ISC",
                "CC0-1.0 AND LicenseRef-scancode-proprietary-license AND MIT",
                "AGPL-3.0-only AND Apache-2.0 AND GPL-3.0-only AND LGPL-3.0-only AND LicenseRef-scancode-proprietary-license AND MIT AND MPL-2.0 AND Unlicense",
                "BSD-2-Clause",
                "Apache-2.0 AND MIT",
                "BSD-2-Clause AND MIT",
                "ISC AND MIT",
                "LicenseRef-scancode-free-unknown AND MIT",
                "BSD-2-Clause-Views",
                "Python-2.0",
                "CC-BY-4.0",
                "Artistic-2.0",
                "LicenseRef-scancode-proprietary-license",
                "JSON AND MIT",
                "BSD-3-Clause",
                "ISC AND JSON",
                "MIT-0",
                "BSD-2-Clause AND BSD-3-Clause AND MIT",
                "BSD-2-Clause AND BSD-3-Clause",
                "0BSD AND MIT",
                "CC-BY-SA-4.0",
                "CC-BY-SA-4.0 AND ISC",
                "BlueOak-1.0.0",
                "CC0-1.0 AND MIT",
                "BSD-3-Clause AND MIT",
                "Apache-2.0 AND BSD-2-Clause AND BSD-3-Clause",
                "Apache-2.0 AND BSD-3-Clause",
                "BSD-2-Clause AND JSON AND MIT",
                "BSD-2-Clause AND JSON",
                "Apache-2.0 AND BSD-2-Clause AND BSD-3-Clause AND ISC AND LicenseRef-scancode-mit-synopsys AND MIT",
                "0BSD AND Apache-2.0",
                "0BSD",
                "AGPL-1.0-only AND AGPL-3.0-or-later AND Apache-2.0 AND BSD-2-Clause AND BSD-3-Clause AND BSD-3-Clause-Clear AND GPL-1.0-only AND GPL-2.0-only AND GPL-3.0-or-later AND LGPL-2.0-only AND LGPL-2.1-only AND LGPL-3.0-or-later AND LicenseRef-scancode-agpl-2.0 AND LicenseRef-scancode-other-permissive AND MPL-1.0",
                "Classpath-exception-2.0 AND GPL-3.0-linking-exception AND GPL-3.0-only AND LLVM-exception AND LZMA-exception AND OCaml-LGPL-linking-exception AND Qt-GPL-exception-1.0 AND Qt-LGPL-exception-1.1 AND Swift-exception",
                "CC-BY-3.0",
                "CC-BY-3.0 AND JSON AND MIT",
                "AGPL-3.0-only AND AGPL-3.0-or-later AND APSL-1.0 AND APSL-1.1 AND Apache-1.1 AND Apache-2.0 AND BSD-2-Clause AND BSD-2-Clause-Views AND BSD-3-Clause AND BSD-3-Clause-Modification AND BSD-3-Clause-No-Military-License AND BSD-4-Clause AND BSD-4-Clause-Shortened AND BSD-4-Clause-UC AND CAL-1.0 AND CAL-1.0-Combined-Work-Exception AND CC-BY-3.0 AND CC-BY-SA-2.0 AND CC-BY-SA-4.0 AND CC0-1.0 AND CDDL-1.0 AND CDDL-1.1 AND CECILL-2.0 AND CECILL-2.1 AND CERN-OHL-1.1 AND CERN-OHL-1.2 AND CERN-OHL-P-2.0 AND CERN-OHL-S-2.0 AND CERN-OHL-W-2.0 AND CPOL-1.02 AND EFL-2.0 AND EPL-1.0 AND Frameworx-1.0 AND GFDL-1.1-invariants-only AND GFDL-1.1-invariants-or-later AND GFDL-1.1-no-invariants-only AND GFDL-1.1-no-invariants-or-later AND GFDL-1.2-invariants-only AND GFDL-1.2-invariants-or-later AND GFDL-1.2-no-invariants-only AND GFDL-1.2-no-invariants-or-later AND GFDL-1.3-invariants-only AND GFDL-1.3-invariants-or-later AND GFDL-1.3-no-invariants-only AND GFDL-1.3-no-invariants-or-later AND GPL-2.0-only AND HPND AND HPND-sell-variant AND HaskellReport AND IBM-pibs AND Interbase-1.0 AND LicenseRef-scancode-d-fsl-1.0-en AND LicenseRef-scancode-free-unknown AND LicenseRef-scancode-mulanpsl-1.0-en AND LicenseRef-scancode-mulanpsl-2.0-en AND Linux-man-pages-copyleft AND MS-PL AND MS-RL AND NAIST-2003 AND NCGL-UK-2.0 AND NGPL AND NIST-PD AND NIST-PD-fallback AND NTP-0 AND OFL-1.1-no-RFN AND OGC-1.0 AND OGDL-Taiwan-1.0 AND OGL-Canada-2.0 AND OGL-UK-1.0 AND OGL-UK-2.0 AND OGL-UK-3.0 AND PSF-2.0 AND Parity-6.0.0 AND Parity-7.0.0 AND PolyForm-Noncommercial-1.0.0 AND PolyForm-Small-Business-1.0.0 AND SSPL-1.0 AND Spencer-86 AND TAPR-OHL-1.0 AND TMate AND TU-Berlin-1.0 AND TU-Berlin-2.0 AND UCL-1.0 AND Zimbra-1.3 AND Zimbra-1.4 AND copyleft-next-0.3.0 AND copyleft-next-0.3.1 AND etalab-2.0 AND libselinux-1.0",
                "CC0-1.0",
                "BSD-3-Clause-Clear",
                "MIT OR CC0-1.0",
                "CC-BY-4.0 AND LicenseRef-scancode-khronos AND LicenseRef-scancode-unicode AND LicenseRef-scancode-unknown AND MIT AND W3C-20150513",
                "Apache-2.0 AND BSD-2-Clause",
                "Apache-2.0 AND BSD-2-Clause AND CC0-1.0 AND ISC AND MIT",
                "BSD-2-Clause AND ISC AND MIT",
                "Apache-2.0 AND BSD-3-Clause AND ISC AND MIT",
                "LicenseRef-scancode-mit-synopsys",
                "LicenseRef-scancode-markus-kuhn-license"
            ],
            "copyrights": [
                "(c) 1999 Entrust.net Limited1301 Entrust.net Certification",
                "(c) 2006 Entrust",
                "(c) 2007-2009 Steven Levithan",
                "(c) 2007-2009 Steven Levithan stevenlevithan.com",
                "(c) 2009 Entrust, Inc. - for",
                "(c) 2011 Gary Court",
                "(c) 2012 Entrust, Inc. - for",
                "(c) 2014-23 Lloyd Brookes (https://github.com/75lb) 75pound@gmail.com",
                "(c) 2015 Entrust, Inc. - for",
                "(c) 2018-present Yuxi",
                "(c) 2019 Denis Pushkarev",
                "(c) 2020 Andrea Giammarchi",
                "(c) 2020 by Philipp Dunkel, Ben Noordhuis, Elan Shankar, Paul Miller",
                "(c) 2020-present Andrea Giammarchi",
                "(c) 2021 Anthony Fu (https://github.com/antfu)",
                "(c) 2022 Anthony Fu (https://github.com/antfu)",
                "(c) 2024 Eduardo San Martin Morote",
                "(c) Ca (c)",
                "(c) EGOIST (https://github.com/egoist)",
                "(c) Ionica Bizau",
                "(c) James Kyle (https://thejameskyle.com)",
                "(c) James Talmage (https://github.com/jamestalmage)",
                "(c) Jared Wray",
                "(c) Javier Blanco (http://jbgutierrez.info)",
                "(c) Julien Fontanet (http://julien.isonoe.net)",
                "(c) Luke Edwards (https://lukeed.com)",
                "(c) Petka Antonov, John-David Dalton, Sindre Sorhus",
                "(c) Sam Verschueren (https://github.com/SamVerschueren)",
                "(c) Sindre Sorhus",
                "(c) Sindre Sorhus (http://sindresorhus.com)",
                "(c) Sindre Sorhus (http://sindresorhus.com), Dmirty Sobolev (https://github.com/dsblv)",
                "(c) Sindre Sorhus (https://sindresorhus.com)",
                "(c) Steve Mao",
                "(c) Steve Mao (https://github.com/stevemao)",
                "(c) Vadim Demedes (https://vadimdemedes.com)",
                "(c) b.value",
                "(c) by W3C",
                "(c) c nn c Co",
                "(c) extraPathPercentEncodeSet.has",
                "Copyright (c) 1991 - 1995, Stichting Mathematisch Centrum Amsterdam, The Netherlands",
                "Copyright (c) 1991-2017 Unicode, Inc.",
                "Copyright (c) 1995-2001 Corporation for National Research Initiatives",
                "Copyright (c) 1999-2001 Gregory P. Ward",
                "Copyright (c) 2001, 2002, 2003, 2004, 2005, 2006, 2007, 2008, 2009, 2010, 2011, 2012, 2013, 2014, 2015, 2016, 2017, 2018, 2019, 2020 Python Software Foundation",
                "Copyright (c) 2002, 2003 Python Software Foundation",
                "Copyright (c) 2004, 2006 The Linux Foundation and its contributors",
                "Copyright (c) 2004, John Gruber http://daringfireball.net",
                "Copyright (c) 2007-2014, Alexandru Marasteanu",
                "Copyright (c) 2008, Fair Oaks Labs, Inc.",
                "Copyright (c) 2009 Google Inc.",
                "Copyright (c) 2009 Thomas Robinson <280north.com>",
                "Copyright (c) 2009-2011, Mozilla Foundation and contributors",
                "Copyright (c) 2009-2015, Kevin Decker <kpdecker@gmail.com>",
                "Copyright (c) 2009-2022 Isaac Z. Schlueter and Contributors",
                "Copyright (c) 2009-2023 Isaac Z. Schlueter and Contributors",
                "Copyright (c) 2010 LearnBoost <dev@learnboost.com>",
                "Copyright (c) 2010 Sencha Inc.",
                "Copyright (c) 2010, Linden Research, Inc.",
                "Copyright (c) 2010-2012 Mikeal Rogers",
                "Copyright (c) 2010-2014, Christian Johansen, christian@cjohansen.no",
                "Copyright (c) 2010-2015 Linux Foundation and its Contributors",
                "Copyright (c) 2010-2016 Charlie Robbins, Jarrett Cruger & the Contributors",
                "Copyright (c) 2010-2018 Caolan McMahon",
                "Copyright (c) 2010-2020 Python Software Foundation",
                "Copyright (c) 2010-2020 Robert Kieffer and other contributors",
                "Copyright (c) 2010-2020 by Philipp Dunkel, Ben Noordhuis, Elan Shankar, Paul Miller",
                "Copyright (c) 2010-2023 Isaac Z. Schlueter and Contributors",
                "Copyright (c) 2011 -2014, Christopher Jeffrey",
                "Copyright (c) 2011 Alexander Shtuchkin",
                "Copyright (c) 2011 Debuggable Limited <felix@debuggable.com>",
                "Copyright (c) 2011 Dominic Tarr",
                "Copyright (c) 2011 Einar Otto Stangvik <einaros@gmail.com>",
                "Copyright (c) 2011 Google Inc.",
                "Copyright (c) 2011 Jake Luer <jake@alogicalparadox.com>",
                "Copyright (c) 2011 LearnBoost",
                "Copyright (c) 2011 TJ Holowaychuk",
                "Copyright (c) 2011 TJ Holowaychuk <tj@vision-media.ca>",
                "Copyright (c) 2011 Tim Koschutzki (tim@debuggable.com) Felix Geisendorfer (felix@debuggable.com)",
                "Copyright (c) 2011 Troy Goode <troygoode@gmail.com>",
                "Copyright (c) 2011 antimatter15",
                "Copyright (c) 2011-2012 Tim Caswell",
                "Copyright (c) 2011-2013 Jake Luer jake@alogicalparadox.com",
                "Copyright (c) 2011-2013, Christopher Jeffrey",
                "Copyright (c) 2011-2014 Jake Luer <jake@alogicalparadox.com>",
                "Copyright (c) 2011-2014 TJ Holowaychuk",
                "Copyright (c) 2011-2014, Christopher Jeffrey",
                "Copyright (c) 2011-2015 Paul Vorbach (http://paul.vorba.ch/) and contributors (https://github.com/pvorb/node-clone/graphs/contributors)",
                "Copyright (c) 2011-2015 Paul Vorbach <paul@vorba.ch>",
                "Copyright (c) 2011-2015 by Vitaly Puzrin",
                "Copyright (c) 2011-2016 Heather Arthur <fayearthur@gmail.com>",
                "Copyright (c) 2011-2016 Jake Luer <jake@alogicalparadox.com>",
                "Copyright (c) 2011-2016, Heather Arthur and Josh Junon",
                "Copyright (c) 2011-2017 JP Richardson",
                "Copyright (c) 2011-2017 JP Richardson (https://github.com/jprichardson)",
                "Copyright (c) 2011-2017 KARASZI Istvan <github@spam.raszi.hu>",
                "Copyright (c) 2011-2018, Christopher Jeffrey (https://github.com/chjj/)",
                "Copyright (c) 2011-2019 by Yehuda Katz",
                "Copyright (c) 2011-2022 Isaac Z. Schlueter, Ben Noordhuis, and Contributors",
                "Copyright (c) 2011-2022 Isaac Z. Schlueter, Ben Noordhuis, and Contributors https://github.com/isaacs/node-graceful-fs/blob/main/LICENSE On Windows",
                "Copyright (c) 2011-2022, Christopher Jeffrey",
                "Copyright (c) 2011-2023 Isaac Z. Schlueter and Contributors",
                "Copyright (c) 2011-2023 Isaac Z. Schlueter, Ben Noordhuis, and Contributors",
                "Copyright (c) 2011-2023, Christopher Jeffrey. (MIT Licensed) https://github.com/markedjs/marked",
                "Copyright (c) 2012 - 2015 fengmk2 <fengmk2@gmail.com>",
                "Copyright (c) 2012 Ariya Hidayat <ariya.hidayat@gmail.com>",
                "Copyright (c) 2012 Cloud9 IDE, Inc.",
                "Copyright (c) 2012 EditorConfig Team",
                "Copyright (c) 2012 Federico Romero",
                "Copyright (c) 2012 Felix Geisendorfer (felix@debuggable.com) and contributors",
                "Copyright (c) 2012 Google Inc.",
                "Copyright (c) 2012 Isaac Z. Schlueter",
                "Copyright (c) 2012 James Halliday",
                "Copyright (c) 2012 James Halliday <mail@substack.net>",
                "Copyright (c) 2012 Nathan Rajlich <nathan@tootallnate.net>",
                "Copyright (c) 2012 Raynos",
                "Copyright (c) 2012 The Chromium Authors",
                "Copyright (c) 2012 Tim Caswell",
                "Copyright (c) 2012 Vitaly Puzrin (https://github.com/puzrin)",
                "Copyright (c) 2012 by Jun Woong",
                "Copyright (c) 2012 by Vitaly Puzrin",
                "Copyright (c) 2012, 2013 Thorsten Lorenz <thlorenz@gmx.de>",
                "Copyright (c) 2012, Joshua Bell",
                "Copyright (c) 2012-2013 TJ Holowaychuk",
                "Copyright (c) 2012-2013 Yusuke Suzuki (twitter Constellation) and other contributors",
                "Copyright (c) 2012-2013 Yusuke Suzuki <utatane.tea@gmail.com>",
                "Copyright (c) 2012-2014 Andris Reinman",
                "Copyright (c) 2012-2014 Federico Romero",
                "Copyright (c) 2012-2014 Isaac Z. Schlueter",
                "Copyright (c) 2012-2014 Jake Luer <jake@alogicalparadox.com>",
                "Copyright (c) 2012-2014 Raynos",
                "Copyright (c) 2012-2014 Yusuke Suzuki <utatane.tea@gmail.com>",
                "Copyright (c) 2012-2014 by Woong Jun and Tim Oxley",
                "Copyright (c) 2012-2014 by various contributors",
                "Copyright (c) 2012-2015 Lauri Rooden <lauri@rooden.ee>",
                "Copyright (c) 2012-2015 Sakthipriyan Vairamani <thechargingvolcano@gmail.com>",
                "Copyright (c) 2012-2015, JP Richardson <jprichardson@gmail.com>",
                "Copyright (c) 2012-2016 Jake Luer <jake@alogicalparadox.com>",
                "Copyright (c) 2012-2016 Yusuke Suzuki (http://github.com/Constellation) (twitter Constellation (http://twitter.com/Constellation)) and other contributors",
                "Copyright (c) 2012-2017 by Ingvar Stepanyan",
                "Copyright (c) 2012-2018 Aseem Kishore, and others",
                "Copyright (c) 2012-2019 JS Foundation and other contributors",
                "Copyright (c) 2012-2019 Paul Miller (https://paulmillr.com), Elan Shanker",
                "Copyright (c) 2012-2019 Thorsten Lorenz, Paul Miller (https://paulmillr.com)",
                "Copyright (c) 2012-2020 by various contributors",
                "Copyright (c) 2012-2022 by various contributors",
                "Copyright (c) 2013 Alex Seville <hi@alexanderseville.com>",
                "Copyright (c) 2013 Andrey Sitnik <andrey@sitnik.ru>",
                "Copyright (c) 2013 Arnout Kazemier and contributors",
                "Copyright (c) 2013 Blake Embrey (hello@blakeembrey.com)",
                "Copyright (c) 2013 Dominic Tarr",
                "Copyright (c) 2013 Gary Court, Jens Taylor",
                "Copyright (c) 2013 Google Inc.",
                "Copyright (c) 2013 Jake Luer <jake@alogicalparadox.com>",
                "Copyright (c) 2013 Jake Luer <jake@alogicalparadox.com> (http://alogicalparadox.com)",
                "Copyright (c) 2013 Jake Luer jake@qualiancy.com (http://qualiancy.com)",
                "Copyright (c) 2013 James Halliday",
                "Copyright (c) 2013 James Halliday (mail@substack.net)",
                "Copyright (c) 2013 Jonathan Ong",
                "Copyright (c) 2013 Jonathan Ong <me@jongleberry.com>",
                "Copyright (c) 2013 Josh Glazebrook",
                "Copyright (c) 2013 Julian Gruber <julian@juliangruber.com>",
                "Copyright (c) 2013 Kael Zhang <i@kael.me> , contributors http://kael.me",
                "Copyright (c) 2013 Liucw",
                "Copyright (c) 2013 Max Ogden",
                "Copyright (c) 2013 Meryn Stol",
                "Copyright (c) 2013 Mikola Lysenko",
                "Copyright (c) 2013 Nathan Rajlich <nathan@tootallnate.net>",
                "Copyright (c) 2013 Ramesh Nair (http://www.hiddentao.com/)",
                "Copyright (c) 2013 Raynos",
                "Copyright (c) 2013 Tim Oxley",
                "Copyright (c) 2013 Troy Goode <troygoode@gmail.com>",
                "Copyright (c) 2013 Yusuke Suzuki (http://github.com/Constellation) (twitter Constellation (http://twitter.com/Constellation)) and other contributors",
                "Copyright (c) 2013 Yusuke Suzuki <utatane.tea@gmail.com>",
                "Copyright (c) 2013 jake luer <jake@alogicalparadox.com>",
                "Copyright (c) 2013, Joel Feenstra",
                "Copyright (c) 2013-2014 Yusuke Suzuki <utatane.tea@gmail.com>",
                "Copyright (c) 2013-2017 Jared Hanson",
                "Copyright (c) 2013-2017 Josh Glazebrook",
                "Copyright (c) 2013-2019 Ivan Nikulin (ifaaan@gmail.com, https://github.com/inikulin)",
                "Copyright (c) 2013-2019 bl contributors",
                "Copyright (c) 2013-present, Facebook, Inc.",
                "Copyright (c) 2014",
                "Copyright (c) 2014 Alex Bell",
                "Copyright (c) 2014 Arnout Kazemier",
                "Copyright (c) 2014 Blake Embrey (hello@blakeembrey.com)",
                "Copyright (c) 2014 Dave Justice",
                "Copyright (c) 2014 Douglas Christopher Wilson",
                "Copyright (c) 2014 Douglas Christopher Wilson <doug@somethingdoug.com>",
                "Copyright (c) 2014 Evan Wallace",
                "Copyright (c) 2014 Federico Romero",
                "Copyright (c) 2014 Google Inc.",
                "Copyright (c) 2014 IndigoUnited",
                "Copyright (c) 2014 Ivan Nikulin <ifaaan@gmail.com>",
                "Copyright (c) 2014 James Talmage <james.talmage@jrtechnical.com>",
                "Copyright (c) 2014 Jameson Little",
                "Copyright (c) 2014 Jonathan Ong",
                "Copyright (c) 2014 Jonathan Ong <me@jongleberry.com>",
                "Copyright (c) 2014 Jonathan Ong me@jongleberry.com",
                "Copyright (c) 2014 KARASZI Istvan",
                "Copyright (c) 2014 Mathias Buus",
                "Copyright (c) 2014 Maxime Thirouin, Jason Campbell & Kevin Martensson",
                "Copyright (c) 2014 Mu-An Chiou",
                "Copyright (c) 2014 Nathan Rajlich <nathan@tootallnate.net>",
                "Copyright (c) 2014 Permission",
                "Copyright (c) 2014 Petka Antonov 2015 Sindre Sorhus",
                "Copyright (c) 2014 Simon Boudrias",
                "Copyright (c) 2014 Stefan Thomas",
                "Copyright (c) 2014 Thiago de Arruda <tpadilha84@gmail.com>",
                "Copyright (c) 2014 Yehuda Katz and contributors",
                "Copyright (c) 2014 Yusuke Suzuki (https://github.com/Constellation) (twitter Constellation (https://twitter.com/Constellation)) and other contributors",
                "Copyright (c) 2014 Yusuke Suzuki <utatane.tea@gmail.com>",
                "Copyright (c) 2014, 2015, 2016, 2017, 2018 Simon Lydell",
                "Copyright (c) 2014, 2015, 2016, 2017, 2018, 2019, 2020, 2021, 2022, 2023, 2024 Simon Lydell",
                "Copyright (c) 2014, Domenic Denicola",
                "Copyright (c) 2014, Hugh Kennedy",
                "Copyright (c) 2014, Rebecca Turner <me@re-becca.org>",
                "Copyright (c) 2014-2015 Douglas Christopher Wilson",
                "Copyright (c) 2014-2016 Douglas Christopher Wilson",
                "Copyright (c) 2014-2016 Jonathan Ong me@jongleberry.com and Contributors",
                "Copyright (c) 2014-2016, Jon Schlinkert",
                "Copyright (c) 2014-2017 Douglas Christopher Wilson",
                "Copyright (c) 2014-2017 Douglas Christopher Wilson <doug@somethingdoug.com>",
                "Copyright (c) 2014-2017 TJ Holowaychuk <tj@vision-media.ca>",
                "Copyright (c) 2014-2017, Jon Schlinkert",
                "Copyright (c) 2014-2018 Douglas Christopher Wilson",
                "Copyright (c) 2014-2018 Suguru Motegi",
                "Copyright (c) 2014-2018, Jon Schlinkert",
                "Copyright (c) 2014-2018, Matteo Collina <hello@matteocollina.com>",
                "Copyright (c) 2014-2020 Angelos Pikoulas (agelos.pikoulas@gmail.com)",
                "Copyright (c) 2014-2020 Teambition",
                "Copyright (c) 2014-2023 Daniel Bugl",
                "Copyright (c) 2014-2023, Jon Schlinkert",
                "Copyright (c) 2014-2024 Denis Pushkarev",
                "Copyright (c) 2014-23 Lloyd Brookes <75pound@gmail.com>",
                "Copyright (c) 2014-present Matt Zabriskie & Collaborators",
                "Copyright (c) 2014-present Sebastian McKenzie and other contributors",
                "Copyright (c) 2014-present, Jon Schlinkert",
                "Copyright (c) 2015 Alexey Litvinov",
                "Copyright (c) 2015 Andreas Lubbe",
                "Copyright (c) 2015 Brian Donovan",
                "Copyright (c) 2015 Calvin Metcalf",
                "Copyright (c) 2015 David Clark",
                "Copyright (c) 2015 Dmitry Ivanov",
                "Copyright (c) 2015 Douglas Christopher Wilson",
                "Copyright (c) 2015 Douglas Christopher Wilson <doug@somethingdoug.com>",
                "Copyright (c) 2015 Elijah Insua",
                "Copyright (c) 2015 JD Ballard",
                "Copyright (c) 2015 Javier Blanco",
                "Copyright (c) 2015 Julian Gruber <julian@juliangruber.com>",
                "Copyright (c) 2015 Kevin Kwok",
                "Copyright (c) 2015 Kyle E. Mitchell",
                "Copyright (c) 2015 Matteo Collina",
                "Copyright (c) 2015 Rich Harris",
                "Copyright (c) 2015 Steve Mao",
                "Copyright (c) 2015 Steve Mao <maochenyan@gmail.com> (https://github.com/stevemao)",
                "Copyright (c) 2015 TJ Holowaychuk <tj@vision-media.ca>",
                "Copyright (c) 2015 Tiancheng Timothy Gu",
                "Copyright (c) 2015 Tilde, Inc.",
                "Copyright (c) 2015 Titus Wormer",
                "Copyright (c) 2015 Titus Wormer <tituswormer@gmail.com>",
                "Copyright (c) 2015 Toru Nagashima",
                "Copyright (c) 2015 Unshift.io, Arnout Kazemier",
                "Copyright (c) 2015 Yusuke Suzuki <utatane.tea@gmail.com>",
                "Copyright (c) 2015 antimatter15",
                "Copyright (c) 2015, 2019 Elan Shanker",
                "Copyright (c) 2015, 2019 Elan Shanker, 2021 Blaine Bublitz <blaine.bublitz@gmail.com> , Eric Schoffstall <yo@contra.io> and other contributors",
                "Copyright (c) 2015, Contributors",
                "Copyright (c) 2015, David Bonnet <david@bonnet.cc>",
                "Copyright (c) 2015, Glen Maddern",
                "Copyright (c) 2015, Ilya Radchenko <ilya@burstcreations.com>",
                "Copyright (c) 2015, Ilya Radchenko <knownasilya@gmail.com>",
                "Copyright (c) 2015, Rebecca Turner",
                "Copyright (c) 2015, Rebecca Turner <me@re-becca.org>",
                "Copyright (c) 2015, Scott Motte",
                "Copyright (c) 2015, npm, Inc",
                "Copyright (c) 2015-20 these people (https://github.com/Rich-Harris/estree-walker/graphs/contributors)",
                "Copyright (c) 2015-2016 Sebastian Mayr",
                "Copyright (c) 2015-2017 Charles Samborski",
                "Copyright (c) 2015-2017 Evgeny Poberezkin",
                "Copyright (c) 2015-2018 Google, Inc., Netflix, Inc., Microsoft Corp. and contributors",
                "Copyright (c) 2015-2020, Matteo Collina <matteo.collina@gmail.com>",
                "Copyright (c) 2015-2022 Douglas Christopher Wilson",
                "Copyright (c) 2015-2022 Douglas Christopher Wilson <doug@somethingdoug.com>",
                "Copyright (c) 2015-2023 Benjamin Coe, Isaac Z. Schlueter, and Contributors",
                "Copyright (c) 2015-2023 Isaac Z. Schlueter and Contributors",
                "Copyright (c) 2015-22 Ionica Bizau <bizauionica@gmail.com> (http://ionicabizau.net)",
                "Copyright (c) 2015-22 Ionica Bizau <bizauionica@gmail.com> (https://ionicabizau.net)",
                "Copyright (c) 2015-24 Ionica Bizau <bizauionica@gmail.com> (https://ionicabizau.net)",
                "Copyright (c) 2015-present Lerna",
                "Copyright (c) 2015-present, Brian Woodward",
                "Copyright (c) 2015-present, Facebook, Inc.",
                "Copyright (c) 2015-present, Facebook, Inc. https://github.com/facebook/create-react-app/blob/master/LICENSE",
                "Copyright (c) 2015-present, Jon Schlinkert",
                "Copyright (c) 2016 Aleksandr Komlev",
                "Copyright (c) 2016 Alex Indigo",
                "Copyright (c) 2016 Andrey Okonetchnikov",
                "Copyright (c) 2016 Ben Noordhuis <info@bnoordhuis.nl>",
                "Copyright (c) 2016 David Frank",
                "Copyright (c) 2016 Denys Kniazevych <webschik@gmail.com>",
                "Copyright (c) 2016 Douglas Christopher Wilson",
                "Copyright (c) 2016 Douglas Christopher Wilson <doug@somethingdoug.com>",
                "Copyright (c) 2016 Jonas Kello",
                "Copyright (c) 2016 Joshua Holbrook",
                "Copyright (c) 2016 Kevin Gravier",
                "Copyright (c) 2016 Luigi Pinca and contributors",
                "Copyright (c) 2016 Mathias Buus",
                "Copyright (c) 2016 Pat Sissons <patricksissons@gmail.com>",
                "Copyright (c) 2016 Thomas Watson Steen",
                "Copyright (c) 2016 Titus Wormer <tituswormer@gmail.com>",
                "Copyright (c) 2016 Zeit, Inc.",
                "Copyright (c) 2016 angus croll",
                "Copyright (c) 2016, 2018 Linus Unneback",
                "Copyright (c) 2016, Contributors",
                "Copyright (c) 2016, Jon Schlinkert (https://github.com/jonschlinkert)",
                "Copyright (c) 2016, Mark Wubben",
                "Copyright (c) 2016, Rebecca Turner <me@re-becca.org>",
                "Copyright (c) 2016, Scott Motte",
                "Copyright (c) 2016-2017 Thomas Watson Steen",
                "Copyright (c) 2016-2018 Kevin Gravier",
                "Copyright (c) 2016-2018 Rob Wu <rob@robwu.nl>",
                "Copyright (c) 2016-2021 Thomas Watson Steen",
                "Copyright (c) 2016-2022 Isaac Z. Schlueter and Contributors",
                "Copyright (c) 2016-2023 Thomas Watson Steen",
                "Copyright (c) 2016-present, Jon Schlinkert",
                "Copyright (c) 2017 Andres Suarez and Teddy Katz",
                "Copyright (c) 2017 Andrew Powell <andrew@shellscape.org>",
                "Copyright (c) 2017 Chai.js Assertion Library",
                "Copyright (c) 2017 Dmitry Soshnikov",
                "Copyright (c) 2017 Evgeny Poberezkin",
                "Copyright (c) 2017 Larry Bahr",
                "Copyright (c) 2017 Martin Munoz and contributors",
                "Copyright (c) 2017 Mikael Brevik",
                "Copyright (c) 2017 Permission",
                "Copyright (c) 2017 Sergey Rubanov (https://github.com/chicoxyzzy)",
                "Copyright (c) 2017 Titus Wormer <tituswormer@gmail.com>",
                "Copyright (c) 2017 these people (https://github.com/rollup/rollup/graphs/contributors)",
                "Copyright (c) 2017, 2018, 2019, 2020, 2021, 2022, 2023 Simon Lydell and contributors",
                "Copyright (c) 2017, Contributors",
                "Copyright (c) 2017, Emil Bay <github@tixz.dk>",
                "Copyright (c) 2017, Jon Schlinkert (https://github.com/jonschlinkert)",
                "Copyright (c) 2017, Rebecca Turner <me@re-becca.org>",
                "Copyright (c) 2017, Ryan Zimmerman <opensrc@ryanzim.com>",
                "Copyright (c) 2017-2018 Octokit",
                "Copyright (c) 2017-2019 Zeit, Inc.",
                "Copyright (c) 2017-2019 by ZEIT, Inc.",
                "Copyright (c) 2017-2022 npm, Inc., Isaac Z. Schlueter, and Contributors",
                "Copyright (c) 2017-2023 Haydn Paterson",
                "Copyright (c) 2017-2023 npm, Inc., Isaac Z. Schlueter, and Contributors",
                "Copyright (c) 2017-2024 Narwhal Technologies Inc.",
                "Copyright (c) 2017-present Dmitry Soshnikov <dmitry.soshnikov@gmail.com>",
                "Copyright (c) 2017-present by Andrea Giammarchi",
                "Copyright (c) 2017-present, Jon Schlinkert",
                "Copyright (c) 2017-present, Jon Schlinkert (https://github.com/jonschlinkert)",
                "Copyright (c) 2017-present, Yuxi",
                "Copyright (c) 2018 Dmitry Shirokov",
                "Copyright (c) 2018 Made With MOXY Lda",
                "Copyright (c) 2018 Mathias Buus",
                "Copyright (c) 2018 Nikita Skovoroda <chalkerx@gmail.com>",
                "Copyright (c) 2018 Octokit",
                "Copyright (c) 2018 Simone Primarosa",
                "Copyright (c) 2018 Terkel Gjervig Nielsen",
                "Copyright (c) 2018 The Khronos Group Inc.",
                "Copyright (c) 2018 Toru Nagashima",
                "Copyright (c) 2018 Trevor Brindle",
                "Copyright (c) 2018 WHATWG",
                "Copyright (c) 2018+, MarkedJS (https://github.com/markedjs/)",
                "Copyright (c) 2018, Gregor Martynus (https://github.com/gr2m)",
                "Copyright (c) 2018, Jon Schlinkert (https://github.com/jonschlinkert)",
                "Copyright (c) 2018, Sinon.JS",
                "Copyright (c) 2018-2020, Andrea Giammarchi",
                "Copyright (c) 2018-2021 Josh Junon",
                "Copyright (c) 2018-2021, Andrea Giammarchi",
                "Copyright (c) 2018-2022 Guy Bedford",
                "Copyright (c) 2018-present, Jon Schlinkert (https://github.com/jonschlinkert)",
                "Copyright (c) 2019 Andres Suarez",
                "Copyright (c) 2019 CFWare, LLC",
                "Copyright (c) 2019 Elan Shanker, Paul Miller (https://paulmillr.com)",
                "Copyright (c) 2019 Octokit",
                "Copyright (c) 2019 Rich Harris",
                "Copyright (c) 2019 Richie Bendall",
                "Copyright (c) 2019 RollupJS",
                "Copyright (c) 2019 Sindre Sorhus <sindresorhus@gmail.com> (https://sindresorhus.com), Paul Miller (https://paulmillr.com)",
                "Copyright (c) 2019 and later, KFlash and others",
                "Copyright (c) 2019 typescript-eslint and other contributors",
                "Copyright (c) 2019, Brian Woodward (https://github.com/doowb)",
                "Copyright (c) 2019, Jon Schlinkert (https://github.com/jonschlinkert)",
                "Copyright (c) 2019-2023 Isaac Z. Schlueter and Contributors",
                "Copyright (c) 2019-present, Yuxi",
                "Copyright (c) 2020 Angelos Pikoulas <agelos.pikoulas@gmail.com>",
                "Copyright (c) 2020 Evan Wallace",
                "Copyright (c) 2020 James M Snell and the Piscina contributors",
                "Copyright (c) 2020 Mael Nison <nison.mael@gmail.com>",
                "Copyright (c) 2020 Nathan Rajlich",
                "Copyright (c) 2020 Node.js contributors",
                "Copyright (c) 2020 Octokit",
                "Copyright (c) 2020 The Preact Authors",
                "Copyright (c) 2020 Titus Wormer <tituswormer@gmail.com>",
                "Copyright (c) 2020 Vercel, Inc.",
                "Copyright (c) 2020 argparse.js authors",
                "Copyright (c) 2020, Jon Schlinkert (https://github.com/jonschlinkert)",
                "Copyright (c) 2020-present, Yuxi",
                "Copyright (c) 2021 Alexey Raspopov, Kostiantyn Denysov, Anton Verinov",
                "Copyright (c) 2021 Anthony Fu <https://github.com/antfu>",
                "Copyright (c) 2021 Titus Wormer",
                "Copyright (c) 2021 UnTS",
                "Copyright (c) 2021 typescript-eslint and other contributors",
                "Copyright (c) 2021 typicode",
                "Copyright (c) 2021-Present Vitest Team",
                "Copyright (c) 2021-present dominikg and contributors (https://github.com/dominikg/tsconfck/graphs/contributors)",
                "Copyright (c) 2022 Anthony Fu <https://github.com/antfu>",
                "Copyright (c) 2022 Anton Kastritskiy",
                "Copyright (c) 2022 GitHub and the TUF Contributors",
                "Copyright (c) 2022 Inspect JS",
                "Copyright (c) 2022 Simon Boudrias",
                "Copyright (c) 2022 Simon Boudrias (twitter vaxilart (https://twitter.com/Vaxilart))",
                "Copyright (c) 2022 Sindre Sorhus",
                "Copyright (c) 2022 Tinylibs",
                "Copyright (c) 2023 Arjun Barrett",
                "Copyright (c) 2023 Simon Boudrias",
                "Copyright (c) 2023 Simon Boudrias (twitter vaxilart (https://twitter.com/Vaxilart))",
                "Copyright (c) 2023 Yosuke Ota",
                "Copyright (c) 2023, Jon Schlinkert (https://github.com/jonschlinkert)",
                "Copyright (c) 2023-present, sapphi-red",
                "Copyright (c) 2024 Matt Zabriskie and contributors",
                "Copyright (c) 2024 Simon Boudrias (twitter vaxilart (https://twitter.com/Vaxilart))",
                "Copyright (c) 2024 Vercel, Inc",
                "Copyright (c) 2024 npm",
                "Copyright (c) Andrew Powell <andrew@shellscape.org>",
                "Copyright (c) Ben Briggs <beneb.info@gmail.com> (http://beneb.info)",
                "Copyright (c) Bogdan Chadkin <trysound@yandex.ru>",
                "Copyright (c) Cenk Kilic <cenk@kilic.dev> (https://srcs.kilic.dev), Sam Verschueren <sam.verschueren@gmail.com>",
                "Copyright (c) DABH (https://github.com/DABH)",
                "Copyright (c) DC",
                "Copyright (c) Denis Malinochkin",
                "Copyright (c) Donald Stufft and individual contributors",
                "Copyright (c) EGOIST",
                "Copyright (c) Facebook, Inc. and its affiliates",
                "Copyright (c) Felix Bohm",
                "Copyright (c) Feross Aboukhadijeh",
                "Copyright (c) Feross Aboukhadijeh (http://feross.org)",
                "Copyright (c) Feross Aboukhadijeh (http://feross.org), and other contributors",
                "Copyright (c) Feross Aboukhadijeh (https://feross.org)",
                "Copyright (c) Feross Aboukhadijeh, and other contributors",
                "Copyright (c) George Zahariev",
                "Copyright (c) GitHub, Inc.",
                "Copyright (c) GraphQL Contributors",
                "Copyright (c) Gregor Martynus and contributors",
                "Copyright (c) Hiroki Osame <hiroki.osame@gmail.com>",
                "Copyright (c) Ika <ikatyang@gmail.com> (https://github.com/ikatyang)",
                "Copyright (c) Isaac Z. Schlueter",
                "Copyright (c) Isaac Z. Schlueter and Contributors",
                "Copyright (c) Isaac Z. Schlueter, Kat Marchan, npm, Inc., and Contributors",
                "Copyright (c) James Long and contributors",
                "Copyright (c) James Talmage <james@talmage.io>",
                "Copyright (c) James Talmage <james@talmage.io> (https://github.com/jamestalmage)",
                "Copyright (c) Jordan Harband and contributors",
                "Copyright (c) Jorge Bucaran <https://jorgebucaran.com>",
                "Copyright (c) Julian Viereck and Contributors",
                "Copyright (c) Kevin Martensson <kevinmartensson@gmail.com>",
                "Copyright (c) Luke Edwards <luke.edwards05@gmail.com> (https://lukeed.com)",
                "Copyright (c) Luke Edwards <luke.edwards05@gmail.com> (lukeed.com)",
                "Copyright (c) Marak Squires",
                "Copyright (c) Meryn Stol 'Author",
                "Copyright (c) Meta Platforms, Inc. and affiliates",
                "Copyright (c) Microsoft",
                "Copyright (c) Microsoft Corporation",
                "Copyright (c) Open JS Foundation",
                "Copyright (c) Paul Johnston 1999 - 2009 Other contributors Greg Holt, Andrew Kepert, Ydnar, Lostinet",
                "Copyright (c) Paul Miller (https://paulmillr.com)",
                "Copyright (c) Petka Antonov Benjamin Gruenbaum",
                "Copyright (c) Pooya Parsa <pooya@pi0.io>",
                "Copyright (c) Pooya Parsa <pooya@pi0.io> and Anthony Fu <https://github.com/antfu>",
                "Copyright (c) Robert Kowalski and Isaac Z. Schlueter 'Authors",
                "Copyright (c) Rod Vagg",
                "Copyright (c) Rod Vagg rvagg (https://twitter.com/rvagg) and additional contributors",
                "Copyright (c) Roy Riojas & Jared Wray",
                "Copyright (c) Roy Riojas and Jared Wray",
                "Copyright (c) Ryan Graham <ryan@strongloop.com> 2014,2018",
                "Copyright (c) Sam Verschueren <sam.verschueren@gmail.com>",
                "Copyright (c) Sindre Sorhus <sindresorhus@gmail.com>",
                "Copyright (c) Sindre Sorhus <sindresorhus@gmail.com> (https://sindresorhus.com)",
                "Copyright (c) Sindre Sorhus <sindresorhus@gmail.com> (sindresorhus.com)",
                "Copyright (c) Stephen Sugden <me@stephensugden.com> (stephensugden.com)",
                "Copyright (c) Steve Mao (https://github.com/stevemao)",
                "Copyright (c) Vadim Demedes <vdemedes@gmail.com> (vadimdemedes.com)",
                "Copyright (c) YEAR W3C(r) (MIT, ERCIM, Keio, Beihang). Disclaimers",
                "Copyright (c) conventional-changelog team (https://github.com/conventional-changelog)",
                "Copyright (c) jQuery Foundation, Inc. and Contributors",
                "Copyright (c) node-modules and other contributors",
                "Copyright (c) npm, Inc.",
                "Copyright (c) npm, Inc. and Contributors",
                "Copyright 1995-2017 Jean-loup Gailly and Mark Adler",
                "Copyright 1995-2017 Mark Adler",
                "Copyright 2006 Google Inc. http://code.google.com/p/google-diff-match-patch",
                "Copyright 2006, Jeremy White <jwhite@codeweavers.com>",
                "Copyright 2006, Kevin Krammer <kevin.krammer@gmx.at>",
                "Copyright 2008 Fair Oaks Labs, Inc.",
                "Copyright 2009-2010, Fathi Boudra <fabo@freedesktop.org>",
                "Copyright 2009-2010, Rex Dieter <rdieter@fedoraproject.org>",
                "Copyright 2009-2011 Mozilla Foundation and contributors",
                "Copyright 2010 James Halliday (mail@substack.net)",
                "Copyright 2011 Gary Court",
                "Copyright 2011 Mozilla Foundation and contributors",
                "Copyright 2011 The Closure Compiler Authors",
                "Copyright 2011, Sebastian Tschan https://blueimp.net",
                "Copyright 2012 (c) Mihai Bazon <mihai.bazon@gmail.com>",
                "Copyright 2012 Thorsten Lorenz",
                "Copyright 2012 the V8 project authors",
                "Copyright 2012-2015 Acorn",
                "Copyright 2012-2015 Yahoo! Inc.",
                "Copyright 2012-2015, Yahoo Inc.",
                "Copyright 2012-2016, JP Richardson <jprichardson@gmail.com>",
                "Copyright 2012-2019 (c) Mihai Bazon <mihai.bazon@gmail.com>",
                "Copyright 2013 Andrey Sitnik <andrey@sitnik.ru>",
                "Copyright 2013 Google Inc.",
                "Copyright 2013 The Chromium Authors",
                "Copyright 2013 Thorsten Lorenz",
                "Copyright 2014 Andrey Sitnik <andrey@sitnik.ru> and other contributors",
                "Copyright 2014 Anthony McCormick",
                "Copyright 2014 Contributors (ben@npmjs.com)",
                "Copyright 2014 Google Inc.",
                "Copyright 2014 Julien Fontanet",
                "Copyright 2014 Mozilla Foundation and contributors",
                "Copyright 2014, 2015, 2016, 2017, 2018 Simon Lydell",
                "Copyright 2014, 2015, 2016, 2017, 2018, 2019, 2020, 2021, 2022, 2023 Simon Lydell",
                "Copyright 2014,2018 Ryan Graham <ryan@strongloop.com>",
                "Copyright 2014-2015 Sebastian McKenzie <sebmck@gmail.com>",
                "Copyright 2014-2015 various",
                "Copyright 2014-present Olivier Lalonde <olalonde@gmail.com> , James Talmage <james@talmage.io> , Ruben Verborgh",
                "Copyright 2015 Glen Maddern",
                "Copyright 2015 Mark Dalgleish <mark.john.dalgleish@gmail.com>",
                "Copyright 2015 Yahoo! Inc.",
                "Copyright 2015, Yahoo Inc.",
                "Copyright 2015-present Alexander Madyankin <alexander@madyankin.name>",
                "Copyright 2016 Bogdan Chadkin <trysound@yandex.ru>",
                "Copyright 2016-2018 Kornel Lesinski",
                "Copyright 2017 - Refael Ackermann",
                "Copyright 2017 Andrey Sitnik <andrey@sitnik.ru>",
                "Copyright 2017 Kat Marchan",
                "Copyright 2017-2022 (c) npm, Inc.",
                "Copyright 2018 Eemeli Aro <eemeli@gmail.com>",
                "Copyright 2018 Glen Maddern",
                "Copyright 2018 Gregor Martynus and other contributors",
                "Copyright 2018 Kilian Valkhof",
                "Copyright 2018 Rich Harris",
                "Copyright 2018 Stefan Penner",
                "Copyright 2018 The diff-match-patch",
                "Copyright 2018, Microsoft",
                "Copyright 2019 David Mark Clements <david.mark.clements@gmail.com>",
                "Copyright 2019 Justin Ridgewell <jridgewell@google.com>",
                "Copyright 2019 ehmicky <ehmicky@gmail.com>",
                "Copyright 2020 Filament Anomalous Technologies",
                "Copyright 2020 Gregor Martynus",
                "Copyright 2021 (c) npm, Inc.",
                "Copyright 2022 Andrey Sitnik <andrey@sitnik.ru> and other contributors",
                "Copyright 2022 Justin Ridgewell <jridgewell@google.com>",
                "Copyright 2022 Justin Ridgewell <justin@ridgewell.name>",
                "Copyright 2022 The Sigstore Authors",
                "Copyright 2022 ehmicky <ehmicky@gmail.com>",
                "Copyright 2023 Andrew Branch",
                "Copyright 2023 The Sigstore Authors",
                "Copyright Caolan McMahon",
                "Copyright Eemeli Aro <eemeli@gmail.com>",
                "Copyright Fedor Indutny, 2012",
                "Copyright GitHub Inc.",
                "Copyright Google Inc.",
                "Copyright IBM Corp. 2014,2018",
                "Copyright Isaac Z.",
                "Copyright Isaac Z. Schlueter",
                "Copyright Isaac Z. Schlueter and Contributors",
                "Copyright JS Foundation and other contributors",
                "Copyright JS Foundation and other contributors, https://js.foundation",
                "Copyright James Halliday (mail@substack.net) and Isaac Z. Schlueter (i@izs.me)",
                "Copyright Jeremy Ashkenas, DocumentCloud and Investigative Reporters & Editors",
                "Copyright Joyent, Inc. and other Node contributors",
                "Copyright Mathias Bynens <http://mathiasbynens.be/>",
                "Copyright Mathias Bynens <https://mathiasbynens.be/>",
                "Copyright Michael Ciniawsky <michael.ciniawsky@gmail.com>",
                "Copyright Node.js contributors",
                "Copyright OpenJS Foundation and other contributors <https://openjsf.org/>",
                "Copyright OpenJS Foundation and other contributors, <www.openjsf.org>",
                "Copyright jQuery Foundation and other contributors <https://jquery.org/>",
                "Copyright npm, Inc",
                "Copyright npm, Inc.",
                "Copyright spdx-correct.js contributors",
                "copyright (c) 2018 Denis Pushkarev",
                "copyright (c) 2019 Denis Pushkarev",
                "copyright 2014 s",
                "copyright Jeremy Ashkenas, DocumentCloud and Investigative Reporters & Editors <http://underscorejs.org/>"
            ],
            "file-count": 19728,
            "sha256": "1591055878528b696d6f611f0050e7de33ce0bc0af27bfbf654c875fd0acd297",
            "source": "https://github.com/SBoudrias/Inquirer.js/archive/refs/tags/inquirer@10.1.2.zip",
            "status": "restricted"
        }
    ]
}