{
    "id": "project/ecd.opensmartclide/eclipse-opensmartclide/smartclide-deployment-extension/e64728f4bf5ddcf4a6ab65cf684394ab3c2575f0",
    "license": "MIT",
    "authority": "https://gitlab.eclipse.org/eclipsefdn/emo-team/iplab/-/issues/6883",
    "source": "https://github.com/eclipse-opensmartclide/smartclide-deployment-extension/archive/e64728f4bf5ddcf4a6ab65cf684394ab3c2575f0.zip",
    "status": "approved",
    "scans": [
        {
            "date": "January 30, 2023 at 10:27:35 p.m. GMT",
            "authority": "https://gitlab.eclipse.org/eclipsefdn/emo-team/iplab/-/issues/6883",
            "scancode-version": "31.2.1",
            "licenses-discovered": [
                "MIT"
            ],
            "copyrights": [
            ],
            "file-count": 31,
            "sha256": "f6f2ad57c34a9bfca5cc0888f4280ce84400ff4677ba93858743c4e75a29c90b",
            "source": "https://github.com/eclipse-opensmartclide/smartclide-deployment-extension/archive/e64728f4bf5ddcf4a6ab65cf684394ab3c2575f0.zip",
            "status": "restricted"
        }
    ]
}
