{
    "id": "maven/mavencentral/jakarta.persistence/jakarta.persistence-api/3.0.0",
    "license": "EPL-2.0 OR BSD-3-Clause AND (EPL-2.0 OR BSD-3-Clause AND BSD-3-Clause)",
    "authority": "https://gitlab.eclipse.org/eclipsefdn/emo-team/iplab/-/issues/9177",
    "source": "https://repo.maven.apache.org/maven2/jakarta/persistence/jakarta.persistence-api/3.0.0/jakarta.persistence-api-3.0.0-sources.jar",
    "status": "approved",
    "scans": [
        {
            "date": "June 23, 2023 at 10:53:50 a.m. GMT",
            "authority": "https://gitlab.eclipse.org/eclipsefdn/emo-team/iplab/-/issues/9177",
            "scancode-version": "31.2.1",
            "licenses-discovered": [
                "EPL-2.0 OR BSD-3-Clause",
                "EPL-2.0 OR BSD-3-Clause AND BSD-3-Clause"
            ],
            "copyrights": [
                "Copyright (c) 2007, Eclipse Foundation, Inc.",
                "Copyright (c) 2008, 2019 Oracle and/or its affiliates",
                "Copyright (c) 2008, 2020 Oracle and/or its affiliates",
                "Copyright (c) 2011, 2020 Oracle and/or its affiliates",
                "Copyright (c) 2013, 2020 Oracle and/or its affiliates",
                "Copyright (c) 2017, 2020 Oracle and/or its affiliates",
                "Copyright (c) 2018, 2020 Oracle and/or its affiliates",
                "Copyright (c) 2019 Oracle and/or its affiliates",
                "Copyright (c) 2019, 2020 Eclipse Foundation",
                "Copyright (c) 2020 Oracle and/or its affiliates"
            ],
            "file-count": 202,
            "sha256": "964eefc521854970e7f1673a3c2e2861a47821bc9aadc3dfdad4ec0d391eec3c",
            "source": "https://repo.maven.apache.org/maven2/jakarta/persistence/jakarta.persistence-api/3.0.0/jakarta.persistence-api-3.0.0-sources.jar",
            "status": "approved"
        }
    ]
}