{
    "id": "nuget/nuget/-/AutoFixture.Xunit/4.18.0",
    "license": "MIT",
    "authority": "https://gitlab.eclipse.org/eclipsefdn/emo-team/iplab/-/issues/10082",
    "source": "https://github.com/AutoFixture/AutoFixture/archive/refs/tags/v4.18.0.zip",
    "status": "approved",
    "scans": [
        {
            "date": "August 17, 2023 at 3:43:29 a.m. GMT",
            "authority": "https://gitlab.eclipse.org/eclipsefdn/emo-team/iplab/-/issues/10082",
            "scancode-version": "31.2.1",
            "licenses-discovered": [
                "MIT"
            ],
            "copyrights": [
                "Copyright (c) 2000-2002 Philip Craig",
                "Copyright (c) 2002-2004 James W. Newkirk, Michael C. Two, Alexei A. Vorontsov",
                "Copyright (c) 2002-2012 Charlie Poole",
                "Copyright (c) 2013 Mark Seemann",
                "Copyright (c) AutoFixture 2011",
                "Copyright (c) Ploeh 2011 NuGet",
                "Copyright (c) Ploeh 2013",
                "Copyright (c) Ploeh 2014",
                "Copyright (c) Ploeh 2016 NuGet"
            ],
            "file-count": 1243,
            "sha256": "4663cf5ee793b72cd9588b1bf16a97665544e559d0dd85ece66598770a35ac6f",
            "source": "https://github.com/AutoFixture/AutoFixture/archive/refs/tags/v4.18.0.zip",
            "status": "approved"
        }
    ]
}