{
    "id": "npm/npmjs/@vscode/emmet-helper/2.10.0",
    "license": "MIT",
    "authority": "https://gitlab.eclipse.org/eclipsefdn/emo-team/iplab/-/issues/17165",
    "source": "https://github.com/microsoft/vscode-emmet-helper/archive/refs/tags/v2.10.0.zip",
    "status": "approved",
    "scans": [
        {
            "date": "November 12, 2024, 8:07:18 p.m. GMT",
            "authority": "https://gitlab.eclipse.org/eclipsefdn/emo-team/iplab/-/issues/17165",
            "scancode-version": "31.2.1",
            "licenses-discovered": [
                "MIT"
            ],
            "copyrights": [
                "Copyright (c) 2017 Emmet.io",
                "Copyright (c) 2020 Sergey Chikuyonok <serge.che@gmail.com>",
                "Copyright (c) Microsoft",
                "Copyright (c) Microsoft Corporation"
            ],
            "file-count": 25,
            "sha256": "3a07dc041a75dc3acc7f086ee5fe7bf0835e92ff26f712bafa2b17cad399a625",
            "source": "https://github.com/microsoft/vscode-emmet-helper/archive/refs/tags/v2.10.0.zip",
            "status": "approved"
        }
    ]
}