{
    "id": "maven/mavencentral/org.apache.camel/camel-yaml-dsl-common/3.21.1",
    "license": "Apache-2.0",
    "authority": "https://gitlab.eclipse.org/eclipsefdn/emo-team/iplab/-/issues/11336",
    "source": "https://repo.maven.apache.org/maven2/org/apache/camel/camel-yaml-dsl-common/3.21.1/camel-yaml-dsl-common-3.21.1-sources.jar",
    "status": "approved",
    "scans": [
        {
            "date": "October 26, 2023 at 7:02:29 p.m. GMT",
            "authority": "https://gitlab.eclipse.org/eclipsefdn/emo-team/iplab/-/issues/11336",
            "scancode-version": "31.2.1",
            "licenses-discovered": [
                "Apache-2.0"
            ],
            "copyrights": [
            ],
            "file-count": 21,
            "sha256": "bea95b69a6edc7ae19c53f48d995e6953855a4976834e8643d6f5a02f037b627",
            "source": "https://repo.maven.apache.org/maven2/org/apache/camel/camel-yaml-dsl-common/3.21.1/camel-yaml-dsl-common-3.21.1-sources.jar",
            "status": "approved"
        }
    ]
}