{
    "id": "npm/npmjs/-/crc32-stream/4.0.3",
    "license": "MIT",
    "authority": "https://gitlab.eclipse.org/eclipsefdn/emo-team/iplab/-/issues/10367",
    "source": "https://github.com/archiverjs/node-crc32-stream/archive/refs/tags/4.0.3.zip",
    "status": "approved",
    "scans": [
        {
            "date": "September 8, 2023 at 2:17:58 p.m. GMT",
            "authority": "https://gitlab.eclipse.org/eclipsefdn/emo-team/iplab/-/issues/10367",
            "scancode-version": "31.2.1",
            "licenses-discovered": [
                "MIT"
            ],
            "copyrights": [
                "Copyright (c) 2014 Chris Talkington"
            ],
            "file-count": 17,
            "sha256": "9e24963006abc98970357d06f2d92211de178e210fba214ba90bef0996a6acc8",
            "source": "https://github.com/archiverjs/node-crc32-stream/archive/refs/tags/4.0.3.zip",
            "status": "approved"
        }
    ]
}