{
    "id": "npm/npmjs/@typescript-eslint/typescript-estree/7.18.0",
    "license": "BSD-2-Clause AND MIT AND (BSD-2-Clause AND ISC AND MIT)",
    "authority": "https://gitlab.eclipse.org/eclipsefdn/emo-team/iplab/-/issues/15826",
    "source": "https://github.com/typescript-eslint/typescript-eslint/archive/refs/tags/v7.18.0.zip",
    "status": "approved",
    "scans": [
        {
            "date": "July 30, 2024 at 11:06:35 a.m. GMT",
            "authority": "https://gitlab.eclipse.org/eclipsefdn/emo-team/iplab/-/issues/15826",
            "scancode-version": "31.2.1",
            "licenses-discovered": [
                "BSD-2-Clause",
                "MIT",
                "BSD-2-Clause AND ISC AND MIT"
            ],
            "copyrights": [
                "Copyright (c) 2016 unional",
                "Copyright (c) 2019 typescript-eslint and other contributors",
                "Copyright (c) 2021 typescript-eslint and other contributors",
                "Copyright (c) 2023 typescript-eslint and other contributors",
                "Copyright JS Foundation and other contributors, https://js.foundation",
                "Copyright Joyent, Inc. and other Node contributors",
                "Pp (c) Ac",
                "Tv (c) Gn"
            ],
            "file-count": 7201,
            "sha256": "bac7404ec7f7aa4ff4d06deedaeb4b2f0e2d215a12afd1a37909444083ffe15f",
            "source": "https://github.com/typescript-eslint/typescript-eslint/archive/refs/tags/v7.18.0.zip",
            "status": "approved"
        }
    ]
}