{
    "id": "maven/mavencentral/org.jacorb/jacorb-omgapi/3.9",
    "license": "LGPL-2.0-or-later",
    "licenses-discovered": [
        "LGPL-2.0-or-later"
    ],
    "file-count": 2422,
    "scancode-version": "30.1.0",
    "authority": "https://gitlab.eclipse.org/eclipsefdn/emo-team/iplab/-/issues/3034",
    "source": "https://search.maven.org/remotecontent?filepath=org/jacorb/jacorb-omgapi/3.9/jacorb-omgapi-3.9-sources.jar",
    "status": "restricted",
    "workswith": [
        "tools.orbit"
    ],
    "copyrights": [
        "Copyright (c) Gerald Brose / The JacORB Team",
        "Copyright (c) Object Management Group. Unlimited"
    ]
}