{
    "id": "maven/mavencentral/software.amazon.awssdk/checksums-spi/2.30.33",
    "license": "Apache-2.0",
    "authority": "https://gitlab.eclipse.org/eclipsefdn/emo-team/iplab/-/issues/19909",
    "source": "https://repo1.maven.org/maven2/software/amazon/awssdk/checksums-spi/2.30.33/checksums-spi-2.30.33-sources.jar",
    "status": "approved",
    "scans": [
        {
            "date": "March 6, 2025 at 8:12:33 a.m. GMT",
            "authority": "https://gitlab.eclipse.org/eclipsefdn/emo-team/iplab/-/issues/19909",
            "scancode-version": "31.2.1",
            "licenses-discovered": [
                "Apache-2.0"
            ],
            "copyrights": [
                "Copyright Amazon.com, Inc. or its affiliates"
            ],
            "file-count": 5,
            "sha256": "2cba310ad3b21636669000cb84347cf3bf6d3362f9adcc6463ce276a41ee4d83",
            "source": "https://repo1.maven.org/maven2/software/amazon/awssdk/checksums-spi/2.30.33/checksums-spi-2.30.33-sources.jar",
            "status": "approved"
        }
    ]
}