{
    "id": "maven/mavencentral/com.squareup.okio/okio-jvm/3.6.0",
    "license": "Apache-2.0",
    "authority": "https://gitlab.eclipse.org/eclipsefdn/emo-team/iplab/-/issues/11158",
    "source": "https://repo.maven.apache.org/maven2/com/squareup/okio/okio-jvm/3.6.0/okio-jvm-3.6.0-sources.jar",
    "status": "approved",
    "scans": [
        {
            "date": "October 25, 2023 at 8:40:08 a.m. GMT",
            "authority": "https://gitlab.eclipse.org/eclipsefdn/emo-team/iplab/-/issues/11158",
            "scancode-version": "31.2.1",
            "licenses-discovered": [
                "Apache-2.0"
            ],
            "copyrights": [
                "Copyright (c) 2014 Square, Inc.",
                "Copyright (c) 2015 Square, Inc.",
                "Copyright (c) 2016 Square, Inc.",
                "Copyright (c) 2017 Square, Inc.",
                "Copyright (c) 2018 Square, Inc.",
                "Copyright (c) 2019 Square, Inc.",
                "Copyright (c) 2020 Square, Inc.",
                "Copyright (c) 2020 Square, Inc. and others",
                "Copyright (c) 2021 Square, Inc.",
                "Copyright (c) 2023 Square, Inc.",
                "Copyright 2014 Square Inc."
            ],
            "file-count": 78,
            "sha256": "870a42a7b468af8fd24d67b7b62e5861aab398c56f15a80b10642e7001564e2f",
            "source": "https://repo.maven.apache.org/maven2/com/squareup/okio/okio-jvm/3.6.0/okio-jvm-3.6.0-sources.jar",
            "status": "approved"
        }
    ]
}