{
    "id": "maven/mavencentral/org.gitlab4j/gitlab4j-api/5.3.0",
    "license": "MIT",
    "authority": "https://gitlab.eclipse.org/eclipsefdn/emo-team/iplab/-/issues/10054",
    "source": "https://repo.maven.apache.org/maven2/org/gitlab4j/gitlab4j-api/5.3.0/gitlab4j-api-5.3.0-sources.jar",
    "status": "approved",
    "scans": [
        {
            "date": "August 16, 2023 at 12:48:20 a.m. GMT",
            "authority": "https://gitlab.eclipse.org/eclipsefdn/emo-team/iplab/-/issues/10054",
            "scancode-version": "31.2.1",
            "licenses-discovered": [
                "MIT",
                "LicenseRef-scancode-proprietary-license"
            ],
            "copyrights": [
                "Copyright (c) 2017 Greg Messner <greg@messners.com>",
                "Copyright (c) 2018 Greg Messner <greg@messners.com>"
            ],
            "file-count": 302,
            "sha256": "9a6efeaf6bbfe645e8ec8a7723cd9a2de1fd26a39061f5e47298c6328af253ae",
            "source": "https://repo.maven.apache.org/maven2/org/gitlab4j/gitlab4j-api/5.3.0/gitlab4j-api-5.3.0-sources.jar",
            "status": "restricted"
        }
    ]
}
