{
    "id": "maven/mavencentral/com.google.javascript/closure-compiler/v20231112",
    "license": "Apache-2.0 AND (GPL-2.0-or-later OR MPL-1.1) AND LicenseRef-ISC-style",
    "authority": "https://gitlab.eclipse.org/eclipsefdn/emo-team/iplab/-/issues/11533",
    "source": "https://repo1.maven.org/maven2/com/google/javascript/closure-compiler/v20231112/closure-compiler-v20231112-sources.jar",
    "status": "approved",
    "scans": [
        {
            "date": "November 14, 2023 at 7:56:37 a.m. GMT",
            "authority": "https://gitlab.eclipse.org/eclipsefdn/emo-team/iplab/-/issues/11533",
            "scancode-version": "31.2.1",
            "licenses-discovered": [
                "Apache-2.0",
                "Apache-2.0 AND LicenseRef-scancode-proprietary-license",
                "GPL-2.0-or-later AND MPL-1.1",
                "GPL-2.0-only AND MPL-1.1",
                "GPL-2.0-or-later AND LicenseRef-scancode-x11-lucent AND MPL-1.1"
            ],
            "copyrights": [
                "(c) . Try",
                "Copyright (c) 1991, 2000, 2001 by Lucent Technologies",
                "Copyright (c) 1997-1999 the Initial Developer",
                "Copyright 2002 The Closure Compiler",
                "Copyright 2004 The Closure Compiler",
                "Copyright 2005 The Closure Compiler",
                "Copyright 2006 The Closure Compiler",
                "Copyright 2007 The Closure Compiler",
                "Copyright 2008 The Closure Compiler",
                "Copyright 2009 The Closure Compiler",
                "Copyright 2010 The Closure Compiler",
                "Copyright 2011 The Closure Compiler",
                "Copyright 2012 The Closure Compiler",
                "Copyright 2013 The Closure Compiler",
                "Copyright 2014 The Closure Compiler",
                "Copyright 2015 The Closure Compiler",
                "Copyright 2016 The Closure Compiler",
                "Copyright 2017 The Closure Compiler",
                "Copyright 2018 The Closure Compiler",
                "Copyright 2019 The Closure Compiler",
                "Copyright 2020 The Closure Compiler",
                "Copyright 2021 The Closure Compiler",
                "Copyright 2022 The Closure Compiler",
                "Copyright 2023 The Closure Compiler"
            ],
            "file-count": 823,
            "sha256": "4688b9142984965c5f42de9a6709efc094d1f187250cfaa52d411388f33f016a",
            "source": "https://repo1.maven.org/maven2/com/google/javascript/closure-compiler/v20231112/closure-compiler-v20231112-sources.jar",
            "status": "restricted"
        }
    ]
}
