{
    "id": "maven/mavencentral/org.geckoprojects.emf/org.gecko.emf.osgi.component/4.3.0",
    "license": "EPL-2.0",
    "licenses-discovered": [
        "EPL-2.0"
    ],
    "copyrights": [
        "Copyright (c) 2012 - 2022 Data In Motion and others"
    ],
    "file-count": 22,
    "scancode-version": "31.2.1",
    "authority": "https://gitlab.eclipse.org/eclipsefdn/emo-team/iplab/-/issues/4333",
    "source": "https://search.maven.org/remotecontent?filepath=org/geckoprojects/emf/org.gecko.emf.osgi.component/4.3.0/org.gecko.emf.osgi.component-4.3.0-sources.jar",
    "status": "approved"
}