{
    "id": "npm/npmjs/-/vscode-languageserver/9.0.0",
    "license": "MIT AND LGPL-2.1-or-later",
    "authority": "https://gitlab.eclipse.org/eclipsefdn/emo-team/iplab/-/issues/10662",
    "source": "https://github.com/microsoft/vscode-languageserver-node/archive/refs/tags/release/server/9.0.0.zip",
    "status": "approved",
    "scans": [
        {
            "date": "September 24, 2023 at 9:23:08 p.m. GMT",
            "authority": "https://gitlab.eclipse.org/eclipsefdn/emo-team/iplab/-/issues/10662",
            "scancode-version": "31.2.1",
            "licenses-discovered": [
                "MIT",
                "LGPL-2.1-or-later",
                "LGPL-2.1-or-later AND MIT"
            ],
            "copyrights": [
                "Copyright (c) Microsoft Corporation",
                "Copyright (c) TypeFox and others",
                "Copyright (c) TypeFox, Microsoft and others"
            ],
            "file-count": 435,
            "sha256": "3cb01f893778425b85bf2e00a445ae23e5b8586affea56a186e0c15f7de07b96",
            "source": "https://github.com/microsoft/vscode-languageserver-node/archive/refs/tags/release/server/9.0.0.zip",
            "status": "approved"
        }
    ]
}