{
    "id": "maven/mavencentral/it.unibz.inf.ontop/ontop-rdb/5.0.2",
    "license": "Apache-2.0",
    "authority": "https://gitlab.eclipse.org/eclipsefdn/emo-team/iplab/-/issues/9813",
    "source": "https://repo.maven.apache.org/maven2/it/unibz/inf/ontop/ontop-rdb/5.0.2/ontop-rdb-5.0.2-sources.jar",
    "status": "approved",
    "scans": [
        {
            "date": "July 27, 2023 at 1:33:21 p.m. GMT",
            "authority": "https://gitlab.eclipse.org/eclipsefdn/emo-team/iplab/-/issues/9813",
            "scancode-version": "31.2.1",
            "licenses-discovered": [
                "Apache-2.0"
            ],
            "copyrights": [
                "Copyright (c) 2009 - 2014 Free University of Bozen-Bolzano",
                "Copyright 2004 Clinton Begin"
            ],
            "file-count": 238,
            "sha256": "7b81e528a186a790920067ea37800d49a0c2a59d5033e420d00fefcc8dcc71d9",
            "source": "https://repo.maven.apache.org/maven2/it/unibz/inf/ontop/ontop-rdb/5.0.2/ontop-rdb-5.0.2-sources.jar",
            "status": "approved"
        }
    ]
}