{
    "id": "pypi/pypi/-/blivet/3.4.4",
    "license": "GPL-2.0-or-later AND LGPL-2.0-or-later AND GPL-2.0-only AND LGPL-2.1-only AND GPL-2.0-or-later AND LGPL-2.0-or-later AND (GPL-2.0-or-later AND LicenseRef-scancode-proprietary-license) AND LicenseRef-scancode-free-unknown",
    "authority": "https://gitlab.eclipse.org/eclipsefdn/emo-team/iplab/-/issues/7738",
    "source": "https://files.pythonhosted.org/packages/31/d4/8a1626f1cfb4125512cd40ae1c962079d1de1b8dfcf239acfb274861269a/blivet-3.4.4.tar.gz",
    "status": "restricted",
    "scans": [
        {
            "date": "November 10, 2022 at 8:37:04 p.m. GMT",
            "authority": "https://gitlab.eclipse.org/eclipsefdn/emo-team/iplab/-/issues/4770",
            "scancode-version": "31.2.1",
            "licenses-discovered": [
                "GPL-2.0-or-later AND LGPL-2.0-or-later",
                "GPL-2.0-only",
                "LGPL-2.1-only",
                "GPL-2.0-or-later",
                "LGPL-2.0-or-later",
                "GPL-2.0-or-later AND LicenseRef-scancode-proprietary-license",
                "LicenseRef-scancode-free-unknown"
            ],
            "copyrights": [
                "Copr repository (https://copr.fedorainfracloud.org/coprs/g/storage/blivet-stable/)",
                "Copyright (c) 1989, 1991 Free Software Foundation, Inc.",
                "Copyright (c) 1991, 1999 Free Software Foundation, Inc.",
                "Copyright (c) 1999, 2000, 2001, 2002, 2003, 2004, 2005, 2006, 2007, 2013 Red Hat, Inc.",
                "Copyright (c) 2001, 2002, 2003, 2004 Red Hat, Inc.",
                "Copyright (c) 2005, 2006 IBM, Inc.",
                "Copyright (c) 2006 Red Hat, Inc.",
                "Copyright (c) 2009 Red Hat, Inc.",
                "Copyright (c) 2009, 2010, 2011, 2012, 2013 Red Hat, Inc.",
                "Copyright (c) 2009, 2013 Red Hat, Inc.",
                "Copyright (c) 2009-2014 Red Hat, Inc.",
                "Copyright (c) 2009-2015 Red Hat, Inc.",
                "Copyright (c) 2009-2016 Red Hat, Inc.",
                "Copyright (c) 2010 Red Hat, Inc.",
                "Copyright (c) 2011 Red Hat, Inc.",
                "Copyright (c) 2011-2014 Red Hat, Inc.",
                "Copyright (c) 2012, 2013 Red Hat, Inc.",
                "Copyright (c) 2013 Red Hat, Inc.",
                "Copyright (c) 2013-2015 Red Hat, Inc.",
                "Copyright (c) 2014 Red Hat, Inc.",
                "Copyright (c) 2014,2015 Red Hat, Inc.",
                "Copyright (c) 2014-2015 Red Hat, Inc.",
                "Copyright (c) 2015 Red Hat, Inc.",
                "Copyright (c) 2015-2016 Red Hat, Inc.",
                "Copyright (c) 2016 Red Hat, Inc.",
                "Copyright (c) 2018 Red Hat, Inc.",
                "Copyright 2010-2015 Red Hat, Inc.",
                "copyrighted by the Free Software Foundation"
            ],
            "file-count": 297,
            "sha256": "835a63f0939d460298cf73ee9167d4e7de2bd076b2b3e82c432f2c01c85d81b2",
            "source": "https://files.pythonhosted.org/packages/31/d4/8a1626f1cfb4125512cd40ae1c962079d1de1b8dfcf239acfb274861269a/blivet-3.4.4.tar.gz",
            "status": "restricted"
        },
        {
            "date": "April 3, 2023 at 5:22:07 p.m. GMT",
            "authority": "https://gitlab.eclipse.org/eclipsefdn/emo-team/iplab/-/issues/7738",
            "scancode-version": "31.2.1",
            "licenses-discovered": [
                "GPL-2.0-or-later AND LGPL-2.0-or-later",
                "GPL-2.0-only",
                "LGPL-2.1-only",
                "GPL-2.0-or-later",
                "LGPL-2.0-or-later",
                "GPL-2.0-or-later AND LicenseRef-scancode-proprietary-license",
                "LicenseRef-scancode-free-unknown"
            ],
            "copyrights": [
                "Copr repository (https://copr.fedorainfracloud.org/coprs/g/storage/blivet-stable/)",
                "Copyright (c) 1989, 1991 Free Software Foundation, Inc.",
                "Copyright (c) 1991, 1999 Free Software Foundation, Inc.",
                "Copyright (c) 1999, 2000, 2001, 2002, 2003, 2004, 2005, 2006, 2007, 2013 Red Hat, Inc.",
                "Copyright (c) 2001, 2002, 2003, 2004 Red Hat, Inc.",
                "Copyright (c) 2005, 2006 IBM, Inc.",
                "Copyright (c) 2006 Red Hat, Inc.",
                "Copyright (c) 2009 Red Hat, Inc.",
                "Copyright (c) 2009, 2010, 2011, 2012, 2013 Red Hat, Inc.",
                "Copyright (c) 2009, 2013 Red Hat, Inc.",
                "Copyright (c) 2009-2014 Red Hat, Inc.",
                "Copyright (c) 2009-2015 Red Hat, Inc.",
                "Copyright (c) 2009-2016 Red Hat, Inc.",
                "Copyright (c) 2010 Red Hat, Inc.",
                "Copyright (c) 2011 Red Hat, Inc.",
                "Copyright (c) 2011-2014 Red Hat, Inc.",
                "Copyright (c) 2012, 2013 Red Hat, Inc.",
                "Copyright (c) 2013 Red Hat, Inc.",
                "Copyright (c) 2013-2015 Red Hat, Inc.",
                "Copyright (c) 2014 Red Hat, Inc.",
                "Copyright (c) 2014,2015 Red Hat, Inc.",
                "Copyright (c) 2014-2015 Red Hat, Inc.",
                "Copyright (c) 2015 Red Hat, Inc.",
                "Copyright (c) 2015-2016 Red Hat, Inc.",
                "Copyright (c) 2016 Red Hat, Inc.",
                "Copyright (c) 2018 Red Hat, Inc.",
                "Copyright 2010-2015 Red Hat, Inc.",
                "copyrighted by the Free Software Foundation"
            ],
            "file-count": 297,
            "sha256": "835a63f0939d460298cf73ee9167d4e7de2bd076b2b3e82c432f2c01c85d81b2",
            "source": "https://files.pythonhosted.org/packages/31/d4/8a1626f1cfb4125512cd40ae1c962079d1de1b8dfcf239acfb274861269a/blivet-3.4.4.tar.gz",
            "status": "restricted"
        }
    ]
}