{
    "id": "git/github/golang/groupcache/869f871628b6",
    "license": "Apache-2.0",
    "authority": "https://gitlab.eclipse.org/eclipsefdn/emo-team/iplab/-/issues/5193",
    "source": "https://github.com/golang/groupcache/archive/869f871628b6.zip",
    "status": "approved",
    "scans": [
        {
            "date": "November 25, 2022 at 11:54:01 p.m. GMT",
            "authority": "https://gitlab.eclipse.org/eclipsefdn/emo-team/iplab/-/issues/5193",
            "scancode-version": "31.2.1",
            "licenses-discovered": [
                "Apache-2.0"
            ],
            "copyrights": [
                "Copyright 2012 Google Inc.",
                "Copyright 2013 Google Inc."
            ],
            "file-count": 21,
            "sha256": "7ce7bcff111c19e230930b8ba06de90d7c37d552cedb75775a393e8b8301b953",
            "source": "https://github.com/golang/groupcache/archive/869f871628b6.zip",
            "status": "approved"
        }
    ]
}