{
    "id": "npm/npmjs/@rollup/pluginutils/5.1.2",
    "license": "MIT",
    "authority": "https://gitlab.eclipse.org/eclipsefdn/emo-team/iplab/-/issues/16428",
    "source": "https://github.com/rollup/plugins/archive/refs/tags/wasm-v5.1.2.zip",
    "status": "approved",
    "scans": [
        {
            "date": "September 30, 2024, 6:43:10 p.m. GMT",
            "authority": "https://gitlab.eclipse.org/eclipsefdn/emo-team/iplab/-/issues/16428",
            "scancode-version": "31.2.1",
            "licenses-discovered": [
                "MIT",
                "MPL-1.0 AND MPL-1.1",
                "ISC"
            ],
            "copyrights": [
                "Copyright (c) 2019 RollupJS"
            ],
            "file-count": 1489,
            "sha256": "266d463e8400d065b5892a78c59efced8619e2bf6ce3f14799e1984dc24c207e",
            "source": "https://github.com/rollup/plugins/archive/refs/tags/wasm-v5.1.2.zip",
            "status": "restricted"
        }
    ]
}