{
    "id": "project/technology.xfsc/eclipse-xfsc/ocm-w-stack-epics/ec29bbfb0a7e50cba3fdd46b22d948519878d812",
    "license": "None",
    "authority": "https://gitlab.eclipse.org/eclipsefdn/emo-team/iplab/-/issues/11445",
    "source": "https://gitlab.eclipse.org/api/v4/projects/eclipse%2Fxfsc%2Focm-w-stack-epics/repository/archive.zip?sha=ec29bbfb0a7e50cba3fdd46b22d948519878d812",
    "status": "restricted",
    "scans": [
        {
            "date": "November 7, 2023 at 4:59:38 a.m. GMT",
            "authority": "https://gitlab.eclipse.org/eclipsefdn/emo-team/iplab/-/issues/11445",
            "scancode-version": "31.2.1",
            "licenses-discovered": [
            ],
            "copyrights": [
            ],
            "file-count": 1,
            "sha256": "203d98f09ff511b799bf74691e2ce52fa0990374e2b5b32db80c2f1189f8cef5",
            "source": "https://gitlab.eclipse.org/api/v4/projects/eclipse%2Fxfsc%2Focm-w-stack-epics/repository/archive.zip?sha=ec29bbfb0a7e50cba3fdd46b22d948519878d812",
            "status": "restricted"
        }
    ]
}