{
    "id": "maven/mavencentral/org.flywaydb/flyway-core/10.8.1",
    "license": "Apache-2.0",
    "authority": "https://gitlab.eclipse.org/eclipsefdn/emo-team/iplab/-/issues/13291",
    "source": "https://repo1.maven.org/maven2/org/flywaydb/flyway-core/10.8.1/flyway-core-10.8.1-sources.jar",
    "status": "approved",
    "scans": [
        {
            "date": "February 19, 2024 at 1:19:46 p.m. GMT",
            "authority": "https://gitlab.eclipse.org/eclipsefdn/emo-team/iplab/-/issues/13291",
            "scancode-version": "31.2.1",
            "licenses-discovered": [
                "Apache-2.0"
            ],
            "copyrights": [
                "Copyright (c) Red Gate Software Ltd 2010-2024"
            ],
            "file-count": 421,
            "sha256": "5d921ebb80ebd8a87d5fd7bcaa93e82ed5d17499ad4d15fe8939c659f1752967",
            "source": "https://repo1.maven.org/maven2/org/flywaydb/flyway-core/10.8.1/flyway-core-10.8.1-sources.jar",
            "status": "approved"
        }
    ]
}