{
    "id": "maven/mavencentral/com.microsoft.sqlserver/mssql-jdbc/6.2.1.jre7",
    "license": "MIT",
    "authority": "https://gitlab.eclipse.org/eclipsefdn/emo-team/iplab/-/issues/19654",
    "source": "https://repo1.maven.org/maven2/com/microsoft/sqlserver/mssql-jdbc/6.2.1.jre7/mssql-jdbc-6.2.1.jre7-sources.jar",
    "status": "approved",
    "scans": [
        {
            "date": "February 28, 2025 at 11:18:47 p.m. GMT",
            "authority": "https://gitlab.eclipse.org/eclipsefdn/emo-team/iplab/-/issues/19654",
            "scancode-version": "31.2.1",
            "licenses-discovered": [
                "MIT"
            ],
            "copyrights": [
                "Copyright (c) Microsoft Corporation"
            ],
            "file-count": 119,
            "sha256": "88a97ff02db622dc3586de0ba77665d4e49dabad02c7522f9cd9f8d835d6b173",
            "source": "https://repo1.maven.org/maven2/com/microsoft/sqlserver/mssql-jdbc/6.2.1.jre7/mssql-jdbc-6.2.1.jre7-sources.jar",
            "status": "approved"
        }
    ]
}