{
    "id": "maven/mavencentral/org.graalvm.js/js-scriptengine/22.0.0.2",
    "license": "UPL-1.0",
    "authority": "https://gitlab.eclipse.org/eclipsefdn/emo-team/iplab/-/issues/5272",
    "source": "https://search.maven.org/remotecontent?filepath=org/graalvm/js/js-scriptengine/22.0.0.2/js-scriptengine-22.0.0.2-sources.jar",
    "status": "approved",
    "scans": [
        {
            "date": "December 1, 2022 at 10:27:05 a.m. GMT",
            "authority": "https://gitlab.eclipse.org/eclipsefdn/emo-team/iplab/-/issues/5272",
            "scancode-version": "31.2.1",
            "licenses-discovered": [
                "UPL-1.0"
            ],
            "copyrights": [
                "Copyright (c) 2018, 2021, Oracle and/or its affiliates"
            ],
            "file-count": 3,
            "sha256": "bfc48cd60600265ade158b6633e532713dfcdb7e933945ba9dd3ca968b78ae38",
            "source": "https://search.maven.org/remotecontent?filepath=org/graalvm/js/js-scriptengine/22.0.0.2/js-scriptengine-22.0.0.2-sources.jar",
            "status": "approved"
        }
    ]
}