{
    "id": "maven/mavencentral/org.jsoup/jsoup/1.19.1",
    "license": "MIT AND Apache-2.0",
    "authority": "https://gitlab.eclipse.org/eclipsefdn/emo-team/iplab/-/issues/19857",
    "source": "https://repo1.maven.org/maven2/org/jsoup/jsoup/1.19.1/jsoup-1.19.1-sources.jar",
    "status": "approved",
    "scans": [
        {
            "date": "March 4, 2025 at 7:19:59 a.m. GMT",
            "authority": "https://gitlab.eclipse.org/eclipsefdn/emo-team/iplab/-/issues/19857",
            "scancode-version": "31.2.1",
            "licenses-discovered": [
                "MIT",
                "Apache-2.0"
            ],
            "copyrights": [
                "Copyright (c) 2009-2025 Jonathan Hedley <https://jsoup.org/>"
            ],
            "file-count": 83,
            "sha256": "54838f69298a69e4b1f5f45b659f5206978b41bcc2a4e13438220f1a1d601ab1",
            "source": "https://repo1.maven.org/maven2/org/jsoup/jsoup/1.19.1/jsoup-1.19.1-sources.jar",
            "status": "approved"
        }
    ]
}