{
    "id": "go/golang/github.com%2Fhashicorp/serf/v0.8.2",
    "license": "MPL-2.0 AND LicenseRef-scancode-proprietary-license",
    "authority": "https://gitlab.eclipse.org/eclipsefdn/emo-team/iplab/-/issues/12393",
    "source": "https://proxy.golang.org/github.com%2Fhashicorp/serf/@v/v0.8.2.zip",
    "status": "approved",
    "scans": [
        {
            "date": "December 21, 2023 at 11:58:35 a.m. GMT",
            "authority": "https://gitlab.eclipse.org/eclipsefdn/emo-team/iplab/-/issues/12393",
            "scancode-version": "31.2.1",
            "licenses-discovered": [
                "MPL-2.0",
                "LicenseRef-scancode-proprietary-license"
            ],
            "copyrights": [
                "(c) 2009-2013 Torstein Honsi",
                "Copyright Hashicorp 2013"
            ],
            "file-count": 254,
            "sha256": "0f431658e69625f61defd36073e893ce21f04fe5a96484b812d47e32d4154be0",
            "source": "https://proxy.golang.org/github.com%2Fhashicorp/serf/@v/v0.8.2.zip",
            "status": "restricted"
        }
    ]
}
