{
    "id": "maven/mavencentral/com.azure.resourcemanager/azure-resourcemanager-containerinstance/2.43.0",
    "license": "MIT",
    "authority": "https://gitlab.eclipse.org/eclipsefdn/emo-team/iplab/-/issues/16707",
    "source": "https://repo1.maven.org/maven2/com/azure/resourcemanager/azure-resourcemanager-containerinstance/2.43.0/azure-resourcemanager-containerinstance-2.43.0-sources.jar",
    "status": "approved",
    "scans": [
        {
            "date": "October 15, 2024, 5:10:01 p.m. GMT",
            "authority": "https://gitlab.eclipse.org/eclipsefdn/emo-team/iplab/-/issues/16707",
            "scancode-version": "31.2.1",
            "licenses-discovered": [
                "MIT"
            ],
            "copyrights": [
                "Copyright (c) Microsoft Corporation"
            ],
            "file-count": 107,
            "sha256": "0ca1566590acc4bb9dfd3a8beaec0de8de2f685d0f4f527fb2bf197ff7010445",
            "source": "https://repo1.maven.org/maven2/com/azure/resourcemanager/azure-resourcemanager-containerinstance/2.43.0/azure-resourcemanager-containerinstance-2.43.0-sources.jar",
            "status": "approved"
        }
    ]
}