{
    "id": "maven/mavencentral/org.openrewrite/rewrite-kotlin/1.4.6",
    "license": "Apache-2.0",
    "authority": "https://gitlab.eclipse.org/eclipsefdn/emo-team/iplab/-/issues/11207",
    "source": "https://repo.maven.apache.org/maven2/org/openrewrite/rewrite-kotlin/1.4.6/rewrite-kotlin-1.4.6-sources.jar",
    "status": "approved",
    "scans": [
        {
            "date": "October 25, 2023 at 9:54:16 p.m. GMT",
            "authority": "https://gitlab.eclipse.org/eclipsefdn/emo-team/iplab/-/issues/11207",
            "scancode-version": "31.2.1",
            "licenses-discovered": [
                "Apache-2.0"
            ],
            "copyrights": [
                "Copyright 2021 the original author or authors",
                "Copyright 2022 the original author or authors",
                "Copyright 2023 the original author or authors"
            ],
            "file-count": 87,
            "sha256": "c080871ac6f697dd3c6a5d4eed74e7c91bf9653bdff31ca597b174a887cc984c",
            "source": "https://repo.maven.apache.org/maven2/org/openrewrite/rewrite-kotlin/1.4.6/rewrite-kotlin-1.4.6-sources.jar",
            "status": "approved"
        }
    ]
}