{
    "id": "pypi/pypi/-/idna/3.10",
    "license": "BSD-3-Clause AND LicenseRef-scancode-unicode",
    "authority": "https://gitlab.eclipse.org/eclipsefdn/emo-team/iplab/-/issues/19865",
    "source": "https://files.pythonhosted.org/packages/f1/70/7703c29685631f5a7590aa73f1f1d3fa9a380e654b86af429e0934a32f7d/idna-3.10.tar.gz",
    "status": "restricted",
    "scans": [
        {
            "date": "March 4, 2025 at 9:29:28 a.m. GMT",
            "authority": "https://gitlab.eclipse.org/eclipsefdn/emo-team/iplab/-/issues/19865",
            "scancode-version": "31.2.1",
            "licenses-discovered": [
                "BSD-3-Clause",
                "LicenseRef-scancode-unicode"
            ],
            "copyrights": [
                "(c) 2019 Unicode(r), Inc.",
                "Copyright (c) 2013-2024, Kim Davies and contributors"
            ],
            "file-count": 23,
            "sha256": "12f65c9b470abda6dc35cf8e63cc574b1c52b11df2c86030af0ac09b01b13ea9",
            "source": "https://files.pythonhosted.org/packages/f1/70/7703c29685631f5a7590aa73f1f1d3fa9a380e654b86af429e0934a32f7d/idna-3.10.tar.gz",
            "status": "restricted"
        }
    ]
}