{
    "id": "npm/npmjs/-/vue-component-create/0.0.4",
    "license": "MIT",
    "authority": "https://gitlab.eclipse.org/eclipsefdn/emo-team/iplab/-/issues/7449",
    "source": "https://registry.yarnpkg.com/vue-component-create/-/vue-component-create-0.0.4.tgz",
    "status": "approved",
    "scans": [
        {
            "date": "March 22, 2023 at 10:22:41 a.m. GMT",
            "authority": "https://gitlab.eclipse.org/eclipsefdn/emo-team/iplab/-/issues/7449",
            "scancode-version": "31.2.1",
            "licenses-discovered": [
                "MIT"
            ],
            "copyrights": [
            ],
            "file-count": 5,
            "sha256": "2ccd31666e845f3597eb0cb2f33fc07ec0f79dd6599bb780804573f4fd6a959e",
            "source": "https://registry.yarnpkg.com/vue-component-create/-/vue-component-create-0.0.4.tgz",
            "status": "approved"
        }
    ]
}