{
    "id": "npm/npmjs/-/oniguruma-to-es/0.10.0",
    "license": "MIT",
    "authority": "https://gitlab.eclipse.org/eclipsefdn/emo-team/iplab/-/issues/18511",
    "source": "https://github.com/slevithan/oniguruma-to-es/archive/refs/tags/v0.10.0.zip",
    "status": "approved",
    "scans": [
        {
            "date": "January 9, 2025 at 8:39:34 a.m. GMT",
            "authority": "https://gitlab.eclipse.org/eclipsefdn/emo-team/iplab/-/issues/18511",
            "scancode-version": "31.2.1",
            "licenses-discovered": [
                "MIT"
            ],
            "copyrights": [
                "(c) 2024-present",
                "Copyright (c) 2024 Steven Levithan"
            ],
            "file-count": 46,
            "sha256": "143232dbcc2c161f0d57a7aa13e2b641776791f6f393d53dca98d8060337ca5d",
            "source": "https://github.com/slevithan/oniguruma-to-es/archive/refs/tags/v0.10.0.zip",
            "status": "approved"
        }
    ]
}