{
    "id": "maven/mavencentral/org.apache.orc/orc-mapreduce/1.9.2",
    "license": "Apache-2.0",
    "authority": "https://gitlab.eclipse.org/eclipsefdn/emo-team/iplab/-/issues/12735",
    "source": "https://repo1.maven.org/maven2/org/apache/orc/orc-mapreduce/1.9.2/orc-mapreduce-1.9.2-sources.jar",
    "status": "approved",
    "scans": [
        {
            "date": "January 10, 2024 at 11:41:39 p.m. GMT",
            "authority": "https://gitlab.eclipse.org/eclipsefdn/emo-team/iplab/-/issues/12735",
            "scancode-version": "31.2.1",
            "licenses-discovered": [
                "Apache-2.0"
            ],
            "copyrights": [
            ],
            "file-count": 20,
            "sha256": "554cca81cc5de6a072530d2154ba6dbf07019311c3ed38a5a6df3e369ef4dedb",
            "source": "https://repo1.maven.org/maven2/org/apache/orc/orc-mapreduce/1.9.2/orc-mapreduce-1.9.2-sources.jar",
            "status": "approved"
        }
    ]
}