{
    "id": "npm/npmjs/-/diagnostic-channel/1.1.1",
    "license": "MIT",
    "authority": "https://gitlab.eclipse.org/eclipsefdn/emo-team/iplab/-/issues/11766",
    "source": "https://registry.yarnpkg.com/diagnostic-channel/-/diagnostic-channel-1.1.1.tgz",
    "status": "approved",
    "scans": [
        {
            "date": "November 30, 2023 at 6:02:04 p.m. GMT",
            "authority": "https://gitlab.eclipse.org/eclipsefdn/emo-team/iplab/-/issues/11766",
            "scancode-version": "31.2.1",
            "licenses-discovered": [
                "MIT"
            ],
            "copyrights": [
                "Copyright (c) Microsoft Corporation"
            ],
            "file-count": 7,
            "sha256": "ac6297d50cb720e80e5ae89ddcc61c96c58b2a8ba8a2c4d765d3d804d9c5a5a0",
            "source": "https://registry.yarnpkg.com/diagnostic-channel/-/diagnostic-channel-1.1.1.tgz",
            "status": "approved"
        }
    ]
}