{
    "id": "npm/npmjs/-/vite/2.9.13",
    "license": "MIT AND ISC AND Apache-2.0 AND BSD-2-Clause AND CC0-1.0 AND (BSD-3-Clause OR GPL-2.0-only)",
    "authority": "https://gitlab.eclipse.org/eclipsefdn/emo-team/iplab/-/issues/5873",
    "source": "https://registry.npmjs.org/vite/-/vite-2.9.13.tgz",
    "status": "approved",
    "scans": [
        {
            "date": "December 16, 2022 at 10:29:52 a.m. GMT",
            "authority": "https://gitlab.eclipse.org/eclipsefdn/emo-team/iplab/-/issues/5873",
            "scancode-version": "31.2.1",
            "licenses-discovered": [
                "Apache-2.0 AND BSD-2-Clause AND BSD-3-Clause AND CC-BY-SA-4.0 AND CC0-1.0 AND GPL-2.0-only AND ISC AND MIT",
                "MIT",
                "BSD-2-Clause AND BSD-3-Clause",
                "BSD-3-Clause AND LicenseRef-scancode-mit-addition AND MIT",
                "ISC AND MIT"
            ],
            "copyrights": [
                "(c) 2016 Permission",
                "(c) Sindre Sorhus",
                "Copyright (c) 1989, 1991 Free Software Foundation, Inc.",
                "Copyright (c) 2003-2005 Tom Wu",
                "Copyright (c) 2005 Tom Wu",
                "Copyright (c) 2005-2009 Tom Wu",
                "Copyright (c) 2009-2014 Digital Bazaar, Inc.",
                "Copyright (c) 2010 Sencha Inc.",
                "Copyright (c) 2010, Digital Bazaar, Inc.",
                "Copyright (c) 2010-2012 Digital Bazaar, Inc.",
                "Copyright (c) 2010-2013 Digital Bazaar, Inc.",
                "Copyright (c) 2010-2014 Digital Bazaar, Inc.",
                "Copyright (c) 2010-2015 Digital Bazaar, Inc.",
                "Copyright (c) 2010-2016 Charlie Robbins, Jarrett Cruger & the Contributors",
                "Copyright (c) 2010-2018 Digital Bazaar, Inc.",
                "Copyright (c) 2011 Einar Otto Stangvik <einaros@gmail.com>",
                "Copyright (c) 2011 LearnBoost",
                "Copyright (c) 2011 TJ Holowaychuk",
                "Copyright (c) 2011-2014 TJ Holowaychuk",
                "Copyright (c) 2011-2022 Isaac Z. Schlueter, Ben Noordhuis, and Contributors https://github.com/isaacs/node-graceful-fs/blob/main/LICENSE On Windows",
                "Copyright (c) 2012 Ben Ripkens http://bripkens.de",
                "Copyright (c) 2012 Kenji Urushima",
                "Copyright (c) 2012 Stefan Siegl <stesie@brokenpipe.de>",
                "Copyright (c) 2012-2013 TJ Holowaychuk",
                "Copyright (c) 2012-2014 Digital Bazaar, Inc.",
                "Copyright (c) 2012-2015 Digital Bazaar, Inc.",
                "Copyright (c) 2012-2018 Aseem Kishore, and others",
                "Copyright (c) 2012-2019 Paul Miller (https://paulmillr.com), Elan Shanker",
                "Copyright (c) 2012-2019 Thorsten Lorenz, Paul Miller (https://paulmillr.com)",
                "Copyright (c) 2012-2022 by various contributors",
                "Copyright (c) 2013 James Halliday (mail@substack.net)",
                "Copyright (c) 2013 Jonathan Ong",
                "Copyright (c) 2013 Jonathan Ong <me@jongleberry.com>",
                "Copyright (c) 2013 Julian Gruber <julian@juliangruber.com>",
                "Copyright (c) 2013 Troy Goode <troygoode@gmail.com>",
                "Copyright (c) 2013-2014 Digital Bazaar, Inc.",
                "Copyright (c) 2013-2017 Jared Hanson",
                "Copyright (c) 2014 Arnout Kazemier",
                "Copyright (c) 2014 Digital Bazaar, Inc.",
                "Copyright (c) 2014 Douglas Christopher Wilson",
                "Copyright (c) 2014 Douglas Christopher Wilson <doug@somethingdoug.com>",
                "Copyright (c) 2014 Jonathan Ong",
                "Copyright (c) 2014 Jonathan Ong <me@jongleberry.com>",
                "Copyright (c) 2014 Jonathan Ong me@jongleberry.com",
                "Copyright (c) 2014 Maxime Thirouin, Jason Campbell & Kevin Martensson",
                "Copyright (c) 2014 Nathan Rajlich <nathan@tootallnate.net>",
                "Copyright (c) 2014-2016 Douglas Christopher Wilson",
                "Copyright (c) 2014-2016, Jon Schlinkert",
                "Copyright (c) 2014-2017 Douglas Christopher Wilson",
                "Copyright (c) 2014-2017 Douglas Christopher Wilson <doug@somethingdoug.com>",
                "Copyright (c) 2014-2017 TJ Holowaychuk <tj@vision-media.ca>",
                "Copyright (c) 2014-2017, Jon Schlinkert",
                "Copyright (c) 2014-2018, Jon Schlinkert",
                "Copyright (c) 2014-2020 Teambition",
                "Copyright (c) 2014-present, Jon Schlinkert",
                "Copyright (c) 2015 Alexey Litvinov",
                "Copyright (c) 2015 Andreas Lubbe",
                "Copyright (c) 2015 Douglas Christopher Wilson",
                "Copyright (c) 2015 Douglas Christopher Wilson <doug@somethingdoug.com>",
                "Copyright (c) 2015 Matteo Collina",
                "Copyright (c) 2015 Rich Harris",
                "Copyright (c) 2015 Tiancheng Timothy Gu",
                "Copyright (c) 2015 Unshift.io, Arnout Kazemier",
                "Copyright (c) 2015, 2019 Elan Shanker",
                "Copyright (c) 2015, Glen Maddern",
                "Copyright (c) 2015, Scott Motte",
                "Copyright (c) 2015-20 these people (https://github.com/Rich-Harris/estree-walker/graphs/contributors)",
                "Copyright (c) 2015-2020, Matteo Collina <matteo.collina@gmail.com>",
                "Copyright (c) 2015-present, Facebook, Inc.",
                "Copyright (c) 2015-present, Facebook, Inc. https://github.com/facebook/create-react-app/blob/master/LICENSE",
                "Copyright (c) 2015-present, Jon Schlinkert",
                "Copyright (c) 2016 Douglas Christopher Wilson",
                "Copyright (c) 2016 Douglas Christopher Wilson <doug@somethingdoug.com>",
                "Copyright (c) 2016 Zeit, Inc.",
                "Copyright (c) 2016, Scott Motte",
                "Copyright (c) 2017-present, Jon Schlinkert",
                "Copyright (c) 2018 Made With MOXY Lda",
                "Copyright (c) 2018-2021 Josh Junon",
                "Copyright (c) 2018-2022 Guy Bedford",
                "Copyright (c) 2018-present, Yuxi",
                "Copyright (c) 2019 Elan Shanker, Paul Miller (https://paulmillr.com)",
                "Copyright (c) 2019 Rich Harris",
                "Copyright (c) 2019 RollupJS",
                "Copyright (c) 2019 Sindre Sorhus <sindresorhus@gmail.com> (https://sindresorhus.com), Paul Miller (https://paulmillr.com)",
                "Copyright (c) 2019-present, Yuxi",
                "Copyright (c) 2020-present, Yuxi",
                "Copyright (c) 2021 Alexey Raspopov, Kostiantyn Denysov, Anton Verinov",
                "Copyright (c) 2021-present dominikg and contributors (https://github.com/dominikg/tsconfck/graphs/contributors)",
                "Copyright (c) 2022 Anthony Fu <https://github.com/antfu>",
                "Copyright (c) Ben Briggs <beneb.info@gmail.com> (http://beneb.info)",
                "Copyright (c) Bogdan Chadkin <trysound@yandex.ru>",
                "Copyright (c) Denis Malinochkin",
                "Copyright (c) EGOIST",
                "Copyright (c) Ellis Pritchard, Guardian Unlimited 2003",
                "Copyright (c) Feross Aboukhadijeh",
                "Copyright (c) Isaac Z. Schlueter",
                "Copyright (c) Isaac Z. Schlueter and Contributors",
                "Copyright (c) Kevin Martensson <kevinmartensson@gmail.com>",
                "Copyright (c) Luke Edwards <luke.edwards05@gmail.com> (https://lukeed.com)",
                "Copyright (c) Luke Edwards <luke.edwards05@gmail.com> (lukeed.com)",
                "Copyright (c) Sindre Sorhus <sindresorhus@gmail.com> (https://sindresorhus.com)",
                "Copyright (c) Sindre Sorhus <sindresorhus@gmail.com> (sindresorhus.com)",
                "Copyright 2009-2011 Mozilla Foundation and contributors",
                "Copyright 2011 Mozilla Foundation and contributors",
                "Copyright 2011 The Closure Compiler Authors",
                "Copyright 2011-2016 Digital Bazaar, Inc.",
                "Copyright 2011-2017 Digital Bazaar, Inc.",
                "Copyright 2012 (c) Mihai Bazon <mihai.bazon@gmail.com>",
                "Copyright 2012 Stefan Siegl <stesie@brokenpipe.de>",
                "Copyright 2012-2018 (c) Mihai Bazon <mihai.bazon@gmail.com>",
                "Copyright 2013 Thorsten Lorenz",
                "Copyright 2014 Mozilla Foundation and contributors",
                "Copyright 2014-present Olivier Lalonde <olalonde@gmail.com> , James Talmage <james@talmage.io> , Ruben Verborgh",
                "Copyright 2015 Glen Maddern",
                "Copyright 2015 Mark Dalgleish <mark.john.dalgleish@gmail.com>",
                "Copyright 2015-present Alexander Madyankin <alexander@madyankin.name>",
                "Copyright 2016 Bogdan Chadkin <trysound@yandex.ru>",
                "Copyright 2018 Eemeli Aro <eemeli@gmail.com>",
                "Copyright 2018 Glen Maddern",
                "Copyright 2018 Rich Harris",
                "Copyright 2019 Google LLC",
                "Copyright 2019 Justin Ridgewell <jridgewell@google.com>",
                "Copyright 2022 Justin Ridgewell <jridgewell@google.com>",
                "Copyright 2022 Justin Ridgewell <justin@ridgewell.name>",
                "Copyright JS Foundation and other contributors",
                "Copyright Jeremy Ashkenas, DocumentCloud and Investigative Reporters & Editors",
                "Copyright Joyent, Inc. and other Node contributors",
                "Copyright Mathias Bynens <https://mathiasbynens.be/>",
                "Copyright Michael Ciniawsky <michael.ciniawsky@gmail.com>",
                "Copyright base-x contributors",
                "Copyright jQuery Foundation and other contributors <https://jquery.org/>",
                "copyright Jeremy Ashkenas, DocumentCloud and Investigative Reporters & Editors <http://underscorejs.org/>",
                "copyrighted by the Free Software Foundation"
            ],
            "file-count": 39,
            "sha256": "2cdf497f5c7fc6834fe6b56be0bc2bf502c3187db9853294dc3324dd01cff217",
            "source": "https://registry.npmjs.org/vite/-/vite-2.9.13.tgz",
            "status": "restricted"
        }
    ]
}
