{
    "id": "maven/mavencentral/software.amazon.awssdk/auth/2.21.5",
    "license": "Apache-2.0",
    "authority": "https://gitlab.eclipse.org/eclipsefdn/emo-team/iplab/-/issues/11139",
    "source": "https://repo.maven.apache.org/maven2/software/amazon/awssdk/auth/2.21.5/auth-2.21.5-sources.jar",
    "status": "approved",
    "scans": [
        {
            "date": "October 24, 2023 at 10:33:57 a.m. GMT",
            "authority": "https://gitlab.eclipse.org/eclipsefdn/emo-team/iplab/-/issues/11139",
            "scancode-version": "31.2.1",
            "licenses-discovered": [
                "Apache-2.0"
            ],
            "copyrights": [
                "Copyright Amazon.com, Inc. or its affiliates"
            ],
            "file-count": 82,
            "sha256": "0f0187a9e78ff3cae4ec15cb4f75585bb02daeab78f2c597309370acb10f7b0c",
            "source": "https://repo.maven.apache.org/maven2/software/amazon/awssdk/auth/2.21.5/auth-2.21.5-sources.jar",
            "status": "approved"
        }
    ]
}