{
    "id": "npm/npmjs/-/vscode-uri/3.0.7",
    "license": "MIT",
    "authority": "https://gitlab.eclipse.org/eclipsefdn/emo-team/iplab/-/issues/5741",
    "source": "https://registry.npmjs.org/vscode-uri/-/vscode-uri-3.0.7.tgz",
    "status": "approved",
    "scans": [
        {
            "date": "December 13, 2022 at 8:20:27 p.m. GMT",
            "authority": "https://gitlab.eclipse.org/eclipsefdn/emo-team/iplab/-/issues/5741",
            "scancode-version": "31.2.1",
            "licenses-discovered": [
                "MIT"
            ],
            "copyrights": [
                "Copyright (c) Microsoft",
                "Copyright (c) Microsoft Corporation",
                "Copyright Joyent, Inc. and other Node contributors"
            ],
            "file-count": 19,
            "sha256": "bca22434ed068f692c381d87ed6041969f4f87e8d795a6e07827a325df25271b",
            "source": "https://registry.npmjs.org/vscode-uri/-/vscode-uri-3.0.7.tgz",
            "status": "approved"
        }
    ]
}