{
    "id": "maven/mavencentral/org.hibernate.validator/hibernate-validator/8.0.2.Final",
    "license": "Apache-2.0 AND CC-PDDC",
    "authority": "https://gitlab.eclipse.org/eclipsefdn/emo-team/iplab/-/issues/18198",
    "source": "https://repo1.maven.org/maven2/org/hibernate/validator/hibernate-validator/8.0.2.Final/hibernate-validator-8.0.2.Final-sources.jar",
    "status": "approved",
    "scans": [
        {
            "date": "January 6, 2025 at 7:28:37 a.m. GMT",
            "authority": "https://gitlab.eclipse.org/eclipsefdn/emo-team/iplab/-/issues/18198",
            "scancode-version": "31.2.1",
            "licenses-discovered": [
                "Apache-2.0",
                "Apache-2.0 AND CC-PDDC"
            ],
            "copyrights": [
                "(c) 2011 SERLI",
                "(c) 2012 SERLI",
                "Copyright 2009 IIZUKA Software Technologies Ltd"
            ],
            "file-count": 828,
            "sha256": "0aab1586afca8098aac4d92e1c54d06cf23460f89b68977524099f7652ef01de",
            "source": "https://repo1.maven.org/maven2/org/hibernate/validator/hibernate-validator/8.0.2.Final/hibernate-validator-8.0.2.Final-sources.jar",
            "status": "restricted"
        }
    ]
}