{
    "id": "pypi/pypi/-/pyzmq/25.1.0",
    "license": "Apache-2.0 AND BSD-3-Clause AND LGPL-2.0-or-later AND LGPL-3.0-only AND BSD-3-Clause AND (GPL-3.0-only AND LicenseRef-scancode-zeromq-exception-lgpl-3.0) AND (BSD-3-Clause AND LGPL-2.0-or-later) AND LGPL-3.0-only AND GPL-3.0-only AND BSD-2-Clause AND (LGPL-3.0-or-later AND LicenseRef-scancode-zeromq-exception-lgpl-3.0) AND CC-BY-SA-3.0 AND GPL-3.0-or-later AND (BSD-2-Clause AND BSD-3-Clause) AND (Apache-2.0 AND BSD-3-Clause AND LGPL-2.0-or-later AND LGPL-2.1-only AND LGPL-3.0-only AND LicenseRef-scancode-other-copyleft AND LicenseRef-scancode-zeromq-exception-lgpl-3.0) AND (BSD-3-Clause AND LGPL-3.0-or-later AND LicenseRef-scancode-other-copyleft AND LicenseRef-scancode-other-permissive AND MIT) AND (BSD-3-Clause AND LGPL-3.0-only) AND (BSD-3-Clause AND MPL-2.0) AND LGPL-2.0-or-later AND (LicenseRef-scancode-free-unknown AND MPL-1.0 AND MPL-2.0) AND (MPL-1.0 AND MPL-2.0) AND (BSD-3-Clause AND LGPL-2.0-or-later AND LGPL-3.0-only AND MPL-2.0) AND LGPL-3.0-or-later AND (GPL-3.0-or-later AND LGPL-3.0-only) AND Apache-2.0 AND (LGPL-2.0-or-later AND LGPL-2.1-only)",
    "authority": "https://gitlab.eclipse.org/eclipsefdn/emo-team/iplab/-/issues/15012",
    "source": "https://files.pythonhosted.org/packages/64/9c/2b2614b0b86ff703b3a33ea5e044923bd7d100adc8c829d579a9b71ea9e7/pyzmq-25.1.0.tar.gz",
    "status": "restricted",
    "scans": [
        {
            "date": "May 29, 2024 at 4:22:01 p.m. GMT",
            "authority": "https://gitlab.eclipse.org/eclipsefdn/emo-team/iplab/-/issues/15012",
            "scancode-version": "31.2.1",
            "licenses-discovered": [
                "Apache-2.0 AND BSD-3-Clause AND LGPL-2.0-or-later AND LGPL-3.0-only",
                "BSD-3-Clause",
                "GPL-3.0-only AND LicenseRef-scancode-zeromq-exception-lgpl-3.0",
                "BSD-3-Clause AND LGPL-2.0-or-later",
                "LGPL-3.0-only",
                "GPL-3.0-only",
                "BSD-2-Clause",
                "LGPL-3.0-or-later AND LicenseRef-scancode-zeromq-exception-lgpl-3.0",
                "CC-BY-SA-3.0",
                "GPL-3.0-or-later",
                "BSD-2-Clause AND BSD-3-Clause",
                "Apache-2.0 AND BSD-3-Clause AND LGPL-2.0-or-later AND LGPL-2.1-only AND LGPL-3.0-only AND LicenseRef-scancode-other-copyleft AND LicenseRef-scancode-zeromq-exception-lgpl-3.0",
                "BSD-3-Clause AND LGPL-3.0-or-later AND LicenseRef-scancode-other-copyleft AND LicenseRef-scancode-other-permissive AND MIT",
                "BSD-3-Clause AND LGPL-3.0-only",
                "BSD-3-Clause AND MPL-2.0",
                "LGPL-2.0-or-later",
                "LicenseRef-scancode-free-unknown AND MPL-1.0 AND MPL-2.0",
                "MPL-1.0 AND MPL-2.0",
                "BSD-3-Clause AND LGPL-2.0-or-later AND LGPL-3.0-only AND MPL-2.0",
                "LGPL-3.0-or-later",
                "GPL-3.0-or-later AND LGPL-3.0-only",
                "Apache-2.0",
                "LGPL-2.0-or-later AND LGPL-2.1-only"
            ],
            "copyrights": [
                "(c) PyZMQ Developers",
                "(c) iMatix Corporation",
                "Copyright (c) 2003-2007 Robey Pointer <robeypointer@gmail.com>",
                "Copyright (c) 2007 Free Software Foundation, Inc. <http://fsf.org/>",
                "Copyright (c) 2007 Free Software Foundation, Inc. <https://fsf.org/>",
                "Copyright (c) 2007-2010 iMatix Corporation",
                "Copyright (c) 2007-2016 Contributors as noted in the AUTHORS file",
                "Copyright (c) 2007-2017 Contributors as noted in the AUTHORS file",
                "Copyright (c) 2007-2018 Contributors as noted in the AUTHORS file",
                "Copyright (c) 2007-2019 Contributors as noted in the AUTHORS file",
                "Copyright (c) 2007-2020 Contributors as noted in the AUTHORS file",
                "Copyright (c) 2009-2012, Brian Granger, Min Ragan-Kelley",
                "Copyright (c) 2010 Andrew Gwozdziewycz",
                "Copyright (c) 2010 Brian E. Granger & Min Ragan-Kelley",
                "Copyright (c) 2010 Brian Granger",
                "Copyright (c) 2010 Brian Granger, Fernando Perez",
                "Copyright (c) 2010 Brian Granger, Min Ragan-Kelley",
                "Copyright (c) 2010 Justin Riley",
                "Copyright (c) 2010 Lisandro Dalcin",
                "Copyright (c) 2010 Min Ragan-Kelley, Brian Granger",
                "Copyright (c) 2010 The IPython Team",
                "Copyright (c) 2010-2011 Brian E. Granger & Min Ragan-Kelley",
                "Copyright (c) 2010-2011 IPython Development Team",
                "Copyright (c) 2010-2012 Brian Granger, Min Ragan-Kelley",
                "Copyright (c) 2011- PyZMQ Developers",
                "Copyright (c) 2011-2012 Travis Cline",
                "Copyright (c) 2012 Godefroid Chapelle",
                "Copyright (c) 2012 The ZeroMQ Authors",
                "Copyright (c) 2013 Brian E. Granger & Min Ragan-Kelley",
                "Copyright (c) 2016 Contributors as noted in the AUTHORS file",
                "Copyright (c) 2016-2017 Contributors as noted in the AUTHORS file",
                "Copyright (c) 2017-2019 SUSE LINUX GmbH, Nuernberg, Germany",
                "Copyright (c) 2018 Contributors as noted in the AUTHORS file",
                "Copyright (c) 2019 Contributors as noted in the AUTHORS file",
                "Copyright (c) 2020 Contributors as noted in the AUTHORS file",
                "Copyright (c) 2022 PyZMQ Developers",
                "Copyright (c) PyZMQ Developers",
                "Copyright (c) PyZMQ Development Team",
                "Copyright (c) Stef van der Struijk",
                "Copyright 2003-2007, Robey Pointer <robeypointer@gmail.com> , 2010-2011, IPython Development Team",
                "Copyright 2007-2010, iMatix Corporation 2013 Brian Granger, Min Ragan-Kelley",
                "Copyright 2009 Facebook",
                "Copyright 2009, Facebook",
                "Copyright 2010, Andrew Gwozdziewycz",
                "Copyright 2010, Brian E. Granger 2010, Min Ragan-Kelley",
                "Copyright 2010, Justin Riley",
                "Copyright 2010, Nikolaus Rath <Nikolaus@rath.org>",
                "Copyright 2010-2011, Brian E. Granger 2010, Andrew Gwozdziewycz 2010, Fernando Perez 2011, 2013, Min Ragan-Kelley",
                "Copyright 2010-2011, Miguel Landaeta <miguel@miguel.cc> 2011-2014, Julian Taylor",
                "Copyright 2010-2012, Brian Granger 2010-2013, Min Ragan-Kelley 2013 Felipe Cruz 2014 PyZMQ Developers",
                "Copyright 2012-2018, Bert Belder <bertbelder@gmail.com>",
                "copyright Brian E. Granger & Min Ragan-Kelley. OMQ",
                "copyright of Boris Feld",
                "copyright of Brian E. Granger",
                "copyright of Chris Laws",
                "copyright of Frank Wiles",
                "copyright of Julian Taylor",
                "copyright of Min Ragan-Kelley",
                "copyright of Thomas Kluyver"
            ],
            "file-count": 619,
            "sha256": "80c41023465d36280e801564a69cbfce8ae85ff79b080e1913f6e90481fb8957",
            "source": "https://files.pythonhosted.org/packages/64/9c/2b2614b0b86ff703b3a33ea5e044923bd7d100adc8c829d579a9b71ea9e7/pyzmq-25.1.0.tar.gz",
            "status": "restricted"
        }
    ]
}