{
    "id": "p2/orbit/p2.eclipse.plugin/org.objectweb.asm.tree/9.4.0.v20221107-1714",
    "license": "BSD-3-Clause",
    "authority": "https://gitlab.eclipse.org/eclipsefdn/emo-team/iplab/-/issues/5319",
    "source": "https://search.maven.org/remotecontent?filepath=org/ow2/asm/asm-tree/9.4/asm-tree-9.4-sources.jar",
    "status": "approved",
    "scans": [
        {
            "date": "December 2, 2022 at 5:47:38 p.m. GMT",
            "authority": "https://gitlab.eclipse.org/eclipsefdn/emo-team/iplab/-/issues/5319",
            "scancode-version": "31.2.1",
            "licenses-discovered": [
                "BSD-3-Clause"
            ],
            "copyrights": [
                "Copyright (c) 2000-2011 INRIA, France Telecom"
            ],
            "file-count": 38,
            "sha256": "0c9fde06c67ed2a73460bb22145ea241af43b34eae1e0ad6f56172ee02904b08",
            "source": "https://search.maven.org/remotecontent?filepath=org/ow2/asm/asm-tree/9.4/asm-tree-9.4-sources.jar",
            "status": "approved"
        }
    ]
}