{
    "id": "maven/mavencentral/com.google.api.grpc/proto-google-cloud-secretmanager-v1/2.52.0",
    "license": "Apache-2.0",
    "authority": "https://gitlab.eclipse.org/eclipsefdn/emo-team/iplab/-/issues/16758",
    "source": "https://repo1.maven.org/maven2/com/google/api/grpc/proto-google-cloud-secretmanager-v1/2.52.0/proto-google-cloud-secretmanager-v1-2.52.0-sources.jar",
    "status": "approved",
    "scans": [
        {
            "date": "October 17, 2024, 3:49:22 a.m. GMT",
            "authority": "https://gitlab.eclipse.org/eclipsefdn/emo-team/iplab/-/issues/16758",
            "scancode-version": "31.2.1",
            "licenses-discovered": [
                "Apache-2.0"
            ],
            "copyrights": [
                "Copyright 2024 Google LLC"
            ],
            "file-count": 59,
            "sha256": "1b41505270d4290182b1d57e5681e6da08fc42c064d1894b2a3a0afacb5d0d2a",
            "source": "https://repo1.maven.org/maven2/com/google/api/grpc/proto-google-cloud-secretmanager-v1/2.52.0/proto-google-cloud-secretmanager-v1-2.52.0-sources.jar",
            "status": "approved"
        }
    ]
}