{
    "id": "p2/orbit/p2.eclipse.plugin/org.pushingpixels.trident/1.3.0.v20231219-1530",
    "license": "BSD-3-Clause",
    "authority": "https://gitlab.eclipse.org/eclipsefdn/emo-team/iplab/-/issues/12175",
    "source": "https://repo1.maven.org/maven2/org/pushingpixels/trident/1.3/trident-1.3-sources.jar",
    "status": "approved",
    "scans": [
        {
            "date": "December 21, 2023 at 7:53:02 p.m. GMT",
            "authority": "https://gitlab.eclipse.org/eclipsefdn/emo-team/iplab/-/issues/12175",
            "scancode-version": "31.2.1",
            "licenses-discovered": [
                "BSD-3-Clause"
            ],
            "copyrights": [
                "Copyright (c) 2005-2006, Sun Microsystems, Inc",
                "Copyright (c) 2005-2010 Trident Kirill Grouchnikov",
                "Copyright (c) 2006, Sun Microsystems, Inc"
            ],
            "file-count": 39,
            "sha256": "dafde39e80d3242fe4cd154ce9fa56f70bb6b65a3028aec33ab6e703956763ac",
            "source": "https://repo1.maven.org/maven2/org/pushingpixels/trident/1.3/trident-1.3-sources.jar",
            "status": "approved"
        }
    ]
}