{
    "id": "maven/mavencentral/io.swagger.core.v3/swagger-integration-jakarta/2.2.18",
    "license": "Apache-2.0",
    "authority": "https://gitlab.eclipse.org/eclipsefdn/emo-team/iplab/-/issues/11475",
    "source": "https://repo1.maven.org/maven2/io/swagger/core/v3/swagger-integration-jakarta/2.2.18/swagger-integration-jakarta-2.2.18-sources.jar",
    "status": "approved",
    "scans": [
        {
            "date": "November 9, 2023 at 8:07:17 a.m. GMT",
            "authority": "https://gitlab.eclipse.org/eclipsefdn/emo-team/iplab/-/issues/11475",
            "scancode-version": "31.2.1",
            "licenses-discovered": [
                "Apache-2.0"
            ],
            "copyrights": [
                "Copyright (c) 2015. SmartBear Software Inc."
            ],
            "file-count": 5,
            "sha256": "e77bc83b756f10da274d527d3f97b0336d70220b1ec2742945e9b1a46c3b867f",
            "source": "https://repo1.maven.org/maven2/io/swagger/core/v3/swagger-integration-jakarta/2.2.18/swagger-integration-jakarta-2.2.18-sources.jar",
            "status": "approved"
        }
    ]
}