{
    "id": "pypi/pypi/-/fb-re2/1.0.7",
    "license": "BSD-3-Clause",
    "authority": "https://gitlab.eclipse.org/eclipsefdn/emo-team/iplab/-/issues/4773",
    "source": "https://files.pythonhosted.org/packages/4b/39/e2f57ddd1c00c54e2a3a868d2ebb2c8674325e42308e88e2ae4842d03bc0/fb-re2-1.0.7.tar.gz",
    "status": "approved",
    "scans": [
        {
            "date": "November 10, 2022 at 8:32:10 p.m. GMT",
            "authority": "https://gitlab.eclipse.org/eclipsefdn/emo-team/iplab/-/issues/4773",
            "scancode-version": "31.2.1",
            "licenses-discovered": [
                "BSD-3-Clause"
            ],
            "copyrights": [
                "Copyright (c) 2010, David Reiss and Facebook, Inc."
            ],
            "file-count": 10,
            "sha256": "83b2c2cd58d3874e6e3a784cf4cf2f1a57ce1969e50180f92b010eea24ef26cf",
            "source": "https://files.pythonhosted.org/packages/4b/39/e2f57ddd1c00c54e2a3a868d2ebb2c8674325e42308e88e2ae4842d03bc0/fb-re2-1.0.7.tar.gz",
            "status": "approved"
        }
    ]
}