{
    "id": "maven/mavencentral/io.etcd/jetcd-core/0.7.6",
    "license": "Apache-2.0",
    "authority": "https://gitlab.eclipse.org/eclipsefdn/emo-team/iplab/-/issues/11326",
    "source": "https://repo.maven.apache.org/maven2/io/etcd/jetcd-core/0.7.6/jetcd-core-0.7.6-sources.jar",
    "status": "approved",
    "scans": [
        {
            "date": "October 26, 2023 at 7:19:18 p.m. GMT",
            "authority": "https://gitlab.eclipse.org/eclipsefdn/emo-team/iplab/-/issues/11326",
            "scancode-version": "31.2.1",
            "licenses-discovered": [
                "Apache-2.0"
            ],
            "copyrights": [
                "Copyright 2016-2021 The jetcd"
            ],
            "file-count": 110,
            "sha256": "67558ef03e50204484bf73f8e19c35d99fe35b5a60b88c1800aeac0f75e34cfc",
            "source": "https://repo.maven.apache.org/maven2/io/etcd/jetcd-core/0.7.6/jetcd-core-0.7.6-sources.jar",
            "status": "approved"
        }
    ]
}