{
    "id": "maven/mavencentral/io.github.openfeign/feign-hc5/13.0",
    "license": "Apache-2.0",
    "authority": "https://gitlab.eclipse.org/eclipsefdn/emo-team/iplab/-/issues/12151",
    "source": "https://repo1.maven.org/maven2/io/github/openfeign/feign-hc5/13.0/feign-hc5-13.0-sources.jar",
    "status": "approved",
    "scans": [
        {
            "date": "December 18, 2023 at 9:33:31 a.m. GMT",
            "authority": "https://gitlab.eclipse.org/eclipsefdn/emo-team/iplab/-/issues/12151",
            "scancode-version": "31.2.1",
            "licenses-discovered": [
                "Apache-2.0"
            ],
            "copyrights": [
                "Copyright 2012-2023 The Feign Authors"
            ],
            "file-count": 5,
            "sha256": "5f878a35e3933a79b81aac25adbcfa321c11cd1c0f9f548727aa248298df8915",
            "source": "https://repo1.maven.org/maven2/io/github/openfeign/feign-hc5/13.0/feign-hc5-13.0-sources.jar",
            "status": "approved"
        }
    ]
}