{
    "id": "npm/npmjs/-/archiver-utils/3.0.4",
    "license": "MIT",
    "authority": "https://gitlab.eclipse.org/eclipsefdn/emo-team/iplab/-/issues/10365",
    "source": "https://github.com/archiverjs/archiver-utils/archive/refs/tags/3.0.4.zip",
    "status": "approved",
    "scans": [
        {
            "date": "September 8, 2023 at 2:19:58 p.m. GMT",
            "authority": "https://gitlab.eclipse.org/eclipsefdn/emo-team/iplab/-/issues/10365",
            "scancode-version": "31.2.1",
            "licenses-discovered": [
                "MIT"
            ],
            "copyrights": [
                "Copyright (c) 2012-2014 Chris Talkington",
                "Copyright (c) 2015 Chris Talkington"
            ],
            "file-count": 21,
            "sha256": "7ac9a025147204e84d20be7340a3f7aa4c2bc206539aa6fc650a98627c7bc179",
            "source": "https://github.com/archiverjs/archiver-utils/archive/refs/tags/3.0.4.zip",
            "status": "approved"
        }
    ]
}