{
    "id": "npm/npmjs/@babel/helpers/7.22.5",
    "license": "MIT",
    "authority": "https://gitlab.eclipse.org/eclipsefdn/emo-team/iplab/-/issues/9060",
    "source": "https://registry.npmjs.org/@babel/helpers/-/helpers-7.22.5.tgz",
    "status": "approved",
    "scans": [
        {
            "date": "June 15, 2023 at 4:30:22 p.m. GMT",
            "authority": "https://gitlab.eclipse.org/eclipsefdn/emo-team/iplab/-/issues/9060",
            "scancode-version": "31.2.1",
            "licenses-discovered": [
                "MIT"
            ],
            "copyrights": [
                "Copyright (c) 2014-present Sebastian McKenzie and other contributors",
                "Copyright (c) 2014-present, Facebook, Inc."
            ],
            "file-count": 54,
            "sha256": "0df4f24b06939ad25e6c0538ec3fcaab2facdb01e947d827b2345c2fe3145d68",
            "source": "https://registry.npmjs.org/@babel/helpers/-/helpers-7.22.5.tgz",
            "status": "approved"
        }
    ]
}