{
    "id": "maven/mavencentral/org.geotools.xsd/gt-xsd-filter/31.0",
    "license": "LGPL-2.1-only",
    "authority": "https://gitlab.eclipse.org/eclipsefdn/emo-team/iplab/-/issues/13895",
    "source": "https://repo.osgeo.org/repository/geotools-releases/org/geotools/xsd/gt-xsd-filter/31.0/gt-xsd-filter-31.0-sources.jar",
    "status": "approved",
    "scans": [
        {
            "date": "March 19, 2024 at 8:59:20 p.m. GMT",
            "authority": "https://gitlab.eclipse.org/eclipsefdn/emo-team/iplab/-/issues/13895",
            "scancode-version": "31.2.1",
            "licenses-discovered": [
                "LGPL-2.1-only"
            ],
            "copyrights": [
                "(c) 2002-2008, Open Source Geospatial Foundation",
                "(c) 2002-2015, Open Source Geospatial Foundation",
                "(c) 2002-2019, Open Source Geospatial Foundation",
                "(c) 2012, Open Source Geospatial Foundation",
                "Copyright (c) 2002,2003,2004,2010 Open Geospatial Consortium",
                "Copyright (c) 2002,2003,2004,2010 Open Geospatial Consortium. To",
                "Copyright (c) 2010 Open Geospatial Consortium. To"
            ],
            "file-count": 88,
            "sha256": "5cb6faafedc3696c868707be4e35b93e51a18db47a86b605154bfc7d0b8b91d7",
            "source": "https://repo.osgeo.org/repository/geotools-releases/org/geotools/xsd/gt-xsd-filter/31.0/gt-xsd-filter-31.0-sources.jar",
            "status": "approved"
        }
    ]
}