{
    "id": "go/golang/gopkg.in/check.v1/v1.0.0-20200227125254-8fa46927fb4f",
    "license": "BSD-3-Clause AND BSD-2-Clause",
    "authority": "https://gitlab.eclipse.org/eclipsefdn/emo-team/iplab/-/issues/6113",
    "source": "https://proxy.golang.org/gopkg.in/check.v1/@v/v1.0.0-20200227125254-8fa46927fb4f.zip",
    "status": "approved",
    "scans": [
        {
            "date": "January 5, 2023 at 9:53:20 p.m. GMT",
            "authority": "https://gitlab.eclipse.org/eclipsefdn/emo-team/iplab/-/issues/6113",
            "scancode-version": "31.2.1",
            "licenses-discovered": [
                "BSD-3-Clause",
                "BSD-2-Clause"
            ],
            "copyrights": [
                "Copyright (c) 2010-2013 Gustavo Niemeyer <gustavo@niemeyer.net>",
                "Copyright (c) 2012 The Go Authors"
            ],
            "file-count": 23,
            "sha256": "dbd4ccdf6e1740df06b141ff0cf6bd4b24e5a659adb5174cb3f7bfc798a21ed1",
            "source": "https://proxy.golang.org/gopkg.in/check.v1/@v/v1.0.0-20200227125254-8fa46927fb4f.zip",
            "status": "approved"
        }
    ]
}