{
    "id": "nuget/nuget/-/NJsonSchema/10.8.0",
    "license": "MIT",
    "authority": "https://gitlab.eclipse.org/eclipsefdn/emo-team/iplab/-/issues/14804",
    "source": "https://github.com/RicoSuter/NJsonSchema/archive/refs/tags/v10.8.0.zip",
    "status": "approved",
    "scans": [
        {
            "date": "May 20, 2024 at 10:32:40 p.m. GMT",
            "authority": "https://gitlab.eclipse.org/eclipsefdn/emo-team/iplab/-/issues/14804",
            "scancode-version": "31.2.1",
            "licenses-discovered": [
                "LicenseRef-scancode-newton-king-cla",
                "MIT"
            ],
            "copyrights": [
                "(c) As UTF16",
                "Copyright (c) 2016 Rico Suter",
                "Copyright (c) Rico Suter",
                "Copyright (c) Rico Suter, 2022"
            ],
            "file-count": 452,
            "sha256": "c4ad68059e1ed91c75610948d4aa538d0ca12d7f618c55c884f30288417ed29f",
            "source": "https://github.com/RicoSuter/NJsonSchema/archive/refs/tags/v10.8.0.zip",
            "status": "restricted"
        }
    ]
}