{
    "id": "maven/mavencentral/com.fasterxml.jackson.core/jackson-core/2.16.0",
    "license": "Apache-2.0 AND MIT",
    "authority": "https://gitlab.eclipse.org/eclipsefdn/emo-team/iplab/-/issues/11602",
    "source": "https://repo1.maven.org/maven2/com/fasterxml/jackson/core/jackson-core/2.16.0/jackson-core-2.16.0-sources.jar",
    "status": "approved",
    "scans": [
        {
            "date": "November 16, 2023 at 9:23:24 a.m. GMT",
            "authority": "https://gitlab.eclipse.org/eclipsefdn/emo-team/iplab/-/issues/11602",
            "scancode-version": "31.2.1",
            "licenses-discovered": [
                "MIT",
                "Apache-2.0",
                "Apache-2.0 AND LicenseRef-scancode-free-unknown AND MIT"
            ],
            "copyrights": [
                "(c) Override public ObjectCodec",
                "Copyright (c) 2007- Tatu Saloranta, tatu.saloranta@iki.fi",
                "Copyright (c) 2023 Werner Randelshofer, Switzerland",
                "Copyright 2007-, Tatu Saloranta (tatu.saloranta@iki.fi)",
                "Copyright 2018-2020 Raffaello Giulietti"
            ],
            "file-count": 142,
            "sha256": "ea95a196a9ad7abdcd0b72fa079b307cccaa1d123b727dfb62b0cbefe6cfd864",
            "source": "https://repo1.maven.org/maven2/com/fasterxml/jackson/core/jackson-core/2.16.0/jackson-core-2.16.0-sources.jar",
            "status": "restricted"
        }
    ]
}
