{
    "id": "npm/npmjs/@electron/asar/3.2.9",
    "license": "MIT",
    "authority": "https://gitlab.eclipse.org/eclipsefdn/emo-team/iplab/-/issues/13902",
    "source": "https://github.com/electron/asar/archive/refs/tags/v3.2.9.zip",
    "status": "approved",
    "scans": [
        {
            "date": "March 20, 2024 at 10:20:15 a.m. GMT",
            "authority": "https://gitlab.eclipse.org/eclipsefdn/emo-team/iplab/-/issues/13902",
            "scancode-version": "31.2.1",
            "licenses-discovered": [
                "MIT"
            ],
            "copyrights": [
                "Copyright (c) 2014 GitHub Inc."
            ],
            "file-count": 82,
            "sha256": "b7e122f50c52e7b527f85ff8585ea4146ccde512a00186a46273dbb1927350ce",
            "source": "https://github.com/electron/asar/archive/refs/tags/v3.2.9.zip",
            "status": "approved"
        }
    ]
}