{
    "id": "npm/npmjs/@storybook/docs-tools/7.0.21",
    "license": "MIT",
    "authority": "https://gitlab.eclipse.org/eclipsefdn/emo-team/iplab/-/issues/9070",
    "source": "https://registry.npmjs.org/@storybook/docs-tools/-/docs-tools-7.0.21.tgz",
    "status": "approved",
    "scans": [
        {
            "date": "June 15, 2023 at 4:25:28 p.m. GMT",
            "authority": "https://gitlab.eclipse.org/eclipsefdn/emo-team/iplab/-/issues/9070",
            "scancode-version": "31.2.1",
            "licenses-discovered": [
                "MIT"
            ],
            "copyrights": [
            ],
            "file-count": 13,
            "sha256": "2b8b6ffe451b58d3e1e0f79dea66a1ab75d1e6e8b3660c7e8ce09b5e7c0a758e",
            "source": "https://registry.npmjs.org/@storybook/docs-tools/-/docs-tools-7.0.21.tgz",
            "status": "approved"
        }
    ]
}