{
    "id": "maven/mavencentral/org.apache.spark/spark-graphx_2.12/3.3.0",
    "license": "Apache-2.0",
    "authority": "https://gitlab.eclipse.org/eclipsefdn/emo-team/iplab/-/issues/6760",
    "source": "https://search.maven.org/remotecontent?filepath=org/apache/spark/spark-graphx_2.12/3.3.0/spark-graphx_2.12-3.3.0-sources.jar",
    "status": "approved",
    "scans": [
        {
            "date": "January 27, 2023 at 10:55:33 p.m. GMT",
            "authority": "https://gitlab.eclipse.org/eclipsefdn/emo-team/iplab/-/issues/6760",
            "scancode-version": "31.2.1",
            "licenses-discovered": [
                "Apache-2.0"
            ],
            "copyrights": [
            ],
            "file-count": 47,
            "sha256": "4191c51b990bd455a5c1962dc4393f53724edae93d007de4032cc4268410aa90",
            "source": "https://search.maven.org/remotecontent?filepath=org/apache/spark/spark-graphx_2.12/3.3.0/spark-graphx_2.12-3.3.0-sources.jar",
            "status": "approved"
        }
    ]
}