{
    "id": "maven/mavencentral/org.apache.maven.shared/maven-verifier/1.8.0",
    "license": "Apache-2.0",
    "licenses-discovered": [
        "Apache-2.0"
    ],
    "file-count": 11,
    "scancode-version": "30.1.0",
    "authority": "https://gitlab.eclipse.org/eclipsefdn/emo-team/iplab/-/issues/2175",
    "source": "https://search.maven.org/remotecontent?filepath=org/apache/maven/shared/maven-verifier/1.8.0/maven-verifier-1.8.0-sources.jar",
    "status": "approved"
}