{
    "id": "go/golang/github.com%2Fdocker/cli/v0.0.0-20191017083524-a8ff7f821017",
    "license": "Apache-2.0 AND BSD-3-Clause",
    "authority": "https://gitlab.eclipse.org/eclipsefdn/emo-team/iplab/-/issues/12555",
    "source": "https://proxy.golang.org/github.com%2Fdocker/cli/@v/v0.0.0-20191017083524-a8ff7f821017.zip",
    "status": "approved",
    "scans": [
        {
            "date": "December 26, 2023 at 10:52:42 a.m. GMT",
            "authority": "https://gitlab.eclipse.org/eclipsefdn/emo-team/iplab/-/issues/12555",
            "scancode-version": "31.2.1",
            "licenses-discovered": [
                "Apache-2.0",
                "BSD-3-Clause"
            ],
            "copyrights": [
                "Copyright (c) 2004, 2006 The Linux Foundation and its contributors",
                "Copyright (c) 2013, Felix Riedel",
                "Copyright 2010 The Go Authors",
                "Copyright 2013-2017 Docker, Inc."
            ],
            "file-count": 1272,
            "sha256": "2c9c5312b883a55e0664124f998549dd3b05b3c10cb17eee99a43f6e31adeaf3",
            "source": "https://proxy.golang.org/github.com%2Fdocker/cli/@v/v0.0.0-20191017083524-a8ff7f821017.zip",
            "status": "approved"
        }
    ]
}