{
    "id": "npm/npmjs/@turf/helpers/7.2.0",
    "license": "MIT AND BSD-2-Clause",
    "authority": "https://gitlab.eclipse.org/eclipsefdn/emo-team/iplab/-/issues/18346",
    "source": "https://github.com/Turfjs/turf/archive/refs/tags/v7.2.0.zip",
    "status": "approved",
    "scans": [
        {
            "date": "January 7, 2025 at 12:45:09 p.m. GMT",
            "authority": "https://gitlab.eclipse.org/eclipsefdn/emo-team/iplab/-/issues/18346",
            "scancode-version": "31.2.1",
            "licenses-discovered": [
                "MIT",
                "BSD-2-Clause"
            ],
            "copyrights": [
                "(c) 2013, Vladimir Agafonkin",
                "Copyright (c) 2013 Leszek Rybicki",
                "Copyright (c) 2017 TurfJS",
                "Copyright (c) 2017, Vladimir Agafonkin",
                "Copyright (c) 2019 Morgan Herlocker",
                "Copyright (c) 2019, Dane Springmeyer",
                "Copyright (c) Microsoft Corporation"
            ],
            "file-count": 2468,
            "sha256": "26cc00f294117df16f691a0c587d2040cbcab86b3d75947809cc5647dfc5d3f3",
            "source": "https://github.com/Turfjs/turf/archive/refs/tags/v7.2.0.zip",
            "status": "approved"
        }
    ]
}