{
    "id": "maven/mavencentral/javax.measure/unit-api/2.1.3",
    "license": "BSD-3-Clause",
    "authority": "https://gitlab.eclipse.org/eclipsefdn/emo-team/iplab/-/issues/15387",
    "source": "https://repo1.maven.org/maven2/javax/measure/unit-api/2.1.3/unit-api-2.1.3-sources.jar",
    "status": "approved",
    "scans": [
        {
            "date": "December 9, 2022 at 4:38:56 a.m. GMT",
            "authority": "https://gitlab.eclipse.org/eclipsefdn/emo-team/iplab/-/issues/5504",
            "scancode-version": "31.2.1",
            "licenses-discovered": [
                "BSD-3-Clause"
            ],
            "copyrights": [
                "Copyright (c) 2014-2021, Jean-Marie Dautelle, Werner Keil, Otavio Santana"
            ],
            "file-count": 59,
            "sha256": "63b29957e157dced9a37961488e52c61bb4c31ae589379424c83f4703943244e",
            "source": "https://search.maven.org/remotecontent?filepath=javax/measure/unit-api/2.1.3/unit-api-2.1.3-sources.jar",
            "status": "approved"
        },
        {
            "date": "June 14, 2024 at 10:45:48 p.m. GMT",
            "authority": "https://gitlab.eclipse.org/eclipsefdn/emo-team/iplab/-/issues/15376",
            "scancode-version": "31.2.1",
            "licenses-discovered": [
                "BSD-3-Clause"
            ],
            "copyrights": [
                "Copyright (c) 2014-2021, Jean-Marie Dautelle, Werner Keil, Otavio Santana"
            ],
            "file-count": 59,
            "sha256": "63b29957e157dced9a37961488e52c61bb4c31ae589379424c83f4703943244e",
            "source": "https://repo1.maven.org/maven2/javax/measure/unit-api/2.1.3/unit-api-2.1.3-sources.jar",
            "status": "approved"
        },
        {
            "date": "June 14, 2024 at 10:47:48 p.m. GMT",
            "authority": "https://gitlab.eclipse.org/eclipsefdn/emo-team/iplab/-/issues/15378",
            "scancode-version": "31.2.1",
            "licenses-discovered": [
                "BSD-3-Clause"
            ],
            "copyrights": [
                "Copyright (c) 2014-2021, Jean-Marie Dautelle, Werner Keil, Otavio Santana"
            ],
            "file-count": 59,
            "sha256": "63b29957e157dced9a37961488e52c61bb4c31ae589379424c83f4703943244e",
            "source": "https://repo1.maven.org/maven2/javax/measure/unit-api/2.1.3/unit-api-2.1.3-sources.jar",
            "status": "approved"
        },
        {
            "date": "June 14, 2024 at 11:28:35 p.m. GMT",
            "authority": "https://gitlab.eclipse.org/eclipsefdn/emo-team/iplab/-/issues/15387",
            "scancode-version": "31.2.1",
            "licenses-discovered": [
                "BSD-3-Clause"
            ],
            "copyrights": [
                "Copyright (c) 2014-2021, Jean-Marie Dautelle, Werner Keil, Otavio Santana"
            ],
            "file-count": 59,
            "sha256": "63b29957e157dced9a37961488e52c61bb4c31ae589379424c83f4703943244e",
            "source": "https://repo1.maven.org/maven2/javax/measure/unit-api/2.1.3/unit-api-2.1.3-sources.jar",
            "status": "approved"
        }
    ]
}