{
    "id": "npm/npmjs/-/yargs/7.1.0",
    "license": "MIT",
    "licenses-discovered": [
        "MIT"
    ],
    "copyrights": [
        "Copyright (c) Andrei Mackenzie",
        "Copyright Contributors (ben@npmjs.com)",
        "Copyright James Halliday (mail@substack.net)",
        "copyright Missing"
    ],
    "file-count": 97,
    "scancode-version": "30.1.0",
    "authority": "https://gitlab.eclipse.org/eclipsefdn/emo-team/iplab/-/issues/2892",
    "source": "https://github.com/yargs/yargs/archive/v7.1.0.zip",
    "status": "approved"
}