{
    "id": "npm/npmjs/-/safe-array-concat/1.0.1",
    "license": "MIT",
    "authority": "https://gitlab.eclipse.org/eclipsefdn/emo-team/iplab/-/issues/10335",
    "source": "https://github.com/ljharb/safe-array-concat/archive/refs/tags/v1.0.1.zip",
    "status": "approved",
    "scans": [
        {
            "date": "September 6, 2023 at 11:01:51 a.m. GMT",
            "authority": "https://gitlab.eclipse.org/eclipsefdn/emo-team/iplab/-/issues/10335",
            "scancode-version": "31.2.1",
            "licenses-discovered": [
                "MIT"
            ],
            "copyrights": [
                "Copyright (c) 2023 Jordan Harband"
            ],
            "file-count": 14,
            "sha256": "93438136ffbc32d853a3511f2abd98a47c595abdda33b880d3275fc3bffbe4c4",
            "source": "https://github.com/ljharb/safe-array-concat/archive/refs/tags/v1.0.1.zip",
            "status": "approved"
        }
    ]
}