{
    "id": "maven/mavencentral/org.activiti/activiti-common-util/8.0.0",
    "license": "Apache-2.0",
    "authority": "https://gitlab.eclipse.org/eclipsefdn/emo-team/iplab/-/issues/12476",
    "source": "https://maven.alfresco.com/nexus/service/local/repositories/activiti-releases/content//org/activiti/activiti-common-util/8.0.0/activiti-common-util-8.0.0-sources.jar",
    "status": "approved",
    "scans": [
        {
            "date": "January 2, 2024 at 8:31:14 p.m. GMT",
            "authority": "https://gitlab.eclipse.org/eclipsefdn/emo-team/iplab/-/issues/12476",
            "scancode-version": "31.2.1",
            "licenses-discovered": [
                "Apache-2.0"
            ],
            "copyrights": [
                "Copyright 2010-2020 Alfresco Software, Ltd."
            ],
            "file-count": 6,
            "sha256": "53af39eb1e74913191f09ee654deda7fa4d8273b3d6f54a3fccd68cfa7cb9eef",
            "source": "https://maven.alfresco.com/nexus/service/local/repositories/activiti-releases/content//org/activiti/activiti-common-util/8.0.0/activiti-common-util-8.0.0-sources.jar",
            "status": "approved"
        }
    ]
}