{
    "id": "npm/npmjs/-/electron-to-chromium/1.5.25",
    "license": "ISC",
    "authority": "https://gitlab.eclipse.org/eclipsefdn/emo-team/iplab/-/issues/16184",
    "source": "https://github.com/Kilian/electron-to-chromium/archive/refs/tags/v1.5.25.zip",
    "status": "approved",
    "scans": [
        {
            "date": "September 18, 2024, 7:24:34 p.m. GMT",
            "authority": "https://gitlab.eclipse.org/eclipsefdn/emo-team/iplab/-/issues/16184",
            "scancode-version": "31.2.1",
            "licenses-discovered": [
                "ISC",
                "ISC AND JSON"
            ],
            "copyrights": [
                "Copyright 2018 Kilian Valkhof"
            ],
            "file-count": 19,
            "sha256": "6fee7cddf21ae23cbae712997c7634f5a53bbcb2f10a0edbc812a5c34302a57c",
            "source": "https://github.com/Kilian/electron-to-chromium/archive/refs/tags/v1.5.25.zip",
            "status": "restricted"
        }
    ]
}