{
    "id": "npm/npmjs/@swc/core-win32-arm64-msvc/1.2.177",
    "license": "Apache-2.0 AND MIT",
    "licenses-discovered": [
        "Apache-2.0 AND BSD-2-Clause AND BSD-2-Clause-Patent AND BSD-3-Clause AND CC0-1.0 AND MIT",
        "Apache-2.0",
        "Apache-2.0 AND MIT",
        "GPL-2.0-only",
        "MIT",
        "BSD-3-Clause AND MIT",
        "MIT-0",
        "Zlib",
        "BSD-3-Clause",
        "MPL-2.0",
        "Apache-2.0 AND BSD-3-Clause",
        "Unlicense",
        "0BSD",
        "ISC",
        "CC0-1.0 AND MIT",
        "0BSD AND Apache-2.0",
        "BSD-2-Clause AND BSD-3-Clause",
        "ISC AND MIT",
        "Apache-2.0 AND BSD-2-Clause",
        "BSD-3-Clause AND GPL-2.0-only AND MIT",
        "BSD-3-Clause AND LGPL-2.0-or-later AND MIT"
    ],
    "copyrights": [
        "(c) Anthony Mancini Dex",
        "(c) C C.One",
        "(c) Elsevier Inc.",
        "(c) Evan",
        "(c) Google, Inc. http://angularjs.org",
        "(c) Google, Inc. https://angular.io",
        "(c) Ja (c)",
        "(c) Jb (c)",
        "(c) Jean-loup Gailly and Mark Adler",
        "(c) Jeremy Ashkenas, DocumentCloud Inc.",
        "(c) Jeremy Ashkenas, DocumentCloud and Investigative Reporters & Editors Backbone",
        "(c) Jeremy Ashkenas, DocumentCloud and Investigative Reporters & Editors Underscore",
        "(c) La (c)",
        "(c) Michael Mathews",
        "(c) Michael Mathews <micmath@gmail.com>",
        "(c) Rob Wu <rob@robwu.nl> (https://robwu.nl)",
        "(c) Sindre Sorhus",
        "(c) Steven Levithan <http://stevenlevithan.com/regex/xregexp/>",
        "(c) Vitaly Puzrin and Andrey Tupitsin",
        "(c) c.position.version b.version",
        "(c) http://www.w3.org/1999/xhtml",
        "(c), Ac (c)",
        "Copyright (c) - Brian Carlson",
        "Copyright (c) Adobe Systems Incorporated",
        "Copyright (c) Ajax.org B.V.",
        "Copyright (c) Alexander C. Mingoia",
        "Copyright (c) Andreas Lubbe",
        "Copyright (c) Baidu Inc.",
        "Copyright (c) Ben Drucker <bvdrucker@gmail.com>",
        "Copyright (c) Brian Carlson (brian.m.carlson@gmail.com)",
        "Copyright (c) Brightcove",
        "Copyright (c) Christian Norrman",
        "Copyright (c) Cowboy Ben Alman",
        "Copyright (c) David Bjorklund",
        "Copyright (c) David Frank",
        "Copyright (c) Dean Edwards, GNU Lesser General",
        "Copyright (c) Denolibs",
        "Copyright (c) Douglas Christopher Wilson",
        "Copyright (c) Douglas Christopher Wilson <doug@somethingdoug.com>",
        "Copyright (c) Ecma International",
        "Copyright (c) Facebook, Inc.",
        "Copyright (c) Facebook, Inc. and its affiliates",
        "Copyright (c) Federico Romero",
        "Copyright (c) Henry Zhuang",
        "Copyright (c) Isaac Z. Schlueter",
        "Copyright (c) J2 Innovations",
        "Copyright (c) Jed Watson",
        "Copyright (c) Jon Schlinkert",
        "Copyright (c) Jonathan Ong",
        "Copyright (c) Jonathan Ong <me@jongleberry.com>",
        "Copyright (c) Jorik Tangelder",
        "Copyright (c) Jun Kato",
        "Copyright (c) Mapbox",
        "Copyright (c) MeLike2D",
        "Copyright (c) Microsoft",
        "Copyright (c) Microsoft Corporation",
        "Copyright (c) Mihai Bazon <mihai.bazon@gmail.com>",
        "Copyright (c) Nicolas Gallagher and Jonathan Neal",
        "Copyright (c) Roman Shtylman <shtylman@gmail.com>",
        "Copyright (c) Sam Stephenson",
        "Copyright (c) T. Jameson Little",
        "Copyright (c) TJ Holowaychuk",
        "Copyright (c) TJ Holowaychuk <tj@vision-media.ca>",
        "Copyright (c) Tiancheng Timothy Gu",
        "Copyright (c) Valerio Proietti (http://mad4milk.net/)",
        "Copyright (c) Xiamen Yaji Software Co., Ltd.",
        "Copyright Alipay, Inc.",
        "Copyright Brightcove, Inc. <https://www.brightcove.com/>",
        "Copyright Emily Stark, Mike Hamburg, Dan Boneh",
        "Copyright Filippo Rossi",
        "Copyright Google Inc.",
        "Copyright Google LLC",
        "Copyright JS Foundation and other contributors",
        "Copyright Jeremy Ashkenas, DocumentCloud and Investigative Reporters & Editors",
        "Copyright Joyent, Inc. and other Node contributors",
        "Copyright Mike Bostock",
        "Copyright OpenJS Foundation and other contributors <https://openjsf.org/>",
        "Copyright Terkel Gjervig Nielsen",
        "Copyright The Bootstrap Authors",
        "Copyright The Go Authors",
        "Copyright The NATS Authors",
        "Copyright The Rust Project",
        "Copyright Three.js",
        "Copyright Twitter, Inc.",
        "Copyright Vladimir Agafonkin",
        "Copyright Yahoo",
        "Copyright Yahoo! Inc.",
        "Copyright by Vitaly Puzrin",
        "Copyright jQuery Foundation and other contributors",
        "Copyright jQuery Foundation, Inc. and other contributors",
        "Copyright the Deno authors",
        "Copyright the Sputnik authors",
        "Copyright the denosaurs team",
        "Copyright the oak",
        "Copyright vtt.js Contributors",
        "Image Resizer (c) - Grant Galitz",
        "Rs (c) Only",
        "copyright (c) Denis Pushkarev",
        "copyright (c) Michael Mathews",
        "copyright (c) Michael Mathews <micmath@gmail.com>",
        "copyright (c) Rotorz Limited",
        "copyright (c) Scott Jehl, Paul Irish, Nicholas Zakas",
        "copyright (c) by Marijn Haverbeke and others",
        "copyright Chen, Yi-Cyuan"
    ],
    "file-count": 52202,
    "scancode-version": "30.1.0",
    "authority": "https://gitlab.eclipse.org/eclipsefdn/emo-team/iplab/-/issues/3321",
    "source": "https://github.com/swc-project/swc/archive/v1.2.177.zip",
    "status": "approved"
}
