{
    "id": "project/iot.kapua/-/refactoring-rest-api-account/0.0",
    "license": "EPL-2.0",
    "authority": "https://gitlab.eclipse.org/eclipsefdn/emo-team/iplab/-/issues/13945",
    "source": "https://github.com/eclipse/kapua/pull/3993.patch",
    "status": "approved",
    "scans": [
        {
            "date": "March 21, 2024 at 1:41:05 p.m. GMT",
            "authority": "https://gitlab.eclipse.org/eclipsefdn/emo-team/iplab/-/issues/13945",
            "scancode-version": "31.2.1",
            "licenses-discovered": [
                "EPL-2.0"
            ],
            "copyrights": [
                "Copyright (c) 2016, 2022 Eurotech and/or its affiliates and others",
                "Copyright (c) 2017, 2022 Eurotech and/or its affiliates and others",
                "Copyright (c) 2021, 2022 Eurotech and/or its affiliates and others"
            ],
            "file-count": 1,
            "sha256": "d1deff45169a34ba399323a020f1c51785369a46b223a40192373b667ee562dd",
            "source": "https://github.com/eclipse/kapua/pull/3993.patch",
            "status": "restricted"
        }
    ]
}
