{
    "id": "npm/npmjs/@tanstack/query-core/5.28.4",
    "license": "MIT",
    "authority": "https://gitlab.eclipse.org/eclipsefdn/emo-team/iplab/-/issues/13850",
    "source": "https://github.com/TanStack/query/archive/refs/tags/v5.28.4.zip",
    "status": "approved",
    "scans": [
        {
            "date": "March 18, 2024 at 2:11:42 a.m. GMT",
            "authority": "https://gitlab.eclipse.org/eclipsefdn/emo-team/iplab/-/issues/13850",
            "scancode-version": "31.2.1",
            "licenses-discovered": [
                "MIT"
            ],
            "copyrights": [
                "Copyright (c) 2021-present Tanner Linsley"
            ],
            "file-count": 1289,
            "sha256": "ea080cba52fa097373026c48335c1e42f5199ee806b6430c5d0b89f98735ec5b",
            "source": "https://github.com/TanStack/query/archive/refs/tags/v5.28.4.zip",
            "status": "approved"
        }
    ]
}