{
    "id": "maven/mavencentral/io.fabric8/kubernetes-model-flowcontrol/6.7.0",
    "license": "Apache-2.0",
    "authority": "https://gitlab.eclipse.org/eclipsefdn/emo-team/iplab/-/issues/8677",
    "source": "https://repo.maven.apache.org/maven2/io/fabric8/kubernetes-model-flowcontrol/6.7.0/kubernetes-model-flowcontrol-6.7.0-sources.jar",
    "status": "approved",
    "scans": [
        {
            "date": "June 5, 2023 at 11:07:34 a.m. GMT",
            "authority": "https://gitlab.eclipse.org/eclipsefdn/emo-team/iplab/-/issues/8677",
            "scancode-version": "31.2.1",
            "licenses-discovered": [
                "Apache-2.0"
            ],
            "copyrights": [
                "Copyright (c) 2015 Red Hat, Inc."
            ],
            "file-count": 361,
            "sha256": "49f2ceae0eddbe9cf4ebfa0b53e404d0acc4c6a098ea17164be1f45e89541339",
            "source": "https://repo.maven.apache.org/maven2/io/fabric8/kubernetes-model-flowcontrol/6.7.0/kubernetes-model-flowcontrol-6.7.0-sources.jar",
            "status": "approved"
        }
    ]
}