{
    "id": "-/-/vscode/language-features-subset/1.92.0",
    "license": "MIT AND (Apache-2.0 AND MIT AND W3C) AND Apache-2.0",
    "authority": "https://gitlab.eclipse.org/eclipsefdn/emo-team/iplab/-/issues/15832",
    "source": "https://gitlab.eclipse.org/-/project/46/uploads/28639c72aaf787a093ba535461a40b60/language-features-1.92.0.zip",
    "status": "approved",
    "scans": [
        {
            "date": "August 14, 2024 at 12:40:24 a.m. GMT",
            "authority": "https://gitlab.eclipse.org/eclipsefdn/emo-team/iplab/-/issues/15832",
            "scancode-version": "31.2.1",
            "licenses-discovered": [
                "MIT",
                "Apache-2.0 AND MIT AND W3C",
                "Apache-2.0"
            ],
            "copyrights": [
                "Copyright (c) 2015 W3C(r) MIT, ERCIM, Keio",
                "Copyright (c) Microsoft Corporation",
                "Copyright Drifty Co. http://drifty.com/"
            ],
            "file-count": 179,
            "sha256": "2d4615f1ebd6a2ee5838d1bb678c41192154a925cca68c296e988955ad7873c6",
            "source": "https://gitlab.eclipse.org/-/project/46/uploads/28639c72aaf787a093ba535461a40b60/language-features-1.92.0.zip",
            "status": "approved"
        }
    ]
}