{
    "id": "maven/mavencentral/org.apache.directory.api/api-util/2.1.3",
    "license": "Apache-2.0",
    "authority": "https://gitlab.eclipse.org/eclipsefdn/emo-team/iplab/-/issues/9465",
    "source": "https://repo.maven.apache.org/maven2/org/apache/directory/api/api-util/2.1.3/api-util-2.1.3-sources.jar",
    "status": "approved",
    "scans": [
        {
            "date": "July 17, 2023 at 8:49:41 a.m. GMT",
            "authority": "https://gitlab.eclipse.org/eclipsefdn/emo-team/iplab/-/issues/9465",
            "scancode-version": "31.2.1",
            "licenses-discovered": [
                "Apache-2.0"
            ],
            "copyrights": [
            ],
            "file-count": 42,
            "sha256": "4fd4b8e3c4eb0859723b9fdd569c93d937df4e433960b35523d62a16a46100f9",
            "source": "https://repo.maven.apache.org/maven2/org/apache/directory/api/api-util/2.1.3/api-util-2.1.3-sources.jar",
            "status": "approved"
        }
    ]
}