{
    "id": "npm/npmjs/@schematics/angular/15.0.3",
    "license": "MIT AND Apache-2.0",
    "authority": "https://gitlab.eclipse.org/eclipsefdn/emo-team/iplab/-/issues/5762",
    "source": "https://registry.npmjs.org/@schematics/angular/-/angular-15.0.3.tgz",
    "status": "approved",
    "scans": [
        {
            "date": "December 14, 2022 at 1:50:47 a.m. GMT",
            "authority": "https://gitlab.eclipse.org/eclipsefdn/emo-team/iplab/-/issues/5762",
            "scancode-version": "31.2.1",
            "licenses-discovered": [
                "MIT",
                "Apache-2.0"
            ],
            "copyrights": [
                "Copyright (c) 2017 Google, Inc.",
                "Copyright (c) Microsoft Corporation",
                "Copyright Google LLC"
            ],
            "file-count": 223,
            "sha256": "f03d99e09d6d8253c5efe797568caefedfcd81150d4837734bf9d222240e5f64",
            "source": "https://registry.npmjs.org/@schematics/angular/-/angular-15.0.3.tgz",
            "status": "approved"
        }
    ]
}