{
    "id": "npm/npmjs/@microsoft/applicationinsights-common/2.8.9",
    "license": "MIT",
    "authority": "https://gitlab.eclipse.org/eclipsefdn/emo-team/iplab/-/issues/8545",
    "source": "https://github.com/microsoft/ApplicationInsights-JS/archive/v2.8.9.zip",
    "status": "approved",
    "scans": [
        {
            "date": "May 24, 2023 at 8:45:22 p.m. GMT",
            "authority": "https://gitlab.eclipse.org/eclipsefdn/emo-team/iplab/-/issues/8545",
            "scancode-version": "31.2.1",
            "licenses-discovered": [
            ],
            "copyrights": [
            ],
            "file-count": 1,
            "sha256": "d5558cd419c8d46bdc958064cb97f963d1ea793866414c025906ec15033512ed",
            "source": "https://github.com/microsoft/ApplicationInsights-JS/archive/v2.8.9.zip",
            "status": "restricted"
        }
    ]
}
