{
    "id": "maven/mavencentral/com.vaadin/vaadin-field-highlighter-flow/24.3.7",
    "license": "Apache-2.0",
    "authority": "https://gitlab.eclipse.org/eclipsefdn/emo-team/iplab/-/issues/13717",
    "source": "https://repo1.maven.org/maven2/com/vaadin/vaadin-field-highlighter-flow/24.3.7/vaadin-field-highlighter-flow-24.3.7-sources.jar",
    "status": "approved",
    "scans": [
        {
            "date": "March 15, 2024 at 12:30:53 p.m. GMT",
            "authority": "https://gitlab.eclipse.org/eclipsefdn/emo-team/iplab/-/issues/13717",
            "scancode-version": "31.2.1",
            "licenses-discovered": [
                "Apache-2.0"
            ],
            "copyrights": [
                "Copyright 2000-2023 Vaadin Ltd."
            ],
            "file-count": 4,
            "sha256": "c63f97897f3a195ac33b95328d30999b101cc2d7c1c475f580162bdbb50326b7",
            "source": "https://repo1.maven.org/maven2/com/vaadin/vaadin-field-highlighter-flow/24.3.7/vaadin-field-highlighter-flow-24.3.7-sources.jar",
            "status": "approved"
        }
    ]
}