{
    "id": "maven/mavencentral/software.amazon.awssdk/auth/2.29.24",
    "license": "Apache-2.0",
    "authority": "https://gitlab.eclipse.org/eclipsefdn/emo-team/iplab/-/issues/17626",
    "source": "https://repo1.maven.org/maven2/software/amazon/awssdk/auth/2.29.24/auth-2.29.24-sources.jar",
    "status": "approved",
    "scans": [
        {
            "date": "December 4, 2024 at 4:38:00 a.m. GMT",
            "authority": "https://gitlab.eclipse.org/eclipsefdn/emo-team/iplab/-/issues/17626",
            "scancode-version": "31.2.1",
            "licenses-discovered": [
                "Apache-2.0"
            ],
            "copyrights": [
                "Copyright Amazon.com, Inc. or its affiliates"
            ],
            "file-count": 83,
            "sha256": "e30ad245437adf909ff18efbcd4709f1757c6e478e0ed1e2fcd1478128a0443e",
            "source": "https://repo1.maven.org/maven2/software/amazon/awssdk/auth/2.29.24/auth-2.29.24-sources.jar",
            "status": "approved"
        }
    ]
}