{
    "id": "maven/mavencentral/software.amazon.awssdk/metrics-spi/2.30.33",
    "license": "Apache-2.0",
    "authority": "https://gitlab.eclipse.org/eclipsefdn/emo-team/iplab/-/issues/19919",
    "source": "https://repo1.maven.org/maven2/software/amazon/awssdk/metrics-spi/2.30.33/metrics-spi-2.30.33-sources.jar",
    "status": "approved",
    "scans": [
        {
            "date": "March 6, 2025 at 8:21:05 a.m. GMT",
            "authority": "https://gitlab.eclipse.org/eclipsefdn/emo-team/iplab/-/issues/19919",
            "scancode-version": "31.2.1",
            "licenses-discovered": [
                "Apache-2.0"
            ],
            "copyrights": [
                "Copyright Amazon.com, Inc. or its affiliates"
            ],
            "file-count": 18,
            "sha256": "8da4ee957009e912f4eb2d40fb89e5106452ad649cdd4d9bdfa2d0aaafda5b28",
            "source": "https://repo1.maven.org/maven2/software/amazon/awssdk/metrics-spi/2.30.33/metrics-spi-2.30.33-sources.jar",
            "status": "approved"
        }
    ]
}