{
    "id": "go/golang/gopkg.in/yaml.v2/v2.0.0-20170812160011-eb3733d160e7",
    "license": "Apache-2.0 AND MIT",
    "authority": "https://gitlab.eclipse.org/eclipsefdn/emo-team/iplab/-/issues/12310",
    "source": "https://proxy.golang.org/gopkg.in/yaml.v2/@v/v2.0.0-20170812160011-eb3733d160e7.zip",
    "status": "approved",
    "scans": [
        {
            "date": "December 20, 2023 at 7:44:34 p.m. GMT",
            "authority": "https://gitlab.eclipse.org/eclipsefdn/emo-team/iplab/-/issues/12310",
            "scancode-version": "31.2.1",
            "licenses-discovered": [
                "Apache-2.0",
                "MIT",
                "Apache-2.0 AND MIT"
            ],
            "copyrights": [
                "Copyright (c) 2006 Kirill Simonov"
            ],
            "file-count": 21,
            "sha256": "ad243b5a6d2444da90f8bdf996b0fefb557d49a05f31c9f9fd64a55e03614d0e",
            "source": "https://proxy.golang.org/gopkg.in/yaml.v2/@v/v2.0.0-20170812160011-eb3733d160e7.zip",
            "status": "approved"
        }
    ]
}