{
    "id": "maven/mavencentral/p2.eclipse.plugin/org.apache.ant/1.10.12.v20211102-1452",
    "license": "Apache-2.0 AND SAX-PD AND W3C AND Apache-2.0 AND (Apache-2.0 AND GPL-1.0-or-later) AND (Apache-2.0 AND LicenseRef-scancode-unknown-license-reference)",
    "licenses-discovered": [
        "Apache-2.0 AND SAX-PD AND W3C",
        "Apache-2.0",
        "Apache-2.0 AND GPL-1.0-or-later",
        "Apache-2.0 AND LicenseRef-scancode-unknown-license-reference"
    ],
    "file-count": 806,
    "scancode-version": "30.1.0",
    "authority": "https://gitlab.eclipse.org/eclipsefdn/emo-team/iplab/-/issues/2455",
    "source": "https://search.maven.org/remotecontent?filepath=org/apache/ant/ant/1.10.12/ant-1.10.12-sources.jar",
    "status": "restricted"
}