{
    "id": "maven/mavencentral/com.vaadin/vaadin-split-layout-flow/24.6.5",
    "license": "Apache-2.0",
    "authority": "https://gitlab.eclipse.org/eclipsefdn/emo-team/iplab/-/issues/19820",
    "source": "https://repo1.maven.org/maven2/com/vaadin/vaadin-split-layout-flow/24.6.5/vaadin-split-layout-flow-24.6.5-sources.jar",
    "status": "approved",
    "scans": [
        {
            "date": "March 1, 2025 at 3:41:28 a.m. GMT",
            "authority": "https://gitlab.eclipse.org/eclipsefdn/emo-team/iplab/-/issues/19820",
            "scancode-version": "31.2.1",
            "licenses-discovered": [
                "Apache-2.0"
            ],
            "copyrights": [
                "Copyright 2000-2024 Vaadin Ltd."
            ],
            "file-count": 5,
            "sha256": "7099a9b54eaa54451a1ff1b74f784d10c1c206cdfd01aea9508efedfcedddf19",
            "source": "https://repo1.maven.org/maven2/com/vaadin/vaadin-split-layout-flow/24.6.5/vaadin-split-layout-flow-24.6.5-sources.jar",
            "status": "approved"
        }
    ]
}