{
    "id": "pypi/pypi/-/babel/2.14.0",
    "license": "BSD-3-Clause",
    "authority": "https://gitlab.eclipse.org/eclipsefdn/emo-team/iplab/-/issues/13086",
    "source": "https://files.pythonhosted.org/packages/e2/80/cfbe44a9085d112e983282ee7ca4c00429bc4d1ce86ee5f4e60259ddff7f/Babel-2.14.0.tar.gz",
    "status": "approved",
    "scans": [
        {
            "date": "February 1, 2024 at 8:35:35 p.m. GMT",
            "authority": "https://gitlab.eclipse.org/eclipsefdn/emo-team/iplab/-/issues/13086",
            "scancode-version": "31.2.1",
            "licenses-discovered": [
                "CC0-1.0",
                "LicenseRef-scancode-unknown-spdx",
                "BSD-3-Clause",
                "LicenseRef-scancode-free-unknown"
            ],
            "copyrights": [
                "Copyright (c) (year)d Foo Company",
                "Copyright (c) 1990-2003 Foo Company",
                "Copyright (c) 1990-2003 ORGANIZATION",
                "Copyright (c) 2006 Ufsoft.org",
                "Copyright (c) 2007 - 2011 by Edgewall Software",
                "Copyright (c) 2007 FooBar, Inc.",
                "Copyright (c) 2007 ORGANIZATION",
                "Copyright (c) 2007 THE PACKAGE'S",
                "Copyright (c) 2007-2011 Edgewall Software, 2013-2023 the Babel team",
                "Copyright (c) 2010 by Armin Ronacher",
                "Copyright (c) 2013-2023 by the Babel Team",
                "Copyright (c) time.strftime Y FooBar, Inc.",
                "Copyright 2010 by Armin Ronacher. :license Flask Design",
                "Copyright 2013 by Lennart",
                "Copyright of Edgewall Software",
                "Foobar. Copyright (c)",
                "POT for my really cool PROJECT project. Copyright (c) 1990-2003 ORGANIZATION",
                "copr Coptegr Crir",
                "copr Kopteschr Tsch",
                "copr Koptischr Creer",
                "copr Koptschr Creer",
                "copr Koptyskr Creer",
                "copyright (c) 2013-2023 by the Babel Team",
                "copyright (c) 2015-2023 by the Babel Team",
                "copyright 2023, The Babel Team",
                "copyright in Babel"
            ],
            "file-count": 1155,
            "sha256": "6919867db036398ba21eb5c7a0f6b28ab8cbc3ae7a73a44ebe34ae74a4e7d363",
            "source": "https://files.pythonhosted.org/packages/e2/80/cfbe44a9085d112e983282ee7ca4c00429bc4d1ce86ee5f4e60259ddff7f/Babel-2.14.0.tar.gz",
            "status": "restricted"
        }
    ]
}
