{
    "id": "npm/npmjs/-/ollama/0.5.9",
    "license": "MIT",
    "authority": "https://gitlab.eclipse.org/eclipsefdn/emo-team/iplab/-/issues/16325",
    "source": "https://github.com/ollama/ollama-js/archive/refs/tags/v0.5.9.zip",
    "status": "approved",
    "scans": [
        {
            "date": "September 26, 2024, 12:09:21 p.m. GMT",
            "authority": "https://gitlab.eclipse.org/eclipsefdn/emo-team/iplab/-/issues/16325",
            "scancode-version": "31.2.1",
            "licenses-discovered": [
                "MIT"
            ],
            "copyrights": [
                "Copyright (c) 2023 Saul"
            ],
            "file-count": 25,
            "sha256": "dcba3f087729b27c094f9f273194e6d57bce3c626a6f98b678506fdab8ba8575",
            "source": "https://github.com/ollama/ollama-js/archive/refs/tags/v0.5.9.zip",
            "status": "approved"
        }
    ]
}