{
    "id": "maven/mavencentral/io.fabric8/kubernetes-model-flowcontrol/6.6.0",
    "license": "Apache-2.0",
    "authority": "https://gitlab.eclipse.org/eclipsefdn/emo-team/iplab/-/issues/8368",
    "source": "https://search.maven.org/remotecontent?filepath=io/fabric8/kubernetes-model-flowcontrol/6.6.0/kubernetes-model-flowcontrol-6.6.0-sources.jar",
    "status": "approved",
    "scans": [
        {
            "date": "May 5, 2023 at 5:03:18 a.m. GMT",
            "authority": "https://gitlab.eclipse.org/eclipsefdn/emo-team/iplab/-/issues/8368",
            "scancode-version": "31.2.1",
            "licenses-discovered": [
                "Apache-2.0"
            ],
            "copyrights": [
                "Copyright (c) 2015 Red Hat, Inc."
            ],
            "file-count": 361,
            "sha256": "eeeaec8a165c12dca4a9491a6e5c03287bf142b63e942ceb0c565443c72a2923",
            "source": "https://search.maven.org/remotecontent?filepath=io/fabric8/kubernetes-model-flowcontrol/6.6.0/kubernetes-model-flowcontrol-6.6.0-sources.jar",
            "status": "approved"
        }
    ]
}