{
    "id": "maven/mavencentral/io.netty/netty-codec-http/4.2.0.Alpha4",
    "license": "Apache-2.0 AND (Apache-2.0 AND MIT) AND (Apache-2.0 AND BSD-3-Clause)",
    "authority": "https://gitlab.eclipse.org/eclipsefdn/emo-team/iplab/-/issues/16121",
    "source": "https://repo1.maven.org/maven2/io/netty/netty-codec-http/4.2.0.Alpha4/netty-codec-http-4.2.0.Alpha4-sources.jar",
    "status": "approved",
    "scans": [
        {
            "date": "September 12, 2024, 12:00:44 a.m. GMT",
            "authority": "https://gitlab.eclipse.org/eclipsefdn/emo-team/iplab/-/issues/16121",
            "scancode-version": "31.2.1",
            "licenses-discovered": [
                "Apache-2.0",
                "Apache-2.0 AND MIT",
                "Apache-2.0 AND BSD-3-Clause"
            ],
            "copyrights": [
                "Copyright (c) 2008-2009 Bjoern Hoehrmann <bjoern@hoehrmann.de>",
                "Copyright (c) 2011, Joe Walnes and contributors",
                "Copyright 2012 The Netty Project",
                "Copyright 2013 The Netty Project",
                "Copyright 2014 The Netty Project",
                "Copyright 2015 The Netty Project",
                "Copyright 2016 The Netty Project",
                "Copyright 2017 The Netty Project",
                "Copyright 2019 The Netty Project",
                "Copyright 2020 The Netty Project",
                "Copyright 2021 The Netty Project",
                "Copyright 2022 The Netty Project",
                "Copyright 2023 The Netty Project",
                "Copyright 2024 The Netty Project"
            ],
            "file-count": 259,
            "sha256": "0ed0d3e3bc46fa00d74782ec1a5ff51446082ba897a99d9d6dc5e3f2e8d6f1e9",
            "source": "https://repo1.maven.org/maven2/io/netty/netty-codec-http/4.2.0.Alpha4/netty-codec-http-4.2.0.Alpha4-sources.jar",
            "status": "approved"
        }
    ]
}