{
    "id": "maven/mavencentral/org.webjars.bower/lodash/3.10.1-amd",
    "license": "MIT",
    "authority": "https://gitlab.eclipse.org/eclipsefdn/emo-team/iplab/-/issues/6785",
    "source": "https://search.maven.org/remotecontent?filepath=org/webjars/bower/lodash/3.10.1-amd/lodash-3.10.1-amd-sources.jar",
    "status": "approved",
    "scans": [
        {
            "date": "January 27, 2023 at 10:30:36 p.m. GMT",
            "authority": "https://gitlab.eclipse.org/eclipsefdn/emo-team/iplab/-/issues/6785",
            "scancode-version": "31.2.1",
            "licenses-discovered": [
            ],
            "copyrights": [
            ],
            "file-count": 0,
            "sha256": "8739c76e681f900923b900c9df0ef75cf421d39cabb54650c4b9ad19b6a76d85",
            "source": "https://search.maven.org/remotecontent?filepath=org/webjars/bower/lodash/3.10.1-amd/lodash-3.10.1-amd-sources.jar",
            "status": "restricted"
        }
    ]
}
