{
    "id": "maven/mavencentral/com.azure.resourcemanager/azure-resourcemanager-containerservice/2.43.0",
    "license": "MIT",
    "authority": "https://gitlab.eclipse.org/eclipsefdn/emo-team/iplab/-/issues/16701",
    "source": "https://repo1.maven.org/maven2/com/azure/resourcemanager/azure-resourcemanager-containerservice/2.43.0/azure-resourcemanager-containerservice-2.43.0-sources.jar",
    "status": "approved",
    "scans": [
        {
            "date": "October 15, 2024, 4:37:52 p.m. GMT",
            "authority": "https://gitlab.eclipse.org/eclipsefdn/emo-team/iplab/-/issues/16701",
            "scancode-version": "31.2.1",
            "licenses-discovered": [
                "MIT"
            ],
            "copyrights": [
                "Copyright (c) Microsoft Corporation"
            ],
            "file-count": 271,
            "sha256": "e126a33000c30aa5ff30e556deeadc1a7511479afc1d9b02c22bf5cc6b1b6e5d",
            "source": "https://repo1.maven.org/maven2/com/azure/resourcemanager/azure-resourcemanager-containerservice/2.43.0/azure-resourcemanager-containerservice-2.43.0-sources.jar",
            "status": "approved"
        }
    ]
}