{
    "id": "maven/mavencentral/org.apache.camel/camel-spring-main/3.22.2",
    "license": "Apache-2.0",
    "authority": "https://gitlab.eclipse.org/eclipsefdn/emo-team/iplab/-/issues/14940",
    "source": "https://repo1.maven.org/maven2/org/apache/camel/camel-spring-main/3.22.2/camel-spring-main-3.22.2-sources.jar",
    "status": "approved",
    "scans": [
        {
            "date": "May 29, 2024 at 10:23:32 a.m. GMT",
            "authority": "https://gitlab.eclipse.org/eclipsefdn/emo-team/iplab/-/issues/14940",
            "scancode-version": "31.2.1",
            "licenses-discovered": [
                "Apache-2.0"
            ],
            "copyrights": [
            ],
            "file-count": 6,
            "sha256": "d64c3074779ae744cb2a3ff634e93239276934fa46957cd8d9cf0678f7e0d36e",
            "source": "https://repo1.maven.org/maven2/org/apache/camel/camel-spring-main/3.22.2/camel-spring-main-3.22.2-sources.jar",
            "status": "approved"
        }
    ]
}