{
    "id": "npm/npmjs/-/es-set-tostringtag/2.0.1",
    "license": "MIT",
    "authority": "https://gitlab.eclipse.org/eclipsefdn/emo-team/iplab/-/issues/6218",
    "source": "https://github.com/es-shims/es-set-tostringtag/archive/v2.0.1.zip",
    "status": "approved",
    "scans": [
        {
            "date": "January 9, 2023 at 11:45:31 p.m. GMT",
            "authority": "https://gitlab.eclipse.org/eclipsefdn/emo-team/iplab/-/issues/6218",
            "scancode-version": "31.2.1",
            "licenses-discovered": [
                "MIT"
            ],
            "copyrights": [
                "Copyright (c) 2022 ECMAScript Shims"
            ],
            "file-count": 12,
            "sha256": "1e60c8aca9fc24c73a61cb563b2680ae0d386f73d98a6bc40edef6e55475981c",
            "source": "https://github.com/es-shims/es-set-tostringtag/archive/v2.0.1.zip",
            "status": "approved"
        }
    ]
}