{
    "id": "maven/mavencentral/org.apache.kafka/kafka-streams/3.6.0",
    "license": "Apache-2.0",
    "authority": "https://gitlab.eclipse.org/eclipsefdn/emo-team/iplab/-/issues/11259",
    "source": "https://repo.maven.apache.org/maven2/org/apache/kafka/kafka-streams/3.6.0/kafka-streams-3.6.0-sources.jar",
    "status": "approved",
    "scans": [
        {
            "date": "October 27, 2023 at 4:53:11 a.m. GMT",
            "authority": "https://gitlab.eclipse.org/eclipsefdn/emo-team/iplab/-/issues/11259",
            "scancode-version": "31.2.1",
            "licenses-discovered": [
                "Apache-2.0"
            ],
            "copyrights": [
            ],
            "file-count": 623,
            "sha256": "4465a92cae626e13bb8b17a63415df9e29a7a4b5c9b142a3b643b86c48c57d2f",
            "source": "https://repo.maven.apache.org/maven2/org/apache/kafka/kafka-streams/3.6.0/kafka-streams-3.6.0-sources.jar",
            "status": "approved"
        }
    ]
}