{
    "id": "npm/npmjs/-/axe-core/4.8.2",
    "license": "MPL-2.0 AND MIT AND (Apache-2.0 AND OFL-1.1)",
    "authority": "https://gitlab.eclipse.org/eclipsefdn/emo-team/iplab/-/issues/10969",
    "source": "https://github.com/dequelabs/axe-core/archive/refs/tags/v4.8.2.zip",
    "status": "approved",
    "scans": [
        {
            "date": "October 10, 2023 at 3:49:07 a.m. GMT",
            "authority": "https://gitlab.eclipse.org/eclipsefdn/emo-team/iplab/-/issues/10969",
            "scancode-version": "31.2.1",
            "licenses-discovered": [
                "MPL-2.0",
                "MIT",
                "Apache-2.0 AND OFL-1.1"
            ],
            "copyrights": [
                "(c) 2007-2008 Steven Levithan <http://stevenlevithan.com/regex/xregexp/>",
                "Copyright (c) 2010-2012 Robert Kieffer",
                "Copyright (c) 2015 - < grunt.template.today 'yyyy > Deque Systems, Inc."
            ],
            "file-count": 1910,
            "sha256": "d3df42776f71063d11fb1baa5f4903e2f468d02bb636a4f4fa38f6bd12743f44",
            "source": "https://github.com/dequelabs/axe-core/archive/refs/tags/v4.8.2.zip",
            "status": "approved"
        }
    ]
}