{
    "id": "npm/npmjs/-/msgpackr-extract/3.0.0",
    "license": "MIT",
    "authority": "https://gitlab.eclipse.org/eclipsefdn/emo-team/iplab/-/issues/7127",
    "source": "https://github.com/kriszyp/msgpackr-extract/archive/v3.0.0.zip",
    "status": "approved",
    "scans": [
        {
            "date": "February 14, 2023 at 3:18:09 p.m. GMT",
            "authority": "https://gitlab.eclipse.org/eclipsefdn/emo-team/iplab/-/issues/7127",
            "scancode-version": "31.2.1",
            "licenses-discovered": [
                "MIT"
            ],
            "copyrights": [
                "Copyright (c) 2020 Kris Zyp"
            ],
            "file-count": 12,
            "sha256": "d236b7369bb3546242eaf712697fe49b2fe299c987545b62844c0c5acffa3d89",
            "source": "https://github.com/kriszyp/msgpackr-extract/archive/v3.0.0.zip",
            "status": "approved"
        }
    ]
}