{
    "id": "maven/mavencentral/org.springframework.boot/spring-boot-actuator/3.2.0",
    "license": "Apache-2.0",
    "authority": "https://gitlab.eclipse.org/eclipsefdn/emo-team/iplab/-/issues/11918",
    "source": "https://repo1.maven.org/maven2/org/springframework/boot/spring-boot-actuator/3.2.0/spring-boot-actuator-3.2.0-sources.jar",
    "status": "approved",
    "scans": [
        {
            "date": "December 13, 2023 at 5:55:52 a.m. GMT",
            "authority": "https://gitlab.eclipse.org/eclipsefdn/emo-team/iplab/-/issues/11918",
            "scancode-version": "31.2.1",
            "licenses-discovered": [
                "Apache-2.0"
            ],
            "copyrights": [
                "Copyright 2012-2019 the original author or authors",
                "Copyright 2012-2020 the original author or authors",
                "Copyright 2012-2021 the original author or authors",
                "Copyright 2012-2022 the original author or authors",
                "Copyright 2012-2023 the original author or authors"
            ],
            "file-count": 366,
            "sha256": "38d7972b19e99d5bb879f58af420cf739d99dc3236ef8cae4d84c21d6614067d",
            "source": "https://repo1.maven.org/maven2/org/springframework/boot/spring-boot-actuator/3.2.0/spring-boot-actuator-3.2.0-sources.jar",
            "status": "approved"
        }
    ]
}