{
    "id": "go/golang/github.com%2FMicrosoft/hcsshim/v0.11.4",
    "license": "MIT AND Apache-2.0 AND ISC AND BSD-2-Clause AND BSD-3-Clause AND CC-BY-SA-4.0 AND MPL-2.0-no-copyleft-exception AND LicenseRef-IP-Rights-Grant",
    "authority": "https://gitlab.eclipse.org/eclipsefdn/emo-team/iplab/-/issues/13183",
    "source": "https://github.com/Microsoft/hcsshim/archive/refs/tags/v0.11.4.zip",
    "status": "approved",
    "scans": [
        {
            "date": "February 8, 2024 at 3:30:32 p.m. GMT",
            "authority": "https://gitlab.eclipse.org/eclipsefdn/emo-team/iplab/-/issues/13183",
            "scancode-version": "31.2.1",
            "licenses-discovered": [
                "MIT",
                "Apache-2.0",
                "Apache-2.0 AND BSD-3-Clause",
                "ISC AND MIT",
                "ISC",
                "GPL-1.0-or-later",
                "BSD-3-Clause",
                "BSD-3-Clause AND MIT",
                "BSD-2-Clause",
                "Apache-2.0 AND BSD-3-Clause AND MIT",
                "Apache-2.0 AND MIT",
                "CC-BY-SA-4.0",
                "Apache-2.0 AND CC-BY-SA-4.0",
                "BSD-2-Clause-Views",
                "MPL-2.0"
            ],
            "copyrights": [
                "(c) 2012-2014, Yann Collet",
                "(c) cc.fr",
                "Copyright (c) 2004, 2006 The Linux Foundation and its contributors",
                "Copyright (c) 2006 Kirill Simonov",
                "Copyright (c) 2009 The Go Authors",
                "Copyright (c) 2011 Russ Ross",
                "Copyright (c) 2011 Russ Ross <russ@russross.com>",
                "Copyright (c) 2011 The Snappy-Go Authors",
                "Copyright (c) 2012 Miki Tebeka <miki.tebeka@gmail.com>",
                "Copyright (c) 2012 Rodrigo Moraes",
                "Copyright (c) 2012 The Go Authors",
                "Copyright (c) 2013 - 2021 Thomas Pelletier, Eric Anderton",
                "Copyright (c) 2013 Ben Johnson",
                "Copyright (c) 2013 Mitchell Hashimoto",
                "Copyright (c) 2013, Georg Reinke , Google",
                "Copyright (c) 2013, The GoGo Authors",
                "Copyright (c) 2013, Yann Collet",
                "Copyright (c) 2013-2014 The btcsuite",
                "Copyright (c) 2013-2014 The rsrc",
                "Copyright (c) 2013-2017 The btcsuite",
                "Copyright (c) 2013-2017 The rsrc",
                "Copyright (c) 2013-2020 Dave Collins",
                "Copyright (c) 2014 Benedikt Lang",
                "Copyright (c) 2014 Brian Goff",
                "Copyright (c) 2014 Cenk Alti",
                "Copyright (c) 2014 Sam Ghods",
                "Copyright (c) 2014 Simon Eskildsen",
                "Copyright (c) 2014-2015 The btcsuite",
                "Copyright (c) 2015 Agniva De Sarker",
                "Copyright (c) 2015 Docker, Inc.",
                "Copyright (c) 2015 Klaus Post",
                "Copyright (c) 2015 Microsoft",
                "Copyright (c) 2015 The btcsuite",
                "Copyright (c) 2015 Vincent Batts, Raleigh, NC",
                "Copyright (c) 2015 lestrrat",
                "Copyright (c) 2015, Dave Cheney <dave@cheney.net>",
                "Copyright (c) 2015-2016 The Decred developers",
                "Copyright (c) 2015-2019 The Decred developers",
                "Copyright (c) 2015-2020 The Decred developers",
                "Copyright (c) 2015-2021 The Decred developers",
                "Copyright (c) 2015-present, Facebook, Inc.",
                "Copyright (c) 2016 Caleb Spare",
                "Copyright (c) 2016 David Calavera",
                "Copyright (c) 2016 Docker, Inc.",
                "Copyright (c) 2016 Jeremy Saenz & Contributors",
                "Copyright (c) 2016 Joseph Spurrier",
                "Copyright (c) 2016 Sergey Kamardin",
                "Copyright (c) 2016, The GoGo Authors",
                "Copyright (c) 2017 The Go Authors",
                "Copyright (c) 2017 The Lightning Network",
                "Copyright (c) 2017 Yasuhiro Matsumoto",
                "Copyright (c) 2018 Adam Scarr",
                "Copyright (c) 2018 Microsoft Corp.",
                "Copyright (c) 2018 The Go Authors",
                "Copyright (c) 2018 lestrrat",
                "Copyright (c) 2018, The GoGo Authors",
                "Copyright (c) 2019 Klaus Post",
                "Copyright (c) 2019 Montgomery Edwards448 and Faye Amacker",
                "Copyright (c) 2019 The Go Authors",
                "Copyright (c) 2019, 2020 OCI Contributors",
                "Copyright (c) 2019-2022 Faye Amacker (https://github.com/fxamacker)",
                "Copyright (c) 2019-present Faye Amacker",
                "Copyright (c) 2020 Masaaki Goshima",
                "Copyright (c) 2020 The Decred developers",
                "Copyright (c) 2020 The Go Authors",
                "Copyright (c) 2020 lestrrat-go",
                "Copyright (c) 2021 The Go Authors",
                "Copyright (c) 2021 lestrrat-go",
                "Copyright (c) Faye Amacker",
                "Copyright (c) Faye Amacker and contributors",
                "Copyright (https://github.com/Cyan4973/xxHash/blob/master/LICENSE)",
                "Copyright 2008 Google Inc.",
                "Copyright 2009 The Go Authors",
                "Copyright 2009,2010 The Go Authors",
                "Copyright 2010 Google Inc.",
                "Copyright 2010 The Go Authors",
                "Copyright 2011 Google Inc.",
                "Copyright 2011 The Go Authors",
                "Copyright 2011 The Snappy-Go Authors",
                "Copyright 2012 Google Inc.",
                "Copyright 2012 Richard Crowley",
                "Copyright 2012 The Go Authors",
                "Copyright 2012 The Gorilla Authors",
                "Copyright 2013 Google Inc.",
                "Copyright 2013 MongoDB, Inc.",
                "Copyright 2013 The Go Authors",
                "Copyright 2013-2014 The btcsuite",
                "Copyright 2013-2015 CoreOS, Inc.",
                "Copyright 2013-2017 Docker, Inc.",
                "Copyright 2013-2018 Docker, Inc.",
                "Copyright 2014 Docker, Inc.",
                "Copyright 2014 The Go Authors",
                "Copyright 2014 The Kubernetes Authors",
                "Copyright 2014 Vishvananda Ishaya",
                "Copyright 2014 gRPC",
                "Copyright 2015 CoreOS, Inc.",
                "Copyright 2015 Docker, Inc.",
                "Copyright 2015 The Go Authors",
                "Copyright 2015 The Linux Foundation",
                "Copyright 2015 The btcsuite",
                "Copyright 2015 gRPC",
                "Copyright 2015 xeipuuv",
                "Copyright 2015 xeipuuv https://github.com/xeipuuv",
                "Copyright 2015, 2018 CoreOS, Inc.",
                "Copyright 2016 Docker, Inc.",
                "Copyright 2016 Google LLC",
                "Copyright 2016 The Go Authors",
                "Copyright 2016 The Linux Foundation",
                "Copyright 2016 The OPA Authors",
                "Copyright 2016 The Snappy-Go Authors",
                "Copyright 2016 The filepathx",
                "Copyright 2016 gRPC",
                "Copyright 2016-2017 The",
                "Copyright 2016-2017 The New York Times Company",
                "Copyright 2016-2022 The Linux Foundation",
                "Copyright 2017 Docker, Inc.",
                "Copyright 2017 The Go Authors",
                "Copyright 2017 The OPA Authors",
                "Copyright 2017 gRPC",
                "Copyright 2017, OpenCensus",
                "Copyright 2017, The Go Authors",
                "Copyright 2017-2020",
                "Copyright 2018 Google LLC",
                "Copyright 2018 Klaus Post",
                "Copyright 2018 The Go Authors",
                "Copyright 2018 The OPA Authors",
                "Copyright 2018 gRPC",
                "Copyright 2018 johandorland https://github.com/johandorland",
                "Copyright 2018, OpenCensus",
                "Copyright 2018, The Go Authors",
                "Copyright 2019 Google LLC",
                "Copyright 2019 Montgomery Edwards448 and Faye Amacker",
                "Copyright 2019 The Go Authors",
                "Copyright 2019 The OPA Authors",
                "Copyright 2019 gRPC",
                "Copyright 2019, 2020 OCI Contributors",
                "Copyright 2019, OpenCensus",
                "Copyright 2019, The Go Authors",
                "Copyright 2020 Google LLC",
                "Copyright 2020 The Go Authors",
                "Copyright 2020 The OPA Authors",
                "Copyright 2020+ Klaus Post",
                "Copyright 2020, OpenCensus",
                "Copyright 2020, The Go Authors",
                "Copyright 2020-2021 The Decred developers",
                "Copyright 2021 The Go Authors",
                "Copyright 2021 The OPA Authors",
                "Copyright 2021 icza",
                "Copyright 2022 Google LLC",
                "Copyright 2022 The Go Authors",
                "Copyright 2022 The Linux Foundation",
                "Copyright 2022 The OPA Authors",
                "Copyright 2023 Google LLC",
                "Copyright 2023 The Go Authors"
            ],
            "file-count": 3701,
            "sha256": "7f52bc12a3f6f43761ff29f54451315fae50514f200994942da27d9a7aff85dd",
            "source": "https://github.com/Microsoft/hcsshim/archive/refs/tags/v0.11.4.zip",
            "status": "restricted"
        }
    ]
}
