{
    "id": "git/github/leethomason/tinyxml2/9.0.0",
    "license": "Zlib AND MIT AND (GPL-2.0-only OR MIT) AND GPL-2.0-only",
    "authority": "https://gitlab.eclipse.org/eclipsefdn/emo-team/iplab/-/issues/9392",
    "source": "https://github.com/leethomason/tinyxml2/archive/refs/tags/9.0.0.zip",
    "status": "approved",
    "scans": [
        {
            "date": "July 14, 2023 at 8:50:23 a.m. GMT",
            "authority": "https://gitlab.eclipse.org/eclipsefdn/emo-team/iplab/-/issues/9392",
            "scancode-version": "31.2.1",
            "licenses-discovered": [
                "Zlib",
                "GPL-2.0-or-later",
                "MIT",
                "GPL-2.0-or-later AND Zlib",
                "GPL-2.0-only AND MIT",
                "GPL-2.0-only",
                "LicenseRef-scancode-other-permissive"
            ],
            "copyrights": [
                "(c) JS Foundation and other contributors",
                "Copyright (c) 1997-2020 by Dimitri van Heesch",
                "Copyright (c) 2007 Ariel Flesler",
                "Copyright (c) 2018 Steven Benner (http://stevenbenner.com/)",
                "Copyright (c) 2020 Dylan Baker",
                "Copyright 2011-2014, Dave Furfero",
                "Copyright Vasil Dinkov, Vadikom Web Ltd. http://vadikom.com",
                "Copyright jQuery Foundation and other contributors"
            ],
            "file-count": 241,
            "sha256": "6904137f290b0836792fd182c0d463cb66da085856b0e5803089b40bf379fdcf",
            "source": "https://github.com/leethomason/tinyxml2/archive/refs/tags/9.0.0.zip",
            "status": "restricted"
        }
    ]
}
