{
    "id": "npm/npmjs/-/rc-picker/4.1.1",
    "license": "MIT",
    "authority": "https://gitlab.eclipse.org/eclipsefdn/emo-team/iplab/-/issues/13334",
    "source": "https://registry.yarnpkg.com/rc-picker/-/rc-picker-4.1.1.tgz",
    "status": "approved",
    "scans": [
        {
            "date": "February 20, 2024 at 8:05:26 a.m. GMT",
            "authority": "https://gitlab.eclipse.org/eclipsefdn/emo-team/iplab/-/issues/13334",
            "scancode-version": "31.2.1",
            "licenses-discovered": [
                "MIT"
            ],
            "copyrights": [
                "Copyright (c) 2019-present afc163"
            ],
            "file-count": 561,
            "sha256": "b711c381f553d583b7d2d82408abb18f6ea531db9b0be37976d6d60eb958ea6c",
            "source": "https://registry.yarnpkg.com/rc-picker/-/rc-picker-4.1.1.tgz",
            "status": "approved"
        }
    ]
}