{
    "id": "npm/npmjs/-/slick-carousel/1.8.1",
    "license": "MIT",
    "licenses-discovered": [
        "MIT"
    ],
    "copyrights": [
        "Copyright (c) Ken Wheeler",
        "Copyright (c) Permission"
    ],
    "file-count": 24,
    "scancode-version": "30.1.0",
    "authority": "https://gitlab.eclipse.org/eclipsefdn/emo-team/iplab/-/issues/2986",
    "source": "https://github.com/kenwheeler/slick/archive/v1.8.1.zip",
    "status": "approved"
}