{
    "license": "LGPL-3.0-only AND LicenseRef-scancode-free-unknown AND MIT",
    "file-count": 25,
    "authority": "https://gitlab.eclipse.org/eclipsefdn/emo-team/iplab/-/issues/523",
    "scancode-version": "30.1.0",
    "licenses-discovered": [
        "MIT",
        "LicenseRef-scancode-free-unknown",
        "LGPL-3.0-only"
    ],
    "id": "npm/npmjs/-/node-notifier/5.4.3",
    "source": "https://registry.npmjs.org/node-notifier/-/node-notifier-5.4.3.tgz",
    "status": "restricted"
}