{
    "id": "maven/mavencentral/androidx.activity/activity/1.7.2",
    "license": "Apache-2.0",
    "authority": "https://gitlab.eclipse.org/eclipsefdn/emo-team/iplab/-/issues/10412",
    "source": "https://dl.google.com/android/maven2/androidx/activity/activity/1.7.2/activity-1.7.2-sources.jar",
    "status": "approved",
    "scans": [
        {
            "date": "September 11, 2023 at 9:08:55 p.m. GMT",
            "authority": "https://gitlab.eclipse.org/eclipsefdn/emo-team/iplab/-/issues/10412",
            "scancode-version": "31.2.1",
            "licenses-discovered": [
                "Apache-2.0"
            ],
            "copyrights": [
                "Copyright (c) 2020 The Android Open Source Project",
                "Copyright 2018 The Android Open Source Project",
                "Copyright 2019 The Android Open Source Project",
                "Copyright 2020 The Android Open Source Project",
                "Copyright 2021 The Android Open Source Project",
                "Copyright 2022 The Android Open Source Project"
            ],
            "file-count": 25,
            "sha256": "a400c7ca4d972e5e6884d78d9dc4f1d4dfc95fe5afcd92fabde47e4d496cae5d",
            "source": "https://dl.google.com/android/maven2/androidx/activity/activity/1.7.2/activity-1.7.2-sources.jar",
            "status": "approved"
        }
    ]
}