{
    "id": "maven/mavencentral/com.azure/azure-security-keyvault-secrets/4.8.0",
    "license": "MIT",
    "authority": "https://gitlab.eclipse.org/eclipsefdn/emo-team/iplab/-/issues/13690",
    "source": "https://repo1.maven.org/maven2/com/azure/azure-security-keyvault-secrets/4.8.0/azure-security-keyvault-secrets-4.8.0-sources.jar",
    "status": "approved",
    "scans": [
        {
            "date": "March 14, 2024 at 12:34:25 p.m. GMT",
            "authority": "https://gitlab.eclipse.org/eclipsefdn/emo-team/iplab/-/issues/13690",
            "scancode-version": "31.2.1",
            "licenses-discovered": [
                "MIT"
            ],
            "copyrights": [
                "(c) 2008 VeriSign, Inc.",
                "Copyright (c) Microsoft Corporation"
            ],
            "file-count": 45,
            "sha256": "c947042e5c3040b0bb543f846b2bd2ffe2a4dcf5a82675f0b106fbb5b5d933f5",
            "source": "https://repo1.maven.org/maven2/com/azure/azure-security-keyvault-secrets/4.8.0/azure-security-keyvault-secrets-4.8.0-sources.jar",
            "status": "approved"
        }
    ]
}