{
    "id": "go/golang/github.com%2Fenvoyproxy/protoc-gen-validate/v0.1.0",
    "license": "CC-BY-4.0 AND MIT AND Apache-2.0 AND BSD-2-Clause",
    "authority": "https://gitlab.eclipse.org/eclipsefdn/emo-team/iplab/-/issues/5648",
    "source": "https://proxy.golang.org/github.com%2Fenvoyproxy/protoc-gen-validate/@v/v0.1.0.zip",
    "status": "approved",
    "scans": [
        {
            "date": "December 12, 2022 at 3:35:23 a.m. GMT",
            "authority": "https://gitlab.eclipse.org/eclipsefdn/emo-team/iplab/-/issues/5648",
            "scancode-version": "31.2.1",
            "licenses-discovered": [
                "CC-BY-4.0 AND MIT",
                "Apache-2.0",
                "BSD-2-Clause"
            ],
            "copyrights": [
                "Copyright (c) 2004, 2006 The Linux Foundation and its contributors",
                "Copyright (c) 2013, The GoGo Authors"
            ],
            "file-count": 194,
            "sha256": "ec5261f3bbc426d71e2be4c76063ba12460c5d27845d630763e9e911ec4768af",
            "source": "https://proxy.golang.org/github.com%2Fenvoyproxy/protoc-gen-validate/@v/v0.1.0.zip",
            "status": "approved"
        }
    ]
}