{
    "id": "npm/npmjs/@typescript-eslint/typescript-estree/6.13.2",
    "license": "BSD-2-Clause AND (BSD-2-Clause AND ISC AND MIT) AND MIT",
    "authority": "https://gitlab.eclipse.org/eclipsefdn/emo-team/iplab/-/issues/11815",
    "source": "https://github.com/typescript-eslint/typescript-eslint/archive/refs/tags/v6.13.2.zip",
    "status": "approved",
    "scans": [
        {
            "date": "December 5, 2023 at 12:01:52 p.m. GMT",
            "authority": "https://gitlab.eclipse.org/eclipsefdn/emo-team/iplab/-/issues/11815",
            "scancode-version": "31.2.1",
            "licenses-discovered": [
                "BSD-2-Clause",
                "BSD-2-Clause AND ISC AND MIT",
                "MIT"
            ],
            "copyrights": [
                "Copyright (c) 2016 unional",
                "Copyright (c) 2019 typescript-eslint and other contributors",
                "Copyright (c) 2021 typescript-eslint and other contributors",
                "Copyright (c) 2023 typescript-eslint and other contributors",
                "Copyright JS Foundation and other contributors, https://js.foundation",
                "Copyright Joyent, Inc. and other Node contributors"
            ],
            "file-count": 7606,
            "sha256": "c498cf3081d5aa8c6e7994e1e765319c70ec8f287f132f99b52c64d5e2f40c0e",
            "source": "https://github.com/typescript-eslint/typescript-eslint/archive/refs/tags/v6.13.2.zip",
            "status": "approved"
        }
    ]
}