{
    "id": "npm/npmjs/@storybook/types/7.6.0",
    "license": "MIT AND OFL-1.1",
    "authority": "https://gitlab.eclipse.org/eclipsefdn/emo-team/iplab/-/issues/12809",
    "source": "https://github.com/storybookjs/storybook/archive/refs/tags/v7.6.0.zip",
    "status": "approved",
    "scans": [
        {
            "date": "January 17, 2024 at 5:22:49 p.m. GMT",
            "authority": "https://gitlab.eclipse.org/eclipsefdn/emo-team/iplab/-/issues/12809",
            "scancode-version": "31.2.1",
            "licenses-discovered": [
                "GPL-1.0-or-later",
                "MIT",
                "BSD-2-Clause AND ISC AND MIT",
                "OFL-1.1",
                "ISC"
            ],
            "copyrights": [
                "(c) 2017-present Renaud Tertrais",
                "(c) Unknown J2 V",
                "(c) Unknown Ks",
                "(c) Unknown Wu",
                "(c) Unknown Xs",
                "Copyright (c) 2016 Oxyno-zeta (Havrileck Alexandre)",
                "Copyright (c) 2017 Kadira Inc. <hello@kadira.io>",
                "Copyright (c) 2017 The swc Project",
                "Copyright 2011-2020 Tilde Inc. and contributors",
                "Copyright 2020 The Rubik Filtered Project",
                "Gt qt (c) Component",
                "Portions Copyright 2006-2011 Strobe Inc.",
                "Portions Copyright 2008-2011 Apple Inc."
            ],
            "file-count": 5812,
            "sha256": "de9fbb7ed9a3e7377a6b52beb1162787ea7e2d6ab3ce8eaceab0600916648aef",
            "source": "https://github.com/storybookjs/storybook/archive/refs/tags/v7.6.0.zip",
            "status": "restricted"
        }
    ]
}
