{
    "id": "project/automotive/ecal/fineftp-server/v1.3.1",
    "license": "MIT",
    "licenses-discovered": [
        "MIT"
    ],
    "copyrights": [
        "Copyright (c) Continental Corporation"
    ],
    "file-count": 32,
    "scancode-version": "30.1.0",
    "authority": "https://gitlab.eclipse.org/eclipsefdn/emo-team/iplab/-/issues/3138",
    "source": "https://github.com/eclipse-ecal/fineftp-server/archive/refs/tags/v1.3.1.zip",
    "status": "approved"
}