{
    "id": "maven/mavencentral/org.commonmark/commonmark-ext-yaml-front-matter/0.22.0",
    "license": "BSD-2-Clause",
    "authority": "https://gitlab.eclipse.org/eclipsefdn/emo-team/iplab/-/issues/13794",
    "source": "https://repo1.maven.org/maven2/org/commonmark/commonmark-ext-yaml-front-matter/0.22.0/commonmark-ext-yaml-front-matter-0.22.0-sources.jar",
    "status": "approved",
    "scans": [
        {
            "date": "March 16, 2024 at 7:32:37 a.m. GMT",
            "authority": "https://gitlab.eclipse.org/eclipsefdn/emo-team/iplab/-/issues/13794",
            "scancode-version": "31.2.1",
            "licenses-discovered": [
                "BSD-2-Clause"
            ],
            "copyrights": [
                "Copyright (c) 2015, Atlassian Pty Ltd"
            ],
            "file-count": 10,
            "sha256": "7210c906377a4fe92ab0fb5ecc793a9a4e7bb13079d79f7a405c9e50b6bbdf39",
            "source": "https://repo1.maven.org/maven2/org/commonmark/commonmark-ext-yaml-front-matter/0.22.0/commonmark-ext-yaml-front-matter-0.22.0-sources.jar",
            "status": "approved"
        }
    ]
}