{
    "id": "maven/mavencentral/org.apache.jena/jena-rdfpatch/4.8.0",
    "license": "Apache-2.0",
    "authority": "https://gitlab.eclipse.org/eclipsefdn/emo-team/iplab/-/issues/8903",
    "source": "https://repo.maven.apache.org/maven2/org/apache/jena/jena-rdfpatch/4.8.0/jena-rdfpatch-4.8.0-sources.jar",
    "status": "approved",
    "scans": [
        {
            "date": "June 14, 2023 at 5:56:52 p.m. GMT",
            "authority": "https://gitlab.eclipse.org/eclipsefdn/emo-team/iplab/-/issues/8903",
            "scancode-version": "31.2.1",
            "licenses-discovered": [
                "Apache-2.0"
            ],
            "copyrights": [
            ],
            "file-count": 84,
            "sha256": "4ea0907bd5c9ea6767347276b9fb3cf504f32a47391cf7ede323c4f868953903",
            "source": "https://repo.maven.apache.org/maven2/org/apache/jena/jena-rdfpatch/4.8.0/jena-rdfpatch-4.8.0-sources.jar",
            "status": "approved"
        }
    ]
}