{
    "id": "p2/orbit/p2.eclipse.plugin/com.fasterxml.jackson.core.jackson-core/2.12.6",
    "license": "Apache-2.0",
    "authority": "https://gitlab.eclipse.org/eclipsefdn/emo-team/iplab/-/issues/15228",
    "source": "https://repo1.maven.org/maven2/com/fasterxml/jackson/core/jackson-core/2.12.6/jackson-core-2.12.6-sources.jar",
    "status": "approved",
    "scans": [
        {
            "date": "June 14, 2024 at 10:51:34 a.m. GMT",
            "authority": "https://gitlab.eclipse.org/eclipsefdn/emo-team/iplab/-/issues/15228",
            "scancode-version": "31.2.1",
            "licenses-discovered": [
                "Apache-2.0"
            ],
            "copyrights": [
                "(c) Override public ObjectCodec",
                "Copyright (c) 2007- Tatu Saloranta, tatu.saloranta@iki.fi"
            ],
            "file-count": 123,
            "sha256": "319c0a2b3afbae4d3a5b45964858ad18514e3ea25d5eb9c7bc94748ac4f8e5e4",
            "source": "https://repo1.maven.org/maven2/com/fasterxml/jackson/core/jackson-core/2.12.6/jackson-core-2.12.6-sources.jar",
            "status": "approved"
        }
    ]
}