{
    "id": "maven/mavencentral/com.google.auth/google-auth-library-credentials/1.29.0",
    "license": "BSD-3-Clause",
    "authority": "https://gitlab.eclipse.org/eclipsefdn/emo-team/iplab/-/issues/16920",
    "source": "https://repo1.maven.org/maven2/com/google/auth/google-auth-library-credentials/1.29.0/google-auth-library-credentials-1.29.0-sources.jar",
    "status": "approved",
    "scans": [
        {
            "date": "October 28, 2024, 2:23:50 p.m. GMT",
            "authority": "https://gitlab.eclipse.org/eclipsefdn/emo-team/iplab/-/issues/16920",
            "scancode-version": "31.2.1",
            "licenses-discovered": [
                "BSD-3-Clause"
            ],
            "copyrights": [
                "Copyright 2015, Google Inc.",
                "Copyright 2016, Google Inc.",
                "Copyright 2022 Google LLC",
                "Copyright 2024 Google LLC",
                "Copyright 2024, Google Inc."
            ],
            "file-count": 9,
            "sha256": "47c7ad73ae09c565dcb50b60c3abcc8e277df7bc7d1285ae96e39cc6f67c6ff9",
            "source": "https://repo1.maven.org/maven2/com/google/auth/google-auth-library-credentials/1.29.0/google-auth-library-credentials-1.29.0-sources.jar",
            "status": "approved"
        }
    ]
}