{
    "id": "maven/mavencentral/software.amazon.awssdk/third-party-jackson-core/2.20.77",
    "license": "Apache-2.0",
    "authority": "https://gitlab.eclipse.org/eclipsefdn/emo-team/iplab/-/issues/8622",
    "source": "https://repo.maven.apache.org/maven2/software/amazon/awssdk/third-party-jackson-core/2.20.0/third-party-jackson-core-2.20.0-sources.jar",
    "status": "approved",
    "scans": [
        {
            "date": "June 2, 2023 at 6:06:18 p.m. GMT",
            "authority": "https://gitlab.eclipse.org/eclipsefdn/emo-team/iplab/-/issues/8622",
            "scancode-version": "31.2.1",
            "licenses-discovered": [
                "Apache-2.0"
            ],
            "copyrights": [
                "Copyright Amazon.com, Inc. or its affiliates"
            ],
            "file-count": 4,
            "sha256": "26d4775cecc02d472be27c98edf76459450999d3147c529400be2bc47b831d59",
            "source": "https://repo.maven.apache.org/maven2/software/amazon/awssdk/third-party-jackson-core/2.20.0/third-party-jackson-core-2.20.0-sources.jar",
            "status": "approved"
        }
    ]
}