{
    "id": "npm/npmjs/@iofog/ecn-viewer/3.0.1",
    "license": "EPL-2.0 AND (BSD-3-Clause AND MIT) AND (Apache-2.0 AND BSD-2-Clause AND BSD-3-Clause AND MIT)",
    "licenses-discovered": [
        "EPL-2.0",
        "BSD-3-Clause AND MIT",
        "Apache-2.0 AND BSD-2-Clause AND BSD-3-Clause AND MIT"
    ],
    "file-count": 19,
    "scancode-version": "30.1.0",
    "authority": "https://gitlab.eclipse.org/eclipsefdn/emo-team/iplab/-/issues/2653",
    "source": "https://registry.npmjs.org/@iofog/ecn-viewer/-/ecn-viewer-3.0.1.tgz",
    "status": "approved"
}