{
    "id": "maven/mavencentral/org.apache.camel/camel-stub/3.21.0",
    "license": "Apache-2.0",
    "authority": "https://gitlab.eclipse.org/eclipsefdn/emo-team/iplab/-/issues/10261",
    "source": "https://repo.maven.apache.org/maven2/org/apache/camel/camel-stub/3.21.0/camel-stub-3.21.0-sources.jar",
    "status": "approved",
    "scans": [
        {
            "date": "September 6, 2023 at 11:52:44 a.m. GMT",
            "authority": "https://gitlab.eclipse.org/eclipsefdn/emo-team/iplab/-/issues/10261",
            "scancode-version": "31.2.1",
            "licenses-discovered": [
                "Apache-2.0"
            ],
            "copyrights": [
            ],
            "file-count": 16,
            "sha256": "e5fcc6f322dc0cc425786c7ca6a91479387479b86c92ac0c0b5932d139878d7b",
            "source": "https://repo.maven.apache.org/maven2/org/apache/camel/camel-stub/3.21.0/camel-stub-3.21.0-sources.jar",
            "status": "approved"
        }
    ]
}