{
    "license": "Apache-2.0 AND MIT",
    "file-count": 11,
    "authority": "https://gitlab.eclipse.org/eclipsefdn/emo-team/iplab/-/issues/1828",
    "scancode-version": "30.1.0",
    "licenses-discovered": [
        "Apache-2.0",
        "LGPL-2.1-only",
        "MIT"
    ],
    "id": "maven/mavencentral/org.apache.httpcomponents.client5/httpclient5-win/5.1.2",
    "source": "https://search.maven.org/remotecontent?filepath=org/apache/httpcomponents/client5/httpclient5-win/5.1.2/httpclient5-win-5.1.2-sources.jar",
    "status": "approved"
}
