{
    "id": "maven/mavencentral/org.postgresql/postgresql/42.5.0",
    "license": "BSD-2-Clause",
    "licenses-discovered": [
        "BSD-2-Clause",
        "LicenseRef-scancode-free-unknown"
    ],
    "copyrights": [
        "(c) Serguei A. Mokhov, <mokhov@cs.concordia.ca>",
        "Bojan Skaljac <skaljac@gmail.com>",
        "Copyright (c) Open Cloud Limited",
        "Copyright (c) PostgreSQL Global Development Group"
    ],
    "file-count": 286,
    "scancode-version": "30.1.0",
    "authority": "https://gitlab.eclipse.org/eclipsefdn/emo-team/iplab/-/issues/3416",
    "source": "https://search.maven.org/remotecontent?filepath=org/postgresql/postgresql/42.5.0/postgresql-42.5.0-sources.jar",
    "status": "approved"
}
