{
    "id": "maven/mavencentral/org.apache.jena/jena-core/4.8.0",
    "license": "Apache-2.0 AND (Apache-2.0 AND BSD-3-Clause)",
    "authority": "https://gitlab.eclipse.org/eclipsefdn/emo-team/iplab/-/issues/8873",
    "source": "https://repo.maven.apache.org/maven2/org/apache/jena/jena-core/4.8.0/jena-core-4.8.0-sources.jar",
    "status": "approved",
    "scans": [
        {
            "date": "June 14, 2023 at 7:05:26 p.m. GMT",
            "authority": "https://gitlab.eclipse.org/eclipsefdn/emo-team/iplab/-/issues/8873",
            "scancode-version": "31.2.1",
            "licenses-discovered": [
                "Apache-2.0",
                "Apache-2.0 AND BSD-3-Clause"
            ],
            "copyrights": [
                "(c) Copyright 2003, Plugged In Software",
                "Copyright (c) 1999-2002 The Apache Software Foundation",
                "Copyright (c) 1999-2003 The Apache Software Foundation"
            ],
            "file-count": 966,
            "sha256": "4fd3174e1a08d8a45e332bc4f131b3189c5003829d32faa52cb557ec762875a1",
            "source": "https://repo.maven.apache.org/maven2/org/apache/jena/jena-core/4.8.0/jena-core-4.8.0-sources.jar",
            "status": "approved"
        }
    ]
}