{
    "id": "maven/mavencentral/software.amazon.awssdk/sdk-core/2.21.5",
    "license": "Apache-2.0",
    "authority": "https://gitlab.eclipse.org/eclipsefdn/emo-team/iplab/-/issues/11121",
    "source": "https://repo.maven.apache.org/maven2/software/amazon/awssdk/sdk-core/2.21.5/sdk-core-2.21.5-sources.jar",
    "status": "approved",
    "scans": [
        {
            "date": "October 24, 2023 at 11:21:37 a.m. GMT",
            "authority": "https://gitlab.eclipse.org/eclipsefdn/emo-team/iplab/-/issues/11121",
            "scancode-version": "31.2.1",
            "licenses-discovered": [
                "Apache-2.0"
            ],
            "copyrights": [
                "Copyright Amazon.com, Inc. or its affiliates"
            ],
            "file-count": 344,
            "sha256": "3f6252075a54580f35524a605eb72cac940e4c4f14b2f87c3a9c542ca8c865b9",
            "source": "https://repo.maven.apache.org/maven2/software/amazon/awssdk/sdk-core/2.21.5/sdk-core-2.21.5-sources.jar",
            "status": "approved"
        }
    ]
}