{
    "id": "npm/npmjs/@adobe/css-tools/4.1.0",
    "license": "MIT",
    "authority": "https://gitlab.eclipse.org/eclipsefdn/emo-team/iplab/-/issues/6677",
    "source": "https://registry.npmjs.org/@adobe/css-tools/-/css-tools-4.1.0.tgz",
    "status": "approved",
    "scans": [
        {
            "date": "January 26, 2023 at 12:52:48 p.m. GMT",
            "authority": "https://gitlab.eclipse.org/eclipsefdn/emo-team/iplab/-/issues/6677",
            "scancode-version": "31.2.1",
            "licenses-discovered": [
                "MIT"
            ],
            "copyrights": [
                "Copyright (c) 2012 TJ Holowaychuk <tj@vision-media.ca>",
                "Copyright (c) 2022 Jean-Philippe Zolesio <holblin@gmail.com>"
            ],
            "file-count": 22,
            "sha256": "e8adeccf96a6f23a1597f8242e272c1d511156960d43eccaa8913f1f4f4159ba",
            "source": "https://registry.npmjs.org/@adobe/css-tools/-/css-tools-4.1.0.tgz",
            "status": "approved"
        }
    ]
}