{
    "id": "maven/mavencentral/org.springframework.session/spring-session-core/3.2.1",
    "license": "Apache-2.0",
    "authority": "https://gitlab.eclipse.org/eclipsefdn/emo-team/iplab/-/issues/12588",
    "source": "https://repo1.maven.org/maven2/org/springframework/session/spring-session-core/3.2.1/spring-session-core-3.2.1-sources.jar",
    "status": "approved",
    "scans": [
        {
            "date": "January 2, 2024 at 2:28:14 p.m. GMT",
            "authority": "https://gitlab.eclipse.org/eclipsefdn/emo-team/iplab/-/issues/12588",
            "scancode-version": "31.2.1",
            "licenses-discovered": [
                "Apache-2.0"
            ],
            "copyrights": [
                "Copyright 2014-2017 the original author or authors",
                "Copyright 2014-2019 the original author or authors",
                "Copyright 2014-2021 the original author or authors",
                "Copyright 2014-2022 the original author or authors",
                "Copyright 2014-2023 the original author or authors"
            ],
            "file-count": 53,
            "sha256": "af4de3daac03a79cf7c2094a138b451b0b79fb40b89ef471c6e20192eb370c33",
            "source": "https://repo1.maven.org/maven2/org/springframework/session/spring-session-core/3.2.1/spring-session-core-3.2.1-sources.jar",
            "status": "approved"
        }
    ]
}