{
    "id": "maven/mavencentral/io.fabric8/openshift-model-machineconfig/6.11.0",
    "license": "Apache-2.0",
    "authority": "https://gitlab.eclipse.org/eclipsefdn/emo-team/iplab/-/issues/14164",
    "source": "https://repo1.maven.org/maven2/io/fabric8/openshift-model-machineconfig/6.11.0/openshift-model-machineconfig-6.11.0-sources.jar",
    "status": "approved",
    "scans": [
        {
            "date": "March 26, 2024 at 5:53:16 p.m. GMT",
            "authority": "https://gitlab.eclipse.org/eclipsefdn/emo-team/iplab/-/issues/14164",
            "scancode-version": "31.2.1",
            "licenses-discovered": [
                "Apache-2.0"
            ],
            "copyrights": [
                "Copyright (c) 2015 Red Hat, Inc."
            ],
            "file-count": 95,
            "sha256": "0847010fdd957c3ceaa42c5dcb0bcd7af42a10536535b2ac5a918863099920ce",
            "source": "https://repo1.maven.org/maven2/io/fabric8/openshift-model-machineconfig/6.11.0/openshift-model-machineconfig-6.11.0-sources.jar",
            "status": "approved"
        }
    ]
}