{
    "id": "p2/orbit/p2.eclipse.plugin/openjfx.web.win32_64/17.0.2",
    "license": "GPL-2.0-only WITH Classpath-exception-2.0",
    "authority": "https://gitlab.eclipse.org/eclipsefdn/emo-team/iplab/-/issues/15732",
    "source": "https://repo1.maven.org/maven2/org/openjfx/javafx-web/17.0.2/javafx-web-17.0.2-sources.jar",
    "status": "approved",
    "scans": [
        {
            "date": "July 17, 2024 at 3:31:25 p.m. GMT",
            "authority": "https://gitlab.eclipse.org/eclipsefdn/emo-team/iplab/-/issues/15732",
            "scancode-version": "31.2.1",
            "licenses-discovered": [
                "GPL-2.0-only WITH Classpath-exception-2.0"
            ],
            "copyrights": [
                "Copyright (c) 2010, 2016, Oracle and/or its affiliates",
                "Copyright (c) 2010, 2017, Oracle and/or its affiliates",
                "Copyright (c) 2010, 2021, Oracle and/or its affiliates",
                "Copyright (c) 2011, 2014, Oracle and/or its affiliates",
                "Copyright (c) 2011, 2015, Oracle and/or its affiliates",
                "Copyright (c) 2011, 2016, Oracle and/or its affiliates",
                "Copyright (c) 2011, 2017, Oracle and/or its affiliates",
                "Copyright (c) 2011, 2018, Oracle and/or its affiliates",
                "Copyright (c) 2011, 2019, Oracle and/or its affiliates",
                "Copyright (c) 2011, 2020, Oracle and/or its affiliates",
                "Copyright (c) 2011, 2021, Oracle and/or its affiliates",
                "Copyright (c) 2012, 2014, Oracle and/or its affiliates",
                "Copyright (c) 2012, 2016, Oracle and/or its affiliates",
                "Copyright (c) 2012, 2018, Oracle and/or its affiliates",
                "Copyright (c) 2012, 2021, Oracle and/or its affiliates",
                "Copyright (c) 2013, 2015, Oracle and/or its affiliates",
                "Copyright (c) 2013, 2017, Oracle and/or its affiliates",
                "Copyright (c) 2013, 2018, Oracle and/or its affiliates",
                "Copyright (c) 2015, 2017, Oracle and/or its affiliates",
                "Copyright (c) 2015, 2019, Oracle and/or its affiliates",
                "Copyright (c) 2015, Oracle and/or its affiliates",
                "Copyright (c) 2016, 2018, Oracle and/or its affiliates",
                "Copyright (c) 2016, Oracle and/or its affiliates",
                "Copyright (c) 2017, 2021, Oracle and/or its affiliates",
                "Copyright (c) 2018, 2019, Oracle and/or its affiliates",
                "Copyright (c) 2018, Oracle and/or its affiliates",
                "Copyright (c) 2019, 2021, Oracle and/or its affiliates",
                "Copyright (c) 2019, Oracle and/or its affiliates"
            ],
            "file-count": 276,
            "sha256": "f894aba51033a3206f50b7ecac9526c840e35f51a6b3ab329a78b661f1419525",
            "source": "https://repo1.maven.org/maven2/org/openjfx/javafx-web/17.0.2/javafx-web-17.0.2-sources.jar",
            "status": "restricted"
        }
    ]
}