{
    "id": "maven/mavencentral/org.springframework.boot/spring-boot-starter-data-rest/3.0.5",
    "license": "Apache-2.0",
    "authority": "https://gitlab.eclipse.org/eclipsefdn/emo-team/iplab/-/issues/7861",
    "source": "https://search.maven.org/remotecontent?filepath=org/springframework/boot/spring-boot-starter-data-rest/3.0.5/spring-boot-starter-data-rest-3.0.5-sources.jar",
    "status": "approved",
    "scans": [
        {
            "date": "April 13, 2023 at 12:31:01 p.m. GMT",
            "authority": "https://gitlab.eclipse.org/eclipsefdn/emo-team/iplab/-/issues/7861",
            "scancode-version": "31.2.1",
            "licenses-discovered": [
                "Apache-2.0"
            ],
            "copyrights": [
            ],
            "file-count": 2,
            "sha256": "b2cc8f9d01d4e5c4e08e3dfe640f5e6b3f25f11d1a9ed6a5edab21f1d4676a7d",
            "source": "https://search.maven.org/remotecontent?filepath=org/springframework/boot/spring-boot-starter-data-rest/3.0.5/spring-boot-starter-data-rest-3.0.5-sources.jar",
            "status": "approved"
        }
    ]
}