{
    "id": "git/github/google/googletest/v1.14.0",
    "license": "BSD-3-Clause",
    "authority": "https://gitlab.eclipse.org/eclipsefdn/emo-team/iplab/-/issues/17168",
    "source": "https://github.com/google/googletest/archive/refs/tags/v1.14.0.zip",
    "status": "approved",
    "scans": [
        {
            "date": "November 13, 2024, 11:33:33 a.m. GMT",
            "authority": "https://gitlab.eclipse.org/eclipsefdn/emo-team/iplab/-/issues/17168",
            "scancode-version": "31.2.1",
            "licenses-discovered": [
                "BSD-3-Clause"
            ],
            "copyrights": [
                "Copyright 2005 Google Inc.",
                "Copyright 2005, Google Inc.",
                "Copyright 2006, Google Inc.",
                "Copyright 2007, Google Inc.",
                "Copyright 2008 Google Inc.",
                "Copyright 2008, Google Inc.",
                "Copyright 2009 Google Inc.",
                "Copyright 2009, Google Inc.",
                "Copyright 2010 Google Inc.",
                "Copyright 2010, Google Inc.",
                "Copyright 2013, Google Inc.",
                "Copyright 2015 Google Inc.",
                "Copyright 2015, Google Inc.",
                "Copyright 2017 Google Inc.",
                "Copyright 2018 Google LLC.",
                "Copyright 2018, Google Inc.",
                "Copyright 2018, Google LLC.",
                "Copyright 2019 Google LLC.",
                "Copyright 2019, Google Inc.",
                "Copyright 2019, Google LLC.",
                "Copyright 2020 Google Inc.",
                "Copyright 2020, Google Inc.",
                "Copyright 2021 Google Inc."
            ],
            "file-count": 244,
            "sha256": "1f357c27ca988c3f7c6b4bf68a9395005ac6761f034046e9dde0896e3aba00e4",
            "source": "https://github.com/google/googletest/archive/refs/tags/v1.14.0.zip",
            "status": "approved"
        }
    ]
}