{
    "id": "maven/mavencentral/es.weso/utils_2.12/0.2.4",
    "license": "MIT",
    "authority": "https://gitlab.eclipse.org/eclipsefdn/emo-team/iplab/-/issues/8856",
    "source": "https://repo.maven.apache.org/maven2/es/weso/utils_2.12/0.2.4/utils_2.12-0.2.4-sources.jar",
    "status": "approved",
    "scans": [
        {
            "date": "June 14, 2023 at 7:23:12 p.m. GMT",
            "authority": "https://gitlab.eclipse.org/eclipsefdn/emo-team/iplab/-/issues/8856",
            "scancode-version": "31.2.1",
            "licenses-discovered": [
            ],
            "copyrights": [
            ],
            "file-count": 20,
            "sha256": "ef697bf3f2df926420572e68d98590d1979a161417adfa42aada8321f4ac69d2",
            "source": "https://repo.maven.apache.org/maven2/es/weso/utils_2.12/0.2.4/utils_2.12-0.2.4-sources.jar",
            "status": "restricted"
        }
    ]
}
