{
    "id": "npm/npmjs/-/vue-json-viewer/3.0.4",
    "license": "MIT",
    "authority": "https://gitlab.eclipse.org/eclipsefdn/emo-team/iplab/-/issues/5870",
    "source": "https://registry.npmjs.org/vue-json-viewer/-/vue-json-viewer-3.0.4.tgz",
    "status": "approved",
    "scans": [
        {
            "date": "December 16, 2022 at 10:33:56 a.m. GMT",
            "authority": "https://gitlab.eclipse.org/eclipsefdn/emo-team/iplab/-/issues/5870",
            "scancode-version": "31.2.1",
            "licenses-discovered": [
                "MIT"
            ],
            "copyrights": [
                "Copyright (c) 2018 Chen Feng"
            ],
            "file-count": 7,
            "sha256": "87a2a5274ff67638551675f7b685d646530cab7c6debe775eef0835c9e701e3e",
            "source": "https://registry.npmjs.org/vue-json-viewer/-/vue-json-viewer-3.0.4.tgz",
            "status": "approved"
        }
    ]
}