{
    "id": "maven/mavencentral/org.eclipse.dataspaceconnector/ids-api-multipart-endpoint-v1/0.0.1-20220922.4-20230220.143048-1",
    "license": "Apache-2.0",
    "authority": "https://gitlab.eclipse.org/eclipsefdn/emo-team/iplab/-/issues/7629",
    "source": "https://search.maven.org/remotecontent?filepath=org/eclipse/dataspaceconnector/ids-api-multipart-endpoint-v1/0.0.1-milestone-6/ids-api-multipart-endpoint-v1-0.0.1-milestone-6-sources.jar",
    "status": "approved",
    "scans": [
        {
            "date": "March 28, 2023 at 9:54:03 p.m. GMT",
            "authority": "https://gitlab.eclipse.org/eclipsefdn/emo-team/iplab/-/issues/7629",
            "scancode-version": "31.2.1",
            "licenses-discovered": [
                "Apache-2.0"
            ],
            "copyrights": [
                "Copyright (c) 2020, 2021 Microsoft Corporation",
                "Copyright (c) 2021 - 2022 Daimler TSS GmbH",
                "Copyright (c) 2021 - 2022 Daimler TSS GmbH, Fraunhofer Institute for Software and Systems Engineering",
                "Copyright (c) 2021 - 2022 Fraunhofer Institute for Software and Systems Engineering",
                "Copyright (c) 2021 - 2022 Fraunhofer Institute for Software and Systems Engineering, Daimler TSS GmbH",
                "Copyright (c) 2021 Daimler TSS GmbH",
                "Copyright (c) 2021 Daimler TSS GmbH, Fraunhofer Institute for Software and Systems Engineering",
                "Copyright (c) 2021 Fraunhofer Institute for Software and Systems Engineering",
                "Copyright (c) 2022 Amadeus",
                "Copyright (c) 2022 Microsoft Corporation"
            ],
            "file-count": 15,
            "sha256": "9aa91b0e7b2deff51c1d6c76d5b8f3e28c35970092c0a469d58fc0b5f986a7e6",
            "source": "https://search.maven.org/remotecontent?filepath=org/eclipse/dataspaceconnector/ids-api-multipart-endpoint-v1/0.0.1-milestone-6/ids-api-multipart-endpoint-v1-0.0.1-milestone-6-sources.jar",
            "status": "approved"
        }
    ]
}