{
    "id": "maven/mavencentral/org.apache.sshd/sshd-core/2.12.0",
    "license": "Apache-2.0",
    "authority": "https://gitlab.eclipse.org/eclipsefdn/emo-team/iplab/-/issues/12841",
    "source": "https://repo1.maven.org/maven2/org/apache/sshd/sshd-core/2.12.0/sshd-core-2.12.0-sources.jar",
    "status": "approved",
    "scans": [
        {
            "date": "January 19, 2024 at 5:36:53 p.m. GMT",
            "authority": "https://gitlab.eclipse.org/eclipsefdn/emo-team/iplab/-/issues/12841",
            "scancode-version": "31.2.1",
            "licenses-discovered": [
                "Apache-2.0"
            ],
            "copyrights": [
            ],
            "file-count": 370,
            "sha256": "9e1d4e546b40ea750fde86d06a7caed42015adee0e63ac29f5e12ea631bb0e45",
            "source": "https://repo1.maven.org/maven2/org/apache/sshd/sshd-core/2.12.0/sshd-core-2.12.0-sources.jar",
            "status": "approved"
        }
    ]
}