{
    "id": "npm/npmjs/@tufjs/models/1.0.1",
    "license": "MIT",
    "authority": "https://gitlab.eclipse.org/eclipsefdn/emo-team/iplab/-/issues/7600",
    "source": "https://registry.npmjs.org/@tufjs/models/-/models-1.0.1.tgz",
    "status": "approved",
    "scans": [
        {
            "date": "March 27, 2023 at 4:42:43 p.m. GMT",
            "authority": "https://gitlab.eclipse.org/eclipsefdn/emo-team/iplab/-/issues/7600",
            "scancode-version": "31.2.1",
            "licenses-discovered": [
                "MIT"
            ],
            "copyrights": [
                "Copyright (c) 2022 GitHub and the TUF Contributors"
            ],
            "file-count": 43,
            "sha256": "ea1816b253690181a9006de10782377928ec2d41de0fb909a40650ac70b8e085",
            "source": "https://registry.npmjs.org/@tufjs/models/-/models-1.0.1.tgz",
            "status": "approved"
        }
    ]
}