{
    "id": "maven/mavencentral/org.apache.maven.resolver/maven-resolver-api/2.0.3",
    "license": "Apache-2.0",
    "authority": "https://gitlab.eclipse.org/eclipsefdn/emo-team/iplab/-/issues/17017",
    "source": "https://repo1.maven.org/maven2/org/apache/maven/resolver/maven-resolver-api/2.0.3/maven-resolver-api-2.0.3-sources.jar",
    "status": "approved",
    "scans": [
        {
            "date": "November 4, 2024, 7:29:34 a.m. GMT",
            "authority": "https://gitlab.eclipse.org/eclipsefdn/emo-team/iplab/-/issues/17017",
            "scancode-version": "31.2.1",
            "licenses-discovered": [
                "Apache-2.0"
            ],
            "copyrights": [
            ],
            "file-count": 135,
            "sha256": "4e1478ed1cc49c2825b89902aa57a08b6bbd235b56dbe9bd54cc733662d5aee8",
            "source": "https://repo1.maven.org/maven2/org/apache/maven/resolver/maven-resolver-api/2.0.3/maven-resolver-api-2.0.3-sources.jar",
            "status": "approved"
        }
    ]
}