{
    "id": "project/eclipse.pde/-/eclipse.pdePR999/0.0",
    "license": "EPL-2.0",
    "authority": "https://gitlab.eclipse.org/eclipsefdn/emo-team/iplab/-/issues/12097",
    "source": "https://github.com/eclipse-pde/eclipse.pde/pull/999.patch",
    "status": "approved",
    "scans": [
        {
            "date": "December 15, 2023 at 5:36:32 p.m. GMT",
            "authority": "https://gitlab.eclipse.org/eclipsefdn/emo-team/iplab/-/issues/12097",
            "scancode-version": "31.2.1",
            "licenses-discovered": [
                "EPL-2.0"
            ],
            "copyrights": [
                "Copyright (c) 2010, 2019 bndtools project and others",
                "Copyright (c) 2010, 2021 bndtools project and others",
                "Copyright (c) 2010, 2023 bndtools project and others",
                "Copyright (c) 2015, 2019 bndtools project and others",
                "Copyright (c) 2015, 2020 bndtools project and others",
                "Copyright (c) 2015, 2023 bndtools project and others",
                "Copyright (c) 2016, 2019 bndtools project and others",
                "Copyright (c) 2016, 2021 bndtools project and others",
                "Copyright (c) 2016, 2023 bndtools project and others",
                "Copyright (c) 2023 Christoph Laubrich and others",
                "Copyright (c) 2023 bndtools project and others",
                "Copyright (c) 2023 eclipse contributors and others"
            ],
            "file-count": 1,
            "sha256": "3f57d6a1bae1e052f298723bc0f3a29dd3192691fda14cc4415683f97d203711",
            "source": "https://github.com/eclipse-pde/eclipse.pde/pull/999.patch",
            "status": "restricted"
        }
    ]
}
