{
    "id": "npm/npmjs/-/eslint-plugin-jsdoc/43.1.1",
    "license": "BSD-3-Clause",
    "authority": "https://gitlab.eclipse.org/eclipsefdn/emo-team/iplab/-/issues/8059",
    "source": "https://github.com/gajus/eslint-plugin-jsdoc/archive/v43.1.1.zip",
    "status": "approved",
    "scans": [
        {
            "date": "April 28, 2023 at 3:10:54 p.m. GMT",
            "authority": "https://gitlab.eclipse.org/eclipsefdn/emo-team/iplab/-/issues/8059",
            "scancode-version": "31.2.1",
            "licenses-discovered": [
                "BSD-3-Clause",
                "GPL-2.0-only AND GPL-3.0-only AND MIT",
                "GPL-3.0-only AND MIT",
                "MIT"
            ],
            "copyrights": [
                "Copyright (c) 2018, Gajus Kuizinas (http://gajus.com/)",
                "Copyright 2022",
                "Copyright Message Invalid JSDoc"
            ],
            "file-count": 200,
            "sha256": "a2b256b7b118f258c63802a2b6e8b3a46f1ce7365077b8cad29f750018af63ec",
            "source": "https://github.com/gajus/eslint-plugin-jsdoc/archive/v43.1.1.zip",
            "status": "restricted"
        }
    ]
}
