{
    "license": "Apache-2.0 AND BSD-3-Clause AND MIT",
    "file-count": 105,
    "authority": "https://gitlab.eclipse.org/eclipsefdn/emo-team/iplab/-/issues/1844",
    "scancode-version": "30.1.0",
    "licenses-discovered": [
        "Apache-2.0",
        "BSD-3-Clause",
        "MIT"
    ],
    "id": "maven/mavencentral/org.apache.shiro/shiro-web/1.8.0",
    "source": "https://search.maven.org/remotecontent?filepath=org/apache/shiro/shiro-web/1.8.0/shiro-web-1.8.0-sources.jar",
    "status": "approved"
}