{
    "id": "maven/mavencentral/org.graalvm.regex/regex/20.3.13",
    "license": "UPL-1.0 AND (LicenseRef-scancode-unicode AND UPL-1.0)",
    "authority": "https://gitlab.eclipse.org/eclipsefdn/emo-team/iplab/-/issues/13793",
    "source": "https://repo1.maven.org/maven2/org/graalvm/regex/regex/20.3.13/regex-20.3.13-sources.jar",
    "status": "restricted",
    "scans": [
        {
            "date": "March 16, 2024 at 3:53:49 a.m. GMT",
            "authority": "https://gitlab.eclipse.org/eclipsefdn/emo-team/iplab/-/issues/13793",
            "scancode-version": "31.2.1",
            "licenses-discovered": [
                "UPL-1.0",
                "LicenseRef-scancode-unicode AND UPL-1.0"
            ],
            "copyrights": [
                "Copyright (c) 2018 Unicode, Inc.",
                "Copyright (c) 2018, 2019, Oracle and/or its affiliates",
                "Copyright (c) 2018, 2020, Oracle and/or its affiliates",
                "Copyright (c) 2019, 2019, Oracle and/or its affiliates",
                "Copyright (c) 2019, 2020, Oracle and/or its affiliates",
                "Copyright (c) 2020, 2020, Oracle and/or its affiliates"
            ],
            "file-count": 309,
            "sha256": "6f8e0cafe2a27985a3b82f150cde5367505cad497dd35f43e62e89353b11fd2d",
            "source": "https://repo1.maven.org/maven2/org/graalvm/regex/regex/20.3.13/regex-20.3.13-sources.jar",
            "status": "restricted"
        }
    ]
}