{
    "id": "crate/cratesio/-/hdrhistogram/7.5.4",
    "license": "Apache-2.0 AND MIT AND Apache-2.0 AND MIT",
    "authority": "https://gitlab.eclipse.org/eclipsefdn/emo-team/iplab/-/issues/17304",
    "source": "https://crates.io/api/v1/crates/hdrhistogram/7.5.4/download",
    "status": "approved",
    "scans": [
        {
            "date": "November 19, 2024, 4:12:37 p.m. GMT",
            "authority": "https://gitlab.eclipse.org/eclipsefdn/emo-team/iplab/-/issues/17304",
            "scancode-version": "31.2.1",
            "licenses-discovered": [
                "Apache-2.0 AND MIT",
                "Apache-2.0",
                "MIT"
            ],
            "copyrights": [
                "Copyright (c) 2016 Jon Gjengset"
            ],
            "file-count": 58,
            "sha256": "765c9198f173dd59ce26ff9f95ef0aafd0a0fe01fb9d72841bc5066a4c06511d",
            "source": "https://crates.io/api/v1/crates/hdrhistogram/7.5.4/download",
            "status": "approved"
        }
    ]
}