{
    "id": "pypi/pypi/-/setuptools/59.6.0",
    "license": "MIT AND BSD-3-Clause AND BSD-2-Clause AND Apache-2.0 AND Python-2.0",
    "authority": "https://gitlab.eclipse.org/eclipsefdn/emo-team/iplab/-/issues/14694",
    "source": "https://files.pythonhosted.org/packages/6a/fa/5ec0fa9095c9b72cb1c31a8175c4c6745bf5927d1045d7a70df35d54944f/setuptools-59.6.0.tar.gz",
    "status": "approved",
    "scans": [
        {
            "date": "November 10, 2022 at 9:13:20 p.m. GMT",
            "authority": "https://gitlab.eclipse.org/eclipsefdn/emo-team/iplab/-/issues/4739",
            "scancode-version": "31.2.1",
            "licenses-discovered": [
                "MIT",
                "Python-2.0",
                "BSD-3-Clause",
                "Apache-2.0 AND BSD-2-Clause AND BSD-3-Clause",
                "Apache-2.0 AND BSD-3-Clause",
                "LicenseRef-scancode-unknown"
            ],
            "copyrights": [
                "Copyright (c) 2003-2018 Paul T. McGuire",
                "Copyright (c) 2005, 2006 Martin von Lowis",
                "Copyright (c) 2005-2010 ActiveState Software Inc.",
                "Copyright (c) 2013 Eddy Petrisor",
                "Copyright (c) Anderson Bravalheri",
                "Copyright 1995-2005 Mark Adler",
                "Copyright 1995-2005 Mark Adler +3 CScs Qkkbal",
                "Copyright 1995-2010 Mark Adler",
                "Copyright 1995-2013 Mark Adler",
                "Copyright Jason R. Coombs",
                "copyright 2014-2019 s"
            ],
            "file-count": 356,
            "sha256": "22c7348c6d2976a52632c67f7ab0cdf40147db7789f9aed18734643fe9cf3373",
            "source": "https://files.pythonhosted.org/packages/6a/fa/5ec0fa9095c9b72cb1c31a8175c4c6745bf5927d1045d7a70df35d54944f/setuptools-59.6.0.tar.gz",
            "status": "restricted"
        },
        {
            "date": "May 14, 2024 at 4:48:38 a.m. GMT",
            "authority": "https://gitlab.eclipse.org/eclipsefdn/emo-team/iplab/-/issues/14694",
            "scancode-version": "31.2.1",
            "licenses-discovered": [
                "MIT",
                "Python-2.0",
                "BSD-3-Clause",
                "Apache-2.0 AND BSD-2-Clause AND BSD-3-Clause",
                "Apache-2.0 AND BSD-3-Clause",
                "LicenseRef-scancode-unknown"
            ],
            "copyrights": [
                "Copyright (c) 2003-2018 Paul T. McGuire",
                "Copyright (c) 2005, 2006 Martin von Lowis",
                "Copyright (c) 2005-2010 ActiveState Software Inc.",
                "Copyright (c) 2013 Eddy Petrisor",
                "Copyright (c) Anderson Bravalheri",
                "Copyright 1995-2005 Mark Adler",
                "Copyright 1995-2005 Mark Adler +3 CScs Qkkbal",
                "Copyright 1995-2010 Mark Adler",
                "Copyright 1995-2013 Mark Adler",
                "Copyright Jason R. Coombs",
                "copyright 2014-2019 s"
            ],
            "file-count": 356,
            "sha256": "22c7348c6d2976a52632c67f7ab0cdf40147db7789f9aed18734643fe9cf3373",
            "source": "https://files.pythonhosted.org/packages/6a/fa/5ec0fa9095c9b72cb1c31a8175c4c6745bf5927d1045d7a70df35d54944f/setuptools-59.6.0.tar.gz",
            "status": "restricted"
        }
    ]
}