{
    "id": "maven/mavencentral/software.amazon.awssdk/apache-client/2.21.5",
    "license": "Apache-2.0",
    "authority": "https://gitlab.eclipse.org/eclipsefdn/emo-team/iplab/-/issues/11133",
    "source": "https://repo.maven.apache.org/maven2/software/amazon/awssdk/apache-client/2.21.5/apache-client-2.21.5-sources.jar",
    "status": "approved",
    "scans": [
        {
            "date": "October 24, 2023 at 11:04:33 a.m. GMT",
            "authority": "https://gitlab.eclipse.org/eclipsefdn/emo-team/iplab/-/issues/11133",
            "scancode-version": "31.2.1",
            "licenses-discovered": [
                "Apache-2.0"
            ],
            "copyrights": [
                "Copyright Amazon.com, Inc. or its affiliates"
            ],
            "file-count": 30,
            "sha256": "73696b8f56b8d9c8da4916a1b878857450f1e2e9a79120ae1a848697713d4f88",
            "source": "https://repo.maven.apache.org/maven2/software/amazon/awssdk/apache-client/2.21.5/apache-client-2.21.5-sources.jar",
            "status": "approved"
        }
    ]
}