{
    "id": "npm/npmjs/-/lunr-languages/1.14.0",
    "license": "MPL-1.1 AND MIT AND (MIT OR BSD-3-Clause)",
    "authority": "https://gitlab.eclipse.org/eclipsefdn/emo-team/iplab/-/issues/19023",
    "source": "https://github.com/MihaiValentin/lunr-languages/archive/refs/tags/1.14.0.zip",
    "status": "approved",
    "scans": [
        {
            "date": "January 20, 2025 at 12:35:58 a.m. GMT",
            "authority": "https://gitlab.eclipse.org/eclipsefdn/emo-team/iplab/-/issues/19023",
            "scancode-version": "31.2.1",
            "licenses-discovered": [
                "MPL-1.1",
                "LicenseRef-scancode-free-unknown",
                "BSD-3-Clause",
                "MIT",
                "BSD-3-Clause AND MIT"
            ],
            "copyrights": [
                "(c) 2008 Taku Kudo <taku@chasen.org>",
                "(c) 2009-2015 Jeremy Ashkenas, DocumentCloud and Investigative Reporters & Editors Underscore",
                "Copyright (c) 2009 Thomas Robinson <280north.com>",
                "Copyright (c) 2010-2014, The Dojo Foundation",
                "Copyright (c) 2015 Oliver Nightingale",
                "Copyright (c) 2016 Oliver Nightingale",
                "Copyright (c) 2017 Oliver Nightingale",
                "Copyright (c) 2018 Oliver Nightingale",
                "Copyright 2010, Oleg Mazko http://www.mozilla.org/MPL",
                "Copyright 2014, Chad Liu http://www.mozilla.org/MPL",
                "Copyright 2014, Mihai Valentin http://www.mozilla.org/MPL",
                "Copyright 2017, Keerati Thiwanruk http://www.mozilla.org/MPL",
                "Copyright 2018, Dalia Al-Shahrabi http://www.mozilla.org/MPL",
                "Copyright 2019, Felix Lian (repairearth) http://www.mozilla.org/MPL",
                "Copyright 2020, Mihir Kumar http://www.mozilla.org/MPL",
                "Copyright 2021, Manikandan Venkatasubban http://www.mozilla.org/MPL",
                "Copyright 2023, Adir Avisar http://www.mozilla.org/MPL",
                "Copyright 2023, India http://www.mozilla.org/MPL",
                "Copyright 2023, Panos Bariamis http://www.mozilla.org/MPL",
                "Copyright Joyent, Inc. and other Node contributors"
            ],
            "file-count": 125,
            "sha256": "c616b2ae6287f33aa668a28f6545f8452d8ee43fd9b2093fa5e8a977023b8fa6",
            "source": "https://github.com/MihaiValentin/lunr-languages/archive/refs/tags/1.14.0.zip",
            "status": "restricted"
        }
    ]
}