{
    "id": "maven/mavencentral/io.netty/netty-codec-http2/4.2.0.Alpha4",
    "license": "Apache-2.0",
    "authority": "https://gitlab.eclipse.org/eclipsefdn/emo-team/iplab/-/issues/16125",
    "source": "https://repo1.maven.org/maven2/io/netty/netty-codec-http2/4.2.0.Alpha4/netty-codec-http2-4.2.0.Alpha4-sources.jar",
    "status": "approved",
    "scans": [
        {
            "date": "September 12, 2024, 12:09:39 a.m. GMT",
            "authority": "https://gitlab.eclipse.org/eclipsefdn/emo-team/iplab/-/issues/16125",
            "scancode-version": "31.2.1",
            "licenses-discovered": [
                "Apache-2.0"
            ],
            "copyrights": [
                "Copyright 2014 The Netty Project",
                "Copyright 2014 Twitter, Inc.",
                "Copyright 2015 The Netty Project",
                "Copyright 2016 The Netty Project",
                "Copyright 2017 The Netty Project",
                "Copyright 2019 The Netty Project",
                "Copyright 2020 The Netty Project",
                "Copyright 2022 The Netty Project",
                "Copyright 2023 The Netty Project",
                "Copyright 2024 The Netty Project"
            ],
            "file-count": 133,
            "sha256": "6f22000678c9a63e9d7462b2b3fc83a02771433ae2316f724cd37b4948774732",
            "source": "https://repo1.maven.org/maven2/io/netty/netty-codec-http2/4.2.0.Alpha4/netty-codec-http2-4.2.0.Alpha4-sources.jar",
            "status": "approved"
        }
    ]
}