{
    "id": "nuget/nuget/-/SharpZipLib/1.4.2",
    "license": "MIT AND GFDL-1.3-or-later AND (Apache-2.0 AND MIT) AND WTFPL AND bzip2-1.0.6 AND LicenseRef-Permissive-license-with-conditions AND LicenseRef-Permission-Notice",
    "authority": "https://gitlab.eclipse.org/eclipsefdn/emo-team/iplab/-/issues/10058",
    "source": "https://github.com/icsharpcode/SharpZipLib/archive/refs/tags/v1.4.2.zip",
    "status": "approved",
    "scans": [
        {
            "date": "August 16, 2023 at 11:41:44 a.m. GMT",
            "authority": "https://gitlab.eclipse.org/eclipsefdn/emo-team/iplab/-/issues/10058",
            "scancode-version": "31.2.1",
            "licenses-discovered": [
                "MIT",
                "Classpath-exception-2.0",
                "LicenseRef-scancode-proprietary-license",
                "GFDL-1.3-or-later",
                "Apache-2.0 AND BSD-3-Clause AND MIT AND WTFPL",
                "WTFPL",
                "bzip2-1.0.6",
                "LicenseRef-scancode-peter-deutsch-document"
            ],
            "copyrights": [
                "(c) 1989 Raymond Clay Permision",
                "(c) 2005, 2014 jQuery Foundation, Inc.",
                "(c) 2010-2014 Google, Inc. http://angularjs.org",
                "Copyright (c) 1989 - 2014 PKWARE Inc.",
                "Copyright (c) 1994,2002 Max Maischein",
                "Copyright (c) 1996 L. Peter Deutsch",
                "Copyright (c) 1996 L. Peter Deutsch and Jean-Loup Gailly",
                "Copyright (c) 1996-2007 Julian Seward",
                "Copyright (c) 2000-2016 AlphaSierraPapa for the SharpZipLib Team",
                "Copyright (c) 2000-2016 SharpZipLib",
                "Copyright (c) 2000-2018 SharpZipLib",
                "Copyright (c) 2000-2022 SharpZipLib",
                "Copyright (c) 2015 Gion Kunz",
                "Copyright 2013-2014 Facebook, Inc.",
                "copyright (c) 1996-2007 Julian Seward",
                "copyright (c) 2012 Scott Jehl, Paul Irish, Nicholas Zakas, David Knight"
            ],
            "file-count": 424,
            "sha256": "137c28f3c37d2a551e1dd2f460086eb4bf380b323a7a8487604c7b1c1b757f48",
            "source": "https://github.com/icsharpcode/SharpZipLib/archive/refs/tags/v1.4.2.zip",
            "status": "restricted"
        }
    ]
}
