{
    "id": "go/golang/golang.org%2Fx/mod/v0.18.0",
    "license": "BSD-3-Clause",
    "authority": "https://gitlab.eclipse.org/eclipsefdn/emo-team/iplab/-/issues/15866",
    "source": "https://proxy.golang.org/golang.org%2Fx/mod/@v/v0.18.0.zip",
    "status": "approved",
    "scans": [
        {
            "date": "August 14, 2024 at 11:54:05 a.m. GMT",
            "authority": "https://gitlab.eclipse.org/eclipsefdn/emo-team/iplab/-/issues/15866",
            "scancode-version": "31.2.1",
            "licenses-discovered": [
                "BSD-3-Clause"
            ],
            "copyrights": [
                "Copyright (c) 2009 The Go Authors",
                "Copyright 2018 The Go Authors",
                "Copyright 2019 The Go Authors",
                "Copyright 2020 The Go Authors",
                "Copyright 2021 The Go Authors"
            ],
            "file-count": 125,
            "sha256": "9c64a3efda43c92014675361b2620de1f2815d59875a379f0b3361018e5bdf59",
            "source": "https://proxy.golang.org/golang.org%2Fx/mod/@v/v0.18.0.zip",
            "status": "approved"
        }
    ]
}