{
    "id": "pypi/pypi/-/libclang/14.0.6",
    "license": "Apache-2.0 WITH LLVM-exception AND NCSA AND Apache-2.0",
    "authority": "https://gitlab.eclipse.org/eclipsefdn/emo-team/iplab/-/issues/5847",
    "source": "https://files.pythonhosted.org/packages/9d/97/a87a352058772f30c39cace0992c807c1d2a0c3a9fc673434b011ac54538/libclang-14.0.6.tar.gz",
    "status": "approved",
    "scans": [
        {
            "date": "December 14, 2022 at 4:50:23 p.m. GMT",
            "authority": "https://gitlab.eclipse.org/eclipsefdn/emo-team/iplab/-/issues/5847",
            "scancode-version": "31.2.1",
            "licenses-discovered": [
                "Apache-2.0 WITH LLVM-exception AND NCSA",
                "Apache-2.0 WITH LLVM-exception",
                "Apache-2.0"
            ],
            "copyrights": [
                "Copyright (c) 2007-2019 University of Illinois at Urbana-Champaign"
            ],
            "file-count": 14,
            "sha256": "9052a8284d8846984f6fa826b1d7460a66d3b23a486d782633b42b6e3b418789",
            "source": "https://files.pythonhosted.org/packages/9d/97/a87a352058772f30c39cace0992c807c1d2a0c3a9fc673434b011ac54538/libclang-14.0.6.tar.gz",
            "status": "restricted"
        }
    ]
}
