{
    "id": "npm/npmjs/-/typedoc/0.26.7",
    "license": "Apache-2.0 AND MIT",
    "authority": "https://gitlab.eclipse.org/eclipsefdn/emo-team/iplab/-/issues/16612",
    "source": "https://github.com/TypeStrong/typedoc/archive/refs/tags/v0.26.7.zip",
    "status": "approved",
    "scans": [
        {
            "date": "October 10, 2024, 10:44:09 p.m. GMT",
            "authority": "https://gitlab.eclipse.org/eclipsefdn/emo-team/iplab/-/issues/16612",
            "scancode-version": "31.2.1",
            "licenses-discovered": [
                "Apache-2.0",
                "MIT"
            ],
            "copyrights": [
                "Copyright 2024 context.hook('footer.end', context)"
            ],
            "file-count": 603,
            "sha256": "be0889d281359eb0c4e2077c65ddcb1ab9df33965ec7ae108c70c8ac205bcde2",
            "source": "https://github.com/TypeStrong/typedoc/archive/refs/tags/v0.26.7.zip",
            "status": "approved"
        }
    ]
}