{
    "id": "go/golang/github.com%2FMasterminds/sprig/v2.15.0",
    "license": "MIT",
    "authority": "https://gitlab.eclipse.org/eclipsefdn/emo-team/iplab/-/issues/12361",
    "source": "https://github.com/Masterminds/sprig/archive/refs/tags/v2.15.0.zip",
    "status": "approved",
    "scans": [
        {
            "date": "December 20, 2023 at 6:09:46 p.m. GMT",
            "authority": "https://gitlab.eclipse.org/eclipsefdn/emo-team/iplab/-/issues/12361",
            "scancode-version": "31.2.1",
            "licenses-discovered": [
                "MIT",
                "LicenseRef-scancode-proprietary-license"
            ],
            "copyrights": [
                "Copyright (c) 2013 Masterminds"
            ],
            "file-count": 51,
            "sha256": "6567345c868894fd0fbee491095af4a04108358e7b6b35b39d8792304ece4fea",
            "source": "https://github.com/Masterminds/sprig/archive/refs/tags/v2.15.0.zip",
            "status": "restricted"
        }
    ]
}
