{
    "id": "npm/npmjs/@babel/helper-create-regexp-features-plugin/7.26.3",
    "license": "MIT AND (BSD-2-Clause AND ISC AND MIT) AND BSD-2-Clause AND BSD-3-Clause",
    "authority": "https://gitlab.eclipse.org/eclipsefdn/emo-team/iplab/-/issues/17733",
    "source": "https://github.com/babel/babel/archive/refs/tags/v7.26.3.zip",
    "status": "approved",
    "scans": [
        {
            "date": "December 5, 2024 at 4:29:10 a.m. GMT",
            "authority": "https://gitlab.eclipse.org/eclipsefdn/emo-team/iplab/-/issues/17733",
            "scancode-version": "31.2.1",
            "licenses-discovered": [
                "MIT",
                "BSD-2-Clause AND ISC AND MIT",
                "BSD-2-Clause",
                "BSD-3-Clause"
            ],
            "copyrights": [
                "(c) 2014-2024 Denis Pushkarev",
                "Copyright (c) 2011-2017 KARASZI Istvan <github@spam.raszi.hu>",
                "Copyright (c) 2012 Yusuke Suzuki <utatane.tea@gmail.com>",
                "Copyright (c) 2012-2013 Ecma International",
                "Copyright (c) 2012-2014 by various contributors",
                "Copyright (c) 2014-2015 Jason Quense <jason@quense.me>",
                "Copyright (c) 2014-present Sebastian McKenzie and other contributors",
                "Copyright (c) 2014-present, Facebook, Inc.",
                "Copyright (c) 2015 Jed Watson",
                "Copyright (c) 2016 the V8 project authors",
                "Copyright (c) 2020 Rick Waldron",
                "Copyright (c) jQuery Foundation, Inc. and Contributors",
                "Copyright 2013-2015, Facebook, Inc.",
                "Copyright 2020 Bloomberg Finance L.P.",
                "Copyright JS Foundation and other contributors",
                "Copyright OpenJS Foundation and other contributors"
            ],
            "file-count": 31729,
            "sha256": "6c83d1a31969ddea2679735f39ba7e2b1bc1f4e9521d07e51001ba693f4d3583",
            "source": "https://github.com/babel/babel/archive/refs/tags/v7.26.3.zip",
            "status": "approved"
        }
    ]
}