{
    "id": "go/golang/github.com%2Fdocker/go-connections/v0.5.0",
    "license": "Apache-2.0",
    "authority": "https://gitlab.eclipse.org/eclipsefdn/emo-team/iplab/-/issues/15559",
    "source": "https://proxy.golang.org/github.com%2Fdocker/go-connections/@v/v0.5.0.zip",
    "status": "approved",
    "scans": [
        {
            "date": "July 3, 2024 at 2:14:27 p.m. GMT",
            "authority": "https://gitlab.eclipse.org/eclipsefdn/emo-team/iplab/-/issues/15559",
            "scancode-version": "31.2.1",
            "licenses-discovered": [
                "Apache-2.0"
            ],
            "copyrights": [
                "Copyright (c) 2004, 2006 The Linux Foundation and its contributors",
                "Copyright 2015 Docker, Inc."
            ],
            "file-count": 39,
            "sha256": "697ae616b50387a10b441375f3c6782e7b1e179e57649d71b8565eed4a78eda9",
            "source": "https://proxy.golang.org/github.com%2Fdocker/go-connections/@v/v0.5.0.zip",
            "status": "approved"
        }
    ]
}