{
    "id": "maven/mavencentral/io.mockk/mockk-agent-jvm/1.13.5",
    "license": "MIT",
    "authority": "https://gitlab.eclipse.org/eclipsefdn/emo-team/iplab/-/issues/10192",
    "source": "https://repo.maven.apache.org/maven2/io/mockk/mockk-agent-jvm/1.13.5/mockk-agent-jvm-1.13.5-sources.jar",
    "status": "approved",
    "scans": [
        {
            "date": "August 23, 2023 at 1:39:25 p.m. GMT",
            "authority": "https://gitlab.eclipse.org/eclipsefdn/emo-team/iplab/-/issues/10192",
            "scancode-version": "31.2.1",
            "licenses-discovered": [
                "MIT"
            ],
            "copyrights": [
                "Copyright (c) 2016 Mockito"
            ],
            "file-count": 26,
            "sha256": "45e03a9ed32441f5d81c780330afa1fd021c9758574e0fb28262f1b781b36522",
            "source": "https://repo.maven.apache.org/maven2/io/mockk/mockk-agent-jvm/1.13.5/mockk-agent-jvm-1.13.5-sources.jar",
            "status": "approved"
        }
    ]
}