{
    "id": "git/github/armon/consul-api/eb2c6b5be1b6",
    "license": "MPL-2.0",
    "licenses-discovered": [
        "MPL-2.0"
    ],
    "copyrights": [
    ],
    "file-count": 20,
    "scancode-version": "30.1.0",
    "authority": "https://gitlab.eclipse.org/eclipsefdn/emo-team/iplab/-/issues/3686",
    "source": "https://github.com/armon/consul-api/archive/eb2c6b5be1b6.zip",
    "status": "approved"
}