{
    "id": "project/automotive.tractusx/-/vas-country-risk/0.0",
    "license": "Apache-2.0",
    "authority": "https://gitlab.eclipse.org/eclipsefdn/emo-team/iplab/-/issues/6652",
    "source": "https://github.com/catenax-ng/product-value-added-service/archive/refs/heads/main.zip",
    "status": "approved",
    "scans": [
        {
            "date": "January 25, 2023 at 10:09:54 p.m. GMT",
            "authority": "https://gitlab.eclipse.org/eclipsefdn/emo-team/iplab/-/issues/6652",
            "scancode-version": "31.2.1",
            "licenses-discovered": [
                "Apache-2.0"
            ],
            "copyrights": [
            ],
            "file-count": 278,
            "sha256": "ea7ab95e7616cc9af0140506d1b5c135ffa39fadfd3bdb5876b466fc822c10f6",
            "source": "https://github.com/catenax-ng/product-value-added-service/archive/refs/heads/main.zip",
            "status": "restricted"
        }
    ]
}
