{
    "id": "project/iot.tocandira/eclipse-tocandira/Tocandira/18d5397e46966c3302feda205fbdf26eb23c660e",
    "license": "EPL-2.0",
    "authority": "https://gitlab.eclipse.org/eclipsefdn/emo-team/iplab/-/issues/10514",
    "source": "https://github.com/eclipse-tocandira/Tocandira/archive/18d5397e46966c3302feda205fbdf26eb23c660e.zip",
    "status": "approved",
    "scans": [
        {
            "date": "September 14, 2023 at 11:47:28 a.m. GMT",
            "authority": "https://gitlab.eclipse.org/eclipsefdn/emo-team/iplab/-/issues/10514",
            "scancode-version": "31.2.1",
            "licenses-discovered": [
                "EPL-2.0"
            ],
            "copyrights": [
                "Copyright (c) 2017 Aimirim STI."
            ],
            "file-count": 17,
            "sha256": "ef6b631dbfa6783e76e0ec8bb4774bed3989423f6e969dfc9e96065c6b8e77eb",
            "source": "https://github.com/eclipse-tocandira/Tocandira/archive/18d5397e46966c3302feda205fbdf26eb23c660e.zip",
            "status": "restricted"
        }
    ]
}
