{
    "id": "maven/mavencentral/org.apache.camel/camel-directvm/3.21.0",
    "license": "Apache-2.0",
    "authority": "https://gitlab.eclipse.org/eclipsefdn/emo-team/iplab/-/issues/10281",
    "source": "https://repo.maven.apache.org/maven2/org/apache/camel/camel-directvm/3.21.0/camel-directvm-3.21.0-sources.jar",
    "status": "approved",
    "scans": [
        {
            "date": "September 6, 2023 at 11:28:41 a.m. GMT",
            "authority": "https://gitlab.eclipse.org/eclipsefdn/emo-team/iplab/-/issues/10281",
            "scancode-version": "31.2.1",
            "licenses-discovered": [
                "Apache-2.0"
            ],
            "copyrights": [
            ],
            "file-count": 21,
            "sha256": "206403de14287c2c592b26dad203326fc05691d63a4421b1946d0e87f4a3bbe2",
            "source": "https://repo.maven.apache.org/maven2/org/apache/camel/camel-directvm/3.21.0/camel-directvm-3.21.0-sources.jar",
            "status": "approved"
        }
    ]
}