{
    "id": "crate/cratesio/-/synthez/0.2.0",
    "license": "BlueOak-1.0.0",
    "authority": "https://gitlab.eclipse.org/eclipsefdn/emo-team/iplab/-/issues/7917",
    "source": "https://crates.io/api/v1/crates/synthez/0.2.0/download",
    "status": "approved",
    "scans": [
        {
            "date": "April 20, 2023 at 9:06:13 a.m. GMT",
            "authority": "https://gitlab.eclipse.org/eclipsefdn/emo-team/iplab/-/issues/7917",
            "scancode-version": "31.2.1",
            "licenses-discovered": [
                "BlueOak-1.0.0"
            ],
            "copyrights": [
            ],
            "file-count": 6,
            "sha256": "033178d0acccffc5490021657006e6a8dd586ee9dc6f7c24e7608b125e568cb1",
            "source": "https://crates.io/api/v1/crates/synthez/0.2.0/download",
            "status": "restricted"
        }
    ]
}
