{
    "id": "maven/mavencentral/org.activiti/activiti-spring-resource-finder/8.4.0",
    "license": "Apache-2.0",
    "authority": "https://gitlab.eclipse.org/eclipsefdn/emo-team/iplab/-/issues/14523",
    "source": "https://maven.alfresco.com/nexus/service/local/repositories/activiti-releases/content//org/activiti/activiti-spring-resource-finder/8.4.0/activiti-spring-resource-finder-8.4.0-sources.jar",
    "status": "approved",
    "scans": [
        {
            "date": "April 24, 2024 at 4:16:33 a.m. GMT",
            "authority": "https://gitlab.eclipse.org/eclipsefdn/emo-team/iplab/-/issues/14523",
            "scancode-version": "31.2.1",
            "licenses-discovered": [
                "Apache-2.0"
            ],
            "copyrights": [
                "Copyright 2010-2020 Alfresco Software, Ltd."
            ],
            "file-count": 8,
            "sha256": "34801b565907f1987d06402ea66eaa49114cfbe1b5a8d74614f7058230f4abe2",
            "source": "https://maven.alfresco.com/nexus/service/local/repositories/activiti-releases/content//org/activiti/activiti-spring-resource-finder/8.4.0/activiti-spring-resource-finder-8.4.0-sources.jar",
            "status": "approved"
        }
    ]
}