{
    "id": "maven/mavencentral/org.flywaydb/flyway-mysql/10.10.0",
    "license": "Apache-2.0",
    "authority": "https://gitlab.eclipse.org/eclipsefdn/emo-team/iplab/-/issues/16487",
    "source": "https://repo1.maven.org/maven2/org/flywaydb/flyway-mysql/10.10.0/flyway-mysql-10.10.0-sources.jar",
    "status": "approved",
    "scans": [
        {
            "date": "October 8, 2024, 1:49:08 p.m. GMT",
            "authority": "https://gitlab.eclipse.org/eclipsefdn/emo-team/iplab/-/issues/16487",
            "scancode-version": "31.2.1",
            "licenses-discovered": [
                "Apache-2.0"
            ],
            "copyrights": [
                "Copyright (c) Red Gate Software Ltd 2010-2024"
            ],
            "file-count": 16,
            "sha256": "677cd6ca37a2bff2271b913f41f4f0c9763b822cfe46c557bdb4250202ee975f",
            "source": "https://repo1.maven.org/maven2/org/flywaydb/flyway-mysql/10.10.0/flyway-mysql-10.10.0-sources.jar",
            "status": "approved"
        }
    ]
}