{
    "id": "npm/npmjs/-/eslint-plugin-n/17.2.0",
    "license": "MIT",
    "authority": "https://gitlab.eclipse.org/eclipsefdn/emo-team/iplab/-/issues/14265",
    "source": "https://github.com/eslint-community/eslint-plugin-n/archive/refs/tags/v17.2.0.zip",
    "status": "approved",
    "scans": [
        {
            "date": "April 11, 2024 at 8:53:51 a.m. GMT",
            "authority": "https://gitlab.eclipse.org/eclipsefdn/emo-team/iplab/-/issues/14265",
            "scancode-version": "31.2.1",
            "licenses-discovered": [
                "MIT"
            ],
            "copyrights": [
                "Copyright (c) 2015 Toru Nagashima",
                "copyright 2016 Toru Nagashima"
            ],
            "file-count": 379,
            "sha256": "74258a20cf26b8f032d044df1197209be0d98e4ab863d096effac7b134e10e0a",
            "source": "https://github.com/eslint-community/eslint-plugin-n/archive/refs/tags/v17.2.0.zip",
            "status": "approved"
        }
    ]
}