{
    "id": "maven/mavencentral/org.webjars.npm/sap-theming__theming-base-content/11.1.42",
    "license": "None",
    "licenses-discovered": [
    ],
    "copyrights": [
    ],
    "file-count": 0,
    "scancode-version": "31.2.1",
    "authority": "https://gitlab.eclipse.org/eclipsefdn/emo-team/iplab/-/issues/4393",
    "source": "https://search.maven.org/remotecontent?filepath=org/webjars/npm/sap-theming__theming-base-content/11.1.42/sap-theming__theming-base-content-11.1.42-sources.jar",
    "status": "restricted"
}