{
    "id": "npm/npmjs/-/eslint-plugin-flowtype/8.0.3",
    "license": "BSD-3-Clause",
    "licenses-discovered": [
        "BSD-3-Clause"
    ],
    "copyrights": [
        "Copyright (c) Gajus Kuizinas (http://gajus.com/)",
        "Copyright no corp"
    ],
    "file-count": 185,
    "scancode-version": "30.1.0",
    "authority": "https://gitlab.eclipse.org/eclipsefdn/emo-team/iplab/-/issues/2958",
    "source": "https://github.com/gajus/eslint-plugin-flowtype/archive/v8.0.3.zip",
    "status": "approved"
}