{
    "id": "maven/mavencentral/com.fasterxml.jackson.datatype/jackson-datatype-jakarta-jsonp/2.15.4",
    "license": "Apache-2.0",
    "authority": "https://gitlab.eclipse.org/eclipsefdn/emo-team/iplab/-/issues/15211",
    "source": "https://repo1.maven.org/maven2/com/fasterxml/jackson/datatype/jackson-datatype-jakarta-jsonp/2.15.4/jackson-datatype-jakarta-jsonp-2.15.4-sources.jar",
    "status": "approved",
    "scans": [
        {
            "date": "June 14, 2024 at 10:24:33 a.m. GMT",
            "authority": "https://gitlab.eclipse.org/eclipsefdn/emo-team/iplab/-/issues/15211",
            "scancode-version": "31.2.1",
            "licenses-discovered": [
                "Apache-2.0"
            ],
            "copyrights": [
            ],
            "file-count": 12,
            "sha256": "35a835fb52eb1155490ac3b81d904774dd1a41d801386954c2f35fe32efc3696",
            "source": "https://repo1.maven.org/maven2/com/fasterxml/jackson/datatype/jackson-datatype-jakarta-jsonp/2.15.4/jackson-datatype-jakarta-jsonp-2.15.4-sources.jar",
            "status": "approved"
        }
    ]
}