{
    "id": "npm/npmjs/@emotion/hash/0.9.1",
    "license": "MIT",
    "authority": "https://gitlab.eclipse.org/eclipsefdn/emo-team/iplab/-/issues/8394",
    "source": "https://registry.npmjs.org/@emotion/hash/-/hash-0.9.1.tgz",
    "status": "approved",
    "scans": [
        {
            "date": "May 10, 2023 at 4:15:43 a.m. GMT",
            "authority": "https://gitlab.eclipse.org/eclipsefdn/emo-team/iplab/-/issues/8394",
            "scancode-version": "31.2.1",
            "licenses-discovered": [
                "MIT"
            ],
            "copyrights": [
                "Copyright (c) Emotion team and other contributors"
            ],
            "file-count": 20,
            "sha256": "532c1ac5b6d21c88eea8568e79a2dd065d9671df5cd0f3daecbc1f83cbf2e420",
            "source": "https://registry.npmjs.org/@emotion/hash/-/hash-0.9.1.tgz",
            "status": "approved"
        }
    ]
}