{
    "id": "npm/npmjs/@webassemblyjs/helper-api-error/1.11.5",
    "license": "MIT",
    "authority": "https://gitlab.eclipse.org/eclipsefdn/emo-team/iplab/-/issues/7969",
    "source": "https://registry.npmjs.org/@webassemblyjs/helper-api-error/-/helper-api-error-1.11.5.tgz",
    "status": "approved",
    "scans": [
        {
            "date": "April 26, 2023 at 12:57:35 p.m. GMT",
            "authority": "https://gitlab.eclipse.org/eclipsefdn/emo-team/iplab/-/issues/7969",
            "scancode-version": "31.2.1",
            "licenses-discovered": [
                "MIT"
            ],
            "copyrights": [
            ],
            "file-count": 2,
            "sha256": "67a374cc32201cab024046610fb969681dde9777b16fabf8256af9d5004a2d25",
            "source": "https://registry.npmjs.org/@webassemblyjs/helper-api-error/-/helper-api-error-1.11.5.tgz",
            "status": "approved"
        }
    ]
}