{
    "license": "Apache-2.0 AND CC-BY-4.0 AND MIT",
    "file-count": 61387,
    "authority": "https://gitlab.eclipse.org/eclipsefdn/emo-team/iplab/-/issues/1671",
    "scancode-version": "30.1.0",
    "licenses-discovered": [
        "Apache-2.0",
        "CC-BY-4.0",
        "LicenseRef-scancode-khronos",
        "LicenseRef-scancode-unicode",
        "MIT",
        "ISC",
        "ODbL-1.0"
    ],
    "id": "npm/npmjs/-/typescript/4.5.2",
    "source": "https://github.com/Microsoft/TypeScript/archive/v4.5.2.zip",
    "status": "approved"
}
