{
    "id": "maven/mavencentral/org.apache.maven.plugins/maven-jar-plugin/3.0.2",
    "license": "Apache-2.0",
    "licenses-discovered": [
        "Apache-2.0"
    ],
    "file-count": 9,
    "scancode-version": "30.1.0",
    "authority": "https://gitlab.eclipse.org/eclipsefdn/emo-team/iplab/-/issues/2196",
    "source": "https://search.maven.org/remotecontent?filepath=org/apache/maven/plugins/maven-jar-plugin/3.0.2/maven-jar-plugin-3.0.2-sources.jar",
    "status": "approved"
}