{
    "id": "maven/mavencentral/org.junit.platform/junit-platform-suite-api/1.10.0",
    "license": "EPL-2.0",
    "authority": "https://gitlab.eclipse.org/eclipsefdn/emo-team/iplab/-/issues/9707",
    "source": "https://repo.maven.apache.org/maven2/org/junit/platform/junit-platform-suite-api/1.10.0-M1/junit-platform-suite-api-1.10.0-M1-sources.jar",
    "status": "approved",
    "scans": [
        {
            "date": "July 23, 2023 at 4:27:06 p.m. GMT",
            "authority": "https://gitlab.eclipse.org/eclipsefdn/emo-team/iplab/-/issues/9707",
            "scancode-version": "31.2.1",
            "licenses-discovered": [
                "EPL-2.0"
            ],
            "copyrights": [
                "Copyright 2015-2021 the original author or authors",
                "Copyright 2015-2023 the original author or authors"
            ],
            "file-count": 28,
            "sha256": "f08d69d7dce33bea9937f7fb4020111af2e82fc29137cf70f525f84a3f8e6979",
            "source": "https://repo.maven.apache.org/maven2/org/junit/platform/junit-platform-suite-api/1.10.0-M1/junit-platform-suite-api-1.10.0-M1-sources.jar",
            "status": "approved"
        }
    ]
}