{
    "id": "maven/mavencentral/org.apache.velocity/velocity-engine-core/2.3",
    "license": "Apache-2.0",
    "licenses-discovered": [
        "Apache-2.0"
    ],
    "file-count": 225,
    "scancode-version": "30.1.0",
    "authority": "https://gitlab.eclipse.org/eclipsefdn/emo-team/iplab/-/issues/2478",
    "source": "https://search.maven.org/remotecontent?filepath=org/apache/velocity/velocity-engine-core/2.3/velocity-engine-core-2.3-sources.jar",
    "status": "approved"
}