{
    "id": "maven/mavencentral/net.javacrumbs.json-unit/json-unit-json-path/2.38.0",
    "license": "Apache-2.0",
    "authority": "https://gitlab.eclipse.org/eclipsefdn/emo-team/iplab/-/issues/11049",
    "source": "https://repo.maven.apache.org/maven2/net/javacrumbs/json-unit/json-unit-json-path/2.38.0/json-unit-json-path-2.38.0-sources.jar",
    "status": "approved",
    "scans": [
        {
            "date": "October 11, 2023 at 11:23:26 a.m. GMT",
            "authority": "https://gitlab.eclipse.org/eclipsefdn/emo-team/iplab/-/issues/11049",
            "scancode-version": "31.2.1",
            "licenses-discovered": [
                "Apache-2.0"
            ],
            "copyrights": [
                "Copyright 2009-2019 the original author or authors"
            ],
            "file-count": 3,
            "sha256": "29ee05ecf13b5f58fe4bcf29e799e5facfcb201bbc665de7eaaf0fcfc8f7f8bc",
            "source": "https://repo.maven.apache.org/maven2/net/javacrumbs/json-unit/json-unit-json-path/2.38.0/json-unit-json-path-2.38.0-sources.jar",
            "status": "approved"
        }
    ]
}