{
    "id": "maven/mavencentral/org.opensaml/opensaml-profile-api/4.3.2",
    "license": "Apache-2.0",
    "authority": "https://gitlab.eclipse.org/eclipsefdn/emo-team/iplab/-/issues/17479",
    "source": "https://build.shibboleth.net/maven/releases/org/opensaml/opensaml-profile-api/4.3.2/opensaml-profile-api-4.3.2-sources.jar",
    "status": "approved",
    "scans": [
        {
            "date": "November 27, 2024 at 3:17:49 a.m. GMT",
            "authority": "https://gitlab.eclipse.org/eclipsefdn/emo-team/iplab/-/issues/17479",
            "scancode-version": "31.2.1",
            "licenses-discovered": [
                "Apache-2.0"
            ],
            "copyrights": [
            ],
            "file-count": 35,
            "sha256": "0c8148bcaf2c96b9d24463d8f8a4be216fd5bb04b18087255cfb2ed00d10240a",
            "source": "https://build.shibboleth.net/maven/releases/org/opensaml/opensaml-profile-api/4.3.2/opensaml-profile-api-4.3.2-sources.jar",
            "status": "approved"
        }
    ]
}