{
    "license": "BSD-2-Clause AND BSD-3-Clause",
    "file-count": 2861,
    "authority": "https://gitlab.eclipse.org/eclipsefdn/emo-team/iplab/-/issues/1649",
    "scancode-version": "30.1.0",
    "licenses-discovered": [
        "BSD-2-Clause",
        "BSD-3-Clause"
    ],
    "id": "git/github/cloudflare/quiche/0.10.0",
    "source": "https://github.com/cloudflare/quiche/archive/refs/tags/0.10.0.zip",
    "status": "approved"
}