{
    "id": "maven/mavencentral/io.swagger.core.v3/swagger-core/2.2.10",
    "license": "Apache-2.0",
    "authority": "https://gitlab.eclipse.org/eclipsefdn/emo-team/iplab/-/issues/9265",
    "source": "https://repo.maven.apache.org/maven2/io/swagger/core/v3/swagger-core/2.2.10/swagger-core-2.2.10-sources.jar",
    "status": "approved",
    "scans": [
        {
            "date": "July 6, 2023 at 1:45:51 a.m. GMT",
            "authority": "https://gitlab.eclipse.org/eclipsefdn/emo-team/iplab/-/issues/9265",
            "scancode-version": "31.2.1",
            "licenses-discovered": [
                "Apache-2.0"
            ],
            "copyrights": [
                "Copyright (c) 2015. SmartBear Software Inc."
            ],
            "file-count": 79,
            "sha256": "42c05b2bea46c3999873f6d427fbf9b33fba31ce786dbbcd261f560f5cfe7c4c",
            "source": "https://repo.maven.apache.org/maven2/io/swagger/core/v3/swagger-core/2.2.10/swagger-core-2.2.10-sources.jar",
            "status": "approved"
        }
    ]
}