{
    "id": "go/golang/github.com%2Feclipse/ditto-clients-golang/v0.0.0-20211126080925-0676267c80ac",
    "license": "EPL-2.0 AND EPL-1.0 AND (Apache-2.0 AND EPL-2.0) AND BSD-3-Clause",
    "authority": "https://gitlab.eclipse.org/eclipsefdn/emo-team/iplab/-/issues/12358",
    "source": "https://proxy.golang.org/github.com%2Feclipse/ditto-clients-golang/@v/v0.0.0-20211126080925-0676267c80ac.zip",
    "status": "approved",
    "scans": [
        {
            "date": "December 20, 2023 at 2:13:08 p.m. GMT",
            "authority": "https://gitlab.eclipse.org/eclipsefdn/emo-team/iplab/-/issues/12358",
            "scancode-version": "31.2.1",
            "licenses-discovered": [
                "EPL-2.0",
                "EPL-1.0",
                "Apache-2.0 AND EPL-2.0",
                "BSD-3-Clause"
            ],
            "copyrights": [
                "Copyright (c) 2007, Eclipse Foundation, Inc.",
                "Copyright (c) 2009 The Go Authors",
                "Copyright (c) 2009,2014 Google Inc.",
                "Copyright (c) 2019 Contributors",
                "Copyright (c) 2020 Contributors",
                "Copyright (c) 2021 Contributors",
                "Copyright 2018-2019 ACME Corporation",
                "Copyright 2020 Bosch.IO GmbH"
            ],
            "file-count": 47,
            "sha256": "e19d122addc4897401c2f2d949076b1d5d3d88a88691387ca89c396156d8d6a6",
            "source": "https://proxy.golang.org/github.com%2Feclipse/ditto-clients-golang/@v/v0.0.0-20211126080925-0676267c80ac.zip",
            "status": "approved"
        }
    ]
}