{
    "id": "maven/mavencentral/org.apache.activemq/activemq-client/5.16.7",
    "license": "Apache-2.0",
    "authority": "https://gitlab.eclipse.org/eclipsefdn/emo-team/iplab/-/issues/11505",
    "source": "https://repo1.maven.org/maven2/org/apache/activemq/activemq-client/5.16.7/activemq-client-5.16.7-sources.jar",
    "status": "approved",
    "scans": [
        {
            "date": "November 10, 2023 at 3:43:49 p.m. GMT",
            "authority": "https://gitlab.eclipse.org/eclipsefdn/emo-team/iplab/-/issues/11505",
            "scancode-version": "31.2.1",
            "licenses-discovered": [
                "Apache-2.0"
            ],
            "copyrights": [
            ],
            "file-count": 760,
            "sha256": "8a88a9e94dbc7d800d36a2b88ed5fa810f3e7c1513bce36487b7d53ee8228537",
            "source": "https://repo1.maven.org/maven2/org/apache/activemq/activemq-client/5.16.7/activemq-client-5.16.7-sources.jar",
            "status": "approved"
        }
    ]
}