{
    "id": "crate/cratesio/-/zenoh-link-udp/1.0.0",
    "license": "Apache-2.0 AND EPL-2.0 AND (EPL-2.0 OR Apache-2.0)",
    "authority": "https://gitlab.eclipse.org/eclipsefdn/emo-team/iplab/-/issues/16990",
    "source": "https://crates.io/api/v1/crates/zenoh-link-udp/1.0.0/download",
    "status": "approved",
    "scans": [
        {
            "date": "October 31, 2024, 4:35:12 p.m. GMT",
            "authority": "https://gitlab.eclipse.org/eclipsefdn/emo-team/iplab/-/issues/16990",
            "scancode-version": "31.2.1",
            "licenses-discovered": [
                "Apache-2.0 AND EPL-2.0",
                "EPL-2.0 OR Apache-2.0"
            ],
            "copyrights": [
                "Copyright (c) 2023 ZettaScale Technology"
            ],
            "file-count": 7,
            "sha256": "168d5f7261c43582b6ff010242497a868d4fc7812fae2028161f0f4c674be56c",
            "source": "https://crates.io/api/v1/crates/zenoh-link-udp/1.0.0/download",
            "status": "approved"
        }
    ]
}