{
    "id": "npm/npmjs/@storybook/addon-toolbars/7.0.21",
    "license": "MIT",
    "authority": "https://gitlab.eclipse.org/eclipsefdn/emo-team/iplab/-/issues/8990",
    "source": "https://registry.npmjs.org/@storybook/addon-toolbars/-/addon-toolbars-7.0.21.tgz",
    "status": "approved",
    "scans": [
        {
            "date": "June 15, 2023 at 2:24:37 p.m. GMT",
            "authority": "https://gitlab.eclipse.org/eclipsefdn/emo-team/iplab/-/issues/8990",
            "scancode-version": "31.2.1",
            "licenses-discovered": [
                "MIT"
            ],
            "copyrights": [
            ],
            "file-count": 11,
            "sha256": "ad5af1ee3ab2ae3083f177d43a83ca24079319200cdc552a76cc594964f479a7",
            "source": "https://registry.npmjs.org/@storybook/addon-toolbars/-/addon-toolbars-7.0.21.tgz",
            "status": "approved"
        }
    ]
}