{
    "id": "maven/mavencentral/com.google.api.grpc/proto-google-common-protos/2.50.1",
    "license": "Apache-2.0",
    "authority": "https://gitlab.eclipse.org/eclipsefdn/emo-team/iplab/-/issues/18660",
    "source": "https://repo1.maven.org/maven2/com/google/api/grpc/proto-google-common-protos/2.50.1/proto-google-common-protos-2.50.1-sources.jar",
    "status": "approved",
    "scans": [
        {
            "date": "January 14, 2025 at 3:33:22 a.m. GMT",
            "authority": "https://gitlab.eclipse.org/eclipsefdn/emo-team/iplab/-/issues/18660",
            "scancode-version": "31.2.1",
            "licenses-discovered": [
                "Apache-2.0"
            ],
            "copyrights": [
                "Copyright 2024 Google LLC",
                "Copyright 2025 Google LLC"
            ],
            "file-count": 435,
            "sha256": "6ae436b89f3487df7d0c474b85474bf9b1fc2e779e3dcdb40fe26efaa7192698",
            "source": "https://repo1.maven.org/maven2/com/google/api/grpc/proto-google-common-protos/2.50.1/proto-google-common-protos-2.50.1-sources.jar",
            "status": "approved"
        }
    ]
}