{
    "id": "project/technology.aidge/eclipse-aidge/aidge_onnx/cb865d494e4ed60a1d5e259ae9441421d9b188a8",
    "license": "EPL-2.0",
    "authority": "https://gitlab.eclipse.org/eclipsefdn/emo-team/iplab/-/issues/10003",
    "source": "https://gitlab.eclipse.org/api/v4/projects/eclipse%2Faidge%2Faidge_onnx/repository/archive.zip?sha=cb865d494e4ed60a1d5e259ae9441421d9b188a8",
    "status": "approved",
    "scans": [
        {
            "date": "August 9, 2023 at 4:54:11 p.m. GMT",
            "authority": "https://gitlab.eclipse.org/eclipsefdn/emo-team/iplab/-/issues/10003",
            "scancode-version": "31.2.1",
            "licenses-discovered": [
                "EPL-2.0"
            ],
            "copyrights": [
            ],
            "file-count": 17,
            "sha256": "281cbad12e68eb90c7810b23844825f8f0e641b6c8d98c09aa2a8bf85f50214e",
            "source": "https://gitlab.eclipse.org/api/v4/projects/eclipse%2Faidge%2Faidge_onnx/repository/archive.zip?sha=cb865d494e4ed60a1d5e259ae9441421d9b188a8",
            "status": "restricted"
        }
    ]
}
