{
    "id": "maven/mavencentral/org.springframework.integration/spring-integration-core/5.5.17",
    "license": "Apache-2.0",
    "authority": "https://gitlab.eclipse.org/eclipsefdn/emo-team/iplab/-/issues/7513",
    "source": "https://search.maven.org/remotecontent?filepath=org/springframework/integration/spring-integration-core/5.5.17/spring-integration-core-5.5.17-sources.jar",
    "status": "approved",
    "scans": [
        {
            "date": "March 24, 2023 at 8:31:30 a.m. GMT",
            "authority": "https://gitlab.eclipse.org/eclipsefdn/emo-team/iplab/-/issues/7513",
            "scancode-version": "31.2.1",
            "licenses-discovered": [
                "Apache-2.0"
            ],
            "copyrights": [
                "Copyright 2002-2019 the original author or authors",
                "Copyright 2002-2020 the original author or authors",
                "Copyright 2002-2021 the original author or authors",
                "Copyright 2002-2022 the original author or authors",
                "Copyright 2002-2023 the original author or authors",
                "Copyright 2007-2019 the original author or authors",
                "Copyright 2013-2019 the original author or authors",
                "Copyright 2013-2020 the original author or authors",
                "Copyright 2013-2021 the original author or authors",
                "Copyright 2013-2023 the original author or authors",
                "Copyright 2014-2019 the original author or authors",
                "Copyright 2014-2020 the original author or authors",
                "Copyright 2014-2021 the original author or authors",
                "Copyright 2014-2022 the original author or authors",
                "Copyright 2014-2023 the original author or authors",
                "Copyright 2015-2019 the original author or authors",
                "Copyright 2015-2020 the original author or authors",
                "Copyright 2015-2021 the original author or authors",
                "Copyright 2015-2022 the original author or authors",
                "Copyright 2015-2023 the original author or authors",
                "Copyright 2016-2019 the original author or authors",
                "Copyright 2016-2020 the original author or authors",
                "Copyright 2016-2021 the original author or authors",
                "Copyright 2016-2023 the original author or authors",
                "Copyright 2017-2019 the original author or authors",
                "Copyright 2017-2020 the original author or authors",
                "Copyright 2017-2021 the original author or authors",
                "Copyright 2017-2023 the original author or authors",
                "Copyright 2018-2019 the original author or authors",
                "Copyright 2018-2020 the original author or authors",
                "Copyright 2018-2021 the original author or authors",
                "Copyright 2018-2023 the original author or authors",
                "Copyright 2019 the original author or authors",
                "Copyright 2019-2020 the original author or authors",
                "Copyright 2019-2021 the original author or authors",
                "Copyright 2019-2023 the original author or authors",
                "Copyright 2020 the original author or authors",
                "Copyright 2020-2021 the original author or authors",
                "Copyright 2020-2022 the original author or authors",
                "Copyright 2020-2023 the original author or authors",
                "Copyright 2021 the original author or authors",
                "Copyright 2021-2023 the original author or authors",
                "Copyright 2022 the original author or authors"
            ],
            "file-count": 769,
            "sha256": "1184d6f58d509b60b2855e256e47c28edc143cbd1162c5b12b623c35ed73bdca",
            "source": "https://search.maven.org/remotecontent?filepath=org/springframework/integration/spring-integration-core/5.5.17/spring-integration-core-5.5.17-sources.jar",
            "status": "approved"
        }
    ]
}