{
    "license": "Apache-2.0",
    "file-count": 10,
    "authority": "https://gitlab.eclipse.org/eclipsefdn/emo-team/iplab/-/issues/1838",
    "scancode-version": "30.1.0",
    "licenses-discovered": [
        "Apache-2.0"
    ],
    "id": "maven/mavencentral/org.atteo.classindex/classindex/3.11",
    "source": "https://search.maven.org/remotecontent?filepath=org/atteo/classindex/classindex/3.11/classindex-3.11-sources.jar",
    "status": "approved"
}