{
    "id": "maven/mavencentral/androidx.appcompat/appcompat/1.3.1",
    "license": "Apache-2.0",
    "authority": "https://gitlab.eclipse.org/eclipsefdn/emo-team/iplab/-/issues/19590",
    "source": "https://dl.google.com/android/maven2/androidx/appcompat/appcompat/1.3.1/appcompat-1.3.1-sources.jar",
    "status": "approved",
    "scans": [
        {
            "date": "February 27, 2025 at 11:18:53 a.m. GMT",
            "authority": "https://gitlab.eclipse.org/eclipsefdn/emo-team/iplab/-/issues/19590",
            "scancode-version": "31.2.1",
            "licenses-discovered": [
                "Apache-2.0"
            ],
            "copyrights": [
                "Copyright (c) 2006 The Android Open Source Project",
                "Copyright (c) 2010 The Android Open Source Project",
                "Copyright (c) 2011 The Android Open Source Project",
                "Copyright (c) 2012 The Android Open Source Project",
                "Copyright (c) 2013 The Android Open Source Project",
                "Copyright (c) 2014 The Android Open Source Project",
                "Copyright (c) 2015 Google Inc.",
                "Copyright (c) 2015 The Android Open Source Project",
                "Copyright (c) 2016 The Android Open Source Project",
                "Copyright (c) 2017 The Android Open Source Project",
                "Copyright 2017 The Android Open Source Project",
                "Copyright 2018 The Android Open Source Project",
                "Copyright 2021 The Android Open Source Project"
            ],
            "file-count": 122,
            "sha256": "bc2ec38cc39dad147d7450c58dc89cd2683438e8de9d98c317e93a51a18d1e65",
            "source": "https://dl.google.com/android/maven2/androidx/appcompat/appcompat/1.3.1/appcompat-1.3.1-sources.jar",
            "status": "approved"
        }
    ]
}