{
    "id": "project/ecd.opensmartclide/eclipse-opensmartclide/smartclide-service-registry-poc/bc126dbaf9da5081f308d15ebb8bf76c824db16f",
    "license": "EPL-2.0 AND Apache-2.0 AND LicenseRef-scancode-unknown",
    "authority": "https://gitlab.eclipse.org/eclipsefdn/emo-team/iplab/-/issues/6900",
    "source": "https://github.com/eclipse-opensmartclide/smartclide-service-registry-poc/archive/bc126dbaf9da5081f308d15ebb8bf76c824db16f.zip",
    "status": "restricted",
    "scans": [
        {
            "date": "January 30, 2023 at 9:33:19 p.m. GMT",
            "authority": "https://gitlab.eclipse.org/eclipsefdn/emo-team/iplab/-/issues/6900",
            "scancode-version": "31.2.1",
            "licenses-discovered": [
                "EPL-2.0",
                "Apache-2.0",
                "LicenseRef-scancode-unknown"
            ],
            "copyrights": [
                "Copyright (c) 2021 KAIROS DS",
                "Copyright 2007-present the original author or authors"
            ],
            "file-count": 67,
            "sha256": "33c915be04ad77795e180c3f8370e97e0c9dc0b5ef7add8bd3c338baef931628",
            "source": "https://github.com/eclipse-opensmartclide/smartclide-service-registry-poc/archive/bc126dbaf9da5081f308d15ebb8bf76c824db16f.zip",
            "status": "restricted"
        }
    ]
}