{
    "id": "npm/npmjs/@sinonjs/fake-timers/11.2.2",
    "license": "BSD-3-Clause",
    "authority": "https://gitlab.eclipse.org/eclipsefdn/emo-team/iplab/-/issues/12896",
    "source": "https://github.com/sinonjs/fake-timers/archive/refs/tags/v11.2.2.zip",
    "status": "approved",
    "scans": [
        {
            "date": "January 25, 2024 at 1:38:25 p.m. GMT",
            "authority": "https://gitlab.eclipse.org/eclipsefdn/emo-team/iplab/-/issues/12896",
            "scancode-version": "31.2.1",
            "licenses-discovered": [
                "BSD-3-Clause"
            ],
            "copyrights": [
                "Copyright (c) 2010-2014, Christian Johansen, christian@cjohansen.no"
            ],
            "file-count": 39,
            "sha256": "a57c578a6e7ce9fc93e637d67a1c4b007ae69bdde384cd33f301a14d6b4ed36c",
            "source": "https://github.com/sinonjs/fake-timers/archive/refs/tags/v11.2.2.zip",
            "status": "approved"
        }
    ]
}