{
    "id": "maven/mavencentral/org.geotools.ogc/net.opengis.ows/30.4",
    "license": "LGPL-2.1-only",
    "authority": "https://gitlab.eclipse.org/eclipsefdn/emo-team/iplab/-/issues/15569",
    "source": "https://repo.osgeo.org/repository/geotools-releases/org/geotools/ogc/net.opengis.ows/30.4/net.opengis.ows-30.4-sources.jar",
    "status": "approved",
    "scans": [
        {
            "date": "July 3, 2024 at 2:35:49 p.m. GMT",
            "authority": "https://gitlab.eclipse.org/eclipsefdn/emo-team/iplab/-/issues/15569",
            "scancode-version": "31.2.1",
            "licenses-discovered": [
            ],
            "copyrights": [
                "Copyright (c) 2006 Open Geospatial Consortium, Inc.",
                "Copyright (c) 2009 Open Geospatial Consortium. To"
            ],
            "file-count": 414,
            "sha256": "11720d028d5acefa95bf899acf78a8b25ad6aa94102cfc1791faff8bbdedde5c",
            "source": "https://repo.osgeo.org/repository/geotools-releases/org/geotools/ogc/net.opengis.ows/30.4/net.opengis.ows-30.4-sources.jar",
            "status": "restricted"
        }
    ]
}