{
    "id": "npm/npmjs/-/yeoman-generator/5.9.0",
    "license": "BSD-3-Clause AND BSD-2-Clause",
    "authority": "https://gitlab.eclipse.org/eclipsefdn/emo-team/iplab/-/issues/10788",
    "source": "https://github.com/yeoman/generator/archive/refs/tags/v5.9.0.zip",
    "status": "approved",
    "scans": [
        {
            "date": "October 2, 2023 at 2:34:07 p.m. GMT",
            "authority": "https://gitlab.eclipse.org/eclipsefdn/emo-team/iplab/-/issues/10788",
            "scancode-version": "31.2.1",
            "licenses-discovered": [
                "BSD-3-Clause",
                "BSD-2-Clause"
            ],
            "copyrights": [
                "Copyright (c) 2015, Google",
                "Copyright (c) Google"
            ],
            "file-count": 66,
            "sha256": "efbaf82901c5607f5331b6b05f0c2b8c7063e9a99ea86071c7dbab3d8aba7eec",
            "source": "https://github.com/yeoman/generator/archive/refs/tags/v5.9.0.zip",
            "status": "approved"
        }
    ]
}