{
    "id": "maven/mavencentral/com.hazelcast/hazelcast/5.5.0",
    "license": "Apache-2.0 AND JSON AND MIT AND LicenseRef-Public-domain AND LicenseRef-Hazelcast-Community-License",
    "authority": "https://gitlab.eclipse.org/eclipsefdn/emo-team/iplab/-/issues/16015",
    "source": "https://repo1.maven.org/maven2/com/hazelcast/hazelcast/5.5.0/hazelcast-5.5.0-sources.jar",
    "status": "approved",
    "workswith": [
        "rt.jetty"
    ],
    "scans": [
        {
            "date": "August 27, 2024 at 12:52:43 p.m. GMT",
            "authority": "https://gitlab.eclipse.org/eclipsefdn/emo-team/iplab/-/issues/16015",
            "scancode-version": "31.2.1",
            "licenses-discovered": [
                "Apache-2.0",
                "Apache-2.0 AND GPL-1.0-or-later",
                "MIT",
                "Apache-2.0 AND LicenseRef-scancode-proprietary-license",
                "Apache-2.0 AND CC-PDDC",
                "JSON",
                "Apache-2.0 AND LicenseRef-scancode-free-unknown AND MIT",
                "BSD-3-Clause"
            ],
            "copyrights": [
                "(c) Override public ObjectCodec",
                "Copyright (c) 2002 JSON.org",
                "Copyright (c) 2005-2021, by Ewgenij Proschak and Contributors",
                "Copyright (c) 2006 JSON.org",
                "Copyright (c) 2007- Tatu Saloranta, tatu.saloranta@iki.fi",
                "Copyright (c) 2008 Google Inc.",
                "Copyright (c) 2008-2024, Hazelcast, Inc.",
                "Copyright (c) 2009-2017 Lightbend Inc. <http://www.lightbend.com>",
                "Copyright (c) 2011 Everit Kft. (http://www.everit.org)",
                "Copyright (c) 2013 Brett Wooldridge",
                "Copyright (c) 2013, 2014 Brett Wooldridge",
                "Copyright (c) 2013, 2014 EclipseSource",
                "Copyright (c) 2013, 2015 EclipseSource",
                "Copyright (c) 2013, 2016 EclipseSource",
                "Copyright (c) 2013, 2017 EclipseSource",
                "Copyright (c) 2013,2014 Brett Wooldridge",
                "Copyright (c) 2014 Brett Wooldridge",
                "Copyright (c) 2014, Appear Networks",
                "Copyright (c) 2015 Brett Wooldridge",
                "Copyright (c) 2015 EclipseSource",
                "Copyright (c) 2015, 2016 EclipseSource",
                "Copyright (c) 2015-2024, Hazelcast, Inc.",
                "Copyright (c) 2016 Brett Wooldridge",
                "Copyright (c) 2016 EclipseSource",
                "Copyright (c) 2016 Johno Crawford",
                "Copyright (c) 2017 Brett Wooldridge",
                "Copyright (c) 2017 Harith Elrufaie",
                "Copyright (c) 2017 R. Kempees",
                "Copyright (c) 2017 Sergey Bespalov",
                "Copyright (c) 2017-2024, Hazelcast, Inc.",
                "Copyright (c) 2018, SnakeYAML",
                "Copyright (c) 2019 Brett Wooldridge",
                "Copyright (c) 2019 Luke Hutchison",
                "Copyright (c) 2019 jacobg, Luke Hutchison",
                "Copyright (c) 2019 mcollovati",
                "Copyright (c) 2019-2024, Hazelcast, Inc.",
                "Copyright (c) 2020 Luke Hutchison",
                "Copyright (c) 2020-2024, Hazelcast, Inc.",
                "Copyright (c) 2021 Luke Hutchison",
                "Copyright (c) 2023 Werner Randelshofer, Switzerland",
                "Copyright 2006-2021 the original author or authors",
                "Copyright 2006-2024 the original author or authors",
                "Copyright 2007-, Tatu Saloranta (tatu.saloranta@iki.fi)",
                "Copyright 2015 Real Logic Ltd.",
                "Copyright 2018-2020 Raffaello Giulietti",
                "Copyright 2019 The Moby Project",
                "Copyright 2024 Hazelcast Inc.",
                "Portions Copyright 2014 Real Logic Ltd.",
                "Portions Copyright 2014 the original author or authors",
                "Portions Copyright 2016 Real Logic Ltd."
            ],
            "file-count": 6766,
            "sha256": "c4c72e5d42f5c94a0cd95802e0895bcd46935cd0284dacb01be0a8cd57270d2e",
            "source": "https://repo1.maven.org/maven2/com/hazelcast/hazelcast/5.5.0/hazelcast-5.5.0-sources.jar",
            "status": "restricted"
        }
    ]
}