{
    "license": "MIT",
    "file-count": 364,
    "authority": "https://gitlab.eclipse.org/eclipsefdn/emo-team/iplab/-/issues/1029",
    "scancode-version": "21.3.31",
    "licenses-discovered": [
        "MIT"
    ],
    "id": "npm/npmjs/-/moment/2.22.2",
    "source": "https://registry.npmjs.org/moment/-/moment-2.22.2.tgz",
    "status": "approved"
}