{
    "id": "pypi/pypi/-/fonttools/4.51.0",
    "license": "MIT AND (Apache-2.0 AND BSD-3-Clause AND OFL-1.1) AND CC-BY-SA-4.0 AND LicenseRef-scancode-other-permissive AND BSD-3-Clause AND Apache-2.0 AND LicenseRef-scancode-unicode AND (GPL-1.0-or-later OR OFL-1.1) AND OFL-1.1",
    "authority": "https://gitlab.eclipse.org/eclipsefdn/emo-team/iplab/-/issues/15041",
    "source": "https://files.pythonhosted.org/packages/73/e4/5f31f97c859e2223d59ce3da03c67908eb8f8f90d96f2537b73b68aa2a5a/fonttools-4.51.0.tar.gz",
    "status": "approved",
    "scans": [
        {
            "date": "May 29, 2024 at 5:36:23 p.m. GMT",
            "authority": "https://gitlab.eclipse.org/eclipsefdn/emo-team/iplab/-/issues/15041",
            "scancode-version": "31.2.1",
            "licenses-discovered": [
                "MIT",
                "Apache-2.0 AND BSD-3-Clause AND OFL-1.1",
                "CC-BY-SA-4.0",
                "LicenseRef-scancode-other-permissive",
                "BSD-3-Clause",
                "Apache-2.0",
                "LicenseRef-scancode-unicode",
                "GPL-1.0-or-later AND OFL-1.1",
                "OFL-1.1"
            ],
            "copyrights": [
                "(c) 2002 Adobe Systems Incorporated",
                "(c) 2010 - 2012 Adobe Systems Incorporated (http://www.adobe.com/)",
                "(c) 2010 by Pablo Impallari",
                "(c) 2010 by Pablo Impallari. www.impallari.com",
                "(c) 2010, Pablo Impallari (www.impallari.com impallari@gmail.com)",
                "(c) 2014-2021 Adobe (http://www.adobe.com/)",
                "(c) 2022 Unicode(r), Inc.",
                "(c) Copyright 1994-1997 Summer Institute of Linguistics",
                "COPYRIGHT STRING.",
                "Copyright (c ) 2015 by FontTools",
                "Copyright (c) 1991-1995 Stichting Mathematisch Centrum, Amsterdam",
                "Copyright (c) 1995-2001 Corporation for National Research Initiatives",
                "Copyright (c) 1997, 2009, 2011 American Mathematical Society http://www.ams.org",
                "Copyright (c) 1999-2004 Just van Rossum, LettError (just@letterror.com)",
                "Copyright (c) 2000 BeOpen.com",
                "Copyright (c) 2001-2010 by the STI Pub Companies",
                "Copyright (c) 2001-2011 by the STI Pub Companies",
                "Copyright (c) 2002 Adobe Systems Incorporated",
                "Copyright (c) 2009 Type Supply LLC",
                "Copyright (c) 2010 by Pablo Impallari",
                "Copyright (c) 2010 by Pablo Impallari. www.impallari.com",
                "Copyright (c) 2010, Pablo Impallari (www.impallari.com impallari@gmail.com)",
                "Copyright (c) 2012-2019 The Libertinus Project",
                "Copyright (c) 2013-2014 Lennart Regebro",
                "Copyright (c) 2014, 2015 Adobe Systems Incorporated (http://www.adobe.com/)",
                "Copyright (c) 2015 by FontTools",
                "Copyright (c) 2015-2019 Belleve Invis",
                "Copyright (c) 2015-2019 The Mada Project Authors",
                "Copyright (c) 2015-2020 Belleve Invis (belleve@typeof.net)",
                "Copyright (c) 2017 Just van Rossum",
                "Copyright (c) 2018 Adobe systems Co., Ltd.",
                "Copyright 1998, Just van Rossum <just@letterror.com>",
                "Copyright 2002-2019 Adobe (http://www.adobe.com/)",
                "Copyright 2008 The Bungee Project",
                "Copyright 2010 - 2012 Adobe Systems Incorporated",
                "Copyright 2010-2020 The Amiri Project",
                "Copyright 2011 Google Inc.",
                "Copyright 2013 Google Inc.",
                "Copyright 2013 Google, Inc.",
                "Copyright 2014 Adobe Systems Incorporated",
                "Copyright 2014, 2015 Adobe Systems Incorporated (http://www.adobe.com/)",
                "Copyright 2014, 2015, 2016 Adobe Systems Incorporated (http://www.adobe.com/)",
                "Copyright 2014-2021 Adobe (http://www.adobe.com/)",
                "Copyright 2015 Adobe System Incorporated",
                "Copyright 2015 Google Inc.",
                "Copyright 2015-2021 Google LLC.",
                "Copyright 2015-2021 The Aref Ruqaa Project",
                "Copyright 2016 Google Inc.",
                "Copyright 2017",
                "Copyright 2017 The Roboto Flex Project",
                "Copyright 2017 by Jens Kutilek",
                "Copyright 2018",
                "Copyright 2019 Google Inc.",
                "Copyright 2021 Behdad Esfahbod",
                "Copyright 2021 The Qahiri Project",
                "Copyright 2023 Behdad Esfahbod",
                "Copyright 2023 Google Inc.",
                "Copyright c 1997, 2009, 2011 American Mathematical Society",
                "Copyright c 2015",
                "Portions copyright (c) 1990 by Elsevier, Inc.",
                "Portions copyright (c) 1998-2003 by MicroPress, Inc.",
                "Portions copyright (c) 2009-2012 by Khaled Hosny",
                "copyright (c) 2005-2016, The RoboFab Developers",
                "copyright 2020, Just van Rossum, Behdad Esfahbod"
            ],
            "file-count": 2456,
            "sha256": "dc0673361331566d7a663d7ce0f6fdcbfbdc1f59c6e3ed1165ad7202ca183c68",
            "source": "https://files.pythonhosted.org/packages/73/e4/5f31f97c859e2223d59ce3da03c67908eb8f8f90d96f2537b73b68aa2a5a/fonttools-4.51.0.tar.gz",
            "status": "restricted"
        }
    ]
}