{
    "id": "maven/mavencentral/org.springframework.cloud/spring-cloud-function-core/4.2.0",
    "license": "Apache-2.0",
    "authority": "https://gitlab.eclipse.org/eclipsefdn/emo-team/iplab/-/issues/18216",
    "source": "https://repo1.maven.org/maven2/org/springframework/cloud/spring-cloud-function-core/4.2.0/spring-cloud-function-core-4.2.0-sources.jar",
    "status": "approved",
    "scans": [
        {
            "date": "January 7, 2025 at 8:45:31 a.m. GMT",
            "authority": "https://gitlab.eclipse.org/eclipsefdn/emo-team/iplab/-/issues/18216",
            "scancode-version": "31.2.1",
            "licenses-discovered": [
                "Apache-2.0"
            ],
            "copyrights": [
                "Copyright 2020-2020 the original author or authors"
            ],
            "file-count": 4,
            "sha256": "54849abda3e70d4f9f95188e26ad5f4f516f452e26f6a90abf81419d6dcd7d89",
            "source": "https://repo1.maven.org/maven2/org/springframework/cloud/spring-cloud-function-core/4.2.0/spring-cloud-function-core-4.2.0-sources.jar",
            "status": "approved"
        }
    ]
}