{
    "id": "npm/npmjs/@storybook/addon-backgrounds/7.0.21",
    "license": "MIT",
    "authority": "https://gitlab.eclipse.org/eclipsefdn/emo-team/iplab/-/issues/8923",
    "source": "https://registry.npmjs.org/@storybook/addon-backgrounds/-/addon-backgrounds-7.0.21.tgz",
    "status": "approved",
    "scans": [
        {
            "date": "June 15, 2023 at 3:42:45 p.m. GMT",
            "authority": "https://gitlab.eclipse.org/eclipsefdn/emo-team/iplab/-/issues/8923",
            "scancode-version": "31.2.1",
            "licenses-discovered": [
                "MIT"
            ],
            "copyrights": [
            ],
            "file-count": 16,
            "sha256": "8abd3cea05a2089c7a23ddeedb491737cebb7a2cf5007404dac7ea5687088531",
            "source": "https://registry.npmjs.org/@storybook/addon-backgrounds/-/addon-backgrounds-7.0.21.tgz",
            "status": "approved"
        }
    ]
}