{
    "id": "go/golang/google.golang.org/grpc/v1.19.0",
    "license": "Apache-2.0",
    "authority": "https://gitlab.eclipse.org/eclipsefdn/emo-team/iplab/-/issues/6052",
    "source": "https://proxy.golang.org/google.golang.org/grpc/@v/v1.19.0.zip",
    "status": "approved",
    "scans": [
        {
            "date": "January 6, 2023 at 6:10:49 p.m. GMT",
            "authority": "https://gitlab.eclipse.org/eclipsefdn/emo-team/iplab/-/issues/6052",
            "scancode-version": "31.2.1",
            "licenses-discovered": [
                "Apache-2.0"
            ],
            "copyrights": [
                "Copyright 2014 gRPC",
                "Copyright 2015 gRPC",
                "Copyright 2015-2016 gRPC",
                "Copyright 2016 gRPC",
                "Copyright 2017 gRPC",
                "Copyright 2018 gRPC",
                "Copyright 2019 gRPC"
            ],
            "file-count": 355,
            "sha256": "b13e2bd92390136a39391460fa55526aadce985cd4a949bd8417b50035e18bba",
            "source": "https://proxy.golang.org/google.golang.org/grpc/@v/v1.19.0.zip",
            "status": "approved"
        }
    ]
}