{
    "id": "pypi/pypi/-/cryptography/3.4.8",
    "license": "(Apache-2.0 OR BSD-3-Clause) AND (Apache-2.0 AND BSD-3-Clause) AND PSF-2.0",
    "authority": "https://gitlab.eclipse.org/eclipsefdn/emo-team/iplab/-/issues/19386",
    "source": "https://files.pythonhosted.org/packages/cc/98/8a258ab4787e6f835d350639792527d2eb7946ff9fc0caca9c3f4cf5dcfe/cryptography-3.4.8.tar.gz",
    "status": "approved",
    "scans": [
        {
            "date": "February 11, 2025 at 9:57:50 p.m. GMT",
            "authority": "https://gitlab.eclipse.org/eclipsefdn/emo-team/iplab/-/issues/19386",
            "scancode-version": "31.2.1",
            "licenses-discovered": [
                "Apache-2.0 AND BSD-3-Clause",
                "Apache-2.0 AND BSD-3-Clause AND Python-2.0",
                "Apache-2.0",
                "BSD-3-Clause",
                "Python-2.0"
            ],
            "copyrights": [
                "Copyright (c) 2001-2016 Python Software Foundation",
                "Copyright (c) Individual contributors",
                "Copyright 2001-2016 Python Software Foundation",
                "Copyright 2013-2021 .format",
                "copyright 2013-2021, Individual"
            ],
            "file-count": 326,
            "sha256": "94cc5ed4ceaefcbe5bf38c8fba6a21fc1d365bb8fb826ea1688e3370b2e24a1c",
            "source": "https://files.pythonhosted.org/packages/cc/98/8a258ab4787e6f835d350639792527d2eb7946ff9fc0caca9c3f4cf5dcfe/cryptography-3.4.8.tar.gz",
            "status": "restricted"
        }
    ]
}