{
    "id": "go/golang/github.com%2Fcontainernetworking/plugins/v1.1.1",
    "license": "Apache-2.0",
    "authority": "https://gitlab.eclipse.org/eclipsefdn/emo-team/iplab/-/issues/12427",
    "source": "https://proxy.golang.org/github.com%2Fcontainernetworking/plugins/@v/v1.1.1.zip",
    "status": "approved",
    "scans": [
        {
            "date": "December 21, 2023 at 7:53:59 a.m. GMT",
            "authority": "https://gitlab.eclipse.org/eclipsefdn/emo-team/iplab/-/issues/12427",
            "scancode-version": "31.2.1",
            "licenses-discovered": [
                "Apache-2.0"
            ],
            "copyrights": [
                "Copyright (c) 2004, 2006 The Linux Foundation and its contributors",
                "Copyright 2014 CNI authors",
                "Copyright 2015 CNI authors",
                "Copyright 2015-2017 CNI authors",
                "Copyright 2015-2018 CNI authors",
                "Copyright 2016 CNI authors",
                "Copyright 2016-2018 CNI authors",
                "Copyright 2017 CNI authors",
                "Copyright 2017-2018 CNI authors",
                "Copyright 2017-2020 CNI authors",
                "Copyright 2018 CNI authors",
                "Copyright 2019 CNI authors",
                "Copyright 2020 CNI authors",
                "Copyright 2021 CNI authors",
                "Copyright 2022 CNI authors"
            ],
            "file-count": 188,
            "sha256": "9ac7ac8a90729ac029d91b871921738d2d8d3c361c7bb4090627a7d0dbe96af3",
            "source": "https://proxy.golang.org/github.com%2Fcontainernetworking/plugins/@v/v1.1.1.zip",
            "status": "approved"
        }
    ]
}