{
    "id": "maven/mavencentral/org.apache.hadoop/hadoop-yarn-server-web-proxy/3.4.0",
    "license": "Apache-2.0 AND BSD-2-Clause AND BSD-3-Clause AND MIT AND Apache-2.0",
    "authority": "https://gitlab.eclipse.org/eclipsefdn/emo-team/iplab/-/issues/14120",
    "source": "https://repo1.maven.org/maven2/org/apache/hadoop/hadoop-yarn-server-web-proxy/3.4.0/hadoop-yarn-server-web-proxy-3.4.0-sources.jar",
    "status": "approved",
    "scans": [
        {
            "date": "March 26, 2024 at 1:36:51 p.m. GMT",
            "authority": "https://gitlab.eclipse.org/eclipsefdn/emo-team/iplab/-/issues/14120",
            "scancode-version": "31.2.1",
            "licenses-discovered": [
                "Apache-2.0 AND BSD-2-Clause AND BSD-3-Clause AND MIT",
                "Apache-2.0"
            ],
            "copyrights": [
                "Copyright (c) 2009-2017 Dave Gamble and cJSON contributors"
            ],
            "file-count": 15,
            "sha256": "d985846579e4c7e2536a7dac813cccd1ea3a17ef9aab437be8629b170cc6fb46",
            "source": "https://repo1.maven.org/maven2/org/apache/hadoop/hadoop-yarn-server-web-proxy/3.4.0/hadoop-yarn-server-web-proxy-3.4.0-sources.jar",
            "status": "approved"
        }
    ]
}