{
    "id": "maven/mavencentral/org.aspectj/aspectjrt/1.9.21",
    "license": "Apache-2.0 AND BSD-3-Clause AND EPL-1.0",
    "authority": "https://gitlab.eclipse.org/eclipsefdn/emo-team/iplab/-/issues/13740",
    "source": "https://repo1.maven.org/maven2/org/aspectj/aspectjrt/1.9.21/aspectjrt-1.9.21-sources.jar",
    "status": "approved",
    "scans": [
        {
            "date": "March 15, 2024 at 2:08:20 p.m. GMT",
            "authority": "https://gitlab.eclipse.org/eclipsefdn/emo-team/iplab/-/issues/13740",
            "scancode-version": "31.2.1",
            "licenses-discovered": [
                "Apache-2.0 AND BSD-3-Clause AND EPL-1.0"
            ],
            "copyrights": [
                "Copyright (c) 1999-2001 Xerox Corporation, 2002 Palo Alto Research Center, Incorporated",
                "Copyright (c) 1999-2001 Xerox Corporation, 2002 Palo Alto Research Center, Incorporated (PARC)",
                "Copyright (c) 1999-2001 Xerox Corporation, 2002-2018 Palo Alto Research Center, Incorporated (PARC), Contributors",
                "Copyright (c) 2000-2005 INRIA, France Telecom",
                "Copyright (c) 2004 IBM Corporation",
                "Copyright (c) 2005 Contributors",
                "Copyright (c) 2006 Contributors",
                "Copyright (c) 2006 IBM Corporation and others",
                "Copyright (c) 2009 Contributors",
                "Copyright (c) 2013 Contributors",
                "Copyright (c) 2014 Contributors"
            ],
            "file-count": 118,
            "sha256": "53bab94cd578837dacf56700831f4cc453077aa02d310c8a85a28f7d6e7acd57",
            "source": "https://repo1.maven.org/maven2/org/aspectj/aspectjrt/1.9.21/aspectjrt-1.9.21-sources.jar",
            "status": "approved"
        }
    ]
}