{
    "id": "maven/mavencentral/com.azure.resourcemanager/azure-resourcemanager-network/2.39.0",
    "license": "MIT",
    "authority": "https://gitlab.eclipse.org/eclipsefdn/emo-team/iplab/-/issues/15098",
    "source": "https://repo1.maven.org/maven2/com/azure/resourcemanager/azure-resourcemanager-network/2.39.0/azure-resourcemanager-network-2.39.0-sources.jar",
    "status": "approved",
    "scans": [
        {
            "date": "June 6, 2024 at 11:35:18 a.m. GMT",
            "authority": "https://gitlab.eclipse.org/eclipsefdn/emo-team/iplab/-/issues/15098",
            "scancode-version": "31.2.1",
            "licenses-discovered": [
                "MIT"
            ],
            "copyrights": [
                "(c) 2008 VeriSign, Inc.",
                "Copyright (c) Microsoft Corporation"
            ],
            "file-count": 1582,
            "sha256": "2ca91f223593d586b25074cedaacccf6488fffa09d16999410cf6d405fbb4d99",
            "source": "https://repo1.maven.org/maven2/com/azure/resourcemanager/azure-resourcemanager-network/2.39.0/azure-resourcemanager-network-2.39.0-sources.jar",
            "status": "approved"
        }
    ]
}