{
    "id": "maven/mavencentral/org.javabits.jgrapht/jgrapht-core/0.9.3",
    "license": "EPL-2.0 OR LGPL-2.1-or-later",
    "authority": "https://gitlab.eclipse.org/eclipsefdn/emo-team/iplab/-/issues/9816",
    "source": "https://repo.maven.apache.org/maven2/org/javabits/jgrapht/jgrapht-core/0.9.3/jgrapht-core-0.9.3-sources.jar",
    "status": "approved",
    "scans": [
        {
            "date": "July 27, 2023 at 1:29:55 p.m. GMT",
            "authority": "https://gitlab.eclipse.org/eclipsefdn/emo-team/iplab/-/issues/9816",
            "scancode-version": "31.2.1",
            "licenses-discovered": [
            ],
            "copyrights": [
                "(c) Copyright 1999-2003, by Nathan Fiedler and Contributors",
                "(c) Copyright 1999-2008, by Nathan Fiedler and Contributors",
                "(c) Copyright 2002-2004, by Barak Naveh and Contributors",
                "(c) Copyright 2003-2008, by Barak Naveh and Contributors",
                "(c) Copyright 2003-2008, by John V. Sichi and Contributors",
                "(c) Copyright 2003-2008, by Linda Buisman and Contributors",
                "(c) Copyright 2003-2008, by Liviu Rau and Contributors",
                "(c) Copyright 2003-2008, by Michael Behrisch and Contributors",
                "(c) Copyright 2003-2008, by Tim Shearouse and Contributors",
                "(c) Copyright 2003-2009, by Barak Naveh and Contributors",
                "(c) Copyright 2003-2010, by Barak Naveh and Contributors",
                "(c) Copyright 2003-2011, by Barak Naveh and Contributors",
                "(c) Copyright 2003-2012, by Barak Naveh and Contributors",
                "(c) Copyright 2003-2013, by Barak Naveh and Contributors",
                "(c) Copyright 2004-2008, by Christian Hammer and Contributors",
                "(c) Copyright 2004-2008, by John V. Sichi and Contributors",
                "(c) Copyright 2004-2008, by Marden Neubert and Contributors",
                "(c) Copyright 2004-2008, by Michael Behrisch and Contributors",
                "(c) Copyright 2005-2008, by Assaf Lehr and Contributors",
                "(c) Copyright 2005-2008, by Charles Fry and Contributors",
                "(c) Copyright 2005-2008, by Christian Soltenborn and Contributors",
                "(c) Copyright 2005-2008, by Ewgenij Proschak and Contributors",
                "(c) Copyright 2005-2008, by John V. Sichi and Contributors",
                "(c) Copyright 2006-2008, by France Telecom",
                "(c) Copyright 2006-2008, by France Telecom and Contributors",
                "(c) Copyright 2006-2008, by John V. Sichi and Contributors",
                "(c) Copyright 2007, by Lucas J. Scharenbroich and Contributors",
                "(c) Copyright 2007, by Vinayak R. Borkar",
                "(c) Copyright 2007-2008, by France Telecom",
                "(c) Copyright 2007-2008, by John V. Sichi and Contributors",
                "(c) Copyright 2007-2008, by Lucas J. Scharenbroich and Contributors",
                "(c) Copyright 2007-2010, by France Telecom",
                "(c) Copyright 2008-2008, by Andrew Newell and Contributors",
                "(c) Copyright 2008-2008, by Ilya Razenshteyn and Contributors",
                "(c) Copyright 2008-2008, by John V. Sichi and Contributors",
                "(c) Copyright 2008-2008, by Peter Giles and Contributors",
                "(c) Copyright 2009-2009, by Ilya Razenshteyn",
                "(c) Copyright 2009-2009, by John V. Sichi and Contributors",
                "(c) Copyright 2009-2009, by Soren Davidsen and Contributors",
                "(c) Copyright 2009-2009, by Tom Larkworthy and Contributors",
                "(c) Copyright 2010-2010, by Tom Conerly and Contributors",
                "(c) Copyright 2011-2011, by Assaf Mizrachi and Contributors",
                "(c) Copyright 2011-2011, by Robby McKilliam and Contributors",
                "(c) Copyright 2012-2012, by Alejandro Ramon Lopez del Huerto and Contributors",
                "(c) Copyright 2012-2012, by Joris Kinable and Contributors",
                "(c) Copyright 2013, by Nikolay Ognyanov"
            ],
            "file-count": 199,
            "sha256": "9ee3d7591a1b85d4446471047a8ab3ff82e70a01e44ccd83a673fb5c0dc1cb0b",
            "source": "https://repo.maven.apache.org/maven2/org/javabits/jgrapht/jgrapht-core/0.9.3/jgrapht-core-0.9.3-sources.jar",
            "status": "restricted"
        }
    ]
}
