{
    "id": "maven/mavencentral/org.junit.platform/junit-platform-commons/1.12.0",
    "license": "EPL-2.0",
    "authority": "https://gitlab.eclipse.org/eclipsefdn/emo-team/iplab/-/issues/19511",
    "source": "https://repo1.maven.org/maven2/org/junit/platform/junit-platform-commons/1.12.0/junit-platform-commons-1.12.0-sources.jar",
    "status": "approved",
    "scans": [
        {
            "date": "February 21, 2025 at 2:20:23 p.m. GMT",
            "authority": "https://gitlab.eclipse.org/eclipsefdn/emo-team/iplab/-/issues/19511",
            "scancode-version": "31.2.1",
            "licenses-discovered": [
                "EPL-2.0"
            ],
            "copyrights": [
                "Copyright 2015-2025 the original author or authors"
            ],
            "file-count": 66,
            "sha256": "7e4b3f1ab96bb687664f26d5c25b9320b90c6e7ff3181cb2cadd30e3abdd47c6",
            "source": "https://repo1.maven.org/maven2/org/junit/platform/junit-platform-commons/1.12.0/junit-platform-commons-1.12.0-sources.jar",
            "status": "approved"
        }
    ]
}