{
    "id": "npm/npmjs/@fortawesome/fontawesome-common-types/0.3.0",
    "license": "None",
    "authority": "https://gitlab.eclipse.org/eclipsefdn/emo-team/iplab/-/issues/12947",
    "source": "https://github.com/FortAwesome/Font-Awesome/pull/0.3.0.patch",
    "status": "restricted",
    "scans": [
        {
            "date": "January 29, 2024 at 8:52:13 p.m. GMT",
            "authority": "https://gitlab.eclipse.org/eclipsefdn/emo-team/iplab/-/issues/12947",
            "scancode-version": "31.2.1",
            "licenses-discovered": [
            ],
            "copyrights": [
            ],
            "file-count": 1,
            "sha256": "22a5aa8e68320a11a2bb14ad8db073ecd8e1d31c03697c871a79bad6ccaaa916",
            "source": "https://github.com/FortAwesome/Font-Awesome/pull/0.3.0.patch",
            "status": "restricted"
        }
    ]
}