{
    "id": "maven/mavencentral/net.sourceforge.tcljava/com.springsource.tcl.lang/1.4.1",
    "license": "BSD-3-Clause AND FSFUL AND TCL AND LicenseRef-scancode-proprietary-license AND MIT-Modern-Variant AND (BSD-3-Clause AND LicenseRef-scancode-proprietary-license) AND LicenseRef-scancode-other-permissive",
    "authority": "https://gitlab.eclipse.org/eclipsefdn/emo-team/iplab/-/issues/5018",
    "source": "https://gitlab.eclipse.org/eclipsefdn/emo-team/iplab/uploads/36fcb28e3678260f5bf375b0079e132e/jacl141.zip",
    "status": "restricted",
    "scans": [
        {
            "date": "November 22, 2022 at 5:21:00 p.m. GMT",
            "authority": "https://gitlab.eclipse.org/eclipsefdn/emo-team/iplab/-/issues/5018",
            "scancode-version": "31.2.1",
            "licenses-discovered": [
                "BSD-3-Clause",
                "FSFUL",
                "TCL",
                "LicenseRef-scancode-proprietary-license",
                "MIT-Modern-Variant",
                "BSD-3-Clause AND LicenseRef-scancode-proprietary-license",
                "LicenseRef-scancode-other-permissive"
            ],
            "copyrights": [
                "(c) 2005 Advanced Micro Devices, Inc.",
                "Copyright (c) 1987-1994 The Regents of the University of California",
                "Copyright (c) 1989-1994 The Regents of the University of California",
                "Copyright (c) 1991-1993 The Regents of the University of California",
                "Copyright (c) 1991-1994 The Regents of the University of California",
                "Copyright (c) 1992-1993 The Regents of the University of California",
                "Copyright (c) 1992-1995 Karl Lehenbauer and Mark Diekhans",
                "Copyright (c) 1993 The Regents of the University of California",
                "Copyright (c) 1993-1997 Lucent Technologies",
                "Copyright (c) 1993-1998 Lucent Technologies, Inc.",
                "Copyright (c) 1994 Sun Microsystems, Inc.",
                "Copyright (c) 1994 The Regents of the University of California",
                "Copyright (c) 1994-1996 Sun Microsystems, Inc.",
                "Copyright (c) 1994-1997 Sun Microsystems, Inc.",
                "Copyright (c) 1994-1998 Sun Microsystems, Inc.",
                "Copyright (c) 1995, by General Electric Company",
                "Copyright (c) 1995-1996 Sun Microsystems, Inc.",
                "Copyright (c) 1995-1997 Roger E. Critchlow Jr",
                "Copyright (c) 1995-1997 Sun Microsystems, Inc.",
                "Copyright (c) 1995-1998 Sun Microsystems, Inc.",
                "Copyright (c) 1996 Sun Microsystems, Inc.",
                "Copyright (c) 1996 by Sun Microsystems, Inc.",
                "Copyright (c) 1996-1997 Sun Microsystems, Inc.",
                "Copyright (c) 1996-1997 by Sun Microsystems, Inc.",
                "Copyright (c) 1996-1998 Sun Microsystems, Inc.",
                "Copyright (c) 1996-1998 by Sun Microsystems, Inc.",
                "Copyright (c) 1997 Cornell University",
                "Copyright (c) 1997 Daeron Meyer, U",
                "Copyright (c) 1997 Lucent Technologies",
                "Copyright (c) 1997 Sun Microsystems",
                "Copyright (c) 1997 Sun Microsystems, Inc.",
                "Copyright (c) 1997 by Sun Microsystems, Inc.",
                "Copyright (c) 1997-1998 Sun Microsystems, Inc.",
                "Copyright (c) 1997-1998 by Sun Microsystems, Inc.",
                "Copyright (c) 1997-1999 Sun Microsystems, Inc.",
                "Copyright (c) 1997-1999 The Regents of the University of California",
                "Copyright (c) 1997-1999 by Sun Microsystems, Inc.",
                "Copyright (c) 1998 Mo DeJong",
                "Copyright (c) 1998 Mo DeJong, U",
                "Copyright (c) 1998 Moses DeJong",
                "Copyright (c) 1998 Sun Microsystems, Inc.",
                "Copyright (c) 1998 by Moses DeJong",
                "Copyright (c) 1998 by Sun Microsystems, Inc.",
                "Copyright (c) 1998, 1999, 2000 Moses DeJong",
                "Copyright (c) 1998-1999 by Scriptics Corporation",
                "Copyright (c) 1998-2000 Ajuba Solutions",
                "Copyright (c) 1998-2000 Christian Krone",
                "Copyright (c) 1998-2000 Scriptics Corporation",
                "Copyright (c) 1998-2000 by Scriptics Corporation",
                "Copyright (c) 1999 Christian Krone",
                "Copyright (c) 1999 Mo DeJong",
                "Copyright (c) 1999 Moses DeJong",
                "Copyright (c) 1999 Scriptics Corporation",
                "Copyright (c) 1999 Sun Microsystems, Inc.",
                "Copyright (c) 1999 by Mo DeJong",
                "Copyright (c) 1999 by Moses DeJong",
                "Copyright (c) 1999 by Scriptics Corporation",
                "Copyright (c) 1999-2005 Moses DeJong",
                "Copyright (c) 2000 Ajuba Solutions",
                "Copyright (c) 2000 Christian Krone",
                "Copyright (c) 2000 Mo DeJong, Red Hat, Inc.",
                "Copyright (c) 2000-2001 Jeffrey Hobbs",
                "Copyright (c) 2001 Bruce A. Johnson",
                "Copyright (c) 2001 Christian Krone",
                "Copyright (c) 2002 Mo DeJong",
                "Copyright (c) 2002 by Mo DeJong",
                "Copyright (c) 2003 Mo DeJong",
                "Copyright (c) 2004 Mo DeJong",
                "Copyright (c) 2005 Advanced Micro Devices, Inc.",
                "Copyright (c) 2005 Mo DeJong",
                "Copyright (c) 2005 One Moon Scientific, Inc.",
                "Copyright (c) 2006 Mo DeJong",
                "Copyright (c) 2006 Moses DeJong",
                "Copyright (c) 2006 by Mo DeJong",
                "Copyright (c) 2006 by Moses DeJong",
                "Copyright (c) 2006, Arno Unkrig",
                "Copyright 1992, 1993, 1994, 1995, 1996, 1998, 1999, 2000, 2001 Free Software Foundation, Inc.",
                "Copyright 1992, 1993, 1994, 1995, 1996, 1998, 1999, 2000, 2001, 2002 Free Software Foundation, Inc.",
                "copyrighted by Cadence Design Systems, Inc.",
                "copyrighted by the Regents of the University of California, Sun Microsystems, Inc."
            ],
            "file-count": 849,
            "sha256": "9a67e821a986b7a2db0359ff31e5698754d34e3ba45a048b03b9873dd93eb85d",
            "source": "https://gitlab.eclipse.org/eclipsefdn/emo-team/iplab/uploads/36fcb28e3678260f5bf375b0079e132e/jacl141.zip",
            "status": "restricted"
        }
    ]
}