{
    "id": "p2/orbit/p2.eclipse.plugin/org.apache.xerces/2.12.2.v20230928-1306",
    "license": "Apache-2.0 AND W3C-19980720",
    "authority": "https://gitlab.eclipse.org/eclipsefdn/emo-team/iplab/-/issues/19240",
    "source": "https://repo1.maven.org/maven2/xerces/xercesImpl/2.12.2/xercesImpl-2.12.2-sources.jar",
    "status": "approved",
    "scans": [
        {
            "date": "January 30, 2025 at 2:45:54 p.m. GMT",
            "authority": "https://gitlab.eclipse.org/eclipsefdn/emo-team/iplab/-/issues/19240",
            "scancode-version": "31.2.1",
            "licenses-discovered": [
                "Apache-2.0",
                "W3C-19980720"
            ],
            "copyrights": [
                "(c) value.ch",
                "Copyright (c) 2000 World Wide Web Consortium, (Massachusetts Institute of Technology, Institut National de Recherche en Informatique et en Automatique, Keio University)",
                "Copyright (c) 2001 World Wide Web Consortium, (Massachusetts Institute of Technology, Institut National de Recherche en Informatique et en Automatique, Keio University)"
            ],
            "file-count": 737,
            "sha256": "3c531edfc074e3e0885e5d4a777a9e7317e108028be50ef6e893a5a9cf3e12c2",
            "source": "https://repo1.maven.org/maven2/xerces/xercesImpl/2.12.2/xercesImpl-2.12.2-sources.jar",
            "status": "approved"
        }
    ]
}