{
    "id": "npm/npmjs/-/antd/5.12.2",
    "license": "MIT",
    "authority": "https://gitlab.eclipse.org/eclipsefdn/emo-team/iplab/-/issues/11970",
    "source": "https://github.com/ant-design/ant-design/archive/refs/tags/5.12.2.zip",
    "status": "approved",
    "scans": [
        {
            "date": "December 13, 2023 at 7:05:07 p.m. GMT",
            "authority": "https://gitlab.eclipse.org/eclipsefdn/emo-team/iplab/-/issues/11970",
            "scancode-version": "31.2.1",
            "licenses-discovered": [
                "MIT",
                "LicenseRef-scancode-free-unknown"
            ],
            "copyrights": [
                "Ant Design (c) 2023",
                "Copyright (c) 2015-present Ant UED, https://xtech.antfin.com"
            ],
            "file-count": 3764,
            "sha256": "2639a3d7c5ba31910c5a15991b3d4798d38f29cb2f8cad9a818c11a478d535e7",
            "source": "https://github.com/ant-design/ant-design/archive/refs/tags/5.12.2.zip",
            "status": "restricted"
        }
    ]
}
