{
    "id": "npm/npmjs/@catena-x/portal-shared-components/3.0.2",
    "license": "Apache-2.0 AND CC-BY-4.0 AND OFL-1.1",
    "authority": "https://gitlab.eclipse.org/eclipsefdn/emo-team/iplab/-/issues/14247",
    "source": "https://github.com/eclipse-tractusx/portal-shared-components/archive/refs/tags/v3.0.2.zip",
    "status": "approved",
    "scans": [
        {
            "date": "April 9, 2024 at 8:16:12 a.m. GMT",
            "authority": "https://gitlab.eclipse.org/eclipsefdn/emo-team/iplab/-/issues/14247",
            "scancode-version": "31.2.1",
            "licenses-discovered": [
                "Apache-2.0",
                "CC-BY-4.0",
                "OFL-1.1"
            ],
            "copyrights": [
                "Copyright (c) 2021, 2023 BMW Group AG",
                "Copyright (c) 2021, 2023 Contributors",
                "Copyright (c) 2021, 2023 Mercedes-Benz Group AG and BMW Group AG",
                "Copyright (c) 2021, 2024 Contributors",
                "Copyright (c) 2023 Contributors",
                "Copyright (c) 2024 Contributors",
                "Copyright 2020 The LibreFranklin Project",
                "Copyright 2021-2024 Contributors"
            ],
            "file-count": 330,
            "sha256": "03f4d9e9f98eb6a32ae1709c74a861340acab7ac838942611ea2e57c2b573c00",
            "source": "https://github.com/eclipse-tractusx/portal-shared-components/archive/refs/tags/v3.0.2.zip",
            "status": "approved"
        }
    ]
}