{
    "id": "maven/mavencentral/org.apache.lucene/lucene-sandbox/9.5.0",
    "license": "Apache-2.0",
    "authority": "https://gitlab.eclipse.org/eclipsefdn/emo-team/iplab/-/issues/8479",
    "source": "https://search.maven.org/remotecontent?filepath=org/apache/lucene/lucene-sandbox/9.5.0/lucene-sandbox-9.5.0-sources.jar",
    "status": "approved",
    "scans": [
        {
            "date": "May 18, 2023 at 12:44:12 p.m. GMT",
            "authority": "https://gitlab.eclipse.org/eclipsefdn/emo-team/iplab/-/issues/8479",
            "scancode-version": "31.2.1",
            "licenses-discovered": [
                "Apache-2.0"
            ],
            "copyrights": [
            ],
            "file-count": 55,
            "sha256": "3ee3e9459aedfa07a717d2815e13c45d843d3daed767229f3311279b6064f1a7",
            "source": "https://search.maven.org/remotecontent?filepath=org/apache/lucene/lucene-sandbox/9.5.0/lucene-sandbox-9.5.0-sources.jar",
            "status": "approved"
        }
    ]
}