{
    "id": "p2/orbit/p2.eclipse-plugin/junit-jupiter-migrationsupport/5.9.1",
    "license": "EPL-2.0",
    "authority": "https://gitlab.eclipse.org/eclipsefdn/emo-team/iplab/-/issues/5352",
    "source": "https://repo1.maven.org/maven2/org/junit/jupiter/junit-jupiter-migrationsupport/5.9.1/junit-jupiter-migrationsupport-5.9.1.jar",
    "status": "approved",
    "scans": [
        {
            "date": "December 5, 2022 at 4:21:54 p.m. GMT",
            "authority": "https://gitlab.eclipse.org/eclipsefdn/emo-team/iplab/-/issues/5352",
            "scancode-version": "31.2.1",
            "licenses-discovered": [
                "EPL-2.0"
            ],
            "copyrights": [
            ],
            "file-count": 21,
            "sha256": "7dbe72b1c558f8744c9c24d8f50cb766ffc2d99280c82e75070592054cbb2b7e",
            "source": "https://repo1.maven.org/maven2/org/junit/jupiter/junit-jupiter-migrationsupport/5.9.1/junit-jupiter-migrationsupport-5.9.1.jar",
            "status": "approved"
        }
    ]
}