{
    "id": "maven/mavencentral/org.apache.kafka/kafka-server-common/3.7.0",
    "license": "Apache-2.0",
    "authority": "https://gitlab.eclipse.org/eclipsefdn/emo-team/iplab/-/issues/13629",
    "source": "https://repo1.maven.org/maven2/org/apache/kafka/kafka-server-common/3.7.0/kafka-server-common-3.7.0-sources.jar",
    "status": "approved",
    "scans": [
        {
            "date": "March 8, 2024 at 1:28:00 a.m. GMT",
            "authority": "https://gitlab.eclipse.org/eclipsefdn/emo-team/iplab/-/issues/13629",
            "scancode-version": "31.2.1",
            "licenses-discovered": [
                "Apache-2.0"
            ],
            "copyrights": [
            ],
            "file-count": 82,
            "sha256": "4d3ea9ad2274b1a2903b248d68f2cd1754510d66c5d4497d8ac412f73651628a",
            "source": "https://repo1.maven.org/maven2/org/apache/kafka/kafka-server-common/3.7.0/kafka-server-common-3.7.0-sources.jar",
            "status": "approved"
        }
    ]
}