{
    "id": "go/golang/golang.org%2Fx/term/v0.4.0",
    "license": "BSD-3-Clause",
    "authority": "https://gitlab.eclipse.org/eclipsefdn/emo-team/iplab/-/issues/11434",
    "source": "https://proxy.golang.org/golang.org%2Fx/term/@v/v0.4.0.zip",
    "status": "approved",
    "scans": [
        {
            "date": "November 3, 2023 at 3:04:00 p.m. GMT",
            "authority": "https://gitlab.eclipse.org/eclipsefdn/emo-team/iplab/-/issues/11434",
            "scancode-version": "31.2.1",
            "licenses-discovered": [
                "BSD-3-Clause"
            ],
            "copyrights": [
                "Copyright (c) 2009 The Go Authors",
                "Copyright 2011 The Go Authors",
                "Copyright 2013 The Go Authors",
                "Copyright 2019 The Go Authors",
                "Copyright 2021 The Go Authors"
            ],
            "file-count": 17,
            "sha256": "4770f37eaa7d54991a71f46eec8e2964109183b022eb8f64d6fa8e68934e2f7c",
            "source": "https://proxy.golang.org/golang.org%2Fx/term/@v/v0.4.0.zip",
            "status": "approved"
        }
    ]
}