{
    "id": "npm/npmjs/-/storybook/8.5.3",
    "license": "MIT",
    "authority": "https://gitlab.eclipse.org/eclipsefdn/emo-team/iplab/-/issues/19352",
    "source": "https://github.com/storybookjs/storybook/archive/refs/tags/v8.5.3.zip",
    "status": "approved",
    "scans": [
        {
            "date": "February 6, 2025 at 11:31:19 a.m. GMT",
            "authority": "https://gitlab.eclipse.org/eclipsefdn/emo-team/iplab/-/issues/19352",
            "scancode-version": "31.2.1",
            "licenses-discovered": [
                "GPL-1.0-or-later",
                "MIT",
                "BSD-2-Clause AND ISC AND MIT",
                "OFL-1.1",
                "ISC"
            ],
            "copyrights": [
                "(c) 2017-present Renaud Tertrais",
                "(c) Unknown J2 V",
                "(c) Unknown Ks",
                "(c) Unknown Wu",
                "(c) Unknown Xs",
                "Copyright (c) 2016 Oxyno-zeta (Havrileck Alexandre)",
                "Copyright (c) 2017 The swc Project",
                "Copyright (c) 2024 Storybook",
                "Copyright 2011-2020 Tilde Inc. and contributors",
                "Copyright 2020 The Rubik Filtered Project",
                "Gt qt (c) Component",
                "Portions Copyright 2006-2011 Strobe Inc.",
                "Portions Copyright 2008-2011 Apple Inc."
            ],
            "file-count": 5179,
            "sha256": "89c17a084f311c1da8d540ec22f2ee100fd868c4f205d332e24f980abc0654c3",
            "source": "https://github.com/storybookjs/storybook/archive/refs/tags/v8.5.3.zip",
            "status": "restricted"
        }
    ]
}