{
    "id": "go/golang/github.com%2Fgoogle/go-cmp/v0.2.0",
    "license": "BSD-3-Clause",
    "authority": "https://gitlab.eclipse.org/eclipsefdn/emo-team/iplab/-/issues/5682",
    "source": "https://proxy.golang.org/github.com%2Fgoogle/go-cmp/@v/v0.2.0.zip",
    "status": "approved",
    "scans": [
        {
            "date": "December 12, 2022 at 10:12:08 p.m. GMT",
            "authority": "https://gitlab.eclipse.org/eclipsefdn/emo-team/iplab/-/issues/5682",
            "scancode-version": "31.2.1",
            "licenses-discovered": [
                "BSD-3-Clause"
            ],
            "copyrights": [
                "Copyright (c) 2017 The Go Authors",
                "Copyright 2017, The Go Authors"
            ],
            "file-count": 35,
            "sha256": "44649293cf714bcee800c9164ef6dcc7314e9ad98c49bba3da3dfad611edd955",
            "source": "https://proxy.golang.org/github.com%2Fgoogle/go-cmp/@v/v0.2.0.zip",
            "status": "approved"
        }
    ]
}