{
    "id": "npm/npmjs/-/eazy-logger/4.0.1",
    "license": "Apache-2.0 AND MIT",
    "authority": "https://gitlab.eclipse.org/eclipsefdn/emo-team/iplab/-/issues/12828",
    "source": "https://github.com/shakyShane/eazy-logger/archive/refs/tags/v4.0.1.zip",
    "status": "approved",
    "scans": [
        {
            "date": "January 17, 2024 at 1:16:19 p.m. GMT",
            "authority": "https://gitlab.eclipse.org/eclipsefdn/emo-team/iplab/-/issues/12828",
            "scancode-version": "31.2.1",
            "licenses-discovered": [
                "Apache-2.0",
                "MIT"
            ],
            "copyrights": [
                "Copyright 2015 Shane Osbourne",
                "Copyright Jeremy Ashkenas, DocumentCloud and Investigative Reporters & Editors",
                "Copyright jQuery Foundation and other contributors <https://jquery.org/>"
            ],
            "file-count": 8,
            "sha256": "0c19a8d09c0abb51d818351a0051d18c76871614703f5ae9d23c72ba435cd08b",
            "source": "https://github.com/shakyShane/eazy-logger/archive/refs/tags/v4.0.1.zip",
            "status": "approved"
        }
    ]
}