{
    "id": "maven/mavencentral/org.apache.lucene/lucene-misc/9.10.0",
    "license": "Apache-2.0",
    "authority": "https://gitlab.eclipse.org/eclipsefdn/emo-team/iplab/-/issues/13361",
    "source": "https://repo1.maven.org/maven2/org/apache/lucene/lucene-misc/9.10.0/lucene-misc-9.10.0-sources.jar",
    "status": "approved",
    "scans": [
        {
            "date": "February 21, 2024 at 9:13:21 a.m. GMT",
            "authority": "https://gitlab.eclipse.org/eclipsefdn/emo-team/iplab/-/issues/13361",
            "scancode-version": "31.2.1",
            "licenses-discovered": [
                "Apache-2.0"
            ],
            "copyrights": [
            ],
            "file-count": 37,
            "sha256": "a6219b7194d6dd2083f29d18851e9677e327b3891b5b7553f71ccfa37961b28c",
            "source": "https://repo1.maven.org/maven2/org/apache/lucene/lucene-misc/9.10.0/lucene-misc-9.10.0-sources.jar",
            "status": "approved"
        }
    ]
}