{
    "license": "MIT",
    "file-count": 10,
    "authority": "https://gitlab.eclipse.org/eclipsefdn/emo-team/iplab/-/issues/1813",
    "scancode-version": "30.1.0",
    "licenses-discovered": [
        "MIT"
    ],
    "id": "npm/npmjs/-/extsprintf/1.3.0",
    "source": "https://github.com/davepacheco/node-extsprintf/archive/v1.3.0.zip",
    "status": "approved"
}