{
    "id": "npm/npmjs/-/entities/4.5.0",
    "license": "BSD-2-Clause",
    "authority": "https://gitlab.eclipse.org/eclipsefdn/emo-team/iplab/-/issues/7910",
    "source": "https://github.com/fb55/entities/archive/v4.5.0.zip",
    "status": "approved",
    "scans": [
        {
            "date": "April 19, 2023 at 1:26:43 p.m. GMT",
            "authority": "https://gitlab.eclipse.org/eclipsefdn/emo-team/iplab/-/issues/7910",
            "scancode-version": "31.2.1",
            "licenses-discovered": [
                "BSD-2-Clause"
            ],
            "copyrights": [
                "Copyright (c) Felix Bohm"
            ],
            "file-count": 40,
            "sha256": "f5a4934e52fb9ddcf8e06b4f55aa71dcd371d4eb40a901eed7d5ccfea8616c4f",
            "source": "https://github.com/fb55/entities/archive/v4.5.0.zip",
            "status": "approved"
        }
    ]
}