{
    "id": "maven/mavencentral/com.vaadin/vaadin-text-field-flow/24.2.2",
    "license": "Apache-2.0",
    "authority": "https://gitlab.eclipse.org/eclipsefdn/emo-team/iplab/-/issues/12145",
    "source": "https://repo1.maven.org/maven2/com/vaadin/vaadin-text-field-flow/24.2.2/vaadin-text-field-flow-24.2.2-sources.jar",
    "status": "approved",
    "scans": [
        {
            "date": "December 18, 2023 at 9:39:27 a.m. GMT",
            "authority": "https://gitlab.eclipse.org/eclipsefdn/emo-team/iplab/-/issues/12145",
            "scancode-version": "31.2.1",
            "licenses-discovered": [
                "Apache-2.0"
            ],
            "copyrights": [
                "Copyright 2000-2023 Vaadin Ltd."
            ],
            "file-count": 22,
            "sha256": "21523d1ef1ceb2fd395e126c6a05a5d6de728f30048ceca276abca3859b80091",
            "source": "https://repo1.maven.org/maven2/com/vaadin/vaadin-text-field-flow/24.2.2/vaadin-text-field-flow-24.2.2-sources.jar",
            "status": "approved"
        }
    ]
}