{
    "id": "crate/cratesio/-/yoke-derive/0.7.4",
    "license": "Unicode-3.0",
    "authority": "https://gitlab.eclipse.org/eclipsefdn/emo-team/iplab/-/issues/15423",
    "source": "https://crates.io/api/v1/crates/yoke-derive/0.7.4/download",
    "status": "approved",
    "scans": [
        {
            "date": "June 15, 2024 at 2:41:35 a.m. GMT",
            "authority": "https://gitlab.eclipse.org/eclipsefdn/emo-team/iplab/-/issues/15423",
            "scancode-version": "31.2.1",
            "licenses-discovered": [
                "LicenseRef-scancode-unknown-spdx"
            ],
            "copyrights": [
                "(c) 1995-2016 International Business Machines Corporation and others",
                "Copyright (c) 2020-2024 Unicode, Inc."
            ],
            "file-count": 9,
            "sha256": "28cc31741b18cb6f1d5ff12f5b7523e3d6eb0852bbbad19d73905511d9849b95",
            "source": "https://crates.io/api/v1/crates/yoke-derive/0.7.4/download",
            "status": "restricted"
        }
    ]
}