{
    "id": "npm/npmjs/@stylistic/eslint-plugin/4.0.1",
    "license": "MIT",
    "authority": "https://gitlab.eclipse.org/eclipsefdn/emo-team/iplab/-/issues/19507",
    "source": "https://github.com/eslint-stylistic/eslint-stylistic/archive/refs/tags/v4.0.1.zip",
    "status": "approved",
    "scans": [
        {
            "date": "February 21, 2025 at 1:45:04 p.m. GMT",
            "authority": "https://gitlab.eclipse.org/eclipsefdn/emo-team/iplab/-/issues/19507",
            "scancode-version": "31.2.1",
            "licenses-discovered": [
                "MIT"
            ],
            "copyrights": [
                "(c) 2023-PRESENT ESLint Stylistic",
                "(c) OpenJS Foundation and other contributors, <www.openjsf.org>",
                "Copyright (c) 2014 Yannick Croissant",
                "Copyright (c) 2014 by Vitaly Puzrin",
                "Copyright (c) 2019 typescript-eslint and other contributors",
                "Copyright (c) 2023-PRESENT ESLint Stylistic",
                "Copyright (c) 2023-PRESENT eslint-stylistic and other contributors",
                "Copyright OpenJS Foundation and other contributors, <www.openjsf.org>",
                "Copyright OpenJS Foundation and other contributors, www.openjsf.org",
                "copyright 2015 Gyandeep Singh",
                "copyright 2015 Vitaly Puzrin"
            ],
            "file-count": 896,
            "sha256": "8d35dea0a4a698e859dd00f70f2f09324a8643cc6b0e96e3cf9820ce35b33bb1",
            "source": "https://github.com/eslint-stylistic/eslint-stylistic/archive/refs/tags/v4.0.1.zip",
            "status": "approved"
        }
    ]
}