{
    "id": "maven/mavencentral/org.wildfly.security/wildfly-elytron-base/2.6.0.Final",
    "license": "Apache-2.0",
    "authority": "https://gitlab.eclipse.org/eclipsefdn/emo-team/iplab/-/issues/16641",
    "source": "https://repo1.maven.org/maven2/org/wildfly/security/wildfly-elytron-base/2.6.0.Final/wildfly-elytron-base-2.6.0.Final-sources.jar",
    "status": "approved",
    "scans": [
        {
            "date": "October 15, 2024, 2:44:54 a.m. GMT",
            "authority": "https://gitlab.eclipse.org/eclipsefdn/emo-team/iplab/-/issues/16641",
            "scancode-version": "31.2.1",
            "licenses-discovered": [
                "Apache-2.0"
            ],
            "copyrights": [
                "Copyright 2013 Red Hat, Inc., and individual contributors",
                "Copyright 2014 Red Hat, Inc., and individual contributors",
                "Copyright 2015 Red Hat, Inc., and individual contributors",
                "Copyright 2017 Red Hat, Inc., and individual contributors",
                "Copyright 2018 Red Hat, Inc., and individual contributors"
            ],
            "file-count": 27,
            "sha256": "2639987201b79050ea64a93e2d56bfb640cf90f1e3cdee713083e10b7dd599a6",
            "source": "https://repo1.maven.org/maven2/org/wildfly/security/wildfly-elytron-base/2.6.0.Final/wildfly-elytron-base-2.6.0.Final-sources.jar",
            "status": "approved"
        }
    ]
}