{
    "id": "maven/mavencentral/io.soabase.record-builder/record-builder-core/41",
    "license": "Apache-2.0",
    "authority": "https://gitlab.eclipse.org/eclipsefdn/emo-team/iplab/-/issues/16091",
    "source": "https://repo1.maven.org/maven2/io/soabase/record-builder/record-builder-core/41/record-builder-core-41-sources.jar",
    "status": "approved",
    "scans": [
        {
            "date": "September 10, 2024, 2:49:43 p.m. GMT",
            "authority": "https://gitlab.eclipse.org/eclipsefdn/emo-team/iplab/-/issues/16091",
            "scancode-version": "31.2.1",
            "licenses-discovered": [
                "Apache-2.0"
            ],
            "copyrights": [
                "Copyright 2019 The original author or authors"
            ],
            "file-count": 8,
            "sha256": "b640f713fa74ab85627c14025910d754cba837cdbbd1e7f635221f3246fe172f",
            "source": "https://repo1.maven.org/maven2/io/soabase/record-builder/record-builder-core/41/record-builder-core-41-sources.jar",
            "status": "approved"
        }
    ]
}