{
    "id": "maven/mavencentral/org.wildfly.security/wildfly-elytron-sasl-plain/2.6.0.Final",
    "license": "Apache-2.0",
    "authority": "https://gitlab.eclipse.org/eclipsefdn/emo-team/iplab/-/issues/16657",
    "source": "https://repo1.maven.org/maven2/org/wildfly/security/wildfly-elytron-sasl-plain/2.6.0.Final/wildfly-elytron-sasl-plain-2.6.0.Final-sources.jar",
    "status": "approved",
    "scans": [
        {
            "date": "October 15, 2024, 2:57:03 a.m. GMT",
            "authority": "https://gitlab.eclipse.org/eclipsefdn/emo-team/iplab/-/issues/16657",
            "scancode-version": "31.2.1",
            "licenses-discovered": [
                "Apache-2.0"
            ],
            "copyrights": [
                "Copyright 2014 Red Hat, Inc., and individual contributors",
                "Copyright 2018 Red Hat, Inc., and individual contributors"
            ],
            "file-count": 10,
            "sha256": "e087b22fa0ddd13cd8705775e8315181e9786f51f15de567e12783d67dc16ec9",
            "source": "https://repo1.maven.org/maven2/org/wildfly/security/wildfly-elytron-sasl-plain/2.6.0.Final/wildfly-elytron-sasl-plain-2.6.0.Final-sources.jar",
            "status": "approved"
        }
    ]
}