{
    "id": "go/golang/github.com%2Fgoogle/uuid/v1.1.2",
    "license": "BSD-3-Clause",
    "authority": "https://gitlab.eclipse.org/eclipsefdn/emo-team/iplab/-/issues/5795",
    "source": "https://proxy.golang.org/github.com%2Fgoogle/uuid/@v/v1.1.2.zip",
    "status": "approved",
    "scans": [
        {
            "date": "December 14, 2022 at 4:29:40 a.m. GMT",
            "authority": "https://gitlab.eclipse.org/eclipsefdn/emo-team/iplab/-/issues/5795",
            "scancode-version": "31.2.1",
            "licenses-discovered": [
                "BSD-3-Clause"
            ],
            "copyrights": [
                "Copyright (c) 2009,2014 Google Inc.",
                "Copyright 2016 Google Inc.",
                "Copyright 2017 Google Inc.",
                "Copyright 2018 Google Inc."
            ],
            "file-count": 23,
            "sha256": "5d52fee1f44cf85dbba03f1bd6098a15a131e32c0e45839b352d69aceb7babfc",
            "source": "https://proxy.golang.org/github.com%2Fgoogle/uuid/@v/v1.1.2.zip",
            "status": "approved"
        }
    ]
}