{
    "id": "npm/npmjs/-/vite-plugin-dts/3.7.3",
    "license": "MIT",
    "authority": "https://gitlab.eclipse.org/eclipsefdn/emo-team/iplab/-/issues/14014",
    "source": "https://github.com/qmhc/vite-plugin-dts/archive/refs/tags/v3.7.3.zip",
    "status": "approved",
    "scans": [
        {
            "date": "March 22, 2024 at 4:28:39 p.m. GMT",
            "authority": "https://gitlab.eclipse.org/eclipsefdn/emo-team/iplab/-/issues/14014",
            "scancode-version": "31.2.1",
            "licenses-discovered": [
                "MIT"
            ],
            "copyrights": [
                "Copyright (c) 2021-present qmhc"
            ],
            "file-count": 107,
            "sha256": "f5328e151e1c66eae84bbc4ee60367c1a62601f28b00dd708eb6c84c24b53aa9",
            "source": "https://github.com/qmhc/vite-plugin-dts/archive/refs/tags/v3.7.3.zip",
            "status": "approved"
        }
    ]
}