{
    "id": "npm/npmjs/@vitest/utils/1.6.0",
    "license": "MIT AND Apache-2.0 AND (Apache-2.0 AND BSD-3-Clause AND ISC AND MIT)",
    "authority": "https://gitlab.eclipse.org/eclipsefdn/emo-team/iplab/-/issues/15487",
    "source": "https://github.com/vitest-dev/vitest/archive/refs/tags/v1.6.0.zip",
    "status": "approved",
    "scans": [
        {
            "date": "June 24, 2024 at 1:01:45 p.m. GMT",
            "authority": "https://gitlab.eclipse.org/eclipsefdn/emo-team/iplab/-/issues/15487",
            "scancode-version": "31.2.1",
            "licenses-discovered": [
                "MIT",
                "Apache-2.0",
                "Apache-2.0 AND BSD-3-Clause AND ISC AND MIT"
            ],
            "copyrights": [
                "(c) 2021 Anthony Fu (https://github.com/antfu)",
                "(c) 2021-Present Anthony Fu (https://github.com/antfu), Matias Capeletto (https://github.com/patak-dev)",
                "Copyright (c) 2008-2016 Pivotal Labs",
                "Copyright (c) 2010-2014, Christian Johansen, christian@cjohansen.no",
                "Copyright (c) 2011 Einar Otto Stangvik <einaros@gmail.com>",
                "Copyright (c) 2013 Arnout Kazemier and contributors",
                "Copyright (c) 2013 Jake Luer <jake@alogicalparadox.com> (http://alogicalparadox.com)",
                "Copyright (c) 2014 Bob Lauer",
                "Copyright (c) 2014 Permission",
                "Copyright (c) 2014-2016, Jon Schlinkert",
                "Copyright (c) 2014-2017, Jon Schlinkert",
                "Copyright (c) 2014-2018, Jon Schlinkert",
                "Copyright (c) 2014-2020 Teambition",
                "Copyright (c) 2014-present, Jon Schlinkert",
                "Copyright (c) 2015 Matteo Collina",
                "Copyright (c) 2015, 2019 Elan Shanker",
                "Copyright (c) 2015, Contributors",
                "Copyright (c) 2015-2020, Matteo Collina <matteo.collina@gmail.com>",
                "Copyright (c) 2015-present, Jon Schlinkert",
                "Copyright (c) 2016 Luigi Pinca and contributors",
                "Copyright (c) 2017-present, Jon Schlinkert",
                "Copyright (c) 2018 Terkel Gjervig Nielsen",
                "Copyright (c) 2018, Sinon.JS",
                "Copyright (c) 2018-2020, Andrea Giammarchi",
                "Copyright (c) 2021 Anthony Fu <https://github.com/antfu>",
                "Copyright (c) 2021-PRESENT Anthony Fu, Matias Capeletto and Vitest",
                "Copyright (c) 2021-Present Vitest Team",
                "Copyright (c) DC",
                "Copyright (c) Denis Malinochkin",
                "Copyright (c) EGOIST",
                "Copyright (c) Facebook, Inc. and its affiliates",
                "Copyright (c) Feross Aboukhadijeh",
                "Copyright (c) Hiroki Osame <hiroki.osame@gmail.com>",
                "Copyright (c) Luke Edwards <luke.edwards05@gmail.com> (lukeed.com)",
                "Copyright (c) Meta Platforms, Inc. and affiliates",
                "Copyright (c) Sindre Sorhus <sindresorhus@gmail.com> (https://sindresorhus.com)",
                "Copyright (c) Sindre Sorhus <sindresorhus@gmail.com> (sindresorhus.com)",
                "Copyright 2018 The diff-match-patch",
                "Copyright Mathias Bynens <https://mathiasbynens.be/>"
            ],
            "file-count": 1582,
            "sha256": "1b1d0c6b6e4a73561ce14921bf7b267917fe210e20c44b51da13567910f52f03",
            "source": "https://github.com/vitest-dev/vitest/archive/refs/tags/v1.6.0.zip",
            "status": "approved"
        }
    ]
}