{
    "id": "maven/mavencentral/org.typelevel/cats-effect-std_2.12/3.3.9",
    "license": "Apache-2.0",
    "authority": "https://gitlab.eclipse.org/eclipsefdn/emo-team/iplab/-/issues/8901",
    "source": "https://repo.maven.apache.org/maven2/org/typelevel/cats-effect-std_2.12/3.3.9/cats-effect-std_2.12-3.3.9-sources.jar",
    "status": "approved",
    "scans": [
        {
            "date": "June 14, 2023 at 5:58:24 p.m. GMT",
            "authority": "https://gitlab.eclipse.org/eclipsefdn/emo-team/iplab/-/issues/8901",
            "scancode-version": "31.2.1",
            "licenses-discovered": [
                "Apache-2.0"
            ],
            "copyrights": [
                "Copyright 2020-2022 Typelevel"
            ],
            "file-count": 22,
            "sha256": "58567280fce79a51e5b179a054dcd2439a344bacad60c46b50e6e4dacc3a50ba",
            "source": "https://repo.maven.apache.org/maven2/org/typelevel/cats-effect-std_2.12/3.3.9/cats-effect-std_2.12-3.3.9-sources.jar",
            "status": "approved"
        }
    ]
}