{
    "id": "npm/npmjs/-/vue-router/4.3.3",
    "license": "MIT",
    "authority": "https://gitlab.eclipse.org/eclipsefdn/emo-team/iplab/-/issues/15390",
    "source": "https://github.com/vuejs/router/archive/refs/tags/v4.3.3.zip",
    "status": "approved",
    "scans": [
        {
            "date": "June 14, 2024 at 11:32:23 p.m. GMT",
            "authority": "https://gitlab.eclipse.org/eclipsefdn/emo-team/iplab/-/issues/15390",
            "scancode-version": "31.2.1",
            "licenses-discovered": [
                "MIT"
            ],
            "copyrights": [
                "Copyright (c) 2014-present Evan You, Eduardo San Martin",
                "Copyright (c) 2019-present Eduardo San Martin Morote"
            ],
            "file-count": 342,
            "sha256": "48788d710cab0b085dae54d52593ad6146e1eb131c92daa20a76328632dd10c9",
            "source": "https://github.com/vuejs/router/archive/refs/tags/v4.3.3.zip",
            "status": "approved"
        }
    ]
}