{
    "id": "maven/mavencentral/io.prometheus/simpleclient_dropwizard/0.16.0",
    "license": "Apache-2.0",
    "authority": "https://gitlab.eclipse.org/eclipsefdn/emo-team/iplab/-/issues/19686",
    "source": "https://repo1.maven.org/maven2/io/prometheus/simpleclient_dropwizard/0.16.0/simpleclient_dropwizard-0.16.0-sources.jar",
    "status": "approved",
    "scans": [
        {
            "date": "February 28, 2025 at 11:59:30 p.m. GMT",
            "authority": "https://gitlab.eclipse.org/eclipsefdn/emo-team/iplab/-/issues/19686",
            "scancode-version": "31.2.1",
            "licenses-discovered": [
                "Apache-2.0"
            ],
            "copyrights": [
            ],
            "file-count": 9,
            "sha256": "f260ab3363c8a495f2f7ecab29ef2dc4581ad78a64199f6ef9c34a2dea11655b",
            "source": "https://repo1.maven.org/maven2/io/prometheus/simpleclient_dropwizard/0.16.0/simpleclient_dropwizard-0.16.0-sources.jar",
            "status": "approved"
        }
    ]
}