{
    "id": "maven/mavencentral/org.bouncycastle/bcutil-jdk18on/1.79",
    "license": "MIT",
    "authority": "https://gitlab.eclipse.org/eclipsefdn/emo-team/iplab/-/issues/16965",
    "source": "https://repo1.maven.org/maven2/org/bouncycastle/bcutil-jdk18on/1.79/bcutil-jdk18on-1.79-sources.jar",
    "status": "approved",
    "scans": [
        {
            "date": "October 30, 2024, 10:56:15 a.m. GMT",
            "authority": "https://gitlab.eclipse.org/eclipsefdn/emo-team/iplab/-/issues/16965",
            "scancode-version": "31.2.1",
            "licenses-discovered": [
            ],
            "copyrights": [
            ],
            "file-count": 514,
            "sha256": "eea160325180797639d715311a04af9702e45ceaed3dbb487ab28ca778434cb6",
            "source": "https://repo1.maven.org/maven2/org/bouncycastle/bcutil-jdk18on/1.79/bcutil-jdk18on-1.79-sources.jar",
            "status": "restricted"
        }
    ]
}