{
    "id": "maven/mavencentral/org.geotools.ogc/net.opengis.wfs/30.4",
    "license": "LGPL-2.1-only",
    "authority": "https://gitlab.eclipse.org/eclipsefdn/emo-team/iplab/-/issues/15572",
    "source": "https://repo.osgeo.org/repository/geotools-releases/org/geotools/ogc/net.opengis.wfs/30.4/net.opengis.wfs-30.4-sources.jar",
    "status": "approved",
    "scans": [
        {
            "date": "July 3, 2024 at 2:43:14 p.m. GMT",
            "authority": "https://gitlab.eclipse.org/eclipsefdn/emo-team/iplab/-/issues/15572",
            "scancode-version": "31.2.1",
            "licenses-discovered": [
            ],
            "copyrights": [
                "Copyright (c) 2001 OGC",
                "Copyright (c) 2006,2010 Open Geospatial Consortium, Inc.",
                "Copyright (c) 2010 Open Geospatial Consortium",
                "Copyright (c) 2010 Open Geospatial Consortium, Inc."
            ],
            "file-count": 319,
            "sha256": "5e53ab6ae92f22938f565b2742944340f744ee47a3c3222b1d8018354c6d3abd",
            "source": "https://repo.osgeo.org/repository/geotools-releases/org/geotools/ogc/net.opengis.wfs/30.4/net.opengis.wfs-30.4-sources.jar",
            "status": "restricted"
        }
    ]
}