{
    "id": "npm/npmjs/-/eslint-import-resolver-typescript/3.7.0",
    "license": "ISC",
    "authority": "https://gitlab.eclipse.org/eclipsefdn/emo-team/iplab/-/issues/18918",
    "source": "https://github.com/import-js/eslint-import-resolver-typescript/archive/refs/tags/v3.7.0.zip",
    "status": "approved",
    "scans": [
        {
            "date": "January 19, 2025 at 2:18:36 a.m. GMT",
            "authority": "https://gitlab.eclipse.org/eclipsefdn/emo-team/iplab/-/issues/18918",
            "scancode-version": "31.2.1",
            "licenses-discovered": [
                "ISC"
            ],
            "copyrights": [
                "Copyright 2021 Alex Gorbatchev <alex.gorbatchev@gmail.com>"
            ],
            "file-count": 126,
            "sha256": "eb6ed12cf503cf463b53edde5b7b3fce7a4db10c5f79316e5e902face530843a",
            "source": "https://github.com/import-js/eslint-import-resolver-typescript/archive/refs/tags/v3.7.0.zip",
            "status": "approved"
        }
    ]
}