{
    "id": "go/golang/github.com%2Fopencontainers/selinux/v1.10.1",
    "license": "Apache-2.0",
    "authority": "https://gitlab.eclipse.org/eclipsefdn/emo-team/iplab/-/issues/12204",
    "source": "https://proxy.golang.org/github.com%2Fopencontainers/selinux/@v/v1.10.1.zip",
    "status": "approved",
    "scans": [
        {
            "date": "December 20, 2023 at 1:34:03 p.m. GMT",
            "authority": "https://gitlab.eclipse.org/eclipsefdn/emo-team/iplab/-/issues/12204",
            "scancode-version": "31.2.1",
            "licenses-discovered": [
                "Apache-2.0"
            ],
            "copyrights": [
                "Copyright (c) 2004, 2006 The Linux Foundation and its contributors"
            ],
            "file-count": 33,
            "sha256": "32a2bde9fd34f6a389b80c72ce51457ecdb96f2ce34ba83b4f95fd8ba2c36d19",
            "source": "https://proxy.golang.org/github.com%2Fopencontainers/selinux/@v/v1.10.1.zip",
            "status": "approved"
        }
    ]
}