{
    "id": "maven/mavencentral/org.apache.jena/jena-arq/3.17.0",
    "license": "Apache-2.0 AND (Apache-2.0 AND EPL-1.0)",
    "authority": "https://gitlab.eclipse.org/eclipsefdn/emo-team/iplab/-/issues/13192",
    "source": "https://repo1.maven.org/maven2/org/apache/jena/jena-arq/3.17.0/jena-arq-3.17.0-sources.jar",
    "status": "approved",
    "scans": [
        {
            "date": "February 11, 2024 at 11:52:35 a.m. GMT",
            "authority": "https://gitlab.eclipse.org/eclipsefdn/emo-team/iplab/-/issues/13192",
            "scancode-version": "31.2.1",
            "licenses-discovered": [
                "Apache-2.0",
                "Apache-2.0 AND EPL-1.0"
            ],
            "copyrights": [
                "Copyright (c) 2004-2009 Mort Bay Consulting Pty. Ltd."
            ],
            "file-count": 1518,
            "sha256": "39ff25f62c4157eece2886481173c710bbc9a2a4c1308edd2687ceabe8aa678d",
            "source": "https://repo1.maven.org/maven2/org/apache/jena/jena-arq/3.17.0/jena-arq-3.17.0-sources.jar",
            "status": "approved"
        }
    ]
}