{
    "id": "npm/npmjs/-/typescript-language-server/2.3.0",
    "license": "Apache-2.0 AND MIT AND Apache-2.0 AND MIT",
    "authority": "https://gitlab.eclipse.org/eclipsefdn/emo-team/iplab/-/issues/6007",
    "source": "https://github.com/typescript-language-server/typescript-language-server/archive/v2.3.0.zip",
    "status": "approved",
    "scans": [
        {
            "date": "December 28, 2022 at 4:49:58 a.m. GMT",
            "authority": "https://gitlab.eclipse.org/eclipsefdn/emo-team/iplab/-/issues/6007",
            "scancode-version": "31.2.1",
            "licenses-discovered": [
                "Apache-2.0 AND MIT",
                "Apache-2.0",
                "MIT"
            ],
            "copyrights": [
                "Copyright (c) 2015 - present Microsoft Corporation",
                "Copyright (c) 2017, 2018 TypeFox and others",
                "Copyright (c) 2018 TypeFox and others",
                "Copyright (c) 2021",
                "Copyright (c) 2022 TypeFox and others",
                "Copyright (c) Microsoft Corporation",
                "Copyright (c) TypeFox and others"
            ],
            "file-count": 87,
            "sha256": "7bd489983848ff0de105af41d30feb240ed824748327137674339fbec5668148",
            "source": "https://github.com/typescript-language-server/typescript-language-server/archive/v2.3.0.zip",
            "status": "approved"
        }
    ]
}