{
    "license": "BSD-3-Clause AND MIT",
    "file-count": 125,
    "authority": "https://gitlab.eclipse.org/eclipsefdn/emo-team/iplab/-/issues/1136",
    "scancode-version": "21.3.31",
    "licenses-discovered": [
        "LicenseRef-scancode-dco-1.1",
        "MIT",
        "BSD-3-Clause"
    ],
    "id": "npm/npmjs/-/node-gyp/5.1.0",
    "source": "https://github.com/nodejs/node-gyp/archive/v5.1.0.zip",
    "status": "approved"
}
