{
    "id": "p2/orbit/p2.eclipse-plugin/org.objectweb.asm.commons/9.3.0",
    "license": "BSD-3-Clause",
    "licenses-discovered": [
        "BSD-3-Clause"
    ],
    "copyrights": [
        "Copyright (c) 2000-2011 INRIA, France Telecom"
    ],
    "file-count": 26,
    "scancode-version": "31.2.1",
    "authority": "https://gitlab.eclipse.org/eclipsefdn/emo-team/iplab/-/issues/3883",
    "source": "https://search.maven.org/remotecontent?filepath=org/ow2/asm/asm-commons/9.3/asm-commons-9.3-sources.jar",
    "status": "approved"
}