{
    "id": "npm/npmjs/-/rc-table/7.39.0",
    "license": "MIT",
    "authority": "https://gitlab.eclipse.org/eclipsefdn/emo-team/iplab/-/issues/13322",
    "source": "https://registry.yarnpkg.com/rc-table/-/rc-table-7.39.0.tgz",
    "status": "approved",
    "scans": [
        {
            "date": "February 20, 2024 at 8:28:26 a.m. GMT",
            "authority": "https://gitlab.eclipse.org/eclipsefdn/emo-team/iplab/-/issues/13322",
            "scancode-version": "31.2.1",
            "licenses-discovered": [
                "MIT"
            ],
            "copyrights": [
                "Copyright (c) 2015-present Alipay.com, https://www.alipay.com"
            ],
            "file-count": 192,
            "sha256": "4cba814ca9be765431844d10728e8608cd8b0ee2d8a6833c93d0b38670c62646",
            "source": "https://registry.yarnpkg.com/rc-table/-/rc-table-7.39.0.tgz",
            "status": "approved"
        }
    ]
}