{
    "id": "maven/mavencentral/org.apache.cxf/cxf-spring-boot-autoconfigure/3.5.3",
    "license": "Apache-2.0",
    "licenses-discovered": [
        "Apache-2.0"
    ],
    "copyrights": [
        "Copyright The Apache Software Foundation"
    ],
    "file-count": 12,
    "scancode-version": "30.1.0",
    "authority": "https://gitlab.eclipse.org/eclipsefdn/emo-team/iplab/-/issues/3370",
    "source": "https://search.maven.org/remotecontent?filepath=org/apache/cxf/cxf-spring-boot-autoconfigure/3.5.3/cxf-spring-boot-autoconfigure-3.5.3-sources.jar",
    "status": "approved"
}