{
    "id": "p2/orbit/p2.eclipse.plugin/org.junit.platform.suite.commons/1.9.1.v20221103-2317",
    "license": "EPL-2.0",
    "authority": "https://gitlab.eclipse.org/eclipsefdn/emo-team/iplab/-/issues/10230",
    "source": "https://repo.maven.apache.org/maven2/org/junit/platform/junit-platform-suite-commons/1.9.0-M1/junit-platform-suite-commons-1.9.0-M1-sources.jar",
    "status": "approved",
    "scans": [
        {
            "date": "August 25, 2023 at 9:06:39 a.m. GMT",
            "authority": "https://gitlab.eclipse.org/eclipsefdn/emo-team/iplab/-/issues/10230",
            "scancode-version": "31.2.1",
            "licenses-discovered": [
                "EPL-2.0"
            ],
            "copyrights": [
                "Copyright 2015-2020 the original author or authors",
                "Copyright 2015-2022 the original author or authors"
            ],
            "file-count": 7,
            "sha256": "e4b1a08cf5ac312ace3b23b57b8253c52155ab2057c08c4d461ee3a683f15d3e",
            "source": "https://repo.maven.apache.org/maven2/org/junit/platform/junit-platform-suite-commons/1.9.0-M1/junit-platform-suite-commons-1.9.0-M1-sources.jar",
            "status": "approved"
        }
    ]
}