{
    "id": "maven/mavencentral/org.junit.platform/junit-platform-suite-api/1.10.2",
    "license": "EPL-2.0",
    "authority": "https://gitlab.eclipse.org/eclipsefdn/emo-team/iplab/-/issues/15240",
    "source": "https://repo1.maven.org/maven2/org/junit/platform/junit-platform-suite-api/1.10.2/junit-platform-suite-api-1.10.2-sources.jar",
    "status": "approved",
    "scans": [
        {
            "date": "June 14, 2024 at 11:12:59 a.m. GMT",
            "authority": "https://gitlab.eclipse.org/eclipsefdn/emo-team/iplab/-/issues/15240",
            "scancode-version": "31.2.1",
            "licenses-discovered": [
                "EPL-2.0"
            ],
            "copyrights": [
                "Copyright 2015-2021 the original author or authors",
                "Copyright 2015-2023 the original author or authors"
            ],
            "file-count": 30,
            "sha256": "0da2dad4f5d546410cd9e0d88a1c556ccb4c1fbfe6812fa7c0423e881f014e3c",
            "source": "https://repo1.maven.org/maven2/org/junit/platform/junit-platform-suite-api/1.10.2/junit-platform-suite-api-1.10.2-sources.jar",
            "status": "approved"
        }
    ]
}