{
    "id": "npm/npmjs/-/react-router-dom/6.15.0",
    "license": "MIT",
    "authority": "https://gitlab.eclipse.org/eclipsefdn/emo-team/iplab/-/issues/10907",
    "source": "https://github.com/remix-run/react-router/archive/refs/tags/react-router@6.15.0.zip",
    "status": "approved",
    "scans": [
        {
            "date": "October 5, 2023 at 8:17:56 a.m. GMT",
            "authority": "https://gitlab.eclipse.org/eclipsefdn/emo-team/iplab/-/issues/10907",
            "scancode-version": "31.2.1",
            "licenses-discovered": [
                "LicenseRef-scancode-google-cla",
                "MIT"
            ],
            "copyrights": [
                "Copyright (c) React Training LLC 2015-2019",
                "Copyright (c) Remix Software Inc.",
                "Copyright (c) Remix Software Inc. 2020-2021",
                "Copyright (c) Shopify Inc. 2022-2023"
            ],
            "file-count": 562,
            "sha256": "76bb641b319bcccc9ee2a54aa3c71156bec40a540e2cc3aa9f3b4118b93b36ed",
            "source": "https://github.com/remix-run/react-router/archive/refs/tags/react-router@6.15.0.zip",
            "status": "restricted"
        }
    ]
}
