{
    "id": "npm/npmjs/@vscode/debugprotocol/1.65.0",
    "license": "MIT",
    "authority": "https://gitlab.eclipse.org/eclipsefdn/emo-team/iplab/-/issues/13541",
    "source": "https://github.com/microsoft/vscode-debugadapter-node/archive/refs/tags/v1.65.0.zip",
    "status": "approved",
    "scans": [
        {
            "date": "March 6, 2024 at 8:54:02 a.m. GMT",
            "authority": "https://gitlab.eclipse.org/eclipsefdn/emo-team/iplab/-/issues/13541",
            "scancode-version": "31.2.1",
            "licenses-discovered": [
                "MIT"
            ],
            "copyrights": [
                "Copyright (c) Microsoft Corporation"
            ],
            "file-count": 54,
            "sha256": "3b6d62108cb0f0f087dc2078ef118c6104f06561d2e3e2e05ad46fcd615f43b0",
            "source": "https://github.com/microsoft/vscode-debugadapter-node/archive/refs/tags/v1.65.0.zip",
            "status": "approved"
        }
    ]
}