{
    "id": "maven/mavencentral/org.keycloak/keycloak-adapter-core/6.0.0",
    "license": "Apache-2.0",
    "authority": "https://gitlab.eclipse.org/eclipsefdn/emo-team/iplab/-/issues/8464",
    "source": "https://search.maven.org/remotecontent?filepath=org/keycloak/keycloak-adapter-core/6.0.0/keycloak-adapter-core-6.0.0-sources.jar",
    "status": "approved",
    "scans": [
        {
            "date": "May 17, 2023 at 3:03:34 p.m. GMT",
            "authority": "https://gitlab.eclipse.org/eclipsefdn/emo-team/iplab/-/issues/8464",
            "scancode-version": "31.2.1",
            "licenses-discovered": [
                "Apache-2.0"
            ],
            "copyrights": [
                "Copyright 2016 Red Hat, Inc. and/or its affiliates and other contributors",
                "Copyright 2016 Red Hat, Inc. and/or its affiliates ~ and other contributors",
                "Copyright 2018 Red Hat, Inc. and/or its affiliates and other contributors"
            ],
            "file-count": 59,
            "sha256": "3fd8cadb15f8a38ebbe456d30bf3c7c938d20541442b3ed573e3376605d8e69a",
            "source": "https://search.maven.org/remotecontent?filepath=org/keycloak/keycloak-adapter-core/6.0.0/keycloak-adapter-core-6.0.0-sources.jar",
            "status": "approved"
        }
    ]
}