{
    "id": "maven/mavencentral/org.apache.logging.log4j/log4j-slf4j-impl/2.17.1",
    "license": "Apache-2.0",
    "licenses-discovered": [
        "Apache-2.0"
    ],
    "file-count": 16,
    "scancode-version": "30.1.0",
    "authority": "https://gitlab.eclipse.org/eclipsefdn/emo-team/iplab/-/issues/2537",
    "source": "https://search.maven.org/remotecontent?filepath=org/apache/logging/log4j/log4j-slf4j-impl/2.17.1/log4j-slf4j-impl-2.17.1-sources.jar",
    "status": "approved"
}