{
    "license": "MIT AND WTFPL",
    "file-count": 16,
    "authority": "https://gitlab.eclipse.org/eclipsefdn/emo-team/iplab/-/issues/1378",
    "scancode-version": "30.1.0",
    "licenses-discovered": [
        "WTFPL",
        "LicenseRef-scancode-unknown-license-reference",
        "MIT"
    ],
    "id": "npm/npmjs/-/lz-string/1.4.4",
    "source": "https://registry.npmjs.org/lz-string/-/lz-string-1.4.4.tgz",
    "status": "approved"
}
