{
    "id": "maven/mavencentral/org.netbeans.tools/sigtest-maven-plugin/1.6",
    "license": "GPL-2.0-only WITH Classpath-exception-2.0",
    "licenses-discovered": [
        "GPL-2.0-only WITH Classpath-exception-2.0"
    ],
    "file-count": 133,
    "scancode-version": "30.1.0",
    "authority": "https://gitlab.eclipse.org/eclipsefdn/emo-team/iplab/-/issues/2420",
    "source": "https://search.maven.org/remotecontent?filepath=org/netbeans/tools/sigtest-maven-plugin/1.6/sigtest-maven-plugin-1.6-sources.jar",
    "status": "restricted",
    "workswith": [
        "ee4j.cu"
    ]
}
