{
    "id": "project/iot.threadx/eclipse-threadx/threadx/d9957d803c0b20f91536e2ee8184b480c0dfc20d",
    "license": "MIT AND LicenseRef-Restricted-rights AND Apache-2.0 AND BSD-3-Clause",
    "authority": "https://gitlab.eclipse.org/eclipsefdn/emo-team/iplab/-/issues/13641",
    "source": "https://github.com/eclipse-threadx/threadx/archive/d9957d803c0b20f91536e2ee8184b480c0dfc20d.zip",
    "status": "approved",
    "scans": [
        {
            "date": "March 12, 2024 at 12:00:54 p.m. GMT",
            "authority": "https://gitlab.eclipse.org/eclipsefdn/emo-team/iplab/-/issues/13641",
            "scancode-version": "31.2.1",
            "licenses-discovered": [
                "LicenseRef-scancode-other-permissive",
                "MIT",
                "LicenseRef-scancode-proprietary-license",
                "Apache-2.0",
                "BSD-3-Clause",
                "LicenseRef-scancode-st-mcd-2.0",
                "BSD-3-Clause AND LicenseRef-scancode-proprietary-license"
            ],
            "copyrights": [
                "(c) (c) (ULONG)",
                "(c) 1996-2018 Express Logic, Inc.",
                "(c) 1996-2020 Microsoft Corporation",
                "(c) COPYRIGHT 2011 STMicroelectronics",
                "(c) COPYRIGHT 2016 STMicroelectronics",
                "(c) COPYRIGHT STMicroelectronics",
                "(c) Keil Software",
                "(c) MIPS Technologies, Inc.",
                "(c) MicroLAB Systems, 2014-2015",
                "(c) MicroLAB Systems, 2014-2017",
                "(c) MicroLAB Systems, 2015",
                "(c) MicroLAB Systems, 2015-2017",
                "(c) Synopsys, 2013",
                "Copyright (c) 1996-2019 Express Logic Inc. ThreadX",
                "Copyright (c) 1996-2019 IAR Systems AB.",
                "Copyright (c) 1996-2020 Microsoft Corporation",
                "Copyright (c) 1996-2021 Microsoft Corporation",
                "Copyright (c) 1996-2022 Microsoft Corporation",
                "Copyright (c) 1999-2007 MIPS Technologies, Inc.",
                "Copyright (c) 2000-2009 ARC International",
                "Copyright (c) 2002-2005 ARC International",
                "Copyright (c) 2005-2018 Arm Limited (or its affiliates)",
                "Copyright (c) 2006-2017 Arm Limited (or its affiliates)",
                "Copyright (c) 2006-2018 Arm Limited (or its affiliates)",
                "Copyright (c) 2006-2019 Cadence Design Systems Inc.",
                "Copyright (c) 2009 CodeSourcery, Inc.",
                "Copyright (c) 2009 CodeSourcery, LLC.",
                "Copyright (c) 2009-2017 Arm Limited (or its affiliates)",
                "Copyright (c) 2009-2018 Arm Limited",
                "Copyright (c) 2009-2019 Arm Limited",
                "Copyright (c) 2009-2020 Arm Limited",
                "Copyright (c) 2009-2022 Arm Limited",
                "Copyright (c) 2011 - 2013 ARM LIMITED",
                "Copyright (c) 2011 ARM Ltd.",
                "Copyright (c) 2011-2012 ARM Ltd.",
                "Copyright (c) 2011-2012 Arm Limited (or its affiliates)",
                "Copyright (c) 2011-2014 Arm Limited (or its affiliates)",
                "Copyright (c) 2011-2015 Arm Limited (or its affiliates)",
                "Copyright (c) 2011-2016 Arm Limited (or its affiliates)",
                "Copyright (c) 2011-2017 Arm Limited (or its affiliates)",
                "Copyright (c) 2011-2018 Arm Limited (or its affiliates)",
                "Copyright (c) 2012 Arm Limited (or its affiliates)",
                "Copyright (c) 2012 Renesas Electronics Corporation",
                "Copyright (c) 2012-2014 Arm Limited (or its affiliates)",
                "Copyright (c) 2012-2016 Arm Limited (or its affiliates)",
                "Copyright (c) 2012-2017 Arm Limited (or its affiliates)",
                "Copyright (c) 2012-2018 Arm Limited (or its affiliates)",
                "Copyright (c) 2012-2019 Arm Limited (or its affiliates)",
                "Copyright (c) 2013-2016 ARM Limited",
                "Copyright (c) 2013-2017 Arm Limited (or its affiliates)",
                "Copyright (c) 2013-2018 Arm Limited",
                "Copyright (c) 2013-2019 Arm Limited",
                "Copyright (c) 2014-2016 Arm Limited (or its affiliates)",
                "Copyright (c) 2014-2017 Arm Limited (or its affiliates)",
                "Copyright (c) 2014-2018 Arm Limited (or its affiliates)",
                "Copyright (c) 2014-2019 Arm Limited (or its affiliates)",
                "Copyright (c) 2015-2016 ARM Limited",
                "Copyright (c) 2016 Arm Limited (or its affiliates)",
                "Copyright (c) 2016, ARM Limited and Contributors",
                "Copyright (c) 2016, Synopsys, Inc.",
                "Copyright (c) 2016-2017 Arm Limited (or its affiliates)",
                "Copyright (c) 2016-2018 Arm Limited (or its affiliates)",
                "Copyright (c) 2016-2022 Arm Limited",
                "Copyright (c) 2017 ARM Ltd.",
                "Copyright (c) 2018-2021 Arm Limited",
                "Copyright (c) 2018-2022 Arm Limited",
                "Copyright (c) 2019-2021 Arm Limited",
                "Copyright (c) 2019-2022 Arm Limited",
                "Copyright (c) 2020 Arm Limited",
                "Copyright (c) 2020-2022 Arm Limited",
                "Copyright (c) 2024 - present Microsoft Corporation",
                "Copyright (c) 2024 Microsoft Corporation",
                "Copyright (c) 2024 Microsoft Corporation. Azure RTOS Xtensa",
                "Copyright (c) 2024 Microsoft Corporation. ThreadX",
                "Copyright (c) 2024 Microsoft Corporation. ThreadX Cortex-A5/Green Hills",
                "Copyright (c) 2024 Microsoft Corporation. ThreadX Cortex-A7/Green Hills",
                "Copyright (c) 2024 Microsoft Corporation. ThreadX Cortex-A8/Green Hills",
                "Copyright (c) 2024 Microsoft Corporation. ThreadX Cortex-A9/Green Hills",
                "Copyright (c) 2024 Microsoft Corporation. ThreadX Cortex-M3",
                "Copyright (c) 2024 Microsoft Corporation. ThreadX Cortex-M4",
                "Copyright (c) 2024 Microsoft Corporation. ThreadX Cortex-M7",
                "Copyright (c) 2024 Microsoft Corporation. ThreadX Cortex-Mx",
                "Copyright (c) 2024 Microsoft Corporation. ThreadX Cortex-Mxx",
                "Copyright (c) 2024 Microsoft Corporation. ThreadX Cortex-R4/Green Hills",
                "Copyright (c) 2024 Microsoft Corporation. ThreadX Cortex-R5/Green Hills",
                "Copyright (c) 2024 Microsoft Corporation. ThreadX Cortex-R7/Green Hills",
                "Copyright (c) 2024 Microsoft Corporation. ThreadX Module Cortex-M3",
                "Copyright (c) 2024 Microsoft Corporation. ThreadX Module Cortex-M4",
                "Copyright (c) 2024 Microsoft Corporation. ThreadX Module Cortex-M7",
                "Copyright (c) 2024 Microsoft Corporation. ThreadX Module Cortex-Mx",
                "Copyright (c) 2024 Microsoft Corporation. ThreadX Modules",
                "Copyright (c) 2024 Microsoft Corporation. ThreadX SMP",
                "Copyright (c) 2024 Microsoft Corporation. ThreadX Win32/Visual Studio",
                "Copyright (c) Cadence Design Systems, Inc.",
                "Copyright (c) Microsoft Corporation",
                "Copyright 1983-2019 Green Hills Software LLC.",
                "Copyright 2007 IAR Systems",
                "Copyright 2007-2017 IAR Systems AB.",
                "Copyright 2009-2010 IAR Systems AB.",
                "Copyright 2019 IAR Systems AB.",
                "Copyright ARM LTD, 2012",
                "Copyright ARM LTD, 2013",
                "Copyright ARM Ltd 2009",
                "Copyright ARM Ltd 2012",
                "Copyright ARM Ltd 2013"
            ],
            "file-count": 10042,
            "sha256": "848bb2f681b82c286b224be602eaefdf280ba9fe551ce0ac81180df97c76973c",
            "source": "https://github.com/eclipse-threadx/threadx/archive/d9957d803c0b20f91536e2ee8184b480c0dfc20d.zip",
            "status": "restricted"
        }
    ]
}