{
    "id": "maven/mavencentral/org.codehaus.plexus/plexus-interpolation/1.27",
    "license": "Apache-2.0 AND Apache-1.1 AND MIT",
    "authority": "https://gitlab.eclipse.org/eclipsefdn/emo-team/iplab/-/issues/12548",
    "source": "https://repo1.maven.org/maven2/org/codehaus/plexus/plexus-interpolation/1.27/plexus-interpolation-1.27-sources.jar",
    "status": "approved",
    "scans": [
        {
            "date": "December 26, 2023 at 6:25:32 a.m. GMT",
            "authority": "https://gitlab.eclipse.org/eclipsefdn/emo-team/iplab/-/issues/12548",
            "scancode-version": "31.2.1",
            "licenses-discovered": [
                "Apache-2.0",
                "Apache-1.1",
                "MIT"
            ],
            "copyrights": [
                "Copyright (c) 2001-2003 The Apache Software Foundation",
                "Copyright (c) 2002 The Apache Software Foundation",
                "Copyright (c) 2002-2003 The Apache Software Foundation",
                "Copyright (c) 2004, The Codehaus",
                "Copyright 2001-2004 The Apache Software Foundation",
                "Copyright 2001-2006 Codehaus Foundation",
                "Copyright 2001-2008 Codehaus Foundation",
                "Copyright 2001-2009 Codehaus Foundation",
                "Copyright 2007 The Codehaus Foundation",
                "Copyright 2014 Codehaus Foundation",
                "Copyright 2014 The Codehaus Foundation"
            ],
            "file-count": 54,
            "sha256": "aef15feee7005390a97304e0d64457fab9e792ef0de9932c87dd3d2898fee566",
            "source": "https://repo1.maven.org/maven2/org/codehaus/plexus/plexus-interpolation/1.27/plexus-interpolation-1.27-sources.jar",
            "status": "approved"
        }
    ]
}