{
    "id": "npm/npmjs/@typescript-eslint/eslint-plugin/6.18.1",
    "license": "BSD-2-Clause AND (BSD-2-Clause AND ISC AND MIT) AND MIT",
    "authority": "https://gitlab.eclipse.org/eclipsefdn/emo-team/iplab/-/issues/12747",
    "source": "https://github.com/typescript-eslint/typescript-eslint/archive/refs/tags/v6.18.1.zip",
    "status": "approved",
    "scans": [
        {
            "date": "January 11, 2024 at 10:42:52 a.m. GMT",
            "authority": "https://gitlab.eclipse.org/eclipsefdn/emo-team/iplab/-/issues/12747",
            "scancode-version": "31.2.1",
            "licenses-discovered": [
                "BSD-2-Clause",
                "BSD-2-Clause AND ISC AND MIT",
                "MIT"
            ],
            "copyrights": [
                "Copyright (c) 2016 unional",
                "Copyright (c) 2019 typescript-eslint and other contributors",
                "Copyright (c) 2021 typescript-eslint and other contributors",
                "Copyright (c) 2023 typescript-eslint and other contributors",
                "Copyright JS Foundation and other contributors, https://js.foundation",
                "Copyright Joyent, Inc. and other Node contributors"
            ],
            "file-count": 6871,
            "sha256": "a0d1c157db7da5cc2b6a991dbfa4e5a8c587148b1f9f6bfa514b08f4f56ab64c",
            "source": "https://github.com/typescript-eslint/typescript-eslint/archive/refs/tags/v6.18.1.zip",
            "status": "approved"
        }
    ]
}