{
    "id": "npm/npmjs/-/dunder-proto/1.0.0",
    "license": "MIT",
    "authority": "https://gitlab.eclipse.org/eclipsefdn/emo-team/iplab/-/issues/17824",
    "source": "https://github.com/es-shims/dunder-proto/archive/refs/tags/v1.0.0.zip",
    "status": "approved",
    "scans": [
        {
            "date": "December 11, 2024 at 3:30:15 p.m. GMT",
            "authority": "https://gitlab.eclipse.org/eclipsefdn/emo-team/iplab/-/issues/17824",
            "scancode-version": "31.2.1",
            "licenses-discovered": [
                "MIT"
            ],
            "copyrights": [
                "Copyright (c) 2024 ECMAScript Shims"
            ],
            "file-count": 21,
            "sha256": "bad432813256b1f6811df297f4662bc58685a3dba92e7c28daaf0f5abc71133f",
            "source": "https://github.com/es-shims/dunder-proto/archive/refs/tags/v1.0.0.zip",
            "status": "approved"
        }
    ]
}