{
    "id": "maven/mavencentral/org.typelevel/alleycats-core_2.12/2.7.0",
    "license": "MIT",
    "authority": "https://gitlab.eclipse.org/eclipsefdn/emo-team/iplab/-/issues/8854",
    "source": "https://repo.maven.apache.org/maven2/org/typelevel/alleycats-core_2.12/2.7.0/alleycats-core_2.12-2.7.0-sources.jar",
    "status": "approved",
    "scans": [
        {
            "date": "June 14, 2023 at 7:25:03 p.m. GMT",
            "authority": "https://gitlab.eclipse.org/eclipsefdn/emo-team/iplab/-/issues/8854",
            "scancode-version": "31.2.1",
            "licenses-discovered": [
            ],
            "copyrights": [
            ],
            "file-count": 23,
            "sha256": "abfb3554c3e558725141d703849f978beddeb538d4081e3cbcd31daeb62d6e11",
            "source": "https://repo.maven.apache.org/maven2/org/typelevel/alleycats-core_2.12/2.7.0/alleycats-core_2.12-2.7.0-sources.jar",
            "status": "restricted"
        }
    ]
}
