{
    "license": "BSD-2-Clause",
    "file-count": 5,
    "authority": "https://gitlab.eclipse.org/eclipsefdn/emo-team/iplab/-/issues/1140",
    "scancode-version": "21.3.31",
    "licenses-discovered": [
        "BSD-2-Clause"
    ],
    "id": "npm/npmjs/-/glob-to-regexp/0.3.0",
    "source": "https://registry.npmjs.org/glob-to-regexp/-/glob-to-regexp-0.3.0.tgz",
    "status": "approved"
}