{
    "id": "maven/mavencentral/org.apache.maven/maven-builder-support/3.8.5",
    "license": "Apache-2.0",
    "licenses-discovered": [
        "Apache-2.0"
    ],
    "file-count": 13,
    "scancode-version": "30.1.0",
    "authority": "https://gitlab.eclipse.org/eclipsefdn/emo-team/iplab/-/issues/2690",
    "source": "https://search.maven.org/remotecontent?filepath=org/apache/maven/maven-builder-support/3.8.5/maven-builder-support-3.8.5-sources.jar",
    "status": "approved"
}