{
    "id": "nuget/nuget/-/MQTTnet/4.1.1",
    "license": "MIT",
    "authority": "https://gitlab.eclipse.org/eclipsefdn/emo-team/iplab/-/issues/15997",
    "source": "https://github.com/dotnet/MQTTnet/archive/refs/tags/v4.1.1.318.zip",
    "status": "approved",
    "scans": [
        {
            "date": "September 11, 2024, 3:19:35 a.m. GMT",
            "authority": "https://gitlab.eclipse.org/eclipsefdn/emo-team/iplab/-/issues/15997",
            "scancode-version": "31.2.1",
            "licenses-discovered": [
                "MIT"
            ],
            "copyrights": [
                "Copyright (c) .NET Foundation and Contributors",
                "Copyright (c) .NET Foundation and Contributors https://github.com/dotnet/MQTTnet https://github.com/dotnet/MQTTnet.git"
            ],
            "file-count": 431,
            "sha256": "c04ca353620c832f9bae65a6ed695d75537b1bc108cbbc60650428979aeb28e4",
            "source": "https://github.com/dotnet/MQTTnet/archive/refs/tags/v4.1.1.318.zip",
            "status": "approved"
        }
    ]
}