{
    "id": "maven/mavencentral/com.vladsch.flexmark/flexmark-ext-gfm-issues/0.64.8",
    "license": "BSD-2-Clause AND CC-BY-SA-4.0",
    "authority": "https://gitlab.eclipse.org/eclipsefdn/emo-team/iplab/-/issues/11313",
    "source": "https://repo.maven.apache.org/maven2/com/vladsch/flexmark/flexmark-ext-gfm-issues/0.64.8/flexmark-ext-gfm-issues-0.64.8-sources.jar",
    "status": "approved",
    "scans": [
        {
            "date": "October 26, 2023 at 7:33:22 p.m. GMT",
            "authority": "https://gitlab.eclipse.org/eclipsefdn/emo-team/iplab/-/issues/11313",
            "scancode-version": "31.2.1",
            "licenses-discovered": [
            ],
            "copyrights": [
            ],
            "file-count": 13,
            "sha256": "c240060f170b239643317e8fb307d7e9b445e6691b39f5ed45c1419ebc684202",
            "source": "https://repo.maven.apache.org/maven2/com/vladsch/flexmark/flexmark-ext-gfm-issues/0.64.8/flexmark-ext-gfm-issues-0.64.8-sources.jar",
            "status": "restricted"
        }
    ]
}
