{
    "id": "git/github/golang/crypto/793ad666bf5e",
    "license": "BSD-3-Clause AND (BSD-3-Clause AND OpenSSL) AND (BSD-3-Clause AND MIT)",
    "authority": "https://gitlab.eclipse.org/eclipsefdn/emo-team/iplab/-/issues/5211",
    "source": "https://github.com/golang/crypto/archive/793ad666bf5e.zip",
    "status": "approved",
    "scans": [
        {
            "date": "November 25, 2022 at 8:58:13 p.m. GMT",
            "authority": "https://gitlab.eclipse.org/eclipsefdn/emo-team/iplab/-/issues/5211",
            "scancode-version": "31.2.1",
            "licenses-discovered": [
                "BSD-3-Clause",
                "BSD-3-Clause AND OpenSSL",
                "BSD-3-Clause AND MIT"
            ],
            "copyrights": [
                "Copyright (c) 2009 The Go Authors",
                "Copyright (c) 2017 The Go Authors",
                "Copyright (c) 2019 The Go Authors",
                "Copyright (c) 2020 The Go Authors",
                "Copyright (c) 2021 The Go Authors",
                "Copyright 2009 The Go Authors",
                "Copyright 2010 The Go Authors",
                "Copyright 2011 The Go Authors",
                "Copyright 2012 The Go Authors",
                "Copyright 2013 The Go Authors",
                "Copyright 2014 The Go Authors",
                "Copyright 2015 The Go Authors",
                "Copyright 2016 The Go Authors",
                "Copyright 2017 The Go Authors",
                "Copyright 2018 The Go Authors",
                "Copyright 2019 The Go Authors",
                "Copyright 2020 The Go Authors",
                "Copyright 2022 The Go Authors"
            ],
            "file-count": 358,
            "sha256": "490a18f8ae770a749488f79560bbbff37789ff1e7d30cf0b306640fabb60c1e8",
            "source": "https://github.com/golang/crypto/archive/793ad666bf5e.zip",
            "status": "approved"
        }
    ]
}