{
    "id": "maven/mavencentral/org.apache.httpcomponents.core5/httpcore5/5.3.1",
    "license": "Apache-2.0",
    "authority": "https://gitlab.eclipse.org/eclipsefdn/emo-team/iplab/-/issues/16866",
    "source": "https://repo1.maven.org/maven2/org/apache/httpcomponents/core5/httpcore5/5.3.1/httpcore5-5.3.1-sources.jar",
    "status": "approved",
    "scans": [
        {
            "date": "October 24, 2024, 8:25:17 a.m. GMT",
            "authority": "https://gitlab.eclipse.org/eclipsefdn/emo-team/iplab/-/issues/16866",
            "scancode-version": "31.2.1",
            "licenses-discovered": [
                "Apache-2.0"
            ],
            "copyrights": [
            ],
            "file-count": 529,
            "sha256": "4b330facbca43d11f708659531eba1833edb227727c287767ac9eacaf74431fd",
            "source": "https://repo1.maven.org/maven2/org/apache/httpcomponents/core5/httpcore5/5.3.1/httpcore5-5.3.1-sources.jar",
            "status": "approved"
        }
    ]
}