{
    "id": "maven/mavencentral/io.quarkus/quarkus-vertx-latebound-mdc-provider/3.17.4",
    "license": "Apache-2.0",
    "authority": "https://gitlab.eclipse.org/eclipsefdn/emo-team/iplab/-/issues/17874",
    "source": "https://repo1.maven.org/maven2/io/quarkus/quarkus-vertx-latebound-mdc-provider/3.17.4/quarkus-vertx-latebound-mdc-provider-3.17.4-sources.jar",
    "status": "approved",
    "scans": [
        {
            "date": "December 13, 2024 at 1:22:41 p.m. GMT",
            "authority": "https://gitlab.eclipse.org/eclipsefdn/emo-team/iplab/-/issues/17874",
            "scancode-version": "31.2.1",
            "licenses-discovered": [
            ],
            "copyrights": [
            ],
            "file-count": 6,
            "sha256": "2f26a0e8e407340029dcaf82d95aa4f3b43b00e91c2166d38623ea4389af9ceb",
            "source": "https://repo1.maven.org/maven2/io/quarkus/quarkus-vertx-latebound-mdc-provider/3.17.4/quarkus-vertx-latebound-mdc-provider-3.17.4-sources.jar",
            "status": "restricted"
        }
    ]
}