{
    "id": "go/golang/github.com%2Fcheckpoint-restore%2Fgo-criu/v5/v5.3.0",
    "license": "Apache-2.0 AND MIT",
    "authority": "https://gitlab.eclipse.org/eclipsefdn/emo-team/iplab/-/issues/12499",
    "source": "https://proxy.golang.org/github.com%2Fcheckpoint-restore%2Fgo-criu/v5/@v/v5.3.0.zip",
    "status": "approved",
    "scans": [
        {
            "date": "December 26, 2023 at 9:18:39 a.m. GMT",
            "authority": "https://gitlab.eclipse.org/eclipsefdn/emo-team/iplab/-/issues/12499",
            "scancode-version": "31.2.1",
            "licenses-discovered": [
                "Apache-2.0",
                "MIT"
            ],
            "copyrights": [
            ],
            "file-count": 30,
            "sha256": "fab492b56bf2e39a16b060456bdf74931ad2290dc33db3ba8d01807febd29ebd",
            "source": "https://proxy.golang.org/github.com%2Fcheckpoint-restore%2Fgo-criu/v5/@v/v5.3.0.zip",
            "status": "approved"
        }
    ]
}