{
    "license": "MIT",
    "file-count": 6,
    "authority": "https://gitlab.eclipse.org/eclipsefdn/emo-team/iplab/-/issues/1115",
    "scancode-version": "21.3.31",
    "licenses-discovered": [
        "MIT"
    ],
    "id": "npm/npmjs/types/jsdom/16.2.13",
    "source": "https://registry.yarnpkg.com/@types/jsdom/-/jsdom-16.2.13.tgz",
    "status": "approved"
}