{
    "id": "npm/npmjs/-/rc-checkbox/3.3.0",
    "license": "MIT",
    "authority": "https://gitlab.eclipse.org/eclipsefdn/emo-team/iplab/-/issues/14842",
    "source": "https://registry.yarnpkg.com/rc-checkbox/-/rc-checkbox-3.3.0.tgz",
    "status": "approved",
    "scans": [
        {
            "date": "May 21, 2024 at 12:11:43 p.m. GMT",
            "authority": "https://gitlab.eclipse.org/eclipsefdn/emo-team/iplab/-/issues/14842",
            "scancode-version": "31.2.1",
            "licenses-discovered": [
                "MIT"
            ],
            "copyrights": [
                "Copyright (c) 2016 React Components"
            ],
            "file-count": 8,
            "sha256": "d11ed932dfbe00713be15a65b09f75f4f7b4ce5916cd2c1c95e5456e78248267",
            "source": "https://registry.yarnpkg.com/rc-checkbox/-/rc-checkbox-3.3.0.tgz",
            "status": "approved"
        }
    ]
}