{
    "id": "crate/cratesio/-/icu_locid_transform/1.5.0",
    "license": "Unicode-3.0",
    "authority": "https://gitlab.eclipse.org/eclipsefdn/emo-team/iplab/-/issues/15422",
    "source": "https://crates.io/api/v1/crates/icu_locid_transform/1.5.0/download",
    "status": "approved",
    "scans": [
        {
            "date": "June 15, 2024 at 2:40:57 a.m. GMT",
            "authority": "https://gitlab.eclipse.org/eclipsefdn/emo-team/iplab/-/issues/15422",
            "scancode-version": "31.2.1",
            "licenses-discovered": [
                "LicenseRef-scancode-unknown-spdx"
            ],
            "copyrights": [
                "(c) 1995-2016 International Business Machines Corporation and others",
                "Copyright (c) 2020-2024 Unicode, Inc."
            ],
            "file-count": 25,
            "sha256": "01d11ac35de8e40fdeda00d9e1e9d92525f3f9d887cdd7aa81d727596788b54e",
            "source": "https://crates.io/api/v1/crates/icu_locid_transform/1.5.0/download",
            "status": "restricted"
        }
    ]
}