{
    "id": "npm/npmjs/-/globals/15.4.0",
    "license": "MIT",
    "authority": "https://gitlab.eclipse.org/eclipsefdn/emo-team/iplab/-/issues/15291",
    "source": "https://github.com/sindresorhus/globals/archive/refs/tags/v15.4.0.zip",
    "status": "approved",
    "scans": [
        {
            "date": "June 14, 2024 at 5:04:57 p.m. GMT",
            "authority": "https://gitlab.eclipse.org/eclipsefdn/emo-team/iplab/-/issues/15291",
            "scancode-version": "31.2.1",
            "licenses-discovered": [
                "MIT"
            ],
            "copyrights": [
                "Copyright (c) Sindre Sorhus <sindresorhus@gmail.com> (https://sindresorhus.com)"
            ],
            "file-count": 66,
            "sha256": "09614875a944017eb5fd18b3d3b7593e5a8e41f4d05df7c8bd254c73ee22a223",
            "source": "https://github.com/sindresorhus/globals/archive/refs/tags/v15.4.0.zip",
            "status": "approved"
        }
    ]
}