{
    "id": "maven/mavencentral/com.google.api/gax/2.57.0",
    "license": "BSD-3-Clause",
    "authority": "https://gitlab.eclipse.org/eclipsefdn/emo-team/iplab/-/issues/16958",
    "source": "https://repo1.maven.org/maven2/com/google/api/gax/2.57.0/gax-2.57.0-sources.jar",
    "status": "approved",
    "scans": [
        {
            "date": "October 30, 2024, 3:18:14 a.m. GMT",
            "authority": "https://gitlab.eclipse.org/eclipsefdn/emo-team/iplab/-/issues/16958",
            "scancode-version": "31.2.1",
            "licenses-discovered": [
                "BSD-3-Clause"
            ],
            "copyrights": [
                "Copyright 2016 Google LLC",
                "Copyright 2017 Google LLC",
                "Copyright 2018 Google LLC",
                "Copyright 2019 Google LLC",
                "Copyright 2020 Google LLC",
                "Copyright 2021 Google LLC",
                "Copyright 2022 Google LLC",
                "Copyright 2023 Google LLC",
                "Copyright 2024 Google LLC"
            ],
            "file-count": 232,
            "sha256": "8c8586cac9bbd39174d7ebc22f64c91bf8f9c20cda5260ea0fd9718598043887",
            "source": "https://repo1.maven.org/maven2/com/google/api/gax/2.57.0/gax-2.57.0-sources.jar",
            "status": "approved"
        }
    ]
}