{
    "id": "go/golang/github.com%2Fdocker/cli/v24.0.6",
    "license": "Apache-2.0 AND BSD-3-Clause AND MIT AND CC-BY-SA-4.0",
    "authority": "https://gitlab.eclipse.org/eclipsefdn/emo-team/iplab/-/issues/14630",
    "source": "https://github.com/docker/cli/archive/refs/tags/v24.0.6.zip",
    "status": "approved",
    "scans": [
        {
            "date": "May 7, 2024 at 10:22:27 a.m. GMT",
            "authority": "https://gitlab.eclipse.org/eclipsefdn/emo-team/iplab/-/issues/14630",
            "scancode-version": "31.2.1",
            "licenses-discovered": [
                "Apache-2.0",
                "BSD-3-Clause",
                "MIT",
                "GPL-1.0-or-later",
                "CC-BY-SA-4.0",
                "Apache-2.0 AND CC-BY-SA-4.0",
                "BSD-2-Clause",
                "Apache-2.0 AND BSD-3-Clause AND MIT",
                "LicenseRef-scancode-oasis-ipr-policy-2014",
                "Apache-2.0 AND BSD-3-Clause",
                "Apache-2.0 AND LicenseRef-scancode-free-unknown",
                "LicenseRef-scancode-unicode",
                "Apache-2.0 AND MIT"
            ],
            "copyrights": [
                "(c) ProgressPrinter ReadCloser",
                "(c) cc.fr",
                "Copyright (c) 2004, 2006 The Linux Foundation and its contributors",
                "Copyright (c) 2006 Kirill Simonov",
                "Copyright (c) 2009 The Go Authors",
                "Copyright (c) 2011 Keith Rarick",
                "Copyright (c) 2011 The Snappy-Go Authors",
                "Copyright (c) 2011, Open Knowledge Foundation Ltd.",
                "Copyright (c) 2012 Alex Ogier",
                "Copyright (c) 2012 Miki Tebeka <miki.tebeka@gmail.com>",
                "Copyright (c) 2012 The Go Authors",
                "Copyright (c) 2012-2018 The Gorilla Authors",
                "Copyright (c) 2013 Blake Mizerany",
                "Copyright (c) 2013 Dario Castane",
                "Copyright (c) 2013 Miek Gieben",
                "Copyright (c) 2013 Mitchell Hashimoto",
                "Copyright (c) 2013, Felix Riedel",
                "Copyright (c) 2013, Patrick Mezard",
                "Copyright (c) 2013, The GoGo Authors",
                "Copyright (c) 2013, Yann Collet",
                "Copyright (c) 2014 Simon Eskildsen",
                "Copyright (c) 2014 youmark",
                "Copyright (c) 2014-2015 Prime Directive, Inc.",
                "Copyright (c) 2014-2018 The Docker & Go Authors",
                "Copyright (c) 2015 Bjorn Rabenstein",
                "Copyright (c) 2015 Docker, Inc.",
                "Copyright (c) 2015 Frits van Bommel",
                "Copyright (c) 2015 Klaus Post",
                "Copyright (c) 2015 Microsoft",
                "Copyright (c) 2015 Microsoft Corporation",
                "Copyright (c) 2015, Dave Cheney <dave@cheney.net>",
                "Copyright (c) 2015, Docker Inc.",
                "Copyright (c) 2015-$ date + Y Docker",
                "Copyright (c) 2016 Caleb Spare",
                "Copyright (c) 2016 David Calavera",
                "Copyright (c) 2016 Docker, Inc.",
                "Copyright (c) 2016 Taihei Morikuni",
                "Copyright (c) 2016 Yasuhiro Matsumoto",
                "Copyright (c) 2016, The GoGo Authors",
                "Copyright (c) 2017 The Go Authors",
                "Copyright (c) 2018 The Go Authors",
                "Copyright (c) 2018, The GoGo Authors",
                "Copyright (c) 2019 Klaus Post",
                "Copyright (c) 2019 Oliver Kuederle",
                "Copyright (c) 2019, 2020 OCI Contributors",
                "Copyright (c) 2020 Tonis Tiigi",
                "Copyright (c) OASIS Open 2016",
                "Copyright 2008 Google Inc.",
                "Copyright 2009 The Go Authors",
                "Copyright 2009,2010 The Go Authors",
                "Copyright 2010 The Go Authors",
                "Copyright 2011 The Go Authors",
                "Copyright 2011 The Snappy-Go Authors",
                "Copyright 2012 Google Inc.",
                "Copyright 2012 The Go Authors",
                "Copyright 2012 The Gorilla Authors",
                "Copyright 2013 Dario Castane",
                "Copyright 2013 Matt T. Proud",
                "Copyright 2013 Miek Gieben",
                "Copyright 2013 MongoDB, Inc.",
                "Copyright 2013 The Go Authors",
                "Copyright 2013 The Prometheus Authors",
                "Copyright 2013-2016 Docker, Inc.",
                "Copyright 2013-2017 Docker, Inc.",
                "Copyright 2013-2018 Docker, Inc.",
                "Copyright 2013-2023 The Cobra Authors",
                "Copyright 2014 Dario Castane",
                "Copyright 2014 Docker, Inc.",
                "Copyright 2014 Prometheus Team",
                "Copyright 2014 The Go Authors",
                "Copyright 2014 The Prometheus Authors",
                "Copyright 2014 gRPC",
                "Copyright 2014-2018 Docker, Inc.",
                "Copyright 2015 Docker, Inc.",
                "Copyright 2015 The Go Authors",
                "Copyright 2015 The Prometheus Authors",
                "Copyright 2015 gRPC",
                "Copyright 2015 xeipuuv",
                "Copyright 2015 xeipuuv https://github.com/xeipuuv",
                "Copyright 2016 Docker, Inc.",
                "Copyright 2016 The Go Authors",
                "Copyright 2016 The Linux Foundation",
                "Copyright 2016 The Prometheus Authors",
                "Copyright 2016 The Snappy-Go Authors",
                "Copyright 2016 The filepathx",
                "Copyright 2016 gRPC",
                "Copyright 2016-2017 The New York Times Company",
                "Copyright 2016-2018 Docker Inc.",
                "Copyright 2016-2022 The Linux Foundation",
                "Copyright 2017 Docker, Inc.",
                "Copyright 2017 Prometheus Team",
                "Copyright 2017 Roger Luethi",
                "Copyright 2017 The Go Authors",
                "Copyright 2017 The Prometheus Authors",
                "Copyright 2017 gRPC",
                "Copyright 2017, The Go Authors",
                "Copyright 2018 Klaus Post",
                "Copyright 2018 The Go Authors",
                "Copyright 2018 The Prometheus Authors",
                "Copyright 2018 The gRPC",
                "Copyright 2018 gRPC",
                "Copyright 2018 gotest.tools",
                "Copyright 2018 johandorland https://github.com/johandorland",
                "Copyright 2018, The Go Authors",
                "Copyright 2019 The Go Authors",
                "Copyright 2019 The Prometheus Authors",
                "Copyright 2019 The etcd",
                "Copyright 2019 gRPC",
                "Copyright 2019, 2020 OCI Contributors",
                "Copyright 2019, The Go Authors",
                "Copyright 2020 Google LLC",
                "Copyright 2020 The Go Authors",
                "Copyright 2020 The Prometheus Authors",
                "Copyright 2020 gRPC",
                "Copyright 2020+ Klaus Post",
                "Copyright 2020, The Go Authors",
                "Copyright 2021 The Go Authors",
                "Copyright 2021 The Prometheus Authors",
                "Copyright 2021 gRPC",
                "Copyright 2022 Alan Shreve",
                "Copyright 2022 The Go Authors",
                "Copyright 2022 The Prometheus Authors",
                "Copyright 2022 gRPC",
                "copyright 2015 Docker, inc."
            ],
            "file-count": 3321,
            "sha256": "a4614ff3d6bf1c1ca16c2066751415b0de6a39a4e26eafd5fec2bb86cae69654",
            "source": "https://github.com/docker/cli/archive/refs/tags/v24.0.6.zip",
            "status": "restricted"
        }
    ]
}