{
    "id": "maven/mavencentral/com.azure.resourcemanager/azure-resourcemanager-privatedns/2.28.0",
    "license": "MIT",
    "authority": "https://gitlab.eclipse.org/eclipsefdn/emo-team/iplab/-/issues/9680",
    "source": "https://repo.maven.apache.org/maven2/com/azure/resourcemanager/azure-resourcemanager-privatedns/2.28.0/azure-resourcemanager-privatedns-2.28.0-sources.jar",
    "status": "approved",
    "scans": [
        {
            "date": "July 20, 2023 at 11:14:43 a.m. GMT",
            "authority": "https://gitlab.eclipse.org/eclipsefdn/emo-team/iplab/-/issues/9680",
            "scancode-version": "31.2.1",
            "licenses-discovered": [
                "MIT"
            ],
            "copyrights": [
                "(c) 2008 VeriSign, Inc.",
                "Copyright (c) Microsoft Corporation"
            ],
            "file-count": 83,
            "sha256": "4c2ea3d973fb4e33552830f4eedcd0db312884e5247d0a691bd172b708a7bd78",
            "source": "https://repo.maven.apache.org/maven2/com/azure/resourcemanager/azure-resourcemanager-privatedns/2.28.0/azure-resourcemanager-privatedns-2.28.0-sources.jar",
            "status": "approved"
        }
    ]
}