{
    "id": "maven/mavencentral/ch.digitalfondue.jfiveparse/jfiveparse/1.1.1",
    "license": "Apache-2.0",
    "authority": "https://gitlab.eclipse.org/eclipsefdn/emo-team/iplab/-/issues/15452",
    "source": "https://repo1.maven.org/maven2/ch/digitalfondue/jfiveparse/jfiveparse/1.1.1/jfiveparse-1.1.1-sources.jar",
    "status": "approved",
    "scans": [
        {
            "date": "June 17, 2024 at 6:08:35 a.m. GMT",
            "authority": "https://gitlab.eclipse.org/eclipsefdn/emo-team/iplab/-/issues/15452",
            "scancode-version": "31.2.1",
            "licenses-discovered": [
                "Apache-2.0"
            ],
            "copyrights": [
                "Copyright (c) 2015 digitalfondue (info@digitalfondue.ch)"
            ],
            "file-count": 50,
            "sha256": "f14551732f22a56864946bba10876db963a1dcbb5c28f1e98dd26a7c287ec098",
            "source": "https://repo1.maven.org/maven2/ch/digitalfondue/jfiveparse/jfiveparse/1.1.1/jfiveparse-1.1.1-sources.jar",
            "status": "approved"
        }
    ]
}