{
    "id": "npm/npmjs/-/ip/2.0.1",
    "license": "MIT",
    "authority": "https://gitlab.eclipse.org/eclipsefdn/emo-team/iplab/-/issues/13289",
    "source": "https://registry.yarnpkg.com/ip/-/ip-2.0.1.tgz",
    "status": "approved",
    "scans": [
        {
            "date": "February 19, 2024 at 8:00:23 a.m. GMT",
            "authority": "https://gitlab.eclipse.org/eclipsefdn/emo-team/iplab/-/issues/13289",
            "scancode-version": "31.2.1",
            "licenses-discovered": [
                "MIT"
            ],
            "copyrights": [
                "Copyright Fedor Indutny, 2012"
            ],
            "file-count": 3,
            "sha256": "1d125fef28131e1b20420637007785feaba79b6c84a0ac1cef2eb8cfb1cd43c9",
            "source": "https://registry.yarnpkg.com/ip/-/ip-2.0.1.tgz",
            "status": "approved"
        }
    ]
}