{
    "id": "maven/mavencentral/org.geotools.ogc/net.opengis.fes/32.0",
    "license": "LGPL-2.1-only",
    "authority": "https://gitlab.eclipse.org/eclipsefdn/emo-team/iplab/-/issues/16227",
    "source": "https://repo.osgeo.org/repository/geotools-releases/org/geotools/ogc/net.opengis.fes/32.0/net.opengis.fes-32.0-sources.jar",
    "status": "approved",
    "scans": [
        {
            "date": "September 19, 2024, 3:21:01 p.m. GMT",
            "authority": "https://gitlab.eclipse.org/eclipsefdn/emo-team/iplab/-/issues/16227",
            "scancode-version": "31.2.1",
            "licenses-discovered": [
            ],
            "copyrights": [
                "Copyright (c) 2001 OGC",
                "Copyright (c) 2006,2010 Open Geospatial Consortium, Inc.",
                "Copyright (c) 2010 Open Geospatial Consortium, Inc."
            ],
            "file-count": 130,
            "sha256": "1a4ef214984bd5c257a2dcac16a1436ed7d35b15829f7b2dbc4f5a29148c907b",
            "source": "https://repo.osgeo.org/repository/geotools-releases/org/geotools/ogc/net.opengis.fes/32.0/net.opengis.fes-32.0-sources.jar",
            "status": "restricted"
        }
    ]
}