{
    "id": "npm/npmjs/-/zod/3.23.8",
    "license": "MIT",
    "authority": "https://gitlab.eclipse.org/eclipsefdn/emo-team/iplab/-/issues/15943",
    "source": "https://github.com/colinhacks/zod/archive/refs/tags/v3.23.8.zip",
    "status": "approved",
    "scans": [
        {
            "date": "August 14, 2024 at 5:53:02 p.m. GMT",
            "authority": "https://gitlab.eclipse.org/eclipsefdn/emo-team/iplab/-/issues/15943",
            "scancode-version": "31.2.1",
            "licenses-discovered": [
                "MIT"
            ],
            "copyrights": [
                "Copyright (c) 2020 Colin McDonnell"
            ],
            "file-count": 223,
            "sha256": "bb3d75c0666edde06cce582fb7d9cd619d85669484eb8026b1e140ca471470ac",
            "source": "https://github.com/colinhacks/zod/archive/refs/tags/v3.23.8.zip",
            "status": "approved"
        }
    ]
}