{
    "id": "go/golang/github.com/vmihailenco%2Fmsgpack%2Fv5/v5.4.1",
    "license": "BSD-2-Clause",
    "authority": "https://gitlab.eclipse.org/eclipsefdn/emo-team/iplab/-/issues/14451",
    "source": "https://proxy.golang.org/github.com/vmihailenco%2Fmsgpack%2Fv5/@v/v5.4.1.zip",
    "status": "approved",
    "scans": [
        {
            "date": "April 19, 2024 at 3:33:47 a.m. GMT",
            "authority": "https://gitlab.eclipse.org/eclipsefdn/emo-team/iplab/-/issues/14451",
            "scancode-version": "31.2.1",
            "licenses-discovered": [
                "BSD-2-Clause"
            ],
            "copyrights": [
                "Copyright (c) 2013 The"
            ],
            "file-count": 45,
            "sha256": "f966b8091c59efce1b44e265097f239be5d4174a827be0a5debebae09517d2b8",
            "source": "https://proxy.golang.org/github.com/vmihailenco%2Fmsgpack%2Fv5/@v/v5.4.1.zip",
            "status": "approved"
        }
    ]
}