{
    "id": "maven/mavencentral/io.github.openfeign/feign-hc5/13.1",
    "license": "Apache-2.0",
    "authority": "https://gitlab.eclipse.org/eclipsefdn/emo-team/iplab/-/issues/13751",
    "source": "https://repo1.maven.org/maven2/io/github/openfeign/feign-hc5/13.1/feign-hc5-13.1-sources.jar",
    "status": "approved",
    "scans": [
        {
            "date": "March 15, 2024 at 1:51:34 p.m. GMT",
            "authority": "https://gitlab.eclipse.org/eclipsefdn/emo-team/iplab/-/issues/13751",
            "scancode-version": "31.2.1",
            "licenses-discovered": [
                "Apache-2.0"
            ],
            "copyrights": [
                "Copyright 2012-2023 The Feign Authors"
            ],
            "file-count": 5,
            "sha256": "65604fc1ab5c8cb2e8a16850932cb2fafff4241cb35ae12f9e162104fcd75f06",
            "source": "https://repo1.maven.org/maven2/io/github/openfeign/feign-hc5/13.1/feign-hc5-13.1-sources.jar",
            "status": "approved"
        }
    ]
}