{
    "license": "Apache-2.0 AND CC-BY-4.0 AND MIT",
    "file-count": 175,
    "authority": "https://gitlab.eclipse.org/eclipsefdn/emo-team/iplab/-/issues/1524",
    "scancode-version": "30.1.0",
    "licenses-discovered": [
        "Apache-2.0",
        "CC-BY-4.0",
        "LicenseRef-scancode-khronos",
        "LicenseRef-scancode-unicode",
        "MIT"
    ],
    "id": "npm/npmjs/-/typescript/4.4.4",
    "source": "https://registry.npmjs.org/typescript/-/typescript-4.4.4.tgz",
    "status": "approved"
}
