{
    "id": "npm/npmjs/-/hosted-git-info/5.2.1",
    "license": "ISC",
    "licenses-discovered": [
        "ISC"
    ],
    "copyrights": [
        "Copyright (c) 2015, Rebecca Turner"
    ],
    "file-count": 7,
    "scancode-version": "31.2.1",
    "authority": "https://gitlab.eclipse.org/eclipsefdn/emo-team/iplab/-/issues/4602",
    "source": "https://registry.npmjs.org/hosted-git-info/-/hosted-git-info-5.2.1.tgz",
    "status": "approved"
}