{
    "id": "project/iot.tocandira/eclipse-tocandira/Tocandira-front/40c84ca560f3462be39ea622c80502de1a861ba0",
    "license": "EPL-2.0",
    "authority": "https://gitlab.eclipse.org/eclipsefdn/emo-team/iplab/-/issues/10518",
    "source": "https://github.com/eclipse-tocandira/Tocandira-front/archive/40c84ca560f3462be39ea622c80502de1a861ba0.zip",
    "status": "approved",
    "scans": [
        {
            "date": "September 14, 2023 at 11:44:08 a.m. GMT",
            "authority": "https://gitlab.eclipse.org/eclipsefdn/emo-team/iplab/-/issues/10518",
            "scancode-version": "31.2.1",
            "licenses-discovered": [
                "EPL-2.0"
            ],
            "copyrights": [
                "Copyright (c) 2017 Aimirim STI.",
                "Copyright (c) 2017 Aimirim STI. Dependencies"
            ],
            "file-count": 66,
            "sha256": "d8bec32e3a87e7d3dbd0b0813a08d874c82c636ef4c8311a459936bd00259f01",
            "source": "https://github.com/eclipse-tocandira/Tocandira-front/archive/40c84ca560f3462be39ea622c80502de1a861ba0.zip",
            "status": "restricted"
        }
    ]
}
