{
    "id": "npm/npmjs/@types/semver/7.3.13",
    "license": "MIT",
    "licenses-discovered": [
        "MIT"
    ],
    "copyrights": [
        "Copyright (c) Microsoft Corporation"
    ],
    "file-count": 44,
    "scancode-version": "31.2.1",
    "authority": "https://gitlab.eclipse.org/eclipsefdn/emo-team/iplab/-/issues/4668",
    "source": "https://registry.npmjs.org/@types/semver/-/semver-7.3.13.tgz",
    "status": "approved"
}