{
    "id": "npm/npmjs/-/terser/5.20.0",
    "license": "BSD-2-Clause AND (BSD-2-Clause AND BSD-3-Clause) AND ISC",
    "authority": "https://gitlab.eclipse.org/eclipsefdn/emo-team/iplab/-/issues/10829",
    "source": "https://github.com/terser/terser/archive/refs/tags/v5.20.0.zip",
    "status": "approved",
    "scans": [
        {
            "date": "October 2, 2023 at 8:40:48 p.m. GMT",
            "authority": "https://gitlab.eclipse.org/eclipsefdn/emo-team/iplab/-/issues/10829",
            "scancode-version": "31.2.1",
            "licenses-discovered": [
                "BSD-2-Clause",
                "BSD-2-Clause AND BSD-3-Clause",
                "ISC"
            ],
            "copyrights": [
                "Copyright 2012 (c) Mihai Bazon <mihai.bazon@gmail.com>",
                "Copyright 2012-2018 (c) Mihai Bazon <mihai.bazon@gmail.com>"
            ],
            "file-count": 303,
            "sha256": "0b28bb00a1185bdd25ba7d2c36704850debe3b00e130e70bbbd2979e8159c7fd",
            "source": "https://github.com/terser/terser/archive/refs/tags/v5.20.0.zip",
            "status": "approved"
        }
    ]
}