{
    "id": "maven/mavencentral/org.apache.activemq/artemis-plugin/2.31.0",
    "license": "Apache-2.0",
    "authority": "https://gitlab.eclipse.org/eclipsefdn/emo-team/iplab/-/issues/10613",
    "source": "https://repo.maven.apache.org/maven2/org/apache/activemq/artemis-plugin/2.31.0/artemis-plugin-2.31.0-sources.jar",
    "status": "approved",
    "scans": [
        {
            "date": "September 22, 2023 at 9:18:23 a.m. GMT",
            "authority": "https://gitlab.eclipse.org/eclipsefdn/emo-team/iplab/-/issues/10613",
            "scancode-version": "31.2.1",
            "licenses-discovered": [
                "Apache-2.0"
            ],
            "copyrights": [
            ],
            "file-count": 6,
            "sha256": "4bc7e85a8b577803bf4ed2516cf56e350f8250fc2e8c2c933b50bae9569ad4f0",
            "source": "https://repo.maven.apache.org/maven2/org/apache/activemq/artemis-plugin/2.31.0/artemis-plugin-2.31.0-sources.jar",
            "status": "approved"
        }
    ]
}