{
    "id": "go/golang/github.com%2Faws%2Faws-sdk-go-v2%2Finternal/ini/v1.1.0",
    "license": "Apache-2.0",
    "authority": "https://gitlab.eclipse.org/eclipsefdn/emo-team/iplab/-/issues/12339",
    "source": "https://proxy.golang.org/github.com%2Faws%2Faws-sdk-go-v2%2Finternal/ini/@v/v1.1.0.zip",
    "status": "approved",
    "scans": [
        {
            "date": "December 20, 2023 at 6:25:15 p.m. GMT",
            "authority": "https://gitlab.eclipse.org/eclipsefdn/emo-team/iplab/-/issues/12339",
            "scancode-version": "31.2.1",
            "licenses-discovered": [
                "Apache-2.0"
            ],
            "copyrights": [
            ],
            "file-count": 88,
            "sha256": "46afb308039f96a9b7a6d99d2162e9bd15ae6060bda2ae500857736a6d95f7db",
            "source": "https://proxy.golang.org/github.com%2Faws%2Faws-sdk-go-v2%2Finternal/ini/@v/v1.1.0.zip",
            "status": "approved"
        }
    ]
}