{
    "id": "git/github/kataras/sitemap/v0.0.5",
    "license": "MIT",
    "licenses-discovered": [
        "MIT"
    ],
    "copyrights": [
        "Copyright (c) Gerasimos Maropoulos"
    ],
    "file-count": 16,
    "scancode-version": "30.1.0",
    "authority": "https://gitlab.eclipse.org/eclipsefdn/emo-team/iplab/-/issues/3612",
    "source": "https://github.com/kataras/sitemap/archive/refs/tags/v0.0.5.zip",
    "status": "approved"
}