{
    "id": "npm/npmjs/@csstools/postcss-light-dark-function/2.0.7",
    "license": "MIT-0",
    "authority": "https://gitlab.eclipse.org/eclipsefdn/emo-team/iplab/-/issues/19019",
    "source": "https://registry.yarnpkg.com/@csstools/postcss-light-dark-function/-/postcss-light-dark-function-2.0.7.tgz",
    "status": "approved",
    "scans": [
        {
            "date": "January 20, 2025 at 12:08:30 a.m. GMT",
            "authority": "https://gitlab.eclipse.org/eclipsefdn/emo-team/iplab/-/issues/19019",
            "scancode-version": "31.2.1",
            "licenses-discovered": [
                "MIT-0"
            ],
            "copyrights": [
                "Copyright (c) CSSTools Contributors"
            ],
            "file-count": 6,
            "sha256": "e8e912107b4fd8e50b72ee792eff67a9c1c43aba9d8b977c89053427f17e71f7",
            "source": "https://registry.yarnpkg.com/@csstools/postcss-light-dark-function/-/postcss-light-dark-function-2.0.7.tgz",
            "status": "approved"
        }
    ]
}