{
    "id": "npm/npmjs/@npmcli/promise-spawn/6.0.2",
    "license": "ISC",
    "authority": "https://gitlab.eclipse.org/eclipsefdn/emo-team/iplab/-/issues/5774",
    "source": "https://registry.npmjs.org/@npmcli/promise-spawn/-/promise-spawn-6.0.2.tgz",
    "status": "approved",
    "scans": [
        {
            "date": "December 14, 2022 at 12:55:03 a.m. GMT",
            "authority": "https://gitlab.eclipse.org/eclipsefdn/emo-team/iplab/-/issues/5774",
            "scancode-version": "31.2.1",
            "licenses-discovered": [
                "ISC"
            ],
            "copyrights": [
                "Copyright (c) npm, Inc."
            ],
            "file-count": 5,
            "sha256": "755918336eacd5cf5c86bf210f8f88fd2e0f27f393b5880ad716e02e9727a9a8",
            "source": "https://registry.npmjs.org/@npmcli/promise-spawn/-/promise-spawn-6.0.2.tgz",
            "status": "approved"
        }
    ]
}