{
    "id": "crate/cratesio/-/ron/0.8.1",
    "license": "Apache-2.0 AND MIT AND Apache-2.0 AND MIT",
    "authority": "https://gitlab.eclipse.org/eclipsefdn/emo-team/iplab/-/issues/14605",
    "source": "https://crates.io/api/v1/crates/ron/0.8.1/download",
    "status": "approved",
    "scans": [
        {
            "date": "May 1, 2024 at 4:49:35 p.m. GMT",
            "authority": "https://gitlab.eclipse.org/eclipsefdn/emo-team/iplab/-/issues/14605",
            "scancode-version": "31.2.1",
            "licenses-discovered": [
                "Apache-2.0 AND MIT",
                "Apache-2.0",
                "MIT"
            ],
            "copyrights": [
                "Copyright (c) 2017 RON"
            ],
            "file-count": 78,
            "sha256": "b91f7eff05f748767f183df4320a63d6936e9c6107d97c9e6bdd9784f4289c94",
            "source": "https://crates.io/api/v1/crates/ron/0.8.1/download",
            "status": "approved"
        }
    ]
}