{
    "id": "pypi/pypi/-/jq/1.6.0",
    "license": "BSD-2-Clause AND MIT AND CC-BY-3.0 AND LicenseRef-MIT-style AND ICU AND (FSFUL AND (GPL-2.0-or-later WITH Libtool-exception)) AND (FSFULLR AND FSFUL AND (GPL-2.0-or-later WITH Libtool-exception)) AND (GPL-3.0-or-later WITH Bison-exception-2.2) AND BSD-2-Clause-NetBSD AND FSFAP AND FSFULLR AND (GPL-3.0-or-later WITH Autoconf-exception) AND (GPL-3.0-or-later WITH Libtool-exception) AND (X11 AND LicenseRef-Public-domain) AND LicenseRef-Public-domain",
    "authority": "https://gitlab.eclipse.org/eclipsefdn/emo-team/iplab/-/issues/13079",
    "source": "https://files.pythonhosted.org/packages/22/50/ab53cc23eddad14a28920e95523b9f39849d9e3139836ec8fcbb7e8e3517/jq-1.6.0.tar.gz",
    "status": "approved",
    "scans": [
        {
            "date": "February 1, 2024 at 8:57:35 p.m. GMT",
            "authority": "https://gitlab.eclipse.org/eclipsefdn/emo-team/iplab/-/issues/13079",
            "scancode-version": "31.2.1",
            "licenses-discovered": [
                "BSD-2-Clause",
                "BSD-2-Clause AND BSD-3-Clause",
                "FSFULLR AND LicenseRef-scancode-fsf-unlimited-no-warranty",
                "FSFUL AND GPL-2.0-or-later AND Libtool-exception",
                "BSD-2-Clause AND CC-BY-3.0 AND ICU AND LicenseRef-scancode-x11-lucent AND MIT",
                "BSD-3-Clause",
                "LicenseRef-scancode-fsf-unlimited-no-warranty",
                "MIT",
                "GPL-2.0-or-later AND LicenseRef-scancode-autoconf-simple-exception-2.0",
                "GPL-3.0-or-later AND LicenseRef-scancode-autoconf-simple-exception AND LicenseRef-scancode-free-unknown",
                "X11",
                "GPL-2.0-or-later AND GPL-3.0-or-later AND Libtool-exception",
                "FSFUL AND FSFULLR AND GPL-2.0-or-later AND Libtool-exception",
                "FSFULLR",
                "FSFAP",
                "Autoconf-exception-2.0 AND GPL-3.0-or-later",
                "LicenseRef-scancode-x11-lucent",
                "Bison-exception-2.2 AND GPL-3.0-or-later",
                "ICU"
            ],
            "copyrights": [
                "(c) K.Kosako, Zui Zhong Geng Xin",
                "(c) iF (c) Y",
                "Copyright (c) 1984, 1989-1990, 2000-2015, 2018-2021 Free Software Foundation, Inc.",
                "Copyright (c) 1991, 1996 by Lucent Technologies",
                "Copyright (c) 1991, 2000, 2001 by Lucent Technologies",
                "Copyright (c) 1992-1996, 1998-2012 Free Software Foundation, Inc.",
                "Copyright (c) 1992-1996, 1998-2017, 2020-2021 Free Software Foundation, Inc.",
                "Copyright (c) 1994 X Consortium",
                "Copyright (c) 1994-1996, 1999-2002, 2004-2016 Free Software Foundation, Inc.",
                "Copyright (c) 1994-2020 Free Software Foundation, Inc.",
                "Copyright (c) 1994-2021 Free Software Foundation, Inc.",
                "Copyright (c) 1995-2005 International Business Machines Corporation and others",
                "Copyright (c) 1996-2001, 2003-2015 Free Software Foundation, Inc.",
                "Copyright (c) 1996-2015 Free Software Foundation, Inc.",
                "Copyright (c) 1996-2020 Free Software Foundation, Inc.",
                "Copyright (c) 1996-2021 Free Software Foundation, Inc.",
                "Copyright (c) 1997, 1998, 2005, 2008 The NetBSD Foundation, Inc.",
                "Copyright (c) 1997-2020 Free Software Foundation, Inc.",
                "Copyright (c) 1997-2021 Free Software Foundation, Inc.",
                "Copyright (c) 1999-2020 Free Software Foundation, Inc.",
                "Copyright (c) 1999-2021 Free Software Foundation, Inc.",
                "Copyright (c) 2001-2020 Free Software Foundation, Inc.",
                "Copyright (c) 2001-2021 Free Software Foundation, Inc.",
                "Copyright (c) 2002-2018 K.Kosako",
                "Copyright (c) 2002-2019 K.Kosako",
                "Copyright (c) 2002-2020 Free Software Foundation, Inc.",
                "Copyright (c) 2002-2020 K.Kosako",
                "Copyright (c) 2002-2021 Free Software Foundation, Inc.",
                "Copyright (c) 2002-2021 K.Kosako",
                "Copyright (c) 2002-2021 K.Kosako <kkosako0@gmail.com>",
                "Copyright (c) 2002-2022 K.Kosako",
                "Copyright (c) 2002-2023 K.Kosako",
                "Copyright (c) 2003-2020 Free Software Foundation, Inc.",
                "Copyright (c) 2003-2021 Free Software Foundation, Inc.",
                "Copyright (c) 2004, 2011-2015 Free Software Foundation, Inc.",
                "Copyright (c) 2004-2005, 2007, 2009, 2011-2015 Free Software Foundation, Inc.",
                "Copyright (c) 2004-2005, 2007-2008, 2011-2015 Free Software Foundation, Inc.",
                "Copyright (c) 2004-2005, 2007-2009, 2011-2015 Free Software Foundation, Inc.",
                "Copyright (c) 2004-2015 Free Software Foundation, Inc.",
                "Copyright (c) 2004-2020 Free Software Foundation, Inc.",
                "Copyright (c) 2004-2021 Free Software Foundation, Inc.",
                "Copyright (c) 2005-2020 KUBO Takehiro K.Kosako",
                "Copyright (c) 2005-2023 KUBO Takehiro K.Kosako",
                "Copyright (c) 2006 K.Kosako",
                "Copyright (c) 2006-2020 Byte K.Kosako",
                "Copyright (c) 2006-2020 Free Software Foundation, Inc.",
                "Copyright (c) 2006-2021 Free Software Foundation, Inc.",
                "Copyright (c) 2008 Steven G. Johnson <stevenj@alum.mit.edu>",
                "Copyright (c) 2008 Tim Toolan <toolan@ele.uri.edu>",
                "Copyright (c) 2009 Francesco Salvestrini <salvestrini@users.sourceforge.net>",
                "Copyright (c) 2009-2020 Free Software Foundation, Inc.",
                "Copyright (c) 2009-2021 Free Software Foundation, Inc.",
                "Copyright (c) 2010-2015 Free Software Foundation, Inc.",
                "Copyright (c) 2010-2021 Free Software Foundation, Inc.",
                "Copyright (c) 2011 Daniel Richard G. <skunk@iSKUNK.ORG>",
                "Copyright (c) 2011 Free Software Foundation, Inc.",
                "Copyright (c) 2011-2020 Free Software Foundation, Inc.",
                "Copyright (c) 2011-2021 Free Software Foundation, Inc.",
                "Copyright (c) 2012 Free Software Foundation, Inc.",
                "Copyright (c) 2013, Michael Williamson",
                "Copyright (c) 2014 Free Software Foundation, Inc.",
                "Copyright (c) 2016-2019 K.Kosako",
                "Copyright (c) 2016-2021 K.Kosako",
                "Copyright (c) 2016-2022 K.Kosako",
                "Copyright (c) 2017-2021 K.Kosako",
                "Copyright (c) 2017-2022 K.Kosako",
                "Copyright (c) 2019 K.Kosako",
                "Copyright (c) 2019 Marc Stevens <marc.stevens@cwi.nl>",
                "Copyright (c) 2019-2021 K.Kosako",
                "Copyright (c) 2019-2022 K.Kosako",
                "Copyright (c) 2020-2021 K.Kosako",
                "Copyright (c) 2021 Free Software Foundation, Inc.",
                "Copyright (c) IBM Corporation, 2000, 2009",
                "Copyright (c) IBM Corporation, 2000, 2010",
                "Copyright 1992-2020 Free Software Foundation, Inc.",
                "Copyright 1992-2022 Free Software Foundation, Inc.",
                "Oniguruma (c) K.Kosako",
                "Portions Copyright (c) 2016 Kungliga Tekniska Hogskolan (Royal Institute of Technology, Stockholm, Sweden)",
                "copyright (c) 2012 Stephen Dolan"
            ],
            "file-count": 477,
            "sha256": "c7711f0c913a826a00990736efa6ffc285f8ef433414516bb14b7df971d6c1ea",
            "source": "https://files.pythonhosted.org/packages/22/50/ab53cc23eddad14a28920e95523b9f39849d9e3139836ec8fcbb7e8e3517/jq-1.6.0.tar.gz",
            "status": "restricted"
        }
    ]
}
