{
    "id": "npm/npmjs/@nrwl/nx-linux-arm64-musl/15.9.3",
    "license": "MIT",
    "authority": "https://gitlab.eclipse.org/eclipsefdn/emo-team/iplab/-/issues/8212",
    "source": "https://registry.npmjs.org/@nrwl/nx-linux-arm64-musl/-/nx-linux-arm64-musl-15.9.3.tgz",
    "status": "approved",
    "scans": [
        {
            "date": "May 5, 2023 at 7:22:20 a.m. GMT",
            "authority": "https://gitlab.eclipse.org/eclipsefdn/emo-team/iplab/-/issues/8212",
            "scancode-version": "31.2.1",
            "licenses-discovered": [
                "MIT"
            ],
            "copyrights": [
                "Copyright (c) 2017-2023 Narwhal Technologies Inc."
            ],
            "file-count": 3,
            "sha256": "41298af370f29b1c278477d75c1d1a5a2115757bb00b489e502a533695a3c845",
            "source": "https://registry.npmjs.org/@nrwl/nx-linux-arm64-musl/-/nx-linux-arm64-musl-15.9.3.tgz",
            "status": "approved"
        }
    ]
}