{
    "license": "Apache-2.0 AND BSD-3-Clause AND CPL-1.0",
    "file-count": 9,
    "authority": "https://gitlab.eclipse.org/eclipsefdn/emo-team/iplab/-/issues/1735",
    "scancode-version": "30.1.0",
    "licenses-discovered": [
        "Apache-2.0",
        "BSD-3-Clause",
        "CPL-1.0"
    ],
    "id": "maven/mavencentral/org.apache.maven.enforcer/enforcer-api/1.4.1",
    "source": "https://search.maven.org/remotecontent?filepath=org/apache/maven/enforcer/enforcer-api/1.4.1/enforcer-api-1.4.1-sources.jar",
    "status": "approved"
}