{
    "id": "npm/npmjs/-/gulp-replace/1.0.0",
    "license": "MIT",
    "licenses-discovered": [
        "MIT"
    ],
    "copyrights": [
        "Copyright (c) 2013 Larry Davis"
    ],
    "file-count": 4,
    "scancode-version": "31.2.1",
    "authority": "https://gitlab.eclipse.org/eclipsefdn/emo-team/iplab/-/issues/4553",
    "source": "https://registry.npmjs.org/gulp-replace/-/gulp-replace-1.0.0.tgz",
    "status": "approved"
}