{
    "id": "npm/npmjs/@storybook/addons/7.0.21",
    "license": "MIT",
    "authority": "https://gitlab.eclipse.org/eclipsefdn/emo-team/iplab/-/issues/9005",
    "source": "https://registry.npmjs.org/@storybook/addons/-/addons-7.0.21.tgz",
    "status": "approved",
    "scans": [
        {
            "date": "June 15, 2023 at 2:17:18 p.m. GMT",
            "authority": "https://gitlab.eclipse.org/eclipsefdn/emo-team/iplab/-/issues/9005",
            "scancode-version": "31.2.1",
            "licenses-discovered": [
                "MIT"
            ],
            "copyrights": [
            ],
            "file-count": 6,
            "sha256": "d468e2e93867c1be5b8fd8611014b0c54fee35f3095ced75f89203e8fdbecbac",
            "source": "https://registry.npmjs.org/@storybook/addons/-/addons-7.0.21.tgz",
            "status": "approved"
        }
    ]
}