{
    "id": "maven/mavencentral/org.apache.camel.springboot/camel-mock-starter/3.22.2",
    "license": "Apache-2.0",
    "authority": "https://gitlab.eclipse.org/eclipsefdn/emo-team/iplab/-/issues/14952",
    "source": "https://repo1.maven.org/maven2/org/apache/camel/springboot/camel-mock-starter/3.22.2/camel-mock-starter-3.22.2-sources.jar",
    "status": "approved",
    "scans": [
        {
            "date": "May 29, 2024 at 10:33:48 a.m. GMT",
            "authority": "https://gitlab.eclipse.org/eclipsefdn/emo-team/iplab/-/issues/14952",
            "scancode-version": "31.2.1",
            "licenses-discovered": [
                "Apache-2.0"
            ],
            "copyrights": [
            ],
            "file-count": 9,
            "sha256": "55e087460a6d0dafee197bf81694d42e639c353f1434aaa3118cff67354827c2",
            "source": "https://repo1.maven.org/maven2/org/apache/camel/springboot/camel-mock-starter/3.22.2/camel-mock-starter-3.22.2-sources.jar",
            "status": "approved"
        }
    ]
}