{
    "id": "p2/orbit/p2.eclipse-plugin/org.apache.qpid.qpid-jms-client/0.29.0",
    "license": "Apache-2.0",
    "licenses-discovered": [
        "Apache-2.0"
    ],
    "file-count": 266,
    "scancode-version": "30.1.0",
    "authority": "https://gitlab.eclipse.org/eclipsefdn/emo-team/iplab/-/issues/2216",
    "source": "https://search.maven.org/remotecontent?filepath=org/apache/qpid/qpid-jms-client/0.29.0/qpid-jms-client-0.29.0-sources.jar",
    "status": "approved"
}