{
    "id": "pypi/pypi/-/typecode/30.0.0",
    "license": "Apache-2.0 AND MIT AND (BSD-2-Clause-Views AND MIT) AND BSD-3-Clause AND BSD-2-Clause AND (Apache-2.0 AND MIT) AND Python-2.0 AND (Apache-2.0 AND BSD-2-Clause) AND (Apache-2.0 AND BSD-3-Clause) AND (BSD-3-Clause AND MIT) AND (Apache-2.0 AND BSD-2-Clause AND MIT) AND GPL-2.0-only AND NIST-PD AND GPL-2.0-or-later AND (BSD-3-Clause AND BSD-4-Clause AND LicenseRef-scancode-bsd-simplified-darwin) AND (GPL-2.0-only AND LicenseRef-scancode-intel-bsd) AND AGPL-3.0-only AND (LGPL-2.1-or-later AND MPL-1.1) AND BSD-4-Clause-UC AND (BSD-3-Clause AND GPL-2.0-only) AND (LGPL-2.0-or-later AND WxWindows-exception-3.1) AND LGPL-2.1-or-later AND LicenseRef-scancode-bsd-simplified-darwin AND Zlib AND (GPL-2.0-only AND Ruby) AND GPL-3.0-or-later AND GPL-3.0-only AND LicenseRef-scancode-other-permissive AND (GPL-2.0-or-later AND GPL-3.0-or-later AND LicenseRef-scancode-gpl-generic-additional-terms) AND GFDL-1.2-only AND GFDL-1.3-or-later AND (GPL-2.0-only AND Linux-syscall-note) AND X11",
    "authority": "https://gitlab.eclipse.org/eclipsefdn/emo-team/iplab/-/issues/4755",
    "source": "https://files.pythonhosted.org/packages/a0/ea/6e1432db5c62f903fb84bef8228d6b857f4e79463555d20bc3db3f11b0c9/typecode-30.0.0.tar.gz",
    "status": "restricted",
    "scans": [
        {
            "date": "November 10, 2022 at 8:54:35 p.m. GMT",
            "authority": "https://gitlab.eclipse.org/eclipsefdn/emo-team/iplab/-/issues/4755",
            "scancode-version": "31.2.1",
            "licenses-discovered": [
                "Apache-2.0",
                "MIT",
                "BSD-2-Clause-Views AND MIT",
                "BSD-3-Clause",
                "BSD-2-Clause",
                "Apache-2.0 AND MIT",
                "Python-2.0",
                "Apache-2.0 AND BSD-2-Clause",
                "Apache-2.0 AND BSD-3-Clause",
                "BSD-3-Clause AND MIT",
                "Apache-2.0 AND BSD-2-Clause AND MIT",
                "GPL-2.0-only",
                "NIST-PD",
                "GPL-2.0-or-later",
                "BSD-3-Clause AND BSD-4-Clause AND LicenseRef-scancode-bsd-simplified-darwin",
                "GPL-2.0-only AND LicenseRef-scancode-intel-bsd",
                "AGPL-3.0-only",
                "LGPL-2.1-or-later AND MPL-1.1",
                "BSD-4-Clause-UC",
                "BSD-3-Clause AND GPL-2.0-only",
                "LGPL-2.0-or-later AND WxWindows-exception-3.1",
                "LGPL-2.1-or-later",
                "LicenseRef-scancode-bsd-simplified-darwin",
                "Zlib",
                "GPL-2.0-only AND Ruby",
                "GPL-3.0-or-later",
                "GPL-3.0-only",
                "LicenseRef-scancode-other-permissive",
                "GPL-2.0-or-later AND GPL-3.0-or-later AND LicenseRef-scancode-gpl-generic-additional-terms",
                "GFDL-1.2-only",
                "GFDL-1.3-or-later",
                "GPL-2.0-only AND Linux-syscall-note",
                "X11"
            ],
            "copyrights": [
                "(c) 1985-1995 Ian F. Darwin",
                "(c) 1994-2008 Christos Zoulas <christos@zoulas.com>",
                "(c) 1995-2002 Jean-loup Gailly and Mark Adler",
                "(c) 1996 Ignatios Souvatzis",
                "(c) 1997-2001",
                "(c) 2003 Dave Jones",
                "(c) 2003-2006 Advanced Micro Devices, Inc.",
                "(c) 2004 Dominik Brodowski <linux@brodo.de>",
                "(c) 2004 Pavel Machek <pavel@suse.cz>",
                "(c) 2004 Ryan Norton <wxprojects@comcast.net>",
                "(c) 2006-2021 by Georg Brandl",
                "(c) 2007-2008 Daniel Baumann <daniel@debian.org>",
                "(c) 2008 Free Software Foundation, Inc.",
                "(c) 2008-2010 Josue Abarca <jmaslibre@debian.org.gt>",
                "(c) 2012",
                "(c) Copyright 2000-2003, by Simba Management Limited and Contributors",
                "(c) Copyright 2001-2003, by Simba Management Limited and Contributors",
                "(c) caLYedi*e (c) A I",
                "Copyright (c) 1989, 1991 Free Software Foundation, Inc.",
                "Copyright (c) 1991 - 1995, Stichting Mathematisch Centrum Amsterdam, The Netherlands",
                "Copyright (c) 1993 The Regents of the University of California",
                "Copyright (c) 1995, 1996, 1997, 1998, 1999, 2000, 2001, 2002, 2003, 2004 2005, 2006, 2007, 2008 Free Software Foundation, Inc.",
                "Copyright (c) 1995-2001 Corporation for National Research Initiatives",
                "Copyright (c) 1996 X Consortium",
                "Copyright (c) 1996, 1997, 1998, 1999, 2000, 2001, 2002, 2003, 2004, 2005, 2006, 2007, 2008 Free Software Foundation, Inc.",
                "Copyright (c) 1997, 1998, 1999, 2000, 2001, 2002, 2003, 2004, 2005, 2006, 2007, 2008 Free Software Foundation, Inc.",
                "Copyright (c) 1997-2005 Free Software Foundation, Inc.",
                "Copyright (c) 1998 Vadim Zeitlin <zeitlin@dptmaths.ens-cachan.fr>",
                "Copyright (c) 1999 ARM Limited",
                "Copyright (c) 1999,2000 Arm Limited",
                "Copyright (c) 2000 Deep Blue Solutions Ltd",
                "Copyright (c) 2000,2001,2002 Free Software Foundation, Inc.",
                "Copyright (c) 2000-2001 Deep Blue Solutions Ltd",
                "Copyright (c) 2001 Deep Blue Solutions Ltd.",
                "Copyright (c) 2001, 2002 Masayuki Ataka <ataka@milk.freemail.ne.jp>",
                "Copyright (c) 2001, 2002, 2003, 2004 Masayuki Ataka <ataka@milk.freemail.ne.jp>",
                "Copyright (c) 2001-2014 Adam Hupp",
                "Copyright (c) 2002, 2003, 2004 Masayuki Ataka <ataka@milk.freemail.ne.jp>",
                "Copyright (c) 2002, 2004 Masayuki Ataka <ataka@milk.freemail.ne.jp>",
                "Copyright (c) 2002-2005 Sam Leffler, Errno Consulting",
                "Copyright (c) 2003, 2004 Jim Weirich, 2009 Eric Hodel",
                "Copyright (c) 2004 Akira TAGOH <tagoh@debian.org>",
                "Copyright (c) 2004 Mauricio Julio Fernandez Pradier",
                "Copyright (c) 2006, Jouni Malinen <j@w1.fi>",
                "Copyright (c) 2006-2021 by the",
                "Copyright (c) 2007 Free Software Foundation, Inc. <http://fsf.org/>",
                "Copyright (c) 2007-2008 by nexB, Inc. http://www.nexb.com",
                "Copyright (c) 2008 Free Software Foundation, Inc.",
                "Copyright (c) 2008 Free Software Foundation, Inc. Could",
                "Copyright (c) 2008 Free Software Foundation, Inc. Der Zufallszahlengenerator",
                "Copyright (c) 2008 Free Software Foundation, Inc. Impossibile",
                "Copyright (c) 2008 Free Software Foundation, Inc. Kan",
                "Copyright (c) 2008 Free Software Foundation, Inc. Ni",
                "Copyright (c) 2008 Free Software Foundation, Inc. Nie",
                "Copyright (c) 2008-2020 The pip",
                "Copyright (c) 2009, International Business Machines",
                "Copyright (c) 2009-2010, International Business Machines Corporation and others",
                "Copyright (c) 2010 David Wolever <david@wolever.net>",
                "Copyright (c) 2012 LearnBoost <tj@learnboost.com>",
                "Copyright (c) 2019 Giovanni Bussi",
                "Copyright (c) Adam Hupp",
                "Copyright (c) Copyright (c) Python Software Foundation",
                "Copyright (c) Giovanni Bussi",
                "Copyright (c) IBM Corporation and others 2000, 2009",
                "Copyright (c) Ian F. Darwin 1986, 1987, 1989, 1990, 1991, 1992, 1994, 1995",
                "Copyright (c) Pygments authors",
                "Copyright (c) Python Software Foundation",
                "Copyright (c) by the Pygments team",
                "Copyright (c) nexB Inc.",
                "Copyright (c) nexB Inc. and others",
                "Copyright (c) nexB. Inc. and others",
                "Copyright 1989-1990 PKWARE Inc.",
                "Copyright 1989-1990 PKWARE Inc. Self-extracting PKZIP",
                "Copyright 1991 - 1998, Microsoft Corp.",
                "Copyright 1995-2005 Jean-loup Gailly",
                "Copyright 1995-2005 Mark Adler",
                "Copyright 1999 Radical Eye Software",
                "Copyright 2001 Pavel Kouznetsov. Jad home page http://www.geocities.com/kpdus/jad.html",
                "Copyright 2003, 2004 Rickard E. Faith (faith@dict.org)",
                "Copyright 2004 Sun Microsystems, Inc.",
                "Copyright 2006 by Chad Fowler, Rich Kilmer, Jim Weirich and others",
                "Copyright 2006, 2007 by Chad Fowler, Rich Kilmer, Jim Weirich, Eric Hodel and others",
                "Copyright 2006-2014, 2016 by the Pygments team",
                "Copyright 2006-2021 by the Pygments team",
                "Copyright 2007 Apple Inc.",
                "Copyright 2008 Free Software Foundation, Inc.",
                "Copyright 2008 Free Software Foundation, Inc. Kunde",
                "Copyright 2012 Nokia Siemens Networks Oyj",
                "Copyright 2020 by the Pygments team",
                "Copyright Google Inc.",
                "Copyright Masayuki Ataka <ataka@milk.freemail.ne.jp>",
                "Copyright by the Pygments team",
                "Copyright nexB and others",
                "Copyright nexB and others (c) 2012",
                "copyright 2010 David Wolever <david@wolever.net>",
                "copyright nexB Inc. and others",
                "copyrighted by me and others",
                "copyrighted by the Free Software Foundation"
            ],
            "file-count": 1151,
            "sha256": "a5118b53fc73410a8364c22caead45cbb560188a458e71eda663bec8beede20f",
            "source": "https://files.pythonhosted.org/packages/a0/ea/6e1432db5c62f903fb84bef8228d6b857f4e79463555d20bc3db3f11b0c9/typecode-30.0.0.tar.gz",
            "status": "restricted"
        }
    ]
}