{
    "id": "maven/mavencentral/com.vaadin/vaadin-notification-flow/24.6.5",
    "license": "Apache-2.0",
    "authority": "https://gitlab.eclipse.org/eclipsefdn/emo-team/iplab/-/issues/19769",
    "source": "https://repo1.maven.org/maven2/com/vaadin/vaadin-notification-flow/24.6.5/vaadin-notification-flow-24.6.5-sources.jar",
    "status": "approved",
    "scans": [
        {
            "date": "March 1, 2025 at 2:54:47 a.m. GMT",
            "authority": "https://gitlab.eclipse.org/eclipsefdn/emo-team/iplab/-/issues/19769",
            "scancode-version": "31.2.1",
            "licenses-discovered": [
                "Apache-2.0"
            ],
            "copyrights": [
                "Copyright 2000-2024 Vaadin Ltd."
            ],
            "file-count": 5,
            "sha256": "6fb80df584c2ff967d6c6a5748539833fce1afe533363a43d26756b4bd31d92d",
            "source": "https://repo1.maven.org/maven2/com/vaadin/vaadin-notification-flow/24.6.5/vaadin-notification-flow-24.6.5-sources.jar",
            "status": "approved"
        }
    ]
}