{
    "id": "maven/mavencentral/org.wildfly.security/wildfly-elytron-encryption/1.15.3.Final",
    "license": "Apache-2.0",
    "licenses-discovered": [
        "Apache-2.0",
        "LicenseRef-scancode-proprietary-license"
    ],
    "file-count": 10,
    "scancode-version": "30.1.0",
    "authority": "https://gitlab.eclipse.org/eclipsefdn/emo-team/iplab/-/issues/2023",
    "source": "https://search.maven.org/remotecontent?filepath=org/wildfly/security/wildfly-elytron-encryption/1.15.3.Final/wildfly-elytron-encryption-1.15.3.Final-sources.jar",
    "status": "approved"
}
