{
    "id": "maven/mavencentral/org.jvnet.mimepull/mimepull/1.10.0",
    "license": "BSD-3-Clause",
    "licenses-discovered": [
        "BSD-3-Clause"
    ],
    "file-count": 33,
    "scancode-version": "30.1.0",
    "authority": "https://gitlab.eclipse.org/eclipsefdn/emo-team/iplab/-/issues/2699",
    "source": "https://search.maven.org/remotecontent?filepath=org/jvnet/mimepull/mimepull/1.10.0/mimepull-1.10.0-sources.jar",
    "status": "approved"
}