{
    "id": "maven/mavencentral/org.jetbrains/annotations/24.0.1",
    "license": "Apache-2.0",
    "authority": "https://gitlab.eclipse.org/eclipsefdn/emo-team/iplab/-/issues/7417",
    "source": "https://search.maven.org/remotecontent?filepath=org/jetbrains/annotations/24.0.1/annotations-24.0.1-sources.jar",
    "status": "approved",
    "scans": [
        {
            "date": "April 19, 2023 at 9:47:49 p.m. GMT",
            "authority": "https://gitlab.eclipse.org/eclipsefdn/emo-team/iplab/-/issues/7417",
            "scancode-version": "31.2.1",
            "licenses-discovered": [
                "Apache-2.0"
            ],
            "copyrights": [
                "Copyright 2000-2020 JetBrains s.r.o.",
                "Copyright 2000-2021 JetBrains s.r.o."
            ],
            "file-count": 32,
            "sha256": "40978d2ac2fe28e0fc2e1eddc443057572ab775986d7afc83cc0c48cc65652ab",
            "source": "https://search.maven.org/remotecontent?filepath=org/jetbrains/annotations/24.0.1/annotations-24.0.1-sources.jar",
            "status": "approved"
        }
    ]
}