{
    "id": "npm/npmjs/@babel/parser/7.21.3",
    "license": "MIT AND (BSD-2-Clause AND MIT) AND BSD-2-Clause AND BSD-3-Clause",
    "authority": "https://gitlab.eclipse.org/eclipsefdn/emo-team/iplab/-/issues/7455",
    "source": "https://github.com/babel/babel/archive/v7.21.3.zip",
    "status": "approved",
    "scans": [
        {
            "date": "March 22, 2023 at 10:19:39 a.m. GMT",
            "authority": "https://gitlab.eclipse.org/eclipsefdn/emo-team/iplab/-/issues/7455",
            "scancode-version": "31.2.1",
            "licenses-discovered": [
                "MIT",
                "BSD-2-Clause AND MIT",
                "BSD-2-Clause",
                "BSD-3-Clause"
            ],
            "copyrights": [
                "Copyright (c) 2011-2017 KARASZI Istvan <github@spam.raszi.hu>",
                "Copyright (c) 2012 Yusuke Suzuki <utatane.tea@gmail.com>",
                "Copyright (c) 2012-2013 Ecma International",
                "Copyright (c) 2012-2014 by various contributors",
                "Copyright (c) 2014-2015 Jason Quense <jason@quense.me>",
                "Copyright (c) 2014-present Sebastian McKenzie and other contributors",
                "Copyright (c) 2014-present, Facebook, Inc.",
                "Copyright (c) 2015 Jed Watson",
                "Copyright (c) jQuery Foundation, Inc. and Contributors",
                "Copyright 2013-2015, Facebook, Inc.",
                "Copyright 2020 Bloomberg Finance L.P.",
                "Copyright JS Foundation and other contributors",
                "Copyright OpenJS Foundation and other contributors",
                "copyright (c) 2014-2022 Denis Pushkarev"
            ],
            "file-count": 28921,
            "sha256": "74edd83baa365f1b7a7f6af44cc17e51cb41c55df032426c8fe45159e1ecfb8b",
            "source": "https://github.com/babel/babel/archive/v7.21.3.zip",
            "status": "approved"
        }
    ]
}