{
    "id": "p2/orbit/p2.eclipse.plugin/org.apache.batik.svggen/1.17.0.v20231009-1000",
    "license": "Apache-2.0",
    "authority": "https://gitlab.eclipse.org/eclipsefdn/emo-team/iplab/-/issues/15407",
    "source": "https://repo1.maven.org/maven2/org/apache/xmlgraphics/batik-svggen/1.17/batik-svggen-1.17-sources.jar",
    "status": "approved",
    "scans": [
        {
            "date": "June 15, 2024 at 1:51:23 a.m. GMT",
            "authority": "https://gitlab.eclipse.org/eclipsefdn/emo-team/iplab/-/issues/15407",
            "scancode-version": "31.2.1",
            "licenses-discovered": [
                "Apache-2.0"
            ],
            "copyrights": [
            ],
            "file-count": 154,
            "sha256": "a6b0c7d8b39f598910e7a9e8ccf2bf90c973ad8620a0e2234042d78b86e30363",
            "source": "https://repo1.maven.org/maven2/org/apache/xmlgraphics/batik-svggen/1.17/batik-svggen-1.17-sources.jar",
            "status": "approved"
        }
    ]
}