{
    "id": "npm/npmjs/-/nx/14.8.3",
    "license": "MIT AND (CC0-1.0 AND MIT) AND (ISC AND MIT)",
    "licenses-discovered": [
        "MIT",
        "CC0-1.0 AND MIT",
        "ISC AND MIT"
    ],
    "copyrights": [
        "(c) Se (c)",
        "(c) const projects",
        "Copyright (c) Chris Pettitt",
        "Copyright (c) David Khourshid",
        "Copyright (c) David Mark Clements",
        "Copyright (c) David Mark Clements & Matteo Collina",
        "Copyright (c) David Mark Clements, Matteo Collina & Ruben Bridgewater",
        "Copyright (c) Denis Pushkarev",
        "Copyright (c) Facebook, Inc. and its affiliates",
        "Copyright (c) Federico Zivolo",
        "Copyright (c) Jason Miller",
        "Copyright (c) Jed Watson",
        "Copyright (c) Mateusz Burzynski",
        "Copyright (c) Michel Weststrate",
        "Copyright (c) Microsoft Corporation",
        "Copyright (c) Narwhal Technologies Inc.",
        "Copyright (c) Ralf S. Engelschall (http://engelschall.com)",
        "Copyright (c) React Training",
        "Copyright (c) Remix Software",
        "Copyright (c) The Cytoscape Consortium",
        "Copyright (c) atomiks",
        "Copyright Gaetan Renaudeau",
        "Copyright OpenJS Foundation and other contributors <https://openjsf.org/>",
        "copyright Jeremy Ashkenas, DocumentCloud and Investigative Reporters & Editors <http://underscorejs.org/>",
        "copyright Koen Bok"
    ],
    "file-count": 557,
    "scancode-version": "30.1.0",
    "authority": "https://gitlab.eclipse.org/eclipsefdn/emo-team/iplab/-/issues/3751",
    "source": "https://registry.npmjs.org/nx/-/nx-14.8.3.tgz",
    "status": "approved"
}