{
    "id": "maven/mavencentral/org.springframework.boot/spring-boot-starter-actuator/3.0.2",
    "license": "Apache-2.0",
    "authority": "https://gitlab.eclipse.org/eclipsefdn/emo-team/iplab/-/issues/6983",
    "source": "https://search.maven.org/remotecontent?filepath=org/springframework/boot/spring-boot-starter-actuator/3.0.2/spring-boot-starter-actuator-3.0.2-sources.jar",
    "status": "approved",
    "scans": [
        {
            "date": "February 3, 2023 at 7:10:56 p.m. GMT",
            "authority": "https://gitlab.eclipse.org/eclipsefdn/emo-team/iplab/-/issues/6983",
            "scancode-version": "31.2.1",
            "licenses-discovered": [
                "Apache-2.0"
            ],
            "copyrights": [
            ],
            "file-count": 2,
            "sha256": "11c6f7cfca9a6387fa357496b2e2c72e32b77ca93158e61878295c999d49bb8d",
            "source": "https://search.maven.org/remotecontent?filepath=org/springframework/boot/spring-boot-starter-actuator/3.0.2/spring-boot-starter-actuator-3.0.2-sources.jar",
            "status": "approved"
        }
    ]
}