{
    "id": "maven/mavencentral/org.apache.lucene/lucene-misc/10.0.0",
    "license": "Apache-2.0",
    "authority": "https://gitlab.eclipse.org/eclipsefdn/emo-team/iplab/-/issues/17860",
    "source": "https://repo1.maven.org/maven2/org/apache/lucene/lucene-misc/10.0.0/lucene-misc-10.0.0-sources.jar",
    "status": "approved",
    "scans": [
        {
            "date": "December 13, 2024 at 1:13:59 p.m. GMT",
            "authority": "https://gitlab.eclipse.org/eclipsefdn/emo-team/iplab/-/issues/17860",
            "scancode-version": "31.2.1",
            "licenses-discovered": [
                "Apache-2.0"
            ],
            "copyrights": [
            ],
            "file-count": 37,
            "sha256": "de1697a50d64ff8a508701e3438d81cef95bfc06355f866b45ad4fc9d6e9ea4f",
            "source": "https://repo1.maven.org/maven2/org/apache/lucene/lucene-misc/10.0.0/lucene-misc-10.0.0-sources.jar",
            "status": "approved"
        }
    ]
}