{
    "id": "p2/orbit/p2.eclipse.plugin/org.eclipse.jdt.apt.core/3.6.700.v20200828-0941",
    "license": "BSD-3-Clause AND EPL-2.0 AND BSD-3-Clause AND EPL-2.0",
    "licenses-discovered": [
        "BSD-3-Clause AND EPL-2.0",
        "BSD-3-Clause",
        "EPL-2.0"
    ],
    "copyrights": [
        "(c) 2008 VeriSign, Inc.",
        "Copyright (c) 2004, Sun Microsystems",
        "Copyright (c) 2004, Sun Microsystems, Inc.",
        "Copyright (c) 2005 BEA Systems, Inc and others",
        "Copyright (c) 2005 BEA Systems, Inc.",
        "Copyright (c) 2005, 2007 BEA Systems, Inc.",
        "Copyright (c) 2005, 2008 BEA Systems, Inc.",
        "Copyright (c) 2005, 2009 BEA Systems, Inc.",
        "Copyright (c) 2005, 2011 BEA Systems, Inc.",
        "Copyright (c) 2005, 2013 BEA Systems, Inc.",
        "Copyright (c) 2005, 2014 BEA Systems, Inc.",
        "Copyright (c) 2005, 2015 BEA Systems, Inc.",
        "Copyright (c) 2005, 2015 BEA Systems, Inc. and others",
        "Copyright (c) 2005, 2016 BEA Systems, Inc.",
        "Copyright (c) 2005, 2016 BEA Systems, Inc. and others",
        "Copyright (c) 2005, 2017 BEA Systems, Inc.",
        "Copyright (c) 2005, 2018 BEA Systems, Inc. and others",
        "Copyright (c) 2005, 2019 BEA Systems Inc. and others",
        "Copyright (c) 2005, 2019 BEA Systems, Inc. and others",
        "Copyright (c) 2006 BEA Systems, Inc.",
        "Copyright (c) 2006, 2007 BEA Systems, Inc.",
        "Copyright (c) 2006, 2017 BEA Systems, Inc. and others",
        "Copyright (c) 2006, 2018 BEA Systems, Inc. and others",
        "Copyright (c) 2007 BEA Systems, Inc.",
        "Copyright (c) 2007, 2015 BEA Systems, Inc.",
        "Copyright (c) 2014, 2015 IBM Corporation and others",
        "Copyright (c) 2018 Till Brychcy and others"
    ],
    "file-count": 183,
    "scancode-version": "31.2.1",
    "authority": "https://gitlab.eclipse.org/eclipsefdn/emo-team/iplab/-/issues/4020",
    "source": "https://search.maven.org/remotecontent?filepath=org/eclipse/jdt/org.eclipse.jdt.apt.core/3.6.700/org.eclipse.jdt.apt.core-3.6.700-sources.jar",
    "status": "approved"
}