{
    "id": "maven/mavencentral/com.vaadin/vaadin-date-picker-flow/24.2.2",
    "license": "Apache-2.0",
    "authority": "https://gitlab.eclipse.org/eclipsefdn/emo-team/iplab/-/issues/12153",
    "source": "https://repo1.maven.org/maven2/com/vaadin/vaadin-date-picker-flow/24.2.2/vaadin-date-picker-flow-24.2.2-sources.jar",
    "status": "approved",
    "scans": [
        {
            "date": "December 18, 2023 at 9:31:27 a.m. GMT",
            "authority": "https://gitlab.eclipse.org/eclipsefdn/emo-team/iplab/-/issues/12153",
            "scancode-version": "31.2.1",
            "licenses-discovered": [
                "Apache-2.0"
            ],
            "copyrights": [
                "Copyright 2000-2023 Vaadin Ltd."
            ],
            "file-count": 6,
            "sha256": "56d78fb5a0c84d046158f2404d13b6bd118e9781cd74123358f40e5690545c79",
            "source": "https://repo1.maven.org/maven2/com/vaadin/vaadin-date-picker-flow/24.2.2/vaadin-date-picker-flow-24.2.2-sources.jar",
            "status": "approved"
        }
    ]
}