{
    "id": "maven/mavencentral/org.wildfly.security/wildfly-elytron-http-util/2.2.1.Final",
    "license": "Apache-2.0",
    "authority": "https://gitlab.eclipse.org/eclipsefdn/emo-team/iplab/-/issues/9456",
    "source": "https://repo.maven.apache.org/maven2/org/wildfly/security/wildfly-elytron-http-util/2.2.1.Final/wildfly-elytron-http-util-2.2.1.Final-sources.jar",
    "status": "approved",
    "scans": [
        {
            "date": "July 17, 2023 at 9:17:49 a.m. GMT",
            "authority": "https://gitlab.eclipse.org/eclipsefdn/emo-team/iplab/-/issues/9456",
            "scancode-version": "31.2.1",
            "licenses-discovered": [
                "Apache-2.0"
            ],
            "copyrights": [
                "Copyright 2014 Red Hat, Inc., and individual contributors",
                "Copyright 2015 Red Hat, Inc., and individual contributors",
                "Copyright 2016 Red Hat, Inc., and individual contributors",
                "Copyright 2017 Red Hat, Inc., and individual contributors",
                "Copyright 2018 Red Hat, Inc., and individual contributors",
                "Copyright 2020 Red Hat, Inc., and individual contributors",
                "Copyright 2021 Red Hat, Inc."
            ],
            "file-count": 18,
            "sha256": "0edb1b6944976e2074a895de822687b182729b0da8d1622adb38cd1fe8c4b207",
            "source": "https://repo.maven.apache.org/maven2/org/wildfly/security/wildfly-elytron-http-util/2.2.1.Final/wildfly-elytron-http-util-2.2.1.Final-sources.jar",
            "status": "approved"
        }
    ]
}