{
    "id": "maven/mavencentral/com.azure.resourcemanager/azure-resourcemanager-redis/2.31.0",
    "license": "MIT",
    "authority": "https://gitlab.eclipse.org/eclipsefdn/emo-team/iplab/-/issues/10863",
    "source": "https://repo.maven.apache.org/maven2/com/azure/resourcemanager/azure-resourcemanager-redis/2.31.0/azure-resourcemanager-redis-2.31.0-sources.jar",
    "status": "approved",
    "scans": [
        {
            "date": "October 4, 2023 at 2:15:10 p.m. GMT",
            "authority": "https://gitlab.eclipse.org/eclipsefdn/emo-team/iplab/-/issues/10863",
            "scancode-version": "31.2.1",
            "licenses-discovered": [
                "MIT"
            ],
            "copyrights": [
                "(c) 2008 VeriSign, Inc.",
                "Copyright (c) Microsoft Corporation"
            ],
            "file-count": 120,
            "sha256": "7f2c46acb749939eb0acdff86f3c3acb61274738a7af44a9a9e50d4731093b93",
            "source": "https://repo.maven.apache.org/maven2/com/azure/resourcemanager/azure-resourcemanager-redis/2.31.0/azure-resourcemanager-redis-2.31.0-sources.jar",
            "status": "approved"
        }
    ]
}