{
    "id": "project/technology.xfsc/eclipse-xfsc-tsa/tests/f860ec2304397cb75df8eae29091d49cb7d13ebf",
    "license": "AGPL-3.0-or-later AND MIT",
    "authority": "https://gitlab.eclipse.org/eclipsefdn/emo-team/iplab/-/issues/9583",
    "source": "https://gitlab.eclipse.org/api/v4/projects/eclipse%2Fxfsc%2Ftsa%2Ftests/repository/archive.zip?sha=f860ec2304397cb75df8eae29091d49cb7d13ebf",
    "status": "restricted",
    "scans": [
        {
            "date": "July 18, 2023 at 7:58:10 a.m. GMT",
            "authority": "https://gitlab.eclipse.org/eclipsefdn/emo-team/iplab/-/issues/9583",
            "scancode-version": "31.2.1",
            "licenses-discovered": [
                "AGPL-3.0-or-later",
                "MIT"
            ],
            "copyrights": [
                "Copyright (c) 2018 Vereign AG https://www.vereign.com",
                "Copyright (c) 2022 Vereign AG https://www.vereign.com"
            ],
            "file-count": 150,
            "sha256": "4edc780a5efebd26284fd076a2104757b4d08b5034468a3893cdefcc6a8b86c3",
            "source": "https://gitlab.eclipse.org/api/v4/projects/eclipse%2Fxfsc%2Ftsa%2Ftests/repository/archive.zip?sha=f860ec2304397cb75df8eae29091d49cb7d13ebf",
            "status": "restricted"
        }
    ]
}