{
    "id": "pypi/pypi/-/gcovr/5.2",
    "license": "BSD-3-Clause",
    "authority": "https://gitlab.eclipse.org/eclipsefdn/emo-team/iplab/-/issues/7983",
    "source": "https://files.pythonhosted.org/packages/ff/e6/7fdb0c3f73d630fcc94b0d4798d27fe22f6c72237b33ae887951791beacb/gcovr-5.2.tar.gz",
    "status": "approved",
    "scans": [
        {
            "date": "April 27, 2023 at 2:56:00 p.m. GMT",
            "authority": "https://gitlab.eclipse.org/eclipsefdn/emo-team/iplab/-/issues/7983",
            "scancode-version": "31.2.1",
            "licenses-discovered": [
                "BSD-3-Clause"
            ],
            "copyrights": [
                "Copyright (c) 2013 Sandia Corporation. Under",
                "Copyright (c) 2013-2022 the gcovr"
            ],
            "file-count": 41,
            "sha256": "217195085ec94346291a87b7b1e6d9cfdeeee562b3e0f9a32b25c9530b3bce8f",
            "source": "https://files.pythonhosted.org/packages/ff/e6/7fdb0c3f73d630fcc94b0d4798d27fe22f6c72237b33ae887951791beacb/gcovr-5.2.tar.gz",
            "status": "approved"
        }
    ]
}