{
    "license": "Apache-2.0",
    "file-count": 135,
    "authority": "https://gitlab.eclipse.org/eclipsefdn/emo-team/iplab/-/issues/1923",
    "scancode-version": "30.1.0",
    "licenses-discovered": [
        "Apache-2.0"
    ],
    "id": "maven/mavencentral/org.apache.thrift/libthrift/0.14.0",
    "source": "https://search.maven.org/remotecontent?filepath=org/apache/thrift/libthrift/0.14.0/libthrift-0.14.0-sources.jar",
    "status": "approved"
}