{
    "id": "npm/npmjs/-/vscode-json-languageservice/4.2.1",
    "license": "BSD-2-Clause AND MIT",
    "licenses-discovered": [
        "BSD-2-Clause AND MIT",
        "MIT"
    ],
    "copyrights": [
        "Copyright (c) Microsoft",
        "Copyright (c) Microsoft Corporation",
        "Copyright (c) Nick Fitzgerald"
    ],
    "file-count": 50,
    "scancode-version": "30.1.0",
    "authority": "https://gitlab.eclipse.org/eclipsefdn/emo-team/iplab/-/issues/3356",
    "source": "https://registry.npmjs.org/vscode-json-languageservice/-/vscode-json-languageservice-4.2.1.tgz",
    "status": "approved"
}
