{
    "id": "maven/mavencentral/org.robolectric/junit/4.14.1",
    "license": "MIT",
    "authority": "https://gitlab.eclipse.org/eclipsefdn/emo-team/iplab/-/issues/19841",
    "source": "https://repo1.maven.org/maven2/org/robolectric/junit/4.14.1/junit-4.14.1-sources.jar",
    "status": "approved",
    "scans": [
        {
            "date": "March 3, 2025 at 5:58:14 a.m. GMT",
            "authority": "https://gitlab.eclipse.org/eclipsefdn/emo-team/iplab/-/issues/19841",
            "scancode-version": "31.2.1",
            "licenses-discovered": [
            ],
            "copyrights": [
            ],
            "file-count": 3,
            "sha256": "33496117b8913915ee85e6db51811ce3044c2996468ad436d4d07284af81dd57",
            "source": "https://repo1.maven.org/maven2/org/robolectric/junit/4.14.1/junit-4.14.1-sources.jar",
            "status": "restricted"
        }
    ]
}