{
    "id": "maven/mavencentral/org.apache.datasketches/datasketches-memory/2.1.0",
    "license": "Apache-2.0 AND BSD-3-Clause AND BSD-2-Clause AND LGPL-2.1-or-later",
    "authority": "https://gitlab.eclipse.org/eclipsefdn/emo-team/iplab/-/issues/6553",
    "source": "https://search.maven.org/remotecontent?filepath=org/apache/datasketches/datasketches-memory/2.1.0/datasketches-memory-2.1.0-sources.jar",
    "status": "approved",
    "scans": [
        {
            "date": "January 23, 2023 at 11:14:00 p.m. GMT",
            "authority": "https://gitlab.eclipse.org/eclipsefdn/emo-team/iplab/-/issues/6553",
            "scancode-version": "31.2.1",
            "licenses-discovered": [
                "Apache-2.0 AND BSD-2-Clause AND LicenseRef-scancode-protobuf",
                "Apache-2.0 AND LGPL-2.0-or-later",
                "Apache-2.0",
                "Apache-2.0 AND BSD-2-Clause AND BSD-3-Clause"
            ],
            "copyrights": [
                "Copyright (c) 2012-2016, Yann Collet",
                "Copyright 2008 Google Inc.",
                "Copyright 2015 Higher Frequency Trading http://www.higherfrequencytrading.com",
                "Copyright 2015 Odnoklassniki Ltd, Mail.Ru Group"
            ],
            "file-count": 69,
            "sha256": "1aebedd287fa1d1f4b735f60db9a6594447d63c5521581ca8ff48a63603678cb",
            "source": "https://search.maven.org/remotecontent?filepath=org/apache/datasketches/datasketches-memory/2.1.0/datasketches-memory-2.1.0-sources.jar",
            "status": "restricted"
        }
    ]
}
