{
    "id": "maven/mavencentral/org.wildfly.security/wildfly-elytron-http-external/2.2.1.Final",
    "license": "Apache-2.0",
    "authority": "https://gitlab.eclipse.org/eclipsefdn/emo-team/iplab/-/issues/9515",
    "source": "https://repo.maven.apache.org/maven2/org/wildfly/security/wildfly-elytron-http-external/2.2.1.Final/wildfly-elytron-http-external-2.2.1.Final-sources.jar",
    "status": "approved",
    "scans": [
        {
            "date": "July 17, 2023 at 1:49:12 p.m. GMT",
            "authority": "https://gitlab.eclipse.org/eclipsefdn/emo-team/iplab/-/issues/9515",
            "scancode-version": "31.2.1",
            "licenses-discovered": [
                "Apache-2.0"
            ],
            "copyrights": [
                "Copyright 2020 Red Hat, Inc., and individual contributors"
            ],
            "file-count": 7,
            "sha256": "b31ff1139df3928fd650b65310907eca11e7a68f09502d4057b0a08e30cf9332",
            "source": "https://repo.maven.apache.org/maven2/org/wildfly/security/wildfly-elytron-http-external/2.2.1.Final/wildfly-elytron-http-external-2.2.1.Final-sources.jar",
            "status": "approved"
        }
    ]
}