{
    "id": "maven/mavencentral/org.geckoprojects.emf/org.gecko.emf.osgi.api/6.2.0",
    "license": "EPL-2.0 AND EPL-1.0",
    "authority": "https://gitlab.eclipse.org/eclipsefdn/emo-team/iplab/-/issues/15751",
    "source": "https://repo1.maven.org/maven2/org/geckoprojects/emf/org.gecko.emf.osgi.api/6.2.0/org.gecko.emf.osgi.api-6.2.0-sources.jar",
    "status": "approved",
    "scans": [
        {
            "date": "July 23, 2024 at 3:10:41 p.m. GMT",
            "authority": "https://gitlab.eclipse.org/eclipsefdn/emo-team/iplab/-/issues/15751",
            "scancode-version": "31.2.1",
            "licenses-discovered": [
                "EPL-2.0",
                "EPL-1.0"
            ],
            "copyrights": [
                "Copyright (c) 2012 - 2022 Data In Motion and others",
                "Copyright (c) 2012 - 2023 Data In Motion and others"
            ],
            "file-count": 34,
            "sha256": "47d627d3fbbb76eabb3ca5c4f6660d6ea61f5d7a811efc58e73387a7394f5388",
            "source": "https://repo1.maven.org/maven2/org/geckoprojects/emf/org.gecko.emf.osgi.api/6.2.0/org.gecko.emf.osgi.api-6.2.0-sources.jar",
            "status": "approved"
        }
    ]
}