{
    "id": "npm/npmjs/-/nodemailer/6.7.3",
    "license": "MIT-0 AND MIT",
    "licenses-discovered": [
        "MIT-0",
        "MIT"
    ],
    "file-count": 108,
    "scancode-version": "30.1.0",
    "authority": "https://gitlab.eclipse.org/eclipsefdn/emo-team/iplab/-/issues/2650",
    "source": "https://github.com/nodemailer/nodemailer/archive/v6.7.3.zip",
    "status": "approved"
}