{
    "id": "go/golang/github.com%2Fmiekg/pkcs11/v1.0.3",
    "license": "BSD-3-Clause AND LicenseRef-scancode-oasis-ipr-policy-2014",
    "authority": "https://gitlab.eclipse.org/eclipsefdn/emo-team/iplab/-/issues/12218",
    "source": "https://proxy.golang.org/github.com%2Fmiekg/pkcs11/@v/v1.0.3.zip",
    "status": "approved",
    "scans": [
        {
            "date": "December 21, 2023 at 3:50:44 p.m. GMT",
            "authority": "https://gitlab.eclipse.org/eclipsefdn/emo-team/iplab/-/issues/12218",
            "scancode-version": "31.2.1",
            "licenses-discovered": [
                "BSD-3-Clause",
                "LicenseRef-scancode-oasis-ipr-policy-2014"
            ],
            "copyrights": [
                "Copyright (c) 2013 Miek Gieben",
                "Copyright (c) OASIS Open 2016",
                "Copyright 2013 Miek Gieben"
            ],
            "file-count": 29,
            "sha256": "d06d401db6104517f860ebd4b523a7219fcf9cd16d7f54c930a62894f2067073",
            "source": "https://proxy.golang.org/github.com%2Fmiekg/pkcs11/@v/v1.0.3.zip",
            "status": "restricted"
        }
    ]
}
