{
    "id": "git/github/antihax/optional/v1.0.0",
    "license": "MIT",
    "authority": "https://gitlab.eclipse.org/eclipsefdn/emo-team/iplab/-/issues/5120",
    "source": "https://github.com/antihax/optional/archive/refs/tags/v1.0.0.zip",
    "status": "approved",
    "scans": [
        {
            "date": "November 24, 2022 at 7:55:58 p.m. GMT",
            "authority": "https://gitlab.eclipse.org/eclipsefdn/emo-team/iplab/-/issues/5120",
            "scancode-version": "31.2.1",
            "licenses-discovered": [
                "MIT"
            ],
            "copyrights": [
                "Copyright (c) 2016 Adam Hintz"
            ],
            "file-count": 23,
            "sha256": "0cae5579a2da2e1062eaa262c6387e6eed445e8b1d7cc28eb8103ba54c695de9",
            "source": "https://github.com/antihax/optional/archive/refs/tags/v1.0.0.zip",
            "status": "approved"
        }
    ]
}