{
    "id": "maven/mavencentral/org.apache.logging.log4j/log4j-to-slf4j/2.21.1",
    "license": "Apache-2.0",
    "authority": "https://gitlab.eclipse.org/eclipsefdn/emo-team/iplab/-/issues/15262",
    "source": "https://repo1.maven.org/maven2/org/apache/logging/log4j/log4j-to-slf4j/2.21.1/log4j-to-slf4j-2.21.1-sources.jar",
    "status": "approved",
    "scans": [
        {
            "date": "December 13, 2023 at 5:52:26 a.m. GMT",
            "authority": "https://gitlab.eclipse.org/eclipsefdn/emo-team/iplab/-/issues/11919",
            "scancode-version": "31.2.1",
            "licenses-discovered": [
                "Apache-2.0"
            ],
            "copyrights": [
            ],
            "file-count": 13,
            "sha256": "dbe95b592f6485960f5678cfd17d511b7fb53416d256d00266ee4508f81b14db",
            "source": "https://repo1.maven.org/maven2/org/apache/logging/log4j/log4j-to-slf4j/2.21.1/log4j-to-slf4j-2.21.1-sources.jar",
            "status": "approved"
        },
        {
            "date": "June 14, 2024 at 4:07:13 p.m. GMT",
            "authority": "https://gitlab.eclipse.org/eclipsefdn/emo-team/iplab/-/issues/15262",
            "scancode-version": "31.2.1",
            "licenses-discovered": [
                "Apache-2.0"
            ],
            "copyrights": [
            ],
            "file-count": 13,
            "sha256": "dbe95b592f6485960f5678cfd17d511b7fb53416d256d00266ee4508f81b14db",
            "source": "https://repo1.maven.org/maven2/org/apache/logging/log4j/log4j-to-slf4j/2.21.1/log4j-to-slf4j-2.21.1-sources.jar",
            "status": "approved"
        }
    ]
}