{
    "id": "maven/mavencentral/com.fasterxml.jackson.core/jackson-databind/2.4.0",
    "license": "Apache-2.0",
    "authority": "https://gitlab.eclipse.org/eclipsefdn/emo-team/iplab/-/issues/19334",
    "source": "https://repo1.maven.org/maven2/com/fasterxml/jackson/core/jackson-databind/2.4.0/jackson-databind-2.4.0-sources.jar",
    "status": "approved",
    "scans": [
        {
            "date": "February 6, 2025 at 12:58:05 a.m. GMT",
            "authority": "https://gitlab.eclipse.org/eclipsefdn/emo-team/iplab/-/issues/19334",
            "scancode-version": "31.2.1",
            "licenses-discovered": [
                "Apache-2.0"
            ],
            "copyrights": [
                "Copyright (c) 2007- Tatu Saloranta, tatu.saloranta@iki.fi"
            ],
            "file-count": 377,
            "sha256": "df94c6b438fab24177faf168a6de557a0a513d18f20355186fdd452a7c3ea45b",
            "source": "https://repo1.maven.org/maven2/com/fasterxml/jackson/core/jackson-databind/2.4.0/jackson-databind-2.4.0-sources.jar",
            "status": "approved"
        }
    ]
}