{
    "id": "p2/orbit/p2.eclipse-plugin/junit-platform-suite-engine.source/1.9.1",
    "license": "EPL-2.0",
    "authority": "https://gitlab.eclipse.org/eclipsefdn/emo-team/iplab/-/issues/5366",
    "source": "https://repo1.maven.org/maven2/org/junit/platform/junit-platform-suite-engine/1.9.1/junit-platform-suite-engine-1.9.1.jar",
    "status": "approved",
    "scans": [
        {
            "date": "December 5, 2022 at 3:43:47 p.m. GMT",
            "authority": "https://gitlab.eclipse.org/eclipsefdn/emo-team/iplab/-/issues/5366",
            "scancode-version": "31.2.1",
            "licenses-discovered": [
                "EPL-2.0"
            ],
            "copyrights": [
            ],
            "file-count": 14,
            "sha256": "e7b7ee49332764acaa64f88cfe4c624e4d69b15d04cacbf98103ed91d027e06c",
            "source": "https://repo1.maven.org/maven2/org/junit/platform/junit-platform-suite-engine/1.9.1/junit-platform-suite-engine-1.9.1.jar",
            "status": "approved"
        }
    ]
}