{
    "id": "maven/mavencentral/org.jetbrains.kotlin/kotlin-build-tools-api/1.9.0",
    "license": "Apache-2.0",
    "authority": "https://gitlab.eclipse.org/eclipsefdn/emo-team/iplab/-/issues/10211",
    "source": "https://repo.maven.apache.org/maven2/org/jetbrains/kotlin/kotlin-build-tools-api/1.9.0/kotlin-build-tools-api-1.9.0-sources.jar",
    "status": "approved",
    "scans": [
        {
            "date": "August 23, 2023 at 11:41:19 a.m. GMT",
            "authority": "https://gitlab.eclipse.org/eclipsefdn/emo-team/iplab/-/issues/10211",
            "scancode-version": "31.2.1",
            "licenses-discovered": [
                "Apache-2.0"
            ],
            "copyrights": [
                "Copyright 2010-2023 JetBrains s.r.o. and Kotlin Programming Language contributors"
            ],
            "file-count": 3,
            "sha256": "37c173b9984f85a5e1aaaeb0c28fd7d7886e58e3faf1c34652115acacd86d04c",
            "source": "https://repo.maven.apache.org/maven2/org/jetbrains/kotlin/kotlin-build-tools-api/1.9.0/kotlin-build-tools-api-1.9.0-sources.jar",
            "status": "approved"
        }
    ]
}