{
    "id": "maven/mavencentral/org.apache.parquet/parquet-jackson/1.13.1",
    "license": "Apache-2.0",
    "authority": "https://gitlab.eclipse.org/eclipsefdn/emo-team/iplab/-/issues/12711",
    "source": "https://repo1.maven.org/maven2/org/apache/parquet/parquet-jackson/1.13.1/parquet-jackson-1.13.1-sources.jar",
    "status": "approved",
    "scans": [
        {
            "date": "January 11, 2024 at 1:02:01 a.m. GMT",
            "authority": "https://gitlab.eclipse.org/eclipsefdn/emo-team/iplab/-/issues/12711",
            "scancode-version": "31.2.1",
            "licenses-discovered": [
                "Apache-2.0"
            ],
            "copyrights": [
                "Copyright 2007-2015 Tatu Saloranta and other contributors"
            ],
            "file-count": 4,
            "sha256": "b924ab34328c6c19815d84076d345113ceb057858747dd81ce18c5d008181738",
            "source": "https://repo1.maven.org/maven2/org/apache/parquet/parquet-jackson/1.13.1/parquet-jackson-1.13.1-sources.jar",
            "status": "approved"
        }
    ]
}