{
    "id": "maven/mavencentral/org.geotools.ogc/net.opengis.ows/32.0",
    "license": "LGPL-2.1-only",
    "authority": "https://gitlab.eclipse.org/eclipsefdn/emo-team/iplab/-/issues/16206",
    "source": "https://repo.osgeo.org/repository/geotools-releases/org/geotools/ogc/net.opengis.ows/32.0/net.opengis.ows-32.0-sources.jar",
    "status": "approved",
    "scans": [
        {
            "date": "September 19, 2024, 2:29:19 p.m. GMT",
            "authority": "https://gitlab.eclipse.org/eclipsefdn/emo-team/iplab/-/issues/16206",
            "scancode-version": "31.2.1",
            "licenses-discovered": [
            ],
            "copyrights": [
                "Copyright (c) 2006 Open Geospatial Consortium, Inc.",
                "Copyright (c) 2009 Open Geospatial Consortium. To"
            ],
            "file-count": 414,
            "sha256": "48389254753a6d973c778aa7487afabbf5ba51efd1d2d695bd8acac8b479db8b",
            "source": "https://repo.osgeo.org/repository/geotools-releases/org/geotools/ogc/net.opengis.ows/32.0/net.opengis.ows-32.0-sources.jar",
            "status": "restricted"
        }
    ]
}