{
    "id": "go/golang/github.com%2Ffatih/color/v1.9.0",
    "license": "MIT",
    "authority": "https://gitlab.eclipse.org/eclipsefdn/emo-team/iplab/-/issues/12235",
    "source": "https://proxy.golang.org/github.com%2Ffatih/color/@v/v1.9.0.zip",
    "status": "approved",
    "scans": [
        {
            "date": "December 21, 2023 at 7:17:52 a.m. GMT",
            "authority": "https://gitlab.eclipse.org/eclipsefdn/emo-team/iplab/-/issues/12235",
            "scancode-version": "31.2.1",
            "licenses-discovered": [
                "MIT"
            ],
            "copyrights": [
                "Copyright (c) 2013 Fatih Arslan"
            ],
            "file-count": 9,
            "sha256": "33d21fd662beb497f642ffbb42305261004d849fe7028ce037e2b15475b4ecd1",
            "source": "https://proxy.golang.org/github.com%2Ffatih/color/@v/v1.9.0.zip",
            "status": "approved"
        }
    ]
}