{
    "id": "maven/mavencentral/io.opentelemetry/opentelemetry-bom/1.42.1",
    "license": "Apache-2.0",
    "authority": "https://gitlab.eclipse.org/eclipsefdn/emo-team/iplab/-/issues/19175",
    "source": "https://repo1.maven.org/maven2/io/opentelemetry/opentelemetry-bom/1.42.1/opentelemetry-bom-1.42.1.pom",
    "status": "approved",
    "scans": [
        {
            "date": "January 22, 2025 at 3:43:50 a.m. GMT",
            "authority": "https://gitlab.eclipse.org/eclipsefdn/emo-team/iplab/-/issues/19175",
            "scancode-version": "31.2.1",
            "licenses-discovered": [
                "Apache-2.0"
            ],
            "copyrights": [
            ],
            "file-count": 1,
            "sha256": "e95306fb7aa896aa292de47131539c16c1f91dfcb99001da06c401251cbe6905",
            "source": "https://repo1.maven.org/maven2/io/opentelemetry/opentelemetry-bom/1.42.1/opentelemetry-bom-1.42.1.pom",
            "status": "approved"
        }
    ]
}