{
    "id": "maven/mavencentral/com.azure.resourcemanager/azure-resourcemanager-cdn/2.30.0",
    "license": "MIT",
    "authority": "https://gitlab.eclipse.org/eclipsefdn/emo-team/iplab/-/issues/10553",
    "source": "https://repo.maven.apache.org/maven2/com/azure/resourcemanager/azure-resourcemanager-cdn/2.30.0/azure-resourcemanager-cdn-2.30.0-sources.jar",
    "status": "approved",
    "scans": [
        {
            "date": "September 18, 2023 at 6:25:51 a.m. GMT",
            "authority": "https://gitlab.eclipse.org/eclipsefdn/emo-team/iplab/-/issues/10553",
            "scancode-version": "31.2.1",
            "licenses-discovered": [
                "MIT"
            ],
            "copyrights": [
                "(c) 2008 VeriSign, Inc.",
                "Copyright (c) Microsoft Corporation"
            ],
            "file-count": 424,
            "sha256": "f28e5ec459dacf7c44da5efc925575799dc5c59d4b42e8e19a87baea13a07d45",
            "source": "https://repo.maven.apache.org/maven2/com/azure/resourcemanager/azure-resourcemanager-cdn/2.30.0/azure-resourcemanager-cdn-2.30.0-sources.jar",
            "status": "approved"
        }
    ]
}