{
    "id": "npm/npmjs/-/eslint/7.8.1",
    "license": "MIT",
    "licenses-discovered": [
        "MIT"
    ],
    "copyrights": [
        "Copyright 2013-2016 Dulin Marat and other contributors",
        "Copyright JS Foundation and other contributors, https://js.foundation"
    ],
    "file-count": 399,
    "scancode-version": "31.2.1",
    "authority": "https://gitlab.eclipse.org/eclipsefdn/emo-team/iplab/-/issues/4550",
    "source": "https://registry.npmjs.org/eslint/-/eslint-7.8.1.tgz",
    "status": "approved"
}