{
    "id": "maven/mavencentral/org.bytedeco/onnxruntime/1.13.1-1.5.8",
    "license": "MIT AND (Apache-2.0 OR GPL-2.0 WITH Classpath-exception-2.0)",
    "authority": "https://gitlab.eclipse.org/eclipsefdn/emo-team/iplab/-/issues/6831",
    "source": "https://search.maven.org/remotecontent?filepath=org/bytedeco/onnxruntime/1.13.1-1.5.8/onnxruntime-1.13.1-1.5.8-sources.jar",
    "status": "approved",
    "scans": [
        {
            "date": "January 27, 2023 at 9:03:13 p.m. GMT",
            "authority": "https://gitlab.eclipse.org/eclipsefdn/emo-team/iplab/-/issues/6831",
            "scancode-version": "31.2.1",
            "licenses-discovered": [
                "MIT",
                "Apache-2.0 AND (GPL-2.0-or-later WITH Classpath-exception-2.0)"
            ],
            "copyrights": [
                "Copyright (c) 2019, 2020, Oracle and/or its affiliates",
                "Copyright (c) 2019, 2022 Oracle and/or its affiliates",
                "Copyright (c) 2019, 2022, Oracle and/or its affiliates",
                "Copyright (c) 2019, Oracle and/or its affiliates",
                "Copyright (c) 2019-2021 Samuel Audet, Alexander Merritt",
                "Copyright (c) 2020, 2021, Oracle and/or its affiliates",
                "Copyright (c) 2021, Oracle and/or its affiliates",
                "Copyright (c) 2022, Oracle and/or its affiliates",
                "Copyright (c) Microsoft Corporation"
            ],
            "file-count": 116,
            "sha256": "a536120cffefdfa5d72bab965beeadbe7d923eff793cde1b871df7a2bae287cc",
            "source": "https://search.maven.org/remotecontent?filepath=org/bytedeco/onnxruntime/1.13.1-1.5.8/onnxruntime-1.13.1-1.5.8-sources.jar",
            "status": "restricted"
        }
    ]
}
