{
    "id": "p2/orbit/p2.eclipse.plugin/wrapped.org.apache.ant.ant-jsch/1.10.14",
    "license": "Apache-2.0 AND LicenseRef-Public-domain AND W3C",
    "authority": "https://gitlab.eclipse.org/eclipsefdn/emo-team/iplab/-/issues/10638",
    "source": "https://repo.maven.apache.org/maven2/org/apache/ant/ant-jsch/1.10.14/ant-jsch-1.10.14-sources.jar",
    "status": "approved",
    "scans": [
        {
            "date": "September 25, 2023 at 9:31:05 p.m. GMT",
            "authority": "https://gitlab.eclipse.org/eclipsefdn/emo-team/iplab/-/issues/10638",
            "scancode-version": "31.2.1",
            "licenses-discovered": [
                "Apache-2.0 AND SAX-PD AND W3C",
                "Apache-2.0"
            ],
            "copyrights": [
            ],
            "file-count": 14,
            "sha256": "7ac86f9b7e5359f468d89a5266000f9b20e2920d71444f58bce8a64a14355ad5",
            "source": "https://repo.maven.apache.org/maven2/org/apache/ant/ant-jsch/1.10.14/ant-jsch-1.10.14-sources.jar",
            "status": "restricted"
        }
    ]
}
