{
    "id": "npm/npmjs/-/js-yaml/3.12.0",
    "license": "MIT",
    "licenses-discovered": [
        "MIT"
    ],
    "copyrights": [
        "Copyright (c) by Vitaly Puzrin"
    ],
    "file-count": 37,
    "scancode-version": "30.1.0",
    "authority": "https://gitlab.eclipse.org/eclipsefdn/emo-team/iplab/-/issues/2938",
    "source": "https://registry.npmjs.org/js-yaml/-/js-yaml-3.12.0.tgz",
    "status": "approved"
}