{
    "id": "maven/mavencentral/com.miglayout/miglayout-core/11.3",
    "license": "BSD-3-Clause",
    "authority": "https://gitlab.eclipse.org/eclipsefdn/emo-team/iplab/-/issues/14168",
    "source": "https://repo1.maven.org/maven2/com/miglayout/miglayout-core/11.3/miglayout-core-11.3-sources.jar",
    "status": "approved",
    "scans": [
        {
            "date": "March 26, 2024 at 6:43:10 p.m. GMT",
            "authority": "https://gitlab.eclipse.org/eclipsefdn/emo-team/iplab/-/issues/14168",
            "scancode-version": "31.2.1",
            "licenses-discovered": [
                "BSD-3-Clause"
            ],
            "copyrights": [
                "Copyright (c) 2004, Mikael Grev, MiG InfoCom AB. (miglayout (at) miginfocom (dot) com)"
            ],
            "file-count": 26,
            "sha256": "d88dbfcf22131aec3b0821e6fa973bc49bd7ba05466cacb16b42c9a266197f0e",
            "source": "https://repo1.maven.org/maven2/com/miglayout/miglayout-core/11.3/miglayout-core-11.3-sources.jar",
            "status": "approved"
        }
    ]
}