{
    "id": "maven/mavencentral/org.geotools/gt-http/30.1",
    "license": "LGPL-2.0-or-later AND LGPL-2.1-only",
    "authority": "https://gitlab.eclipse.org/eclipsefdn/emo-team/iplab/-/issues/12730",
    "source": "https://repo.osgeo.org/repository/geotools-releases/org/geotools/gt-http/30.1/gt-http-30.1-sources.jar",
    "status": "approved",
    "scans": [
        {
            "date": "January 10, 2024 at 11:59:28 p.m. GMT",
            "authority": "https://gitlab.eclipse.org/eclipsefdn/emo-team/iplab/-/issues/12730",
            "scancode-version": "31.2.1",
            "licenses-discovered": [
                "LGPL-2.0-or-later",
                "LGPL-2.1-only"
            ],
            "copyrights": [
                "(c) 2004-2008, Open Source Geospatial Foundation",
                "(c) 2004-2011, Open Source Geospatial Foundation",
                "(c) 2019, Open Source Geospatial Foundation",
                "(c) 2020, Open Source Geospatial Foundation",
                "(c) 2021, Open Source Geospatial Foundation",
                "(c) 2023, Open Source Geospatial Foundation"
            ],
            "file-count": 20,
            "sha256": "261dbcc963dd1f2618c41a34d8e05fa3cb4407687c575da95a53cb751ecc9caa",
            "source": "https://repo.osgeo.org/repository/geotools-releases/org/geotools/gt-http/30.1/gt-http-30.1-sources.jar",
            "status": "approved"
        }
    ]
}