{
    "id": "-/-/-/chromium/118.0.5993.119",
    "license": "None",
    "authority": "https://gitlab.eclipse.org/eclipsefdn/emo-team/iplab/-/issues/11486",
    "source": "https://github.com/chromium/chromium/archive/refs/tags/118.0.5993.119.zip",
    "status": "approved",
    "scans": [
        {
            "date": "November 10, 2023 at 7:09:19 a.m. GMT",
            "authority": "https://gitlab.eclipse.org/eclipsefdn/emo-team/iplab/-/issues/11486",
            "scancode-version": "31.2.1",
            "licenses-discovered": [
            ],
            "copyrights": [
            ],
            "file-count": 1,
            "sha256": "1e4f030c52f2950b97ca020a2a48c791d0237b7203d57dcc7d10aef126f9a64b",
            "source": "https://github.com/chromium/chromium/archive/refs/tags/118.0.5993.119.zip",
            "status": "restricted"
        }
    ]
}
