{
    "id": "maven/mavencentral/org.apache.kafka/kafka-clients/3.0.1",
    "license": "Apache-2.0 AND (Apache-2.0 AND BSD-3-Clause AND EPL-2.0) AND (Apache-2.0 AND BSD-3-Clause)",
    "licenses-discovered": [
        "Apache-2.0",
        "Apache-2.0 AND BSD-3-Clause AND EPL-2.0",
        "Apache-2.0 AND BSD-3-Clause"
    ],
    "copyrights": [
        "Copyright (c) Alexis Seigneurin",
        "Copyright (c) Intel Corporation",
        "Copyright (c) Lightbend Inc. <https://www.lightbend.com>",
        "Copyright The Apache Software Foundation"
    ],
    "file-count": 1331,
    "scancode-version": "30.1.0",
    "authority": "https://gitlab.eclipse.org/eclipsefdn/emo-team/iplab/-/issues/3223",
    "source": "https://search.maven.org/remotecontent?filepath=org/apache/kafka/kafka-clients/3.0.1/kafka-clients-3.0.1-sources.jar",
    "status": "approved"
}