{
    "id": "maven/mavencentral/software.amazon.awssdk/http-client-spi/2.24.1",
    "license": "Apache-2.0",
    "authority": "https://gitlab.eclipse.org/eclipsefdn/emo-team/iplab/-/issues/13259",
    "source": "https://repo1.maven.org/maven2/software/amazon/awssdk/http-client-spi/2.24.1/http-client-spi-2.24.1-sources.jar",
    "status": "approved",
    "scans": [
        {
            "date": "February 14, 2024 at 2:30:29 p.m. GMT",
            "authority": "https://gitlab.eclipse.org/eclipsefdn/emo-team/iplab/-/issues/13259",
            "scancode-version": "31.2.1",
            "licenses-discovered": [
                "Apache-2.0"
            ],
            "copyrights": [
                "Copyright Amazon.com, Inc. or its affiliates"
            ],
            "file-count": 45,
            "sha256": "057410fa4367bd3ca98e7d2117d6cdaae8531f03f88765427f98529d3ce23791",
            "source": "https://repo1.maven.org/maven2/software/amazon/awssdk/http-client-spi/2.24.1/http-client-spi-2.24.1-sources.jar",
            "status": "approved"
        }
    ]
}