{
    "id": "maven/mavencentral/org.geotools/gt-epsg-hsql/25.4",
    "license": "BSD-3-Clause AND LGPL-2.1-only",
    "licenses-discovered": [
        "BSD-3-Clause",
        "LGPL-2.1-only",
        "LicenseRef-scancode-proprietary-license"
    ],
    "copyrights": [
        "(c) 2005-2008, Open Source Geospatial Foundation"
    ],
    "file-count": 22,
    "scancode-version": "31.2.1",
    "authority": "https://gitlab.eclipse.org/eclipsefdn/emo-team/iplab/-/issues/4448",
    "source": "https://repo.osgeo.org/repository/geotools-releases/org/geotools/gt-epsg-hsql/25.4/gt-epsg-hsql-25.4-sources.jar",
    "status": "approved"
}
