{
    "id": "p2/orbit/p2.eclipse.plugin/jakarta.xml.bind/2.3.3.v20201118-1818",
    "license": "BSD-3-Clause",
    "authority": "https://gitlab.eclipse.org/eclipsefdn/emo-team/iplab/-/issues/15311",
    "source": "https://repo1.maven.org/maven2/jakarta/xml/bind/jakarta.xml.bind-api/2.3.3/jakarta.xml.bind-api-2.3.3-sources.jar",
    "status": "approved",
    "scans": [
        {
            "date": "June 14, 2024 at 6:22:14 p.m. GMT",
            "authority": "https://gitlab.eclipse.org/eclipsefdn/emo-team/iplab/-/issues/15310",
            "scancode-version": "31.2.1",
            "licenses-discovered": [
                "BSD-3-Clause"
            ],
            "copyrights": [
                "Copyright (c) 2003, 2018 Oracle and/or its affiliates",
                "Copyright (c) 2003, 2019 Oracle and/or its affiliates",
                "Copyright (c) 2003, 2020 Oracle and/or its affiliates",
                "Copyright (c) 2004, 2018 Oracle and/or its affiliates",
                "Copyright (c) 2004, 2019 Oracle and/or its affiliates",
                "Copyright (c) 2005, 2018 Oracle and/or its affiliates",
                "Copyright (c) 2005, 2019 Oracle and/or its affiliates",
                "Copyright (c) 2006, 2018 Oracle and/or its affiliates",
                "Copyright (c) 2007, 2018 Oracle and/or its affiliates",
                "Copyright (c) 2015, 2019 Oracle and/or its affiliates",
                "Copyright (c) 2015, 2020 Oracle and/or its affiliates",
                "Copyright (c) 2017, 2018 Oracle and/or its affiliates",
                "Copyright (c) 2017, 2019 Oracle and/or its affiliates",
                "Copyright (c) 2018, 2019 Oracle and/or its affiliates",
                "Copyright (c) 2018, 2020 Oracle and/or its affiliates",
                "Copyright (c) 2019, 2020 Eclipse Foundation"
            ],
            "file-count": 107,
            "sha256": "6da17f357f2e37a53ddeefb2d7445c1da550e50119fe87e0b4c7f275dc48b3cb",
            "source": "https://repo1.maven.org/maven2/jakarta/xml/bind/jakarta.xml.bind-api/2.3.3/jakarta.xml.bind-api-2.3.3-sources.jar",
            "status": "approved"
        },
        {
            "date": "June 14, 2024 at 6:23:43 p.m. GMT",
            "authority": "https://gitlab.eclipse.org/eclipsefdn/emo-team/iplab/-/issues/15311",
            "scancode-version": "31.2.1",
            "licenses-discovered": [
                "BSD-3-Clause"
            ],
            "copyrights": [
                "Copyright (c) 2003, 2018 Oracle and/or its affiliates",
                "Copyright (c) 2003, 2019 Oracle and/or its affiliates",
                "Copyright (c) 2003, 2020 Oracle and/or its affiliates",
                "Copyright (c) 2004, 2018 Oracle and/or its affiliates",
                "Copyright (c) 2004, 2019 Oracle and/or its affiliates",
                "Copyright (c) 2005, 2018 Oracle and/or its affiliates",
                "Copyright (c) 2005, 2019 Oracle and/or its affiliates",
                "Copyright (c) 2006, 2018 Oracle and/or its affiliates",
                "Copyright (c) 2007, 2018 Oracle and/or its affiliates",
                "Copyright (c) 2015, 2019 Oracle and/or its affiliates",
                "Copyright (c) 2015, 2020 Oracle and/or its affiliates",
                "Copyright (c) 2017, 2018 Oracle and/or its affiliates",
                "Copyright (c) 2017, 2019 Oracle and/or its affiliates",
                "Copyright (c) 2018, 2019 Oracle and/or its affiliates",
                "Copyright (c) 2018, 2020 Oracle and/or its affiliates",
                "Copyright (c) 2019, 2020 Eclipse Foundation"
            ],
            "file-count": 107,
            "sha256": "6da17f357f2e37a53ddeefb2d7445c1da550e50119fe87e0b4c7f275dc48b3cb",
            "source": "https://repo1.maven.org/maven2/jakarta/xml/bind/jakarta.xml.bind-api/2.3.3/jakarta.xml.bind-api-2.3.3-sources.jar",
            "status": "approved"
        }
    ]
}