{
    "id": "npm/npmjs/-/pause-stream/0.0.11",
    "license": "Apache-2.0 AND MIT AND MIT",
    "authority": "https://gitlab.eclipse.org/eclipsefdn/emo-team/iplab/-/issues/15442",
    "source": "https://registry.yarnpkg.com/pause-stream/-/pause-stream-0.0.11.tgz",
    "status": "approved",
    "scans": [
        {
            "date": "June 15, 2024 at 3:02:40 a.m. GMT",
            "authority": "https://gitlab.eclipse.org/eclipsefdn/emo-team/iplab/-/issues/15442",
            "scancode-version": "31.2.1",
            "licenses-discovered": [
                "Apache-2.0 AND MIT",
                "MIT"
            ],
            "copyrights": [
                "Copyright (c) 2013 Dominic Tarr"
            ],
            "file-count": 7,
            "sha256": "66df1b1aad8eed88f70cfa06ed541252215a8b725cfcad893a58bfc93f45ebe6",
            "source": "https://registry.yarnpkg.com/pause-stream/-/pause-stream-0.0.11.tgz",
            "status": "approved"
        }
    ]
}