{
    "id": "nuget/nuget/-/Serilog.Formatting.Compact/1.1.0",
    "license": "Apache-2.0",
    "authority": "https://gitlab.eclipse.org/eclipsefdn/emo-team/iplab/-/issues/11115",
    "source": "https://github.com/serilog/serilog-formatting-compact/archive/refs/tags/v1.1.0.zip",
    "status": "approved",
    "scans": [
        {
            "date": "October 24, 2023 at 6:46:27 a.m. GMT",
            "authority": "https://gitlab.eclipse.org/eclipsefdn/emo-team/iplab/-/issues/11115",
            "scancode-version": "31.2.1",
            "licenses-discovered": [
                "Apache-2.0"
            ],
            "copyrights": [
                "Copyright 2016 Serilog"
            ],
            "file-count": 29,
            "sha256": "0cba4aa6db4f1e83ffa62eea9d847f387cda9e5cc48094ac03d6d25785a91480",
            "source": "https://github.com/serilog/serilog-formatting-compact/archive/refs/tags/v1.1.0.zip",
            "status": "approved"
        }
    ]
}