{
    "id": "npm/npmjs/@types/body-parser/1.19.3",
    "license": "MIT",
    "authority": "https://gitlab.eclipse.org/eclipsefdn/emo-team/iplab/-/issues/10831",
    "source": "https://registry.yarnpkg.com/@types/body-parser/-/body-parser-1.19.3.tgz",
    "status": "approved",
    "scans": [
        {
            "date": "October 2, 2023 at 8:01:02 p.m. GMT",
            "authority": "https://gitlab.eclipse.org/eclipsefdn/emo-team/iplab/-/issues/10831",
            "scancode-version": "31.2.1",
            "licenses-discovered": [
                "MIT"
            ],
            "copyrights": [
                "Copyright (c) Microsoft Corporation"
            ],
            "file-count": 4,
            "sha256": "a8ae370102b9a8c95606f5ee95324196aaf18ee8df941447851511ebb1555f63",
            "source": "https://registry.yarnpkg.com/@types/body-parser/-/body-parser-1.19.3.tgz",
            "status": "approved"
        }
    ]
}