{
    "id": "nuget/nuget/-/RestAssured.Net/4.4.0",
    "license": "Apache-2.0",
    "authority": "https://gitlab.eclipse.org/eclipsefdn/emo-team/iplab/-/issues/16855",
    "source": "https://github.com/basdijkstra/rest-assured-net/archive/refs/tags/rest-assured-net-4.4.0.zip",
    "status": "approved",
    "scans": [
        {
            "date": "October 22, 2024, 6:03:39 a.m. GMT",
            "authority": "https://gitlab.eclipse.org/eclipsefdn/emo-team/iplab/-/issues/16855",
            "scancode-version": "31.2.1",
            "licenses-discovered": [
                "Apache-2.0"
            ],
            "copyrights": [
                "Copyright 2019 the original author or authors"
            ],
            "file-count": 86,
            "sha256": "3cf2bff26df8dc2c67ca5b10dc6d1d47cd7f14aee7a9f75a2804868bfc00d5e3",
            "source": "https://github.com/basdijkstra/rest-assured-net/archive/refs/tags/rest-assured-net-4.4.0.zip",
            "status": "approved"
        }
    ]
}