{
    "id": "npm/npmjs/@esbuild/android-x64/0.23.1",
    "license": "Apache-2.0 AND MIT AND BSD-3-Clause AND (BSD-2-Clause AND BSD-3-Clause)",
    "authority": "https://gitlab.eclipse.org/eclipsefdn/emo-team/iplab/-/issues/16406",
    "source": "https://github.com/evanw/esbuild/archive/refs/tags/v0.23.1.zip",
    "status": "approved",
    "scans": [
        {
            "date": "September 30, 2024, 11:58:15 a.m. GMT",
            "authority": "https://gitlab.eclipse.org/eclipsefdn/emo-team/iplab/-/issues/16406",
            "scancode-version": "31.2.1",
            "licenses-discovered": [
                "Apache-2.0",
                "MIT",
                "BSD-3-Clause",
                "BSD-2-Clause AND BSD-3-Clause"
            ],
            "copyrights": [
                "(c) Evil Software Corp",
                "(c) Good Software",
                "(c) Good Software Corp",
                "(c) expectPrintedTarget t, 2019",
                "Copyright (c) 2009 The Go Authors",
                "Copyright (c) 2016 Caleb Spare",
                "Copyright (c) 2020 Evan Wallace",
                "Copyright (c) Microsoft Corporation",
                "Copyright 2012-2019 (c) Mihai Bazon <mihai.bazon@gmail.com>"
            ],
            "file-count": 322,
            "sha256": "a76ead9ae83178a538e02cb8a2eff0221bdfac65e8ffde8cc2ec2303690f734f",
            "source": "https://github.com/evanw/esbuild/archive/refs/tags/v0.23.1.zip",
            "status": "approved"
        }
    ]
}