{
    "id": "npm/npmjs/@volar/source-map/1.11.1",
    "license": "MIT",
    "authority": "https://gitlab.eclipse.org/eclipsefdn/emo-team/iplab/-/issues/11743",
    "source": "https://github.com/volarjs/volar.js/archive/refs/tags/v1.11.1.zip",
    "status": "approved",
    "scans": [
        {
            "date": "November 29, 2023 at 3:21:18 p.m. GMT",
            "authority": "https://gitlab.eclipse.org/eclipsefdn/emo-team/iplab/-/issues/11743",
            "scancode-version": "31.2.1",
            "licenses-discovered": [
                "MIT"
            ],
            "copyrights": [
                "Copyright (c) 2021-present Johnson Chu",
                "Copyright (c) 2023-present Johnson Chu"
            ],
            "file-count": 179,
            "sha256": "3c7a918df0e43fe7e3170dc2e10fd980ec2c217091e2bb331784efc95e8fdc17",
            "source": "https://github.com/volarjs/volar.js/archive/refs/tags/v1.11.1.zip",
            "status": "approved"
        }
    ]
}