{
    "id": "npm/npmjs/@types/express-serve-static-core/4.17.32",
    "license": "MIT",
    "authority": "https://gitlab.eclipse.org/eclipsefdn/emo-team/iplab/-/issues/6020",
    "source": "https://registry.npmjs.org/@types/express-serve-static-core/-/express-serve-static-core-4.17.32.tgz",
    "status": "approved",
    "scans": [
        {
            "date": "January 3, 2023 at 4:32:02 p.m. GMT",
            "authority": "https://gitlab.eclipse.org/eclipsefdn/emo-team/iplab/-/issues/6020",
            "scancode-version": "31.2.1",
            "licenses-discovered": [
                "MIT"
            ],
            "copyrights": [
                "Copyright (c) Microsoft Corporation"
            ],
            "file-count": 4,
            "sha256": "120632b72aa6fc0c3473f0dc6ea8743f57d03744222ccfd2ad6e161ac3c472eb",
            "source": "https://registry.npmjs.org/@types/express-serve-static-core/-/express-serve-static-core-4.17.32.tgz",
            "status": "approved"
        }
    ]
}