{
    "license": "ISC",
    "file-count": 12,
    "authority": "https://gitlab.eclipse.org/eclipsefdn/emo-team/iplab/-/issues/1025",
    "scancode-version": "21.3.31",
    "licenses-discovered": [
        "ISC"
    ],
    "id": "npm/npmjs/-/npmlog/4.1.2",
    "source": "https://github.com/npm/npmlog/archive/v4.1.2.zip",
    "status": "approved"
}