{
    "id": "maven/mavencentral/org.mockito/mockito-core/5.3.1",
    "license": "MIT AND (Apache-2.0 AND MIT) AND Apache-2.0",
    "authority": "https://gitlab.eclipse.org/eclipsefdn/emo-team/iplab/-/issues/7925",
    "source": "https://search.maven.org/remotecontent?filepath=org/mockito/mockito-core/5.3.1/mockito-core-5.3.1-sources.jar",
    "status": "approved",
    "scans": [
        {
            "date": "April 24, 2023 at 4:56:28 p.m. GMT",
            "authority": "https://gitlab.eclipse.org/eclipsefdn/emo-team/iplab/-/issues/7925",
            "scancode-version": "31.2.1",
            "licenses-discovered": [
                "MIT",
                "Apache-2.0 AND MIT",
                "Apache-2.0"
            ],
            "copyrights": [
                "Copyright (c) 2007 Mockito",
                "Copyright (c) 2015 Mockito",
                "Copyright (c) 2016 Mockito",
                "Copyright (c) 2017 Mockito",
                "Copyright (c) 2018 Mockito",
                "Copyright (c) 2019 Mockito",
                "Copyright (c) 2020 Mockito",
                "Copyright (c) 2021 Mockito",
                "Copyright (c) 2022 Mockito"
            ],
            "file-count": 473,
            "sha256": "1104c1f622c0007fcaa77052f9253a7123da94856a8841e63d045c9de74470a9",
            "source": "https://search.maven.org/remotecontent?filepath=org/mockito/mockito-core/5.3.1/mockito-core-5.3.1-sources.jar",
            "status": "approved"
        }
    ]
}