id,license,status,authority
p2/orbit/p2.eclipse-feature/openjfx.media.feature/11.0.0,GPL-2.0 WITH Classpath-exception-2.0,approved,CQ22580
p2/orbit/p2.eclipse-feature/openjfx.standard.feature/11.0.0,GPL-2.0 WITH Classpath-exception-2.0,approved,CQ22580
p2/orbit/p2.eclipse-feature/openjfx.swing.feature/11.0.0,GPL-2.0 WITH Classpath-exception-2.0,approved,CQ22580
p2/orbit/p2.eclipse-feature/openjfx.swt.feature/11.0.0,GPL-2.0 WITH Classpath-exception-2.0,approved,CQ22580
p2/orbit/p2.eclipse-feature/openjfx.web.feature/11.0.0,GPL-2.0 WITH Classpath-exception-2.0,approved,CQ22580
p2/orbit/p2.eclipse-plugin/openjfx.base/11.0.0,GPL-2.0 WITH Classpath-exception-2.0,approved,CQ22580
p2/orbit/p2.eclipse-plugin/openjfx.controls/11.0.0,GPL-2.0 WITH Classpath-exception-2.0,approved,CQ22580
p2/orbit/p2.eclipse-plugin/openjfx.fxml/11.0.0,GPL-2.0 WITH Classpath-exception-2.0,approved,CQ22580
p2/orbit/p2.eclipse-plugin/openjfx.graphics.linux_64/11.0.0,GPL-2.0 WITH Classpath-exception-2.0,approved,CQ22580
p2/orbit/p2.eclipse-plugin/openjfx.graphics.mac/11.0.0,GPL-2.0 WITH Classpath-exception-2.0,approved,CQ22580
p2/orbit/p2.eclipse-plugin/openjfx.graphics.win32_64/11.0.0,GPL-2.0 WITH Classpath-exception-2.0,approved,CQ22580
p2/orbit/p2.eclipse-plugin/openjfx.media.linux_64/11.0.0,GPL-2.0 WITH Classpath-exception-2.0,approved,CQ22580
p2/orbit/p2.eclipse-plugin/openjfx.media.mac/11.0.0,GPL-2.0 WITH Classpath-exception-2.0,approved,CQ22580
p2/orbit/p2.eclipse-plugin/openjfx.media.win32_64/11.0.0,GPL-2.0 WITH Classpath-exception-2.0,approved,CQ22580
p2/orbit/p2.eclipse-plugin/openjfx.swing/11.0.0,GPL-2.0 WITH Classpath-exception-2.0,approved,CQ22580
p2/orbit/p2.eclipse-plugin/openjfx.swt/11.0.0,GPL-2.0 WITH Classpath-exception-2.0,approved,CQ22580
p2/orbit/p2.eclipse-plugin/openjfx.web.linux_64/11.0.0,GPL-2.0 WITH Classpath-exception-2.0,approved,CQ22580
p2/orbit/p2.eclipse-plugin/openjfx.web.mac/11.0.0,GPL-2.0 WITH Classpath-exception-2.0,approved,CQ22580
p2/orbit/p2.eclipse-plugin/openjfx.web.win32_64/11.0.0,GPL-2.0 WITH Classpath-exception-2.0,approved,CQ22580
