{
    "id": "npm/npmjs/-/resolve-url/0.2.1",
    "license": "MIT",
    "licenses-discovered": [
        "MIT"
    ],
    "copyrights": [
        "Copyright (c) Simon Lydell",
        "Copyright Simon Lydell X11"
    ],
    "file-count": 10,
    "scancode-version": "30.1.0",
    "authority": "https://gitlab.eclipse.org/eclipsefdn/emo-team/iplab/-/issues/2922",
    "source": "https://github.com/lydell/resolve-url/archive/v0.2.1.zip",
    "status": "approved"
}