{
    "id": "maven/mavencentral/org.osgi/org.osgi.service.log/1.3.0",
    "license": "Apache-1.1 AND Apache-2.0",
    "authority": "https://gitlab.eclipse.org/eclipsefdn/emo-team/iplab/-/issues/17644",
    "source": "https://repo1.maven.org/maven2/org/osgi/org.osgi.service.log/1.3.0/org.osgi.service.log-1.3.0-sources.jar",
    "status": "approved",
    "scans": [
        {
            "date": "December 4, 2024 at 11:44:06 a.m. GMT",
            "authority": "https://gitlab.eclipse.org/eclipsefdn/emo-team/iplab/-/issues/17644",
            "scancode-version": "31.2.1",
            "licenses-discovered": [
                "Apache-1.1",
                "Apache-2.0"
            ],
            "copyrights": [
                "Copyright (c) OSGi Alliance (2000, 2013)",
                "Copyright (c) OSGi Alliance (2000, 2015)",
                "Copyright (c) OSGi Alliance (2010, 2012)"
            ],
            "file-count": 9,
            "sha256": "201b5923d38cc5c09f2a0aea5a27029f7338dd9040b1ff235591b3dfc0904980",
            "source": "https://repo1.maven.org/maven2/org/osgi/org.osgi.service.log/1.3.0/org.osgi.service.log-1.3.0-sources.jar",
            "status": "approved"
        }
    ]
}