{
    "id": "maven/mavencentral/javax.interceptor/javax.interceptor-api/1.2.2",
    "license": "CDDL-1.0 OR GPL-2.0-only with Classpath-Exception-2.0",
    "licenses-discovered": [
    ],
    "file-count": 13,
    "scancode-version": "30.1.0",
    "authority": "https://gitlab.eclipse.org/eclipsefdn/emo-team/iplab/-/issues/2167",
    "source": "https://search.maven.org/remotecontent?filepath=javax/interceptor/javax.interceptor-api/1.2.2/javax.interceptor-api-1.2.2-sources.jar",
    "status": "approved"
}
