{
    "id": "git/github/golang/tools/8de300cfc20a",
    "license": "BSD-3-Clause AND MIT AND (GPL-1.0-or-later AND MIT)",
    "authority": "https://gitlab.eclipse.org/eclipsefdn/emo-team/iplab/-/issues/5569",
    "source": "https://github.com/golang/tools/archive/8de300cfc20a.zip",
    "status": "approved",
    "scans": [
        {
            "date": "December 9, 2022 at 10:57:32 a.m. GMT",
            "authority": "https://gitlab.eclipse.org/eclipsefdn/emo-team/iplab/-/issues/5569",
            "scancode-version": "31.2.1",
            "licenses-discovered": [
                "BSD-3-Clause",
                "MIT",
                "GPL-1.0-or-later AND MIT"
            ],
            "copyrights": [
                "Copyright (c) 1994-1999 Lucent Technologies Inc.",
                "Copyright (c) 2000-2007 Lucent Technologies Inc. and others",
                "Copyright (c) 2007 Jorn Zaefferer",
                "Copyright (c) 2009 The Go Authors",
                "Copyright (c) 2017 The Go Authors",
                "Copyright 2009 The Go Authors",
                "Copyright 2010 The Go Authors",
                "Copyright 2011 The Go Authors",
                "Copyright 2012 The Go Authors",
                "Copyright 2013 The Go Authors",
                "Copyright 2013 jQuery Foundation and other contributors",
                "Copyright 2014 The Go Authors",
                "Copyright 2015 The Go Authors",
                "Copyright 2016 The Go Authors",
                "Copyright 2017 The Go Authors",
                "Copyright 2018 The Go Authors",
                "Copyright 2019 The Go Authors",
                "Copyright The Go Authors",
                "Portions Copyright (c) 1995-1997 C H Forsyth (forsyth@terzarima.net)",
                "Portions Copyright (c) 1997-1999 Vita Nuova Limited",
                "Portions Copyright (c) 2000-2007 Vita Nuova Holdings Limited (www.vitanuova.com)",
                "Portions Copyright (c) 2004,2006 Bruce Ellis",
                "Portions Copyright (c) 2005-2007 C H Forsyth (forsyth@terzarima.net)",
                "Portions Copyright (c) 2009 The Go Authors"
            ],
            "file-count": 1280,
            "sha256": "e30c3f0fb296346bda24ce31ceeb8cff394934d15766bb1c8050049de65dc83b",
            "source": "https://github.com/golang/tools/archive/8de300cfc20a.zip",
            "status": "restricted"
        }
    ]
}
