{
    "id": "pypi/pypi/-/requests/2.29.0",
    "license": "Apache-2.0 AND MIT AND Apache-2.0",
    "authority": "https://gitlab.eclipse.org/eclipsefdn/emo-team/iplab/-/issues/8005",
    "source": "https://files.pythonhosted.org/packages/4c/d2/70fc708727b62d55bc24e43cc85f073039023212d482553d853c44e57bdb/requests-2.29.0.tar.gz",
    "status": "approved",
    "scans": [
        {
            "date": "April 27, 2023 at 1:15:27 p.m. GMT",
            "authority": "https://gitlab.eclipse.org/eclipsefdn/emo-team/iplab/-/issues/8005",
            "scancode-version": "31.2.1",
            "licenses-discovered": [
                "Apache-2.0 AND MIT",
                "Apache-2.0"
            ],
            "copyrights": [
                "Copyright Kenneth Reitz",
                "copyright (c) 2012 by Kenneth Reitz",
                "copyright (c) 2017 by Kenneth Reitz"
            ],
            "file-count": 47,
            "sha256": "f2e34a75f4749019bb0e3effb66683630e4ffeaf75819fb51bebef1bf5aef059",
            "source": "https://files.pythonhosted.org/packages/4c/d2/70fc708727b62d55bc24e43cc85f073039023212d482553d853c44e57bdb/requests-2.29.0.tar.gz",
            "status": "approved"
        }
    ]
}