{
    "id": "project/iot.keypop/eclipse-keypop/.github/677074a1505963f5ac4b3c7f827e7e56a61be61a",
    "license": "MIT",
    "authority": "https://gitlab.eclipse.org/eclipsefdn/emo-team/iplab/-/issues/9988",
    "source": "https://github.com/eclipse-keypop/.github/archive/677074a1505963f5ac4b3c7f827e7e56a61be61a.zip",
    "status": "approved",
    "scans": [
        {
            "date": "August 9, 2023 at 5:08:16 p.m. GMT",
            "authority": "https://gitlab.eclipse.org/eclipsefdn/emo-team/iplab/-/issues/9988",
            "scancode-version": "31.2.1",
            "licenses-discovered": [
                "MIT"
            ],
            "copyrights": [
                "Copyright (c) 2023 Calypso Networks Association"
            ],
            "file-count": 2,
            "sha256": "9301fa8be6a63fb92aa1eb4a4878823fb3f19a7f2a060e7ea8b49289224a0a7b",
            "source": "https://github.com/eclipse-keypop/.github/archive/677074a1505963f5ac4b3c7f827e7e56a61be61a.zip",
            "status": "restricted"
        }
    ]
}
