{
    "id": "maven/mavencentral/com.bugsnag/bugsnag/3.7.0",
    "license": "MIT",
    "authority": "https://gitlab.eclipse.org/eclipsefdn/emo-team/iplab/-/issues/8921",
    "source": "https://repo.maven.apache.org/maven2/com/bugsnag/bugsnag/3.7.0/bugsnag-3.7.0-sources.jar",
    "status": "approved",
    "scans": [
        {
            "date": "June 15, 2023 at 11:48:28 a.m. GMT",
            "authority": "https://gitlab.eclipse.org/eclipsefdn/emo-team/iplab/-/issues/8921",
            "scancode-version": "31.2.1",
            "licenses-discovered": [
            ],
            "copyrights": [
            ],
            "file-count": 46,
            "sha256": "38d78153859b28ece50ca2ea1cd2a8dc2f0dab171e9f2ba48ed1f94ffcbf3b26",
            "source": "https://repo.maven.apache.org/maven2/com/bugsnag/bugsnag/3.7.0/bugsnag-3.7.0-sources.jar",
            "status": "restricted"
        }
    ]
}
