{
    "id": "maven/mavencentral/com.squareup.okhttp3/okhttp/4.10.0",
    "license": "Apache-2.0 AND MPL-2.0",
    "licenses-discovered": [
        "Apache-2.0",
        "MPL-2.0"
    ],
    "copyrights": [
        "Copyright (c) Square, Inc.",
        "Copyright (c) The Android Open Source Project",
        "Copyright Twitter, Inc."
    ],
    "file-count": 128,
    "scancode-version": "30.1.0",
    "authority": "https://gitlab.eclipse.org/eclipsefdn/emo-team/iplab/-/issues/3057",
    "source": "https://search.maven.org/remotecontent?filepath=com/squareup/okhttp3/okhttp/4.10.0/okhttp-4.10.0-sources.jar",
    "status": "approved"
}