{
    "id": "maven/mavencentral/org.wildfly.security/wildfly-elytron-sasl-plain/2.2.1.Final",
    "license": "Apache-2.0",
    "authority": "https://gitlab.eclipse.org/eclipsefdn/emo-team/iplab/-/issues/9487",
    "source": "https://repo.maven.apache.org/maven2/org/wildfly/security/wildfly-elytron-sasl-plain/2.2.1.Final/wildfly-elytron-sasl-plain-2.2.1.Final-sources.jar",
    "status": "approved",
    "scans": [
        {
            "date": "July 17, 2023 at 10:31:59 a.m. GMT",
            "authority": "https://gitlab.eclipse.org/eclipsefdn/emo-team/iplab/-/issues/9487",
            "scancode-version": "31.2.1",
            "licenses-discovered": [
                "Apache-2.0"
            ],
            "copyrights": [
                "Copyright 2014 Red Hat, Inc., and individual contributors",
                "Copyright 2018 Red Hat, Inc., and individual contributors"
            ],
            "file-count": 10,
            "sha256": "e31c0c93e758a94c0318642c541611287ae870cbdb3bef6b3204109e24a8d1d8",
            "source": "https://repo.maven.apache.org/maven2/org/wildfly/security/wildfly-elytron-sasl-plain/2.2.1.Final/wildfly-elytron-sasl-plain-2.2.1.Final-sources.jar",
            "status": "approved"
        }
    ]
}