{
    "id": "maven/mavencentral/io.quarkus.vertx.utils/quarkus-vertx-utils/3.17.4",
    "license": "Apache-2.0",
    "authority": "https://gitlab.eclipse.org/eclipsefdn/emo-team/iplab/-/issues/17917",
    "source": "https://repo1.maven.org/maven2/io/quarkus/vertx/utils/quarkus-vertx-utils/3.17.4/quarkus-vertx-utils-3.17.4-sources.jar",
    "status": "approved",
    "scans": [
        {
            "date": "December 13, 2024 at 1:55:42 p.m. GMT",
            "authority": "https://gitlab.eclipse.org/eclipsefdn/emo-team/iplab/-/issues/17916",
            "scancode-version": "31.2.1",
            "licenses-discovered": [
            ],
            "copyrights": [
            ],
            "file-count": 8,
            "sha256": "5e8b50b09e958107a14ed0751b8fa3e8852df757f76054c2849417b61c045307",
            "source": "https://repo1.maven.org/maven2/io/quarkus/vertx/utils/quarkus-vertx-utils/3.17.4/quarkus-vertx-utils-3.17.4-sources.jar",
            "status": "restricted"
        },
        {
            "date": "December 13, 2024 at 1:56:20 p.m. GMT",
            "authority": "https://gitlab.eclipse.org/eclipsefdn/emo-team/iplab/-/issues/17917",
            "scancode-version": "31.2.1",
            "licenses-discovered": [
            ],
            "copyrights": [
            ],
            "file-count": 8,
            "sha256": "5e8b50b09e958107a14ed0751b8fa3e8852df757f76054c2849417b61c045307",
            "source": "https://repo1.maven.org/maven2/io/quarkus/vertx/utils/quarkus-vertx-utils/3.17.4/quarkus-vertx-utils-3.17.4-sources.jar",
            "status": "restricted"
        }
    ]
}