{
    "id": "maven/mavencentral/io.cucumber/cucumber-expressions/17.0.1",
    "license": "MIT",
    "authority": "https://gitlab.eclipse.org/eclipsefdn/emo-team/iplab/-/issues/13858",
    "source": "https://repo1.maven.org/maven2/io/cucumber/cucumber-expressions/17.0.1/cucumber-expressions-17.0.1-sources.jar",
    "status": "approved",
    "scans": [
        {
            "date": "March 19, 2024 at 8:32:08 a.m. GMT",
            "authority": "https://gitlab.eclipse.org/eclipsefdn/emo-team/iplab/-/issues/13858",
            "scancode-version": "31.2.1",
            "licenses-discovered": [
            ],
            "copyrights": [
            ],
            "file-count": 34,
            "sha256": "070ddafde7ef78783318de12b2874004d01983b6646bfc4103d1fb2b37ab80f7",
            "source": "https://repo1.maven.org/maven2/io/cucumber/cucumber-expressions/17.0.1/cucumber-expressions-17.0.1-sources.jar",
            "status": "restricted"
        }
    ]
}
