{
    "id": "maven/mavencentral/software.amazon.awssdk/protocol-core/2.28.17",
    "license": "Apache-2.0",
    "authority": "https://gitlab.eclipse.org/eclipsefdn/emo-team/iplab/-/issues/16521",
    "source": "https://repo1.maven.org/maven2/software/amazon/awssdk/protocol-core/2.28.17/protocol-core-2.28.17-sources.jar",
    "status": "approved",
    "scans": [
        {
            "date": "October 8, 2024, 11:08:36 p.m. GMT",
            "authority": "https://gitlab.eclipse.org/eclipsefdn/emo-team/iplab/-/issues/16521",
            "scancode-version": "31.2.1",
            "licenses-discovered": [
                "Apache-2.0"
            ],
            "copyrights": [
                "Copyright Amazon.com, Inc. or its affiliates"
            ],
            "file-count": 17,
            "sha256": "af849fcf67339c9465edf1ad8aa3a08b557de2f88b158aeee1813ebeef9849a3",
            "source": "https://repo1.maven.org/maven2/software/amazon/awssdk/protocol-core/2.28.17/protocol-core-2.28.17-sources.jar",
            "status": "approved"
        }
    ]
}