{
    "id": "p2/orbit/p2.eclipse.plugin/org.apache.lucene.core/9.7.0.v20230703-0758",
    "license": "Apache-2.0 AND BSD-3-Clause AND BSD-2-Clause AND ISC AND MIT AND LicenseRef-Public-Domain",
    "authority": "https://gitlab.eclipse.org/eclipsefdn/emo-team/iplab/-/issues/9230",
    "source": "https://repo.maven.apache.org/maven2/org/apache/lucene/lucene-core/9.7.0/lucene-core-9.7.0-sources.jar",
    "status": "approved",
    "scans": [
        {
            "date": "July 3, 2023 at 2:19:08 p.m. GMT",
            "authority": "https://gitlab.eclipse.org/eclipsefdn/emo-team/iplab/-/issues/9230",
            "scancode-version": "31.2.1",
            "licenses-discovered": [
                "Apache-2.0",
                "Apache-2.0 AND BSD-3-Clause AND NCSA",
                "Apache-2.0 AND ISC",
                "Apache-2.0 AND LicenseRef-scancode-sunpro",
                "Apache-2.0 AND ICU AND LicenseRef-scancode-unicode-mappings",
                "BSD-3-Clause",
                "Apache-2.0 AND MIT",
                "BSD-2-Clause"
            ],
            "copyrights": [
                "Copyright (c) 1970-2003, Wm. Randolph Franklin",
                "Copyright (c) 1993 by Sun Microsystems, Inc.",
                "Copyright (c) 1999-2010, International Business Machines Corporation and others",
                "Copyright (c) 2001-2009 Anders Moeller",
                "Copyright (c) 2011-2016, Yann Collet",
                "Copyright (c) 2016, Mapbox",
                "Copyright 2001-2004 Unicode, Inc."
            ],
            "file-count": 1021,
            "sha256": "49249db193112c2cc4814c53ea069f69a48a3ca71dc093ef087f29a01a49ea6f",
            "source": "https://repo.maven.apache.org/maven2/org/apache/lucene/lucene-core/9.7.0/lucene-core-9.7.0-sources.jar",
            "status": "restricted"
        }
    ]
}
