{
    "license": "Apache-2.0",
    "file-count": 3,
    "authority": "https://gitlab.eclipse.org/eclipsefdn/emo-team/iplab/-/issues/1568",
    "scancode-version": "30.1.0",
    "licenses-discovered": [
    ],
    "id": "maven/mavencentral/org.camunda.commons/camunda-commons-logging/1.10.0",
    "source": "https://search.maven.org/remotecontent?filepath=org/camunda/commons/camunda-commons-logging/1.10.0/camunda-commons-logging-1.10.0-sources.jar",
    "status": "approved"
}
