{
    "id": "npm/npmjs/-/sucrase/3.32.0",
    "license": "MIT",
    "authority": "https://gitlab.eclipse.org/eclipsefdn/emo-team/iplab/-/issues/8042",
    "source": "https://registry.yarnpkg.com/sucrase/-/sucrase-3.32.0.tgz",
    "status": "approved",
    "scans": [
        {
            "date": "April 28, 2023 at 5:48:35 p.m. GMT",
            "authority": "https://gitlab.eclipse.org/eclipsefdn/emo-team/iplab/-/issues/8042",
            "scancode-version": "31.2.1",
            "licenses-discovered": [
                "MIT"
            ],
            "copyrights": [
                "Copyright (c) 2012-2018 various"
            ],
            "file-count": 187,
            "sha256": "7638a610b4215127dca526fb9d90c3609fc64eee6bbe4b410f9530ef3bf992c8",
            "source": "https://registry.yarnpkg.com/sucrase/-/sucrase-3.32.0.tgz",
            "status": "approved"
        }
    ]
}