{
    "id": "maven/mavencentral/io.fabric8/kubernetes-client/6.5.0",
    "license": "Apache-2.0",
    "authority": "https://gitlab.eclipse.org/eclipsefdn/emo-team/iplab/-/issues/7371",
    "source": "https://search.maven.org/remotecontent?filepath=io/fabric8/kubernetes-client/6.5.0/kubernetes-client-6.5.0-sources.jar",
    "status": "approved",
    "scans": [
        {
            "date": "March 14, 2023 at 10:07:19 a.m. GMT",
            "authority": "https://gitlab.eclipse.org/eclipsefdn/emo-team/iplab/-/issues/7371",
            "scancode-version": "31.2.1",
            "licenses-discovered": [
                "Apache-2.0"
            ],
            "copyrights": [
                "Copyright (c) 2015 Red Hat, Inc."
            ],
            "file-count": 130,
            "sha256": "e6e295fa4c4cd9ef3b67caa2ad9d2390a55e37429f38139faa0465465900522f",
            "source": "https://search.maven.org/remotecontent?filepath=io/fabric8/kubernetes-client/6.5.0/kubernetes-client-6.5.0-sources.jar",
            "status": "approved"
        }
    ]
}