{
    "id": "npm/npmjs/-/monaco-editor/0.48.0",
    "license": "MIT AND Apache-2.0 AND CC-BY-4.0 AND Unicode-TOU AND W3C",
    "authority": "https://gitlab.eclipse.org/eclipsefdn/emo-team/iplab/-/issues/14585",
    "source": "https://github.com/microsoft/monaco-editor/archive/refs/tags/v0.48.0.zip",
    "status": "approved",
    "scans": [
        {
            "date": "April 29, 2024 at 4:41:39 a.m. GMT",
            "authority": "https://gitlab.eclipse.org/eclipsefdn/emo-team/iplab/-/issues/14585",
            "scancode-version": "31.2.1",
            "licenses-discovered": [
            ],
            "copyrights": [
            ],
            "file-count": 1,
            "sha256": "dc9bc84108492ad833a55258835882da960a59405d97d8d720207c3ac544c303",
            "source": "https://github.com/microsoft/monaco-editor/archive/refs/tags/v0.48.0.zip",
            "status": "restricted"
        },
        {
            "date": "May 7, 2024 at 1:59:02 p.m. GMT",
            "authority": "https://gitlab.eclipse.org/eclipsefdn/emo-team/iplab/-/issues/14585",
            "scancode-version": "31.2.1",
            "licenses-discovered": [
                "MIT",
                "Apache-2.0 AND CC-BY-4.0 AND LicenseRef-scancode-khronos AND LicenseRef-scancode-unicode AND LicenseRef-scancode-unknown AND MIT AND W3C-20150513",
                "Apache-2.0 AND MIT",
                "Apache-2.0",
                "GPL-2.0-only AND MIT"
            ],
            "copyrights": [
                "(c) Microsoft",
                "(c) by W3C",
                "Copyright (c) 1991-2017 Unicode, Inc.",
                "Copyright (c) 2007-2017 Einar Lielmanis, Liam Newman, and contributors",
                "Copyright (c) 2015 David Owens II",
                "Copyright (c) 2015 W3C(r) MIT, ERCIM, Keio",
                "Copyright (c) 2016 - present Microsoft Corporation",
                "Copyright (c) 2018 The Khronos Group Inc.",
                "Copyright (c) 2018 WHATWG",
                "Copyright (c) Artyom Shalkhakov",
                "Copyright (c) David Owens II, owensd.io",
                "Copyright (c) Microsoft",
                "Copyright (c) Microsoft Corporation",
                "Copyright (c) Microsoft Corporation, Google LLC.",
                "Copyright (c) YEAR W3C(r) (MIT, ERCIM, Keio, Beihang). Disclaimers",
                "Copyright 2012, AUTHORS.txt (http://jqueryui.com/about)",
                "Copyright Drifty Co. http://drifty.com/",
                "Copyright jQuery Foundation and other contributors"
            ],
            "file-count": 761,
            "sha256": "dc9bc84108492ad833a55258835882da960a59405d97d8d720207c3ac544c303",
            "source": "https://github.com/microsoft/monaco-editor/archive/refs/tags/v0.48.0.zip",
            "status": "restricted"
        }
    ]
}