{
    "id": "npm/npmjs/@types/node-netconf/2.0.1",
    "license": "MIT",
    "licenses-discovered": [
        "MIT"
    ],
    "file-count": 4,
    "scancode-version": "30.1.0",
    "authority": "https://gitlab.eclipse.org/eclipsefdn/emo-team/iplab/-/issues/2098",
    "source": "https://registry.npmjs.org/@types/netconf/-/netconf-2.0.1.tgz",
    "status": "approved"
}