{
    "id": "maven/mavencentral/org.wildfly.security/wildfly-elytron-sasl-entity/2.2.1.Final",
    "license": "Apache-2.0",
    "authority": "https://gitlab.eclipse.org/eclipsefdn/emo-team/iplab/-/issues/9500",
    "source": "https://repo.maven.apache.org/maven2/org/wildfly/security/wildfly-elytron-sasl-entity/2.2.1.Final/wildfly-elytron-sasl-entity-2.2.1.Final-sources.jar",
    "status": "approved",
    "scans": [
        {
            "date": "July 17, 2023 at 11:15:51 a.m. GMT",
            "authority": "https://gitlab.eclipse.org/eclipsefdn/emo-team/iplab/-/issues/9500",
            "scancode-version": "31.2.1",
            "licenses-discovered": [
                "Apache-2.0"
            ],
            "copyrights": [
                "Copyright 2015 Red Hat, Inc., and individual contributors",
                "Copyright 2018 Red Hat, Inc., and individual contributors"
            ],
            "file-count": 11,
            "sha256": "c6d496d60d487de570ae56ad084e225bfa6b4f59b45c4ceba27309fa2d2c2b68",
            "source": "https://repo.maven.apache.org/maven2/org/wildfly/security/wildfly-elytron-sasl-entity/2.2.1.Final/wildfly-elytron-sasl-entity-2.2.1.Final-sources.jar",
            "status": "approved"
        }
    ]
}