{
    "id": "npm/npmjs/-/msgpackr/1.10.2",
    "license": "MIT",
    "authority": "https://gitlab.eclipse.org/eclipsefdn/emo-team/iplab/-/issues/14868",
    "source": "https://registry.npmjs.org/msgpackr/-/msgpackr-1.10.2.tgz",
    "status": "approved",
    "scans": [
        {
            "date": "May 21, 2024 at 3:34:49 p.m. GMT",
            "authority": "https://gitlab.eclipse.org/eclipsefdn/emo-team/iplab/-/issues/14868",
            "scancode-version": "31.2.1",
            "licenses-discovered": [
                "MIT"
            ],
            "copyrights": [
                "Copyright (c) 2020 Kris Zyp"
            ],
            "file-count": 34,
            "sha256": "29a1a9fa3cf40ed5b57ae073a02e8ec4687a601426cf0fea85d5eaf7f27b75fc",
            "source": "https://registry.npmjs.org/msgpackr/-/msgpackr-1.10.2.tgz",
            "status": "approved"
        }
    ]
}