{
    "id": "npm/npmjs/-/rc-cascader/3.24.0",
    "license": "MIT",
    "authority": "https://gitlab.eclipse.org/eclipsefdn/emo-team/iplab/-/issues/13848",
    "source": "https://github.com/react-component/cascader/archive/refs/tags/v3.24.0.zip",
    "status": "approved",
    "scans": [
        {
            "date": "March 18, 2024 at 2:13:24 a.m. GMT",
            "authority": "https://gitlab.eclipse.org/eclipsefdn/emo-team/iplab/-/issues/13848",
            "scancode-version": "31.2.1",
            "licenses-discovered": [
                "MIT"
            ],
            "copyrights": [
                "Copyright (c) 2014-present alipay.com"
            ],
            "file-count": 100,
            "sha256": "44d9cb29188a84dbfc3063ae694ba279583e681d4ad3873d46e5b68936ff34f0",
            "source": "https://github.com/react-component/cascader/archive/refs/tags/v3.24.0.zip",
            "status": "approved"
        }
    ]
}