{
    "license": "CC-BY-SA-4.0 AND MIT AND MITNFA",
    "file-count": 16,
    "authority": "https://gitlab.eclipse.org/eclipsefdn/emo-team/iplab/-/issues/671",
    "scancode-version": "21.3.31",
    "licenses-discovered": [
        "MITNFA",
        "MIT",
        "CC-BY-SA-4.0"
    ],
    "id": "npm/npmjs/-/shortid/2.2.8",
    "source": "https://registry.npmjs.org/shortid/-/shortid-2.2.8.tgz",
    "status": "approved"
}
