{
    "id": "go/golang/google.golang.org/grpc/v1.29.1",
    "license": "Apache-2.0",
    "authority": "https://gitlab.eclipse.org/eclipsefdn/emo-team/iplab/-/issues/6105",
    "source": "https://proxy.golang.org/google.golang.org/grpc/@v/v1.29.1.zip",
    "status": "approved",
    "scans": [
        {
            "date": "January 6, 2023 at 1:35:23 a.m. GMT",
            "authority": "https://gitlab.eclipse.org/eclipsefdn/emo-team/iplab/-/issues/6105",
            "scancode-version": "31.2.1",
            "licenses-discovered": [
                "Apache-2.0"
            ],
            "copyrights": [
                "Copyright 2014 gRPC",
                "Copyright 2015 gRPC",
                "Copyright 2015-2016 gRPC",
                "Copyright 2016 gRPC",
                "Copyright 2017 gRPC",
                "Copyright 2018 gRPC",
                "Copyright 2019 gRPC",
                "Copyright 2020 gRPC"
            ],
            "file-count": 514,
            "sha256": "17733816e7fa5d6f0a76a59a8593a6d981be13743d4d7fa848c513689e950b42",
            "source": "https://proxy.golang.org/google.golang.org/grpc/@v/v1.29.1.zip",
            "status": "approved"
        }
    ]
}