{
    "id": "pypi/pypi/-/protobuf/5.28.3",
    "license": "BSD-3-Clause AND MIT",
    "authority": "https://gitlab.eclipse.org/eclipsefdn/emo-team/iplab/-/issues/17105",
    "source": "https://files.pythonhosted.org/packages/74/6e/e69eb906fddcb38f8530a12f4b410699972ab7ced4e21524ece9d546ac27/protobuf-5.28.3.tar.gz",
    "status": "approved",
    "scans": [
        {
            "date": "November 7, 2024, 7:59:08 a.m. GMT",
            "authority": "https://gitlab.eclipse.org/eclipsefdn/emo-team/iplab/-/issues/17105",
            "scancode-version": "31.2.1",
            "licenses-discovered": [
                "LicenseRef-scancode-protobuf",
                "BSD-3-Clause",
                "MIT"
            ],
            "copyrights": [
                "Copyright 2007 Google Inc.",
                "Copyright 2008 Google Inc.",
                "Copyright 2023 Google LLC",
                "Copyright 2023 Google LLC.",
                "Copyright 2024 Google LLC."
            ],
            "file-count": 266,
            "sha256": "64badbc49180a5e401f373f9ce7ab1d18b63f7dd4a9cdc43c92b9f0b481cef7b",
            "source": "https://files.pythonhosted.org/packages/74/6e/e69eb906fddcb38f8530a12f4b410699972ab7ced4e21524ece9d546ac27/protobuf-5.28.3.tar.gz",
            "status": "restricted"
        }
    ]
}