{
    "id": "project/ecd.theia/@theia/monaco-editor-core/1.72.2",
    "license": "MIT AND (Apache-2.0 OR MPL-2.0)",
    "licenses-discovered": [
        "MIT",
        "Apache-2.0 AND MPL-2.0"
    ],
    "copyrights": [
        "(c) Cure53 and other contributors",
        "Copyright (c) 2008 Microsoft Corporation",
        "Copyright (c) 2011-2018, Christopher Jeffrey (https://github.com/chjj/)",
        "Copyright (c) 2011-2022, Christopher Jeffrey. (MIT Licensed) https://github.com/markedjs/marked",
        "Copyright (c) 2016 - present Microsoft Corporation",
        "Copyright (c) 2018+, MarkedJS (https://github.com/markedjs/)",
        "Copyright (c) Microsoft Corporation",
        "Copyright Joyent, Inc. and other Node contributors"
    ],
    "file-count": 3342,
    "scancode-version": "31.2.1",
    "authority": "https://gitlab.eclipse.org/eclipsefdn/emo-team/iplab/-/issues/4117",
    "source": "https://gitlab.eclipse.org/eclipsefdn/emo-team/iplab/uploads/9baf5d0bd60c6d5cea73f16ba8360c79/out-monaco-editor-core.zip",
    "status": "approved"
}
