{
    "id": "maven/mavencentral/com.yahoo.elide/elide-datastore-jpa/7.1.2",
    "license": "Apache-2.0",
    "authority": "https://gitlab.eclipse.org/eclipsefdn/emo-team/iplab/-/issues/17495",
    "source": "https://repo1.maven.org/maven2/com/yahoo/elide/elide-datastore-jpa/7.1.2/elide-datastore-jpa-7.1.2-sources.jar",
    "status": "approved",
    "scans": [
        {
            "date": "November 26, 2024 at 11:01:36 p.m. GMT",
            "authority": "https://gitlab.eclipse.org/eclipsefdn/emo-team/iplab/-/issues/17495",
            "scancode-version": "31.2.1",
            "licenses-discovered": [
                "Apache-2.0"
            ],
            "copyrights": [
                "Copyright 2015, Yahoo Inc.",
                "Copyright 2016, Yahoo Inc.",
                "Copyright 2018, Yahoo Inc.",
                "Copyright 2020, Yahoo Inc.",
                "Copyright 2023, the original author or authors"
            ],
            "file-count": 16,
            "sha256": "e5263584e7d91c74dac25c3d15be53d49436320940c21a1cc02b175131d4c3a6",
            "source": "https://repo1.maven.org/maven2/com/yahoo/elide/elide-datastore-jpa/7.1.2/elide-datastore-jpa-7.1.2-sources.jar",
            "status": "approved"
        }
    ]
}