{
    "id": "maven/mavencentral/com.vegardit.no-npe/no-npe-eea-all/1.3.0",
    "license": "EPL-2.0",
    "authority": "https://gitlab.eclipse.org/eclipsefdn/emo-team/iplab/-/issues/17961",
    "source": "https://github.com/vegardit/no-npe/archive/refs/tags/1.3.0.zip",
    "status": "approved",
    "scans": [
        {
            "date": "December 18, 2024 at 11:33:49 p.m. GMT",
            "authority": "https://gitlab.eclipse.org/eclipsefdn/emo-team/iplab/-/issues/17961",
            "scancode-version": "31.2.1",
            "licenses-discovered": [
                "EPL-2.0"
            ],
            "copyrights": [
                "Copyright (c) Vegard IT GmbH (https://vegardit.com) and contributors"
            ],
            "file-count": 29030,
            "sha256": "4b89116557c4a314c0760df620115d136dbf63d8fc7834aef06e8455d4f9fc9d",
            "source": "https://github.com/vegardit/no-npe/archive/refs/tags/1.3.0.zip",
            "status": "approved"
        }
    ]
}