{
    "id": "maven/mavencentral/org.bouncycastle/bcpg-jdk18on/1.78",
    "license": "Apache-2.0",
    "authority": "https://gitlab.eclipse.org/eclipsefdn/emo-team/iplab/-/issues/14236",
    "source": "https://repo1.maven.org/maven2/org/bouncycastle/bcpg-jdk18on/1.78/bcpg-jdk18on-1.78-sources.jar",
    "status": "approved",
    "scans": [
        {
            "date": "April 6, 2024 at 11:05:54 a.m. GMT",
            "authority": "https://gitlab.eclipse.org/eclipsefdn/emo-team/iplab/-/issues/14236",
            "scancode-version": "31.2.1",
            "licenses-discovered": [
                "Apache-2.0"
            ],
            "copyrights": [
            ],
            "file-count": 278,
            "sha256": "059f145decc9e754af2e6aac530a6b43bc01eb296df53f966c99ece79f9c4b18",
            "source": "https://repo1.maven.org/maven2/org/bouncycastle/bcpg-jdk18on/1.78/bcpg-jdk18on-1.78-sources.jar",
            "status": "approved"
        }
    ]
}