{
    "id": "maven/mavencentral/org.snakeyaml/snakeyaml-engine/2.8",
    "license": "Apache-2.0",
    "authority": "https://gitlab.eclipse.org/eclipsefdn/emo-team/iplab/-/issues/16168",
    "source": "https://repo1.maven.org/maven2/org/snakeyaml/snakeyaml-engine/2.8/snakeyaml-engine-2.8-sources.jar",
    "status": "approved",
    "scans": [
        {
            "date": "September 17, 2024, 7:09:11 p.m. GMT",
            "authority": "https://gitlab.eclipse.org/eclipsefdn/emo-team/iplab/-/issues/16168",
            "scancode-version": "31.2.1",
            "licenses-discovered": [
                "Apache-2.0"
            ],
            "copyrights": [
                "Copyright (c) 2008 Google Inc.",
                "Copyright (c) 2018, SnakeYAML"
            ],
            "file-count": 136,
            "sha256": "18a19d37d92a9a73e329f1520922c823e7cad86c5d3faa1b36b38b5cad62df34",
            "source": "https://repo1.maven.org/maven2/org/snakeyaml/snakeyaml-engine/2.8/snakeyaml-engine-2.8-sources.jar",
            "status": "approved"
        }
    ]
}