{
    "id": "project/automotive.tractusx/-/knowledge-agents-edc/1.13.21-SNAPSHOT",
    "license": "Apache-2.0",
    "authority": "https://gitlab.eclipse.org/eclipsefdn/emo-team/iplab/-/issues/15692",
    "source": "https://github.com/eclipse-tractusx/knowledge-agents-edc/pull/219.patch",
    "status": "approved",
    "scans": [
        {
            "date": "July 11, 2024 at 9:05:27 a.m. GMT",
            "authority": "https://gitlab.eclipse.org/eclipsefdn/emo-team/iplab/-/issues/15692",
            "scancode-version": "31.2.1",
            "licenses-discovered": [
                "Apache-2.0"
            ],
            "copyrights": [
                "Copyright (c) 2021,2023 Contributors",
                "Copyright (c) 2021,2024 Contributors",
                "Copyright (c) 2022,2023 Contributors",
                "Copyright (c) 2022,2024 Contributors",
                "Copyright (c) 2023 Bayerische Motoren Werke Aktiengesellschaft",
                "Copyright (c) 2023 Contributors",
                "Copyright (c) 2023 Mercedes-Benz Tech Innovation GmbH",
                "Copyright (c) 2023 ZF Friedrichshafen AG",
                "Copyright (c) 2023,2024 T-Systems International GmbH",
                "Copyright (c) 2024 Contributors",
                "Copyright (c) 2024 T-Systems International GmbH"
            ],
            "file-count": 1,
            "sha256": "0a07dd32d5826cc88c39587c50969251e7bfa5a7c22cb4f52d00a1466f4e1d5e",
            "source": "https://github.com/eclipse-tractusx/knowledge-agents-edc/pull/219.patch",
            "status": "restricted"
        }
    ]
}