{
    "id": "maven/mavencentral/jakarta.ws.rs/jakarta.ws.rs-api/3.1.0",
    "license": "EPL-2.0 and GPL-2.0-with-classpath-exception",
    "authority": "https://gitlab.eclipse.org/eclipsefdn/emo-team/iplab/-/issues/8019",
    "source": "https://search.maven.org/remotecontent?filepath=jakarta/ws/rs/jakarta.ws.rs-api/3.1.0/jakarta.ws.rs-api-3.1.0-sources.jar",
    "status": "approved",
    "scans": [
        {
            "date": "April 28, 2023 at 1:42:09 p.m. GMT",
            "authority": "https://gitlab.eclipse.org/eclipsefdn/emo-team/iplab/-/issues/8019",
            "scancode-version": "31.2.1",
            "licenses-discovered": [
                "EPL-2.0 AND (GPL-2.0-only WITH Classpath-exception-2.0)",
                "Apache-2.0",
                "Apache-2.0 AND CPL-1.0 AND EPL-2.0 AND (GPL-2.0-only WITH Classpath-exception-2.0) AND LicenseRef-scancode-generic-export-compliance"
            ],
            "copyrights": [
                "Copyright (c) 1989, 1991 Free Software Foundation, Inc.",
                "Copyright (c) 2006 Google Inc.",
                "Copyright (c) 2010, 2019 Oracle and/or its affiliates",
                "Copyright (c) 2010, 2020 Oracle and/or its affiliates",
                "Copyright (c) 2010, 2021 Oracle and/or its affiliates",
                "Copyright (c) 2011, 2019 Oracle and/or its affiliates",
                "Copyright (c) 2011, 2020 Oracle and/or its affiliates",
                "Copyright (c) 2011, 2021 Oracle and/or its affiliates",
                "Copyright (c) 2012, 2019 Oracle and/or its affiliates",
                "Copyright (c) 2012, 2020 Oracle and/or its affiliates",
                "Copyright (c) 2012, 2021 Oracle and/or its affiliates",
                "Copyright (c) 2013, 2019 Oracle and/or its affiliates",
                "Copyright (c) 2013, 2020 Oracle and/or its affiliates",
                "Copyright (c) 2013, 2021 Oracle and/or its affiliates",
                "Copyright (c) 2015, 2019 Oracle and/or its affiliates",
                "Copyright (c) 2017 Oracle and/or its affiliates",
                "Copyright (c) 2017, 2021 Oracle and/or its affiliates",
                "Copyright (c) 2018 Markus KARG.",
                "Copyright (c) 2018, 2020 Eclipse Foundation",
                "Copyright (c) 2019 Oracle and/or its affiliates",
                "Copyright (c) 2021 Eclipse Foundation",
                "copyrighted by the Free Software Foundation"
            ],
            "file-count": 135,
            "sha256": "9daf5a26dd3dce53049784a7d5258037f7b3da7df07eaa19a02efb785719052e",
            "source": "https://search.maven.org/remotecontent?filepath=jakarta/ws/rs/jakarta.ws.rs-api/3.1.0/jakarta.ws.rs-api-3.1.0-sources.jar",
            "status": "restricted"
        }
    ]
}
