{
    "id": "npm/npmjs/@octokit/openapi-types/13.6.0",
    "license": "MIT",
    "authority": "https://gitlab.eclipse.org/eclipsefdn/emo-team/iplab/-/issues/7921",
    "source": "https://github.com/octokit/openapi-types.ts/archive/v13.6.0.zip",
    "status": "approved",
    "scans": [
        {
            "date": "April 21, 2023 at 4:53:47 p.m. GMT",
            "authority": "https://gitlab.eclipse.org/eclipsefdn/emo-team/iplab/-/issues/7921",
            "scancode-version": "31.2.1",
            "licenses-discovered": [
                "MIT",
                "AGPL-3.0-only AND Apache-2.0 AND GPL-3.0-only AND LGPL-3.0-only AND LicenseRef-scancode-proprietary-license AND MIT AND MPL-2.0 AND Unlicense",
                "LicenseRef-scancode-proprietary-license AND MIT"
            ],
            "copyrights": [
                "Copyright 2020 Gregor Martynus"
            ],
            "file-count": 49,
            "sha256": "76f9309034ec1bda7990ee7b9891d19f7180431138af831a2c33f602af3bac1b",
            "source": "https://github.com/octokit/openapi-types.ts/archive/v13.6.0.zip",
            "status": "restricted"
        }
    ]
}
