{
    "id": "maven/mavencentral/org.springframework.security/spring-security-aspects/6.2.2",
    "license": "Apache-2.0",
    "authority": "https://gitlab.eclipse.org/eclipsefdn/emo-team/iplab/-/issues/13723",
    "source": "https://repo1.maven.org/maven2/org/springframework/security/spring-security-aspects/6.2.2/spring-security-aspects-6.2.2-sources.jar",
    "status": "approved",
    "scans": [
        {
            "date": "March 15, 2024 at 2:31:22 p.m. GMT",
            "authority": "https://gitlab.eclipse.org/eclipsefdn/emo-team/iplab/-/issues/13723",
            "scancode-version": "31.2.1",
            "licenses-discovered": [
                "Apache-2.0"
            ],
            "copyrights": [
                "Copyright 2002-2022 the original author or authors"
            ],
            "file-count": 9,
            "sha256": "9035055c5166a37410a72a005d5bab6a4c39c5105c58308f68b5670e501f6365",
            "source": "https://repo1.maven.org/maven2/org/springframework/security/spring-security-aspects/6.2.2/spring-security-aspects-6.2.2-sources.jar",
            "status": "approved"
        }
    ]
}