{
    "id": "maven/mavencentral/software.amazon.awssdk/metrics-spi/2.25.1",
    "license": "Apache-2.0",
    "authority": "https://gitlab.eclipse.org/eclipsefdn/emo-team/iplab/-/issues/13680",
    "source": "https://repo1.maven.org/maven2/software/amazon/awssdk/metrics-spi/2.25.1/metrics-spi-2.25.1-sources.jar",
    "status": "approved",
    "scans": [
        {
            "date": "March 14, 2024 at 12:59:09 p.m. GMT",
            "authority": "https://gitlab.eclipse.org/eclipsefdn/emo-team/iplab/-/issues/13680",
            "scancode-version": "31.2.1",
            "licenses-discovered": [
                "Apache-2.0"
            ],
            "copyrights": [
                "Copyright Amazon.com, Inc. or its affiliates"
            ],
            "file-count": 18,
            "sha256": "da4795ea80aa8aa3c923f3d34443f472082c2dc98fbfb9d2f5e789f801c0e1a6",
            "source": "https://repo1.maven.org/maven2/software/amazon/awssdk/metrics-spi/2.25.1/metrics-spi-2.25.1-sources.jar",
            "status": "approved"
        }
    ]
}