{
    "id": "npm/npmjs/-/eslint/8.42.0",
    "license": "MIT",
    "authority": "https://gitlab.eclipse.org/eclipsefdn/emo-team/iplab/-/issues/9753",
    "source": "https://registry.yarnpkg.com/eslint/-/eslint-8.42.0.tgz",
    "status": "approved",
    "scans": [
        {
            "date": "July 25, 2023 at 5:46:39 p.m. GMT",
            "authority": "https://gitlab.eclipse.org/eclipsefdn/emo-team/iplab/-/issues/9753",
            "scancode-version": "31.2.1",
            "licenses-discovered": [
                "MIT"
            ],
            "copyrights": [
                "Copyright 2013-2016 Dulin Marat and other contributors",
                "Copyright OpenJS Foundation and other contributors, <www.openjsf.org>"
            ],
            "file-count": 404,
            "sha256": "49d02600ed9d413ba21487dd04897bade0bcff8620d805243f1dd11c791babd2",
            "source": "https://registry.yarnpkg.com/eslint/-/eslint-8.42.0.tgz",
            "status": "approved"
        }
    ]
}