{
    "id": "npm/npmjs/-/git-url-parse/16.0.0",
    "license": "MIT",
    "authority": "https://gitlab.eclipse.org/eclipsefdn/emo-team/iplab/-/issues/18893",
    "source": "https://registry.yarnpkg.com/git-url-parse/-/git-url-parse-16.0.0.tgz",
    "status": "approved",
    "scans": [
        {
            "date": "January 18, 2025 at 1:05:38 p.m. GMT",
            "authority": "https://gitlab.eclipse.org/eclipsefdn/emo-team/iplab/-/issues/18893",
            "scancode-version": "31.2.1",
            "licenses-discovered": [
                "MIT"
            ],
            "copyrights": [
                "(c) Ionica Bizau",
                "Copyright (c) 2015-24 Ionica Bizau <bizauionica@gmail.com> (https://ionicabizau.net)"
            ],
            "file-count": 4,
            "sha256": "ae675edf33fecd80440b99598d437fdae0ec8d5b24f88176e828856b5c3e6013",
            "source": "https://registry.yarnpkg.com/git-url-parse/-/git-url-parse-16.0.0.tgz",
            "status": "approved"
        }
    ]
}