{
    "id": "maven/mavencentral/org.eclipse.dataspaceconnector/http/0.0.1-20220922.4-20230220.143048-1",
    "license": "Apache-2.0",
    "authority": "https://gitlab.eclipse.org/eclipsefdn/emo-team/iplab/-/issues/7687",
    "source": "https://search.maven.org/remotecontent?filepath=org/eclipse/dataspaceconnector/http/0.0.1-milestone-6/http-0.0.1-milestone-6-sources.jar",
    "status": "approved",
    "scans": [
        {
            "date": "March 28, 2023 at 9:26:38 p.m. GMT",
            "authority": "https://gitlab.eclipse.org/eclipsefdn/emo-team/iplab/-/issues/7687",
            "scancode-version": "31.2.1",
            "licenses-discovered": [
            ],
            "copyrights": [
            ],
            "file-count": 1,
            "sha256": "1a0a7ffae8669d3779473c99abd1162bc915b2e46037e1d38b9532abfcf9eb28",
            "source": "https://search.maven.org/remotecontent?filepath=org/eclipse/dataspaceconnector/http/0.0.1-milestone-6/http-0.0.1-milestone-6-sources.jar",
            "status": "restricted"
        }
    ]
}
