{
    "id": "maven/mavencentral/org.springframework.boot/spring-boot/2.7.5",
    "license": "Apache-2.0",
    "licenses-discovered": [
        "Apache-2.0"
    ],
    "copyrights": [
        "Copyright 2002-2020 the original author or authors",
        "Copyright 2002-2021 the original author or authors",
        "Copyright 2002-2022 the original author or authors",
        "Copyright 2012-2017 the original author or authors",
        "Copyright 2012-2019 the original author or authors",
        "Copyright 2012-2020 the original author or authors",
        "Copyright 2012-2021 the original author or authors",
        "Copyright 2012-2022 the original author or authors"
    ],
    "file-count": 705,
    "scancode-version": "31.2.1",
    "authority": "https://gitlab.eclipse.org/eclipsefdn/emo-team/iplab/-/issues/4322",
    "source": "https://search.maven.org/remotecontent?filepath=org/springframework/boot/spring-boot/2.7.5/spring-boot-2.7.5-sources.jar",
    "status": "approved"
}