{
    "id": "project/technology.xfsc/eclipse-xfsc-por/did-management-service/3860a0709b90d4da3dbfb7f56b2df4747c30eebf",
    "license": "Apache-2.0",
    "authority": "https://gitlab.eclipse.org/eclipsefdn/emo-team/iplab/-/issues/9572",
    "source": "https://gitlab.eclipse.org/api/v4/projects/eclipse%2Fxfsc%2Fpor%2Fdid-management-service/repository/archive.zip?sha=3860a0709b90d4da3dbfb7f56b2df4747c30eebf",
    "status": "approved",
    "scans": [
        {
            "date": "July 18, 2023 at 4:15:33 a.m. GMT",
            "authority": "https://gitlab.eclipse.org/eclipsefdn/emo-team/iplab/-/issues/9572",
            "scancode-version": "31.2.1",
            "licenses-discovered": [
            ],
            "copyrights": [
            ],
            "file-count": 20,
            "sha256": "5caa852298f6db4c9045b427e9d31847cccd7b944efdd1e79982b42bec29d365",
            "source": "https://gitlab.eclipse.org/api/v4/projects/eclipse%2Fxfsc%2Fpor%2Fdid-management-service/repository/archive.zip?sha=3860a0709b90d4da3dbfb7f56b2df4747c30eebf",
            "status": "restricted"
        }
    ]
}
