{
    "id": "npm/npmjs/-/language-subtag-registry/0.3.22",
    "license": "CC0-1.0",
    "licenses-discovered": [
        "CC0-1.0"
    ],
    "copyrights": [
    ],
    "file-count": 16,
    "scancode-version": "30.1.0",
    "authority": "https://gitlab.eclipse.org/eclipsefdn/emo-team/iplab/-/issues/3233",
    "source": "https://registry.npmjs.org/language-subtag-registry/-/language-subtag-registry-0.3.22.tgz",
    "status": "approved"
}