{
    "id": "npm/npmjs/-/reflect.getprototypeof/1.0.6",
    "license": "MIT",
    "authority": "https://gitlab.eclipse.org/eclipsefdn/emo-team/iplab/-/issues/13910",
    "source": "https://github.com/es-shims/Reflect.getPrototypeOf/archive/refs/tags/v1.0.6.zip",
    "status": "approved",
    "scans": [
        {
            "date": "March 22, 2024 at 2:56:56 a.m. GMT",
            "authority": "https://gitlab.eclipse.org/eclipsefdn/emo-team/iplab/-/issues/13910",
            "scancode-version": "31.2.1",
            "licenses-discovered": [
                "MIT"
            ],
            "copyrights": [
                "Copyright (c) 2021 ECMAScript Shims"
            ],
            "file-count": 21,
            "sha256": "a8441f3a1f5881bd7e4b6092d7f64ba0ab21ba18d2aa3158a2b8918ab846c220",
            "source": "https://github.com/es-shims/Reflect.getPrototypeOf/archive/refs/tags/v1.0.6.zip",
            "status": "approved"
        }
    ]
}