{
    "id": "maven/mavencentral/com.vaadin/vaadin-button-flow/14.8.9",
    "license": "Apache-2.0",
    "authority": "https://gitlab.eclipse.org/eclipsefdn/emo-team/iplab/-/issues/11214",
    "source": "https://repo.maven.apache.org/maven2/com/vaadin/vaadin-button-flow/14.8.9/vaadin-button-flow-14.8.9-sources.jar",
    "status": "approved",
    "scans": [
        {
            "date": "October 25, 2023 at 9:45:18 p.m. GMT",
            "authority": "https://gitlab.eclipse.org/eclipsefdn/emo-team/iplab/-/issues/11214",
            "scancode-version": "31.2.1",
            "licenses-discovered": [
                "Apache-2.0"
            ],
            "copyrights": [
                "Copyright 2000-2022 Vaadin Ltd."
            ],
            "file-count": 6,
            "sha256": "6427d0b0b08c925de058fb37074a5f665007cc4a3b38fbe8564d8a88b55badb1",
            "source": "https://repo.maven.apache.org/maven2/com/vaadin/vaadin-button-flow/14.8.9/vaadin-button-flow-14.8.9-sources.jar",
            "status": "approved"
        }
    ]
}