{
    "id": "maven/mavencentral/org.jboss.arquillian.testenricher/arquillian-testenricher-ejb-jakarta/1.7.0.Alpha13",
    "license": "Apache-2.0",
    "authority": "https://gitlab.eclipse.org/eclipsefdn/emo-team/iplab/-/issues/5296",
    "source": "https://search.maven.org/remotecontent?filepath=org/jboss/arquillian/testenricher/arquillian-testenricher-ejb-jakarta/1.7.0.Alpha13/arquillian-testenricher-ejb-jakarta-1.7.0.Alpha13-sources.jar",
    "status": "approved",
    "scans": [
        {
            "date": "December 1, 2022 at 11:43:25 p.m. GMT",
            "authority": "https://gitlab.eclipse.org/eclipsefdn/emo-team/iplab/-/issues/5296",
            "scancode-version": "31.2.1",
            "licenses-discovered": [
                "Apache-2.0"
            ],
            "copyrights": [
                "Copyright 2020 Red Hat Inc. and/or its affiliates and other contributors as indicated by the authors tag",
                "Copyright 2020 Red Hat Inc. and/or its affiliates and other contributors by the authors"
            ],
            "file-count": 10,
            "sha256": "acdc18b536bfde4ce5da19d82237e64b654e04070fab950052c99ba4d0ee1eb4",
            "source": "https://search.maven.org/remotecontent?filepath=org/jboss/arquillian/testenricher/arquillian-testenricher-ejb-jakarta/1.7.0.Alpha13/arquillian-testenricher-ejb-jakarta-1.7.0.Alpha13-sources.jar",
            "status": "approved"
        }
    ]
}