{
    "id": "maven/mavencentral/org.projectlombok/lombok/1.18.32",
    "license": "MIT",
    "authority": "https://gitlab.eclipse.org/eclipsefdn/emo-team/iplab/-/issues/15192",
    "source": "https://repo1.maven.org/maven2/org/projectlombok/lombok/1.18.32/lombok-1.18.32-sources.jar",
    "status": "approved",
    "scans": [
        {
            "date": "June 14, 2024 at 9:23:48 a.m. GMT",
            "authority": "https://gitlab.eclipse.org/eclipsefdn/emo-team/iplab/-/issues/15192",
            "scancode-version": "31.2.1",
            "licenses-discovered": [
                "MIT"
            ],
            "copyrights": [
                "Copyright (c) 2009 The Project Lombok Authors",
                "Copyright (c) 2009-2010 The Project Lombok Authors",
                "Copyright (c) 2009-2011 The Project Lombok Authors",
                "Copyright (c) 2009-2012 The Project Lombok Authors",
                "Copyright (c) 2009-2014 The Project Lombok Authors",
                "Copyright (c) 2009-2016 The Project Lombok Authors",
                "Copyright (c) 2009-2017 The Project Lombok Authors",
                "Copyright (c) 2009-2018 The Project Lombok Authors",
                "Copyright (c) 2009-2019 The Project Lombok Authors",
                "Copyright (c) 2009-2020 The Project Lombok Authors",
                "Copyright (c) 2009-2021 The Project Lombok Authors",
                "Copyright (c) 2009-2022 The Project Lombok Authors",
                "Copyright (c) 2009-2023 The Project Lombok Authors",
                "Copyright (c) 2009-2024 The Project Lombok Authors",
                "Copyright (c) 2010 The Project Lombok Authors",
                "Copyright (c) 2010-2011 The Project Lombok Authors",
                "Copyright (c) 2010-2012 The Project Lombok Authors",
                "Copyright (c) 2010-2013 The Project Lombok Authors",
                "Copyright (c) 2010-2017 The Project Lombok Authors",
                "Copyright (c) 2010-2018 The Project Lombok Authors",
                "Copyright (c) 2010-2019 The Project Lombok Authors",
                "Copyright (c) 2010-2020 The Project Lombok Authors",
                "Copyright (c) 2010-2021 The Project Lombok Authors",
                "Copyright (c) 2010-2023 The Project Lombok Authors",
                "Copyright (c) 2010-2024 The Project Lombok Authors",
                "Copyright (c) 2011 The Project Lombok Authors",
                "Copyright (c) 2011-2013 The Project Lombok Authors",
                "Copyright (c) 2011-2015 The Project Lombok Authors",
                "Copyright (c) 2011-2019 The Project Lombok Authors",
                "Copyright (c) 2011-2020 The Project Lombok Authors",
                "Copyright (c) 2011-2021 The Project Lombok Authors",
                "Copyright (c) 2012 The Project Lombok Authors",
                "Copyright (c) 2012-2013 The Project Lombok Authors",
                "Copyright (c) 2012-2014 The Project Lombok Authors",
                "Copyright (c) 2012-2017 The Project Lombok Authors",
                "Copyright (c) 2012-2019 The Project Lombok Authors",
                "Copyright (c) 2012-2021 The Project Lombok Authors",
                "Copyright (c) 2012-2022 The Project Lombok Authors",
                "Copyright (c) 2012-2024 The Project Lombok Authors",
                "Copyright (c) 2013 The Project Lombok Authors",
                "Copyright (c) 2013-2014 The Project Lombok Authors",
                "Copyright (c) 2013-2015 The Project Lombok Authors",
                "Copyright (c) 2013-2017 The Project Lombok Authors",
                "Copyright (c) 2013-2018 The Project Lombok Authors",
                "Copyright (c) 2013-2019 The Project Lombok Authors",
                "Copyright (c) 2013-2020 The Project Lombok Authors",
                "Copyright (c) 2013-2021 The Project Lombok Authors",
                "Copyright (c) 2013-2022 The Project Lombok Authors",
                "Copyright (c) 2013-2023 The Project Lombok Authors",
                "Copyright (c) 2014 The Project Lombok Authors",
                "Copyright (c) 2014-2015 The Project Lombok Authors",
                "Copyright (c) 2014-2018 The Project Lombok Authors",
                "Copyright (c) 2014-2020 The Project Lombok Authors",
                "Copyright (c) 2014-2021 The Project Lombok Authors",
                "Copyright (c) 2014-2022 The Project Lombok Authors",
                "Copyright (c) 2014-2023 The Project Lombok Authors",
                "Copyright (c) 2014-2024 The Project Lombok Authors",
                "Copyright (c) 2015 The Project Lombok Authors",
                "Copyright (c) 2015-2016 The Project Lombok Authors",
                "Copyright (c) 2015-2017 The Project Lombok Authors",
                "Copyright (c) 2015-2019 The Project Lombok Authors",
                "Copyright (c) 2015-2020 The Project Lombok Authors",
                "Copyright (c) 2015-2021 The Project Lombok Authors",
                "Copyright (c) 2016 The Project Lombok Authors",
                "Copyright (c) 2016-2017 The Project Lombok Authors",
                "Copyright (c) 2016-2021 The Project Lombok Authors",
                "Copyright (c) 2016-2024 The Project Lombok Authors",
                "Copyright (c) 2017 The Project Lombok Authors",
                "Copyright (c) 2017-2021 The Project Lombok Authors",
                "Copyright (c) 2018 The Project Lombok Authors",
                "Copyright (c) 2018-2021 The Project Lombok Authors",
                "Copyright (c) 2018-2023 The Project Lombok Authors",
                "Copyright (c) 2019 The Project Lombok Authors",
                "Copyright (c) 2019-2020 The Project Lombok Authors",
                "Copyright (c) 2020 The Project Lombok Authors",
                "Copyright (c) 2020-2021 The Project Lombok Authors",
                "Copyright (c) 2020-2022 The Project Lombok Authors",
                "Copyright (c) 2020-2023 The Project Lombok Authors",
                "Copyright (c) 2020-2024 The Project Lombok Authors",
                "Copyright (c) 2021 The Project Lombok Authors",
                "Copyright (c) 2021-2023 The Project Lombok Authors",
                "Copyright (c) 2021-2024 The Project Lombok Authors",
                "Copyright (c) 2022 The Project Lombok Authors",
                "Copyright (c) 2023 The Project Lombok Authors",
                "Copyright (c) 2024 The Project Lombok Authors"
            ],
            "file-count": 391,
            "sha256": "262e1f198b9532da584471c8b4684825b23e7d9dc5006822332fd66c7e12a514",
            "source": "https://repo1.maven.org/maven2/org/projectlombok/lombok/1.18.32/lombok-1.18.32-sources.jar",
            "status": "approved"
        }
    ]
}