{
    "id": "go/golang/golang.org%2Fx/tools/v0.21.1-0.20240508182429-e35e4ccd0d2d",
    "license": "BSD-3-Clause AND MIT",
    "authority": "https://gitlab.eclipse.org/eclipsefdn/emo-team/iplab/-/issues/15548",
    "source": "https://proxy.golang.org/golang.org%2Fx/tools/@v/v0.21.1-0.20240508182429-e35e4ccd0d2d.zip",
    "status": "approved",
    "scans": [
        {
            "date": "July 3, 2024 at 11:51:33 a.m. GMT",
            "authority": "https://gitlab.eclipse.org/eclipsefdn/emo-team/iplab/-/issues/15548",
            "scancode-version": "31.2.1",
            "licenses-discovered": [
                "BSD-3-Clause",
                "MIT"
            ],
            "copyrights": [
                "Copyright (c) 1994-1999 Lucent Technologies Inc.",
                "Copyright (c) 2000-2007 Lucent Technologies Inc. and others",
                "Copyright (c) 2009 The Go Authors",
                "Copyright 2009 The Go Authors",
                "Copyright 2010 The Go Authors",
                "Copyright 2011 The Go Authors",
                "Copyright 2012 The Go Authors",
                "Copyright 2013 The Go Authors",
                "Copyright 2013 jQuery Foundation and other contributors",
                "Copyright 2014 The Go Authors",
                "Copyright 2015 The Go Authors",
                "Copyright 2016 The Go Authors",
                "Copyright 2017 The Go Authors",
                "Copyright 2018 The Go Authors",
                "Copyright 2019 The Go Authors",
                "Copyright 2020 The Go Authors",
                "Copyright 2021 The Go Authors",
                "Copyright 2022 The Go Authors",
                "Copyright 2023 The Go Authors",
                "Copyright 2024 The Go Authors",
                "Copyright Jorn Zaefferer",
                "Portions Copyright (c) 1995-1997 C H Forsyth (forsyth@terzarima.net)",
                "Portions Copyright (c) 1997-1999 Vita Nuova Limited",
                "Portions Copyright (c) 2000-2007 Vita Nuova Holdings Limited (www.vitanuova.com)",
                "Portions Copyright (c) 2004,2006 Bruce Ellis",
                "Portions Copyright (c) 2005-2007 C H Forsyth (forsyth@terzarima.net)",
                "Portions Copyright (c) 2009 The Go Authors"
            ],
            "file-count": 1397,
            "sha256": "80beec66ba124d6d097ac4ee77e54db0ecd47ecc9bf3474a04c81f4e8fd2dd4a",
            "source": "https://proxy.golang.org/golang.org%2Fx/tools/@v/v0.21.1-0.20240508182429-e35e4ccd0d2d.zip",
            "status": "approved"
        }
    ]
}