{
    "id": "maven/mavencentral/org.geotools/gt-main/30.1",
    "license": "LGPL-2.1-only AND (BSD-3-Clause AND LGPL-2.1-only) AND (LGPL-2.1-only AND WTFPL) AND LGPL-2.1-or-later",
    "authority": "https://gitlab.eclipse.org/eclipsefdn/emo-team/iplab/-/issues/12726",
    "source": "https://repo.osgeo.org/repository/geotools-releases/org/geotools/gt-main/30.1/gt-main-30.1-sources.jar",
    "status": "approved",
    "scans": [
        {
            "date": "January 11, 2024 at 12:14:33 a.m. GMT",
            "authority": "https://gitlab.eclipse.org/eclipsefdn/emo-team/iplab/-/issues/12726",
            "scancode-version": "31.2.1",
            "licenses-discovered": [
                "LGPL-2.1-only",
                "BSD-3-Clause AND LGPL-2.1-only",
                "LGPL-2.1-only AND WTFPL",
                "LGPL-2.0-or-later",
                "LGPL-2.1-or-later",
                "LGPL-2.1-only AND LicenseRef-scancode-proprietary-license"
            ],
            "copyrights": [
                "(c) 2001, Vivid Solutions",
                "(c) 2001-2007, Open Source Geospatial Foundation",
                "(c) 2001-2013, Open Source Geospatial Foundation",
                "(c) 2002-2008, Open Source Geospatial Foundation",
                "(c) 2002-2011, Open Source Geospatial Foundation",
                "(c) 2002-2012, Open Source Geospatial Foundation",
                "(c) 2002-2014, Open Source Geospatial Foundation",
                "(c) 2002-2015, Open Source Geospatial Foundation",
                "(c) 2002-2016, Open Source Geospatial Foundation",
                "(c) 2002-2018, Open Source Geospatial Foundation",
                "(c) 2003-2008, Open Source Geospatial Foundation",
                "(c) 2003-2012, Open Source Geospatial Foundation",
                "(c) 2003-2015, Open Source Geospatial Foundation",
                "(c) 2003-2016, Open Source Geospatial Foundation",
                "(c) 2004 - 2015, Open Source Geospatial Foundation",
                "(c) 2004-2008, Open Source Geospatial Foundation",
                "(c) 2004-2010, Open Source Geospatial Foundation",
                "(c) 2004-2012, Open Source Geospatial Foundation",
                "(c) 2004-2014, Open Source Geospatial Foundation",
                "(c) 2004-2015, Open Source Geospatial Foundation",
                "(c) 2004-2016, Open Source Geospatial Foundation",
                "(c) 2004-2022, Open Source Geospatial Foundation",
                "(c) 2005, Open Geospatial Consortium Inc.",
                "(c) 2005-2008, Open Source Geospatial Foundation",
                "(c) 2005-2010, Open Source Geospatial Foundation",
                "(c) 2005-2012, Open Source Geospatial Foundation",
                "(c) 2005-2013, Open Source Geospatial Foundation",
                "(c) 2005-2014, Open Source Geospatial Foundation",
                "(c) 2005-2015, Open Source Geospatial Foundation",
                "(c) 2005-2016, Open Source Geospatial Foundation",
                "(c) 2006 - 2015, Open Source Geospatial Foundation",
                "(c) 2006-2008, Open Source Geospatial Foundation",
                "(c) 2006-2011, Open Source Geospatial Foundation",
                "(c) 2006-2015, Open Source Geospatial Foundation",
                "(c) 2006-2016, Open Source Geospatial Foundation",
                "(c) 2007-2008, Open Source Geospatial Foundation",
                "(c) 2007-2015, Open Source Geospatial Foundation",
                "(c) 2008 - 2015, Open Source Geospatial Foundation",
                "(c) 2008, Open Source Geospatial Foundation",
                "(c) 2008-2010, Open Source Geospatial Foundation",
                "(c) 2008-2011 TOPP - www.openplans.org",
                "(c) 2008-2012 TOPP - www.openplans.org",
                "(c) 2008-2014, Open Source Geospatial Foundation",
                "(c) 2008-2015, Open Source Geospatial Foundation",
                "(c) 2008-2016, Open Source Geospatial Foundation",
                "(c) 2009 - 2016, Open Source Geospatial Foundation",
                "(c) 2009, Open Source Geospatial Foundation",
                "(c) 2009-2011, Open Source Geospatial Foundation",
                "(c) 2009-2015, Open Source Geospatial Foundation",
                "(c) 2010 - 2016, Open Source Geospatial Foundation",
                "(c) 2010, Open Source Geospatial Foundation",
                "(c) 2010-2016, Open Source Geospatial Foundation",
                "(c) 2011, Open Source Geospatial Foundation",
                "(c) 2011-2015, Open Source Geospatial Foundation",
                "(c) 2012, Open Source Geospatial Foundation",
                "(c) 2013, Open Source Geospatial Foundation",
                "(c) 2013-2016, Open Source Geospatial Foundation",
                "(c) 2014 - 2015, Open Source Geospatial Foundation",
                "(c) 2014, Open Source Geospatial Foundation",
                "(c) 2014-2015, Open Source Geospatial Foundation",
                "(c) 2015, Open Source Geospatial Foundation",
                "(c) 2015-2016, Open Source Geospatial Foundation",
                "(c) 2016, Open Source Geospatial Foundation",
                "(c) 2017, Open Source Geospatial Foundation",
                "(c) 2018, Open Source Geospatial Foundation",
                "(c) 2019, Open Source Geospatial Foundation",
                "(c) 2020, Open Source Geospatial Foundation",
                "(c) 2021, Open Source Geospatial Foundation",
                "(c) 2022, Open Source Geospatial Foundation",
                "(c) 2023, Open Source Geospatial Foundation",
                "Copyright (c) 2001 - 2014 Vivid Solutions",
                "Copyright (c) 2001 Vivid Solutions",
                "Copyright (c) 2002-2004, Dennis M. Sosnoski",
                "Copyright 2010-2011 Michael Bedward"
            ],
            "file-count": 884,
            "sha256": "b30593f7f8c2165382b75e701d42a9042004ef950d739335ba185c57af1d3cef",
            "source": "https://repo.osgeo.org/repository/geotools-releases/org/geotools/gt-main/30.1/gt-main-30.1-sources.jar",
            "status": "restricted"
        }
    ]
}
