{
    "id": "p2/orbit/p2.eclipse.feature/org.eclipse.emf.common/2.20.0.v20200822-0801",
    "license": "EPL-1.0 AND EPL-2.0 AND EPL-2.0",
    "licenses-discovered": [
        "EPL-1.0 AND EPL-2.0",
        "EPL-2.0"
    ],
    "copyrights": [
        "(c) 2008 VeriSign, Inc.",
        "Copyright (c) 2002-2004 IBM Corporation and others",
        "Copyright (c) 2002-2006 IBM Corporation and others",
        "Copyright (c) 2002-2007 IBM Corporation and others",
        "Copyright (c) 2002-2009 IBM Corporation and others",
        "Copyright (c) 2002-2012 IBM Corporation and others",
        "Copyright (c) 2002-2013 IBM Corporation and others",
        "Copyright (c) 2004 IBM Corporation and others",
        "Copyright (c) 2004-2006 IBM Corporation and others",
        "Copyright (c) 2004-2007 IBM Corporation and others",
        "Copyright (c) 2004-2008 IBM Corporation and others",
        "Copyright (c) 2005 IBM Corporation and others",
        "Copyright (c) 2005-2006 IBM Corporation and others",
        "Copyright (c) 2005-2012 IBM Corporation and others",
        "Copyright (c) 2006 IBM Corporation and others",
        "Copyright (c) 2008 IBM Corporation and others",
        "Copyright (c) 2009 IBM Corporation and others",
        "Copyright (c) 2010-2011 Ed Merks and others",
        "Copyright (c) 2013 Eclipse"
    ],
    "file-count": 75,
    "scancode-version": "31.2.1",
    "authority": "https://gitlab.eclipse.org/eclipsefdn/emo-team/iplab/-/issues/4076",
    "source": "https://search.maven.org/remotecontent?filepath=org/eclipse/emf/org.eclipse.emf.common/2.20.0/org.eclipse.emf.common-2.20.0-sources.jar",
    "status": "approved"
}