{
    "id": "npm/npmjs/-/has-proto/1.1.0",
    "license": "MIT",
    "authority": "https://gitlab.eclipse.org/eclipsefdn/emo-team/iplab/-/issues/17605",
    "source": "https://github.com/inspect-js/has-proto/archive/refs/tags/v1.1.0.zip",
    "status": "approved",
    "scans": [
        {
            "date": "December 2, 2024 at 9:26:53 p.m. GMT",
            "authority": "https://gitlab.eclipse.org/eclipsefdn/emo-team/iplab/-/issues/17605",
            "scancode-version": "31.2.1",
            "licenses-discovered": [
                "MIT"
            ],
            "copyrights": [
                "Copyright (c) 2022 Inspect JS"
            ],
            "file-count": 26,
            "sha256": "8da997506fa7629814ebec997572ae184e1b1363dda8cb76c815e743b849f68f",
            "source": "https://github.com/inspect-js/has-proto/archive/refs/tags/v1.1.0.zip",
            "status": "approved"
        }
    ]
}