{
    "id": "go/golang/helm.sh%2Fhelm/v3/v3.12.2",
    "license": "Apache-2.0 AND (Apache-2.0 AND BSD-3-Clause) AND BSD-3-Clause AND (Apache-2.0 AND MIT)",
    "authority": "https://gitlab.eclipse.org/eclipsefdn/emo-team/iplab/-/issues/10681",
    "source": "https://proxy.golang.org/helm.sh%2Fhelm/v3/@v/v3.12.2.zip",
    "status": "approved",
    "scans": [
        {
            "date": "September 26, 2023 at 2:45:29 p.m. GMT",
            "authority": "https://gitlab.eclipse.org/eclipsefdn/emo-team/iplab/-/issues/10681",
            "scancode-version": "31.2.1",
            "licenses-discovered": [
                "Apache-2.0",
                "Apache-2.0 AND BSD-3-Clause",
                "BSD-3-Clause",
                "Apache-2.0 AND MIT"
            ],
            "copyrights": [
                "Copyright (c) 2004, 2006 The Linux Foundation and its contributors",
                "Copyright 2016 The Kubernetes Authors"
            ],
            "file-count": 1797,
            "sha256": "870bd327cfbab91068dc1428aa18b55bf6bb422f95e0a864abb91f745c383115",
            "source": "https://proxy.golang.org/helm.sh%2Fhelm/v3/@v/v3.12.2.zip",
            "status": "approved"
        }
    ]
}