{
    "id": "maven/mavencentral/io.fabric8/servicecatalog-model/6.5.0",
    "license": "Apache-2.0",
    "authority": "https://gitlab.eclipse.org/eclipsefdn/emo-team/iplab/-/issues/7363",
    "source": "https://search.maven.org/remotecontent?filepath=io/fabric8/servicecatalog-model/6.5.0/servicecatalog-model-6.5.0-sources.jar",
    "status": "approved",
    "scans": [
        {
            "date": "March 14, 2023 at 10:18:09 a.m. GMT",
            "authority": "https://gitlab.eclipse.org/eclipsefdn/emo-team/iplab/-/issues/7363",
            "scancode-version": "31.2.1",
            "licenses-discovered": [
                "Apache-2.0"
            ],
            "copyrights": [
                "Copyright (c) 2015 Red Hat, Inc."
            ],
            "file-count": 230,
            "sha256": "1d9e989ced4f6fc84bd9cc36ba996096039f3965f9e30198833ab842ef2260fb",
            "source": "https://search.maven.org/remotecontent?filepath=io/fabric8/servicecatalog-model/6.5.0/servicecatalog-model-6.5.0-sources.jar",
            "status": "approved"
        }
    ]
}