{
    "id": "nuget/nuget/-/Swashbuckle.AspNetCore.Swagger/6.9.0",
    "license": "MIT AND Apache-2.0",
    "authority": "https://gitlab.eclipse.org/eclipsefdn/emo-team/iplab/-/issues/16817",
    "source": "https://github.com/domaindrivendev/Swashbuckle.AspNetCore/archive/refs/tags/v6.9.0.zip",
    "status": "approved",
    "scans": [
        {
            "date": "October 21, 2024, 7:00:22 a.m. GMT",
            "authority": "https://gitlab.eclipse.org/eclipsefdn/emo-team/iplab/-/issues/16817",
            "scancode-version": "31.2.1",
            "licenses-discovered": [
                "MIT",
                "Apache-2.0"
            ],
            "copyrights": [
                "Copyright (c) 2016 Richard Morris",
                "Copyright (c) 2016-$( System.DateTime ::Now.ToString(yyyy)) Richard Morris"
            ],
            "file-count": 566,
            "sha256": "5ed064f9c721c7847bde6ae9ae9e106a1cf6d4f0849f4bffed84abf70a998b9a",
            "source": "https://github.com/domaindrivendev/Swashbuckle.AspNetCore/archive/refs/tags/v6.9.0.zip",
            "status": "approved"
        }
    ]
}