{
    "id": "npm/npmjs/@types/vscode/1.83.0",
    "license": "MIT",
    "authority": "https://gitlab.eclipse.org/eclipsefdn/emo-team/iplab/-/issues/11023",
    "source": "https://registry.yarnpkg.com/@types/vscode/-/vscode-1.83.0.tgz",
    "status": "approved",
    "scans": [
        {
            "date": "October 10, 2023 at 9:56:39 p.m. GMT",
            "authority": "https://gitlab.eclipse.org/eclipsefdn/emo-team/iplab/-/issues/11023",
            "scancode-version": "31.2.1",
            "licenses-discovered": [
                "MIT"
            ],
            "copyrights": [
                "Copyright (c) Microsoft Corporation"
            ],
            "file-count": 4,
            "sha256": "eb2e2c7aea2fe9c44d28d587596845b04ca1a76d637da2c64a2c2ea8ef55f85f",
            "source": "https://registry.yarnpkg.com/@types/vscode/-/vscode-1.83.0.tgz",
            "status": "approved"
        }
    ]
}