{
    "id": "maven/mavencentral/com.sun.jersey/jersey-client/1.19.4",
    "license": "CDDL-1.1 AND (GPL-2.0-only WITH Classpath-exception-2.0)",
    "authority": "https://gitlab.eclipse.org/eclipsefdn/emo-team/iplab/-/issues/19735",
    "source": "https://repo1.maven.org/maven2/com/sun/jersey/jersey-client/1.19.4/jersey-client-1.19.4-sources.jar",
    "status": "restricted",
    "scans": [
        {
            "date": "March 1, 2025 at 1:23:59 a.m. GMT",
            "authority": "https://gitlab.eclipse.org/eclipsefdn/emo-team/iplab/-/issues/19735",
            "scancode-version": "31.2.1",
            "licenses-discovered": [
                "CDDL-1.1 AND (GPL-2.0-only WITH Classpath-exception-2.0)"
            ],
            "copyrights": [
                "Copyright (c) 2010-2011 Oracle and/or its affiliates",
                "Copyright (c) 2010-2013 Oracle and/or its affiliates",
                "Copyright (c) 2010-2015 Oracle and/or its affiliates",
                "Copyright (c) 2011 Oracle and/or its affiliates",
                "FutureTask (c) Override"
            ],
            "file-count": 55,
            "sha256": "9631abce0f95276f98df223721776e2901d88af6a5cc9e7b6f7bd43dfe7eb5e6",
            "source": "https://repo1.maven.org/maven2/com/sun/jersey/jersey-client/1.19.4/jersey-client-1.19.4-sources.jar",
            "status": "restricted"
        }
    ]
}