{
    "id": "maven/mavencentral/com.vaadin/flow-html-components/24.3.7",
    "license": "Apache-2.0",
    "authority": "https://gitlab.eclipse.org/eclipsefdn/emo-team/iplab/-/issues/13713",
    "source": "https://repo1.maven.org/maven2/com/vaadin/flow-html-components/24.3.7/flow-html-components-24.3.7-sources.jar",
    "status": "approved",
    "scans": [
        {
            "date": "March 15, 2024 at 12:34:46 p.m. GMT",
            "authority": "https://gitlab.eclipse.org/eclipsefdn/emo-team/iplab/-/issues/13713",
            "scancode-version": "31.2.1",
            "licenses-discovered": [
                "Apache-2.0"
            ],
            "copyrights": [
                "Copyright 2000-2023 Vaadin Ltd."
            ],
            "file-count": 39,
            "sha256": "56c01635a1d371105bf81564fdf57de0d1a1f644bf5e9c9b0272352351b7046b",
            "source": "https://repo1.maven.org/maven2/com/vaadin/flow-html-components/24.3.7/flow-html-components-24.3.7-sources.jar",
            "status": "approved"
        }
    ]
}