{
    "id": "npm/npmjs/@petamoriken/float16/3.4.7",
    "license": "Apache-2.0 AND MIT",
    "licenses-discovered": [
        "MIT",
        "Apache-2.0",
        "LicenseRef-scancode-unknown-license-reference"
    ],
    "file-count": 38,
    "scancode-version": "30.1.0",
    "authority": "https://gitlab.eclipse.org/eclipsefdn/emo-team/iplab/-/issues/2092",
    "source": "https://github.com/petamoriken/float16/archive/v3.4.7.zip",
    "status": "approved"
}
