{
    "id": "maven/mavencentral/com.azure.resourcemanager/azure-resourcemanager-keyvault/2.28.0",
    "license": "MIT",
    "authority": "https://gitlab.eclipse.org/eclipsefdn/emo-team/iplab/-/issues/9678",
    "source": "https://repo.maven.apache.org/maven2/com/azure/resourcemanager/azure-resourcemanager-keyvault/2.28.0/azure-resourcemanager-keyvault-2.28.0-sources.jar",
    "status": "approved",
    "scans": [
        {
            "date": "July 20, 2023 at 11:24:06 a.m. GMT",
            "authority": "https://gitlab.eclipse.org/eclipsefdn/emo-team/iplab/-/issues/9678",
            "scancode-version": "31.2.1",
            "licenses-discovered": [
                "MIT"
            ],
            "copyrights": [
                "(c) 2008 VeriSign, Inc.",
                "Copyright (c) Microsoft Corporation"
            ],
            "file-count": 141,
            "sha256": "0898914985f1a7d0f5a14d12f69e45d952932e18f110e5d4458c89956d6535b2",
            "source": "https://repo.maven.apache.org/maven2/com/azure/resourcemanager/azure-resourcemanager-keyvault/2.28.0/azure-resourcemanager-keyvault-2.28.0-sources.jar",
            "status": "approved"
        }
    ]
}