{
    "id": "p2/orbit/p2.eclipse-plugin/net.sf.jasperreports.jasperreports/6.7.0",
    "license": "LicenseRef-scancode-commercial-license",
    "licenses-discovered": [
        "LicenseRef-scancode-commercial-license"
    ],
    "file-count": 3002,
    "scancode-version": "30.1.0",
    "authority": "https://gitlab.eclipse.org/eclipsefdn/emo-team/iplab/-/issues/2275",
    "source": "https://search.maven.org/remotecontent?filepath=net/sf/jasperreports/jasperreports/6.7.0/jasperreports-6.7.0-sources.jar",
    "status": "restricted"
}