{
    "id": "npm/npmjs/-/esbuild-wasm/0.18.17",
    "license": "Apache-2.0 AND MIT AND BSD-3-Clause AND (BSD-2-Clause AND BSD-3-Clause)",
    "authority": "https://gitlab.eclipse.org/eclipsefdn/emo-team/iplab/-/issues/13304",
    "source": "https://github.com/evanw/esbuild/archive/refs/tags/v0.18.17.zip",
    "status": "approved",
    "scans": [
        {
            "date": "February 19, 2024 at 2:38:01 p.m. GMT",
            "authority": "https://gitlab.eclipse.org/eclipsefdn/emo-team/iplab/-/issues/13304",
            "scancode-version": "31.2.1",
            "licenses-discovered": [
                "Apache-2.0",
                "MIT",
                "BSD-3-Clause",
                "BSD-2-Clause AND BSD-3-Clause"
            ],
            "copyrights": [
                "(c) Evil Software Corp",
                "(c) Good Software",
                "(c) Good Software Corp",
                "(c) expectPrintedTarget t, 2019",
                "Copyright (c) 2009 The Go Authors",
                "Copyright (c) 2016 Caleb Spare",
                "Copyright (c) 2020 Evan Wallace",
                "Copyright (c) Microsoft Corporation",
                "Copyright 2012-2019 (c) Mihai Bazon <mihai.bazon@gmail.com>"
            ],
            "file-count": 292,
            "sha256": "92c9b3d8e684e51694e08490b4f0d6553d53adbfb06a6bc35a1890551e9a06cb",
            "source": "https://github.com/evanw/esbuild/archive/refs/tags/v0.18.17.zip",
            "status": "approved"
        }
    ]
}