{
    "id": "maven/mavencentral/com.azure.resourcemanager/azure-resourcemanager-dns/2.39.0",
    "license": "MIT",
    "authority": "https://gitlab.eclipse.org/eclipsefdn/emo-team/iplab/-/issues/15097",
    "source": "https://repo1.maven.org/maven2/com/azure/resourcemanager/azure-resourcemanager-dns/2.39.0/azure-resourcemanager-dns-2.39.0-sources.jar",
    "status": "approved",
    "scans": [
        {
            "date": "June 6, 2024 at 11:16:56 a.m. GMT",
            "authority": "https://gitlab.eclipse.org/eclipsefdn/emo-team/iplab/-/issues/15097",
            "scancode-version": "31.2.1",
            "licenses-discovered": [
                "MIT"
            ],
            "copyrights": [
                "(c) 2008 VeriSign, Inc.",
                "Copyright (c) Microsoft Corporation"
            ],
            "file-count": 93,
            "sha256": "d00ed782e3518889651170d7af71045fb9af1fd018ae7171095406337af205c5",
            "source": "https://repo1.maven.org/maven2/com/azure/resourcemanager/azure-resourcemanager-dns/2.39.0/azure-resourcemanager-dns-2.39.0-sources.jar",
            "status": "approved"
        }
    ]
}