{
    "id": "maven/mavencentral/org.scalatest/scalatest-mustmatchers_2.13/3.2.12",
    "license": "Apache-2.0",
    "licenses-discovered": [
    ],
    "copyrights": [
    ],
    "file-count": 1,
    "scancode-version": "31.2.1",
    "authority": "https://gitlab.eclipse.org/eclipsefdn/emo-team/iplab/-/issues/4478",
    "source": "https://search.maven.org/remotecontent?filepath=org/scalatest/scalatest-mustmatchers_2.13/3.2.12/scalatest-mustmatchers_2.13-3.2.12-sources.jar",
    "status": "approved"
}
