{
    "id": "npm/npmjs/-/postcss-sort-media-queries/4.4.1",
    "license": "MIT",
    "authority": "https://gitlab.eclipse.org/eclipsefdn/emo-team/iplab/-/issues/11343",
    "source": "https://github.com/yunusga/postcss-sort-media-queries/archive/refs/tags/v4.4.1.zip",
    "status": "approved",
    "scans": [
        {
            "date": "October 27, 2023 at 10:53:02 a.m. GMT",
            "authority": "https://gitlab.eclipse.org/eclipsefdn/emo-team/iplab/-/issues/11343",
            "scancode-version": "31.2.1",
            "licenses-discovered": [
                "MIT"
            ],
            "copyrights": [
                "Copyright 2019 Yunus Gaziev <yunusga@yandex.ru>"
            ],
            "file-count": 39,
            "sha256": "cbfb33a3269158521e083a949e4c5f3e241049f9ea089587e62a4e8edd792196",
            "source": "https://github.com/yunusga/postcss-sort-media-queries/archive/refs/tags/v4.4.1.zip",
            "status": "approved"
        }
    ]
}