{
    "id": "maven/mavencentral/io.mockk/mockk-agent-api/1.13.5",
    "license": "Apache-2.0",
    "authority": "https://gitlab.eclipse.org/eclipsefdn/emo-team/iplab/-/issues/10186",
    "source": "https://repo.maven.apache.org/maven2/io/mockk/mockk-agent-api/1.13.5/mockk-agent-api-1.13.5-sources.jar",
    "status": "approved",
    "scans": [
        {
            "date": "August 23, 2023 at 1:45:48 p.m. GMT",
            "authority": "https://gitlab.eclipse.org/eclipsefdn/emo-team/iplab/-/issues/10186",
            "scancode-version": "31.2.1",
            "licenses-discovered": [
            ],
            "copyrights": [
            ],
            "file-count": 15,
            "sha256": "e1c3297f9eeeaeff66074c53da0be0deb367858424c5ad1fa3d846fe9f8ae11f",
            "source": "https://repo.maven.apache.org/maven2/io/mockk/mockk-agent-api/1.13.5/mockk-agent-api-1.13.5-sources.jar",
            "status": "restricted"
        }
    ]
}
