{
    "id": "maven/mavencentral/org.flywaydb/flyway-database-postgresql/10.16.0",
    "license": "Apache-2.0",
    "authority": "https://gitlab.eclipse.org/eclipsefdn/emo-team/iplab/-/issues/15746",
    "source": "https://repo1.maven.org/maven2/org/flywaydb/flyway-database-postgresql/10.16.0/flyway-database-postgresql-10.16.0-sources.jar",
    "status": "approved",
    "scans": [
        {
            "date": "July 23, 2024 at 9:57:38 a.m. GMT",
            "authority": "https://gitlab.eclipse.org/eclipsefdn/emo-team/iplab/-/issues/15746",
            "scancode-version": "31.2.1",
            "licenses-discovered": [
                "Apache-2.0"
            ],
            "copyrights": [
                "Copyright (c) 2010 - 2024 Red Gate Software Ltd"
            ],
            "file-count": 25,
            "sha256": "20bd36094a73f157c3d6e1e21ec1b0fffab6a9f5bdc2c46112fda8a4340277cc",
            "source": "https://repo1.maven.org/maven2/org/flywaydb/flyway-database-postgresql/10.16.0/flyway-database-postgresql-10.16.0-sources.jar",
            "status": "approved"
        }
    ]
}