{
    "id": "npm/npmjs/@types/eslint/8.44.0",
    "license": "MIT",
    "authority": "https://gitlab.eclipse.org/eclipsefdn/emo-team/iplab/-/issues/9382",
    "source": "https://registry.npmjs.org/@types/eslint/-/eslint-8.44.0.tgz",
    "status": "approved",
    "scans": [
        {
            "date": "July 12, 2023 at 2:14:23 p.m. GMT",
            "authority": "https://gitlab.eclipse.org/eclipsefdn/emo-team/iplab/-/issues/9382",
            "scancode-version": "31.2.1",
            "licenses-discovered": [
                "MIT"
            ],
            "copyrights": [
                "Copyright (c) Microsoft Corporation"
            ],
            "file-count": 15,
            "sha256": "209c99af1750a3ccdca9376bffb167326f4d16a0b973e4bfe7bd15d7460d9074",
            "source": "https://registry.npmjs.org/@types/eslint/-/eslint-8.44.0.tgz",
            "status": "approved"
        }
    ]
}