{
    "id": "maven/mavencentral/com.google.dagger/dagger-compiler/2.49",
    "license": "Apache-2.0",
    "authority": "https://gitlab.eclipse.org/eclipsefdn/emo-team/iplab/-/issues/11831",
    "source": "https://repo1.maven.org/maven2/com/google/dagger/dagger-compiler/2.49/dagger-compiler-2.49-sources.jar",
    "status": "approved",
    "scans": [
        {
            "date": "December 5, 2023 at 10:19:24 a.m. GMT",
            "authority": "https://gitlab.eclipse.org/eclipsefdn/emo-team/iplab/-/issues/11831",
            "scancode-version": "31.2.1",
            "licenses-discovered": [
                "Apache-2.0"
            ],
            "copyrights": [
                "Copyright (c) 2013 The Dagger Authors",
                "Copyright (c) 2014 The Dagger Authors",
                "Copyright (c) 2015 The Dagger Authors",
                "Copyright (c) 2016 The Dagger Authors",
                "Copyright (c) 2017 The Dagger Authors",
                "Copyright (c) 2018 The Dagger Authors",
                "Copyright (c) 2019 The Dagger Authors",
                "Copyright (c) 2020 The Dagger Authors",
                "Copyright (c) 2021 The Dagger Authors",
                "Copyright (c) 2022 The Dagger Authors",
                "Copyright (c) 2023 The Dagger Authors"
            ],
            "file-count": 564,
            "sha256": "10081f708c1774c60d66998e8e7c566fd51fe57b69a094aada46d9ae7f213e9a",
            "source": "https://repo1.maven.org/maven2/com/google/dagger/dagger-compiler/2.49/dagger-compiler-2.49-sources.jar",
            "status": "approved"
        }
    ]
}