{
    "id": "nuget/nuget/-/xunit.runner.visualstudio/2.8.1",
    "license": "Apache-2.0 AND MIT",
    "authority": "https://gitlab.eclipse.org/eclipsefdn/emo-team/iplab/-/issues/15181",
    "source": "https://github.com/xunit/visualstudio.xunit/archive/refs/tags/2.8.1.zip",
    "status": "approved",
    "scans": [
        {
            "date": "June 13, 2024 at 5:35:35 p.m. GMT",
            "authority": "https://gitlab.eclipse.org/eclipsefdn/emo-team/iplab/-/issues/15181",
            "scancode-version": "31.2.1",
            "licenses-discovered": [
                "Apache-2.0 AND MIT",
                "Apache-2.0 AND LicenseRef-scancode-free-unknown",
                "Apache-2.0",
                "MIT"
            ],
            "copyrights": [
                "Copyright (c) .NET Foundation",
                "Copyright (c) .NET Foundation and Contributors",
                "Copyright (c) .NET Foundation and contributors",
                "Copyright (c) 2015 .NET Foundation"
            ],
            "file-count": 131,
            "sha256": "af8fe91f31ef30e6fb083892a9301d3bb012c17711be7164e575e7ae6d45d478",
            "source": "https://github.com/xunit/visualstudio.xunit/archive/refs/tags/2.8.1.zip",
            "status": "restricted"
        }
    ]
}