{
    "id": "npm/npmjs/@docusaurus/plugin-content-pages/3.7.0",
    "license": "MIT",
    "authority": "https://gitlab.eclipse.org/eclipsefdn/emo-team/iplab/-/issues/19024",
    "source": "https://github.com/facebook/docusaurus/archive/refs/tags/v3.7.0.zip",
    "status": "approved",
    "scans": [
        {
            "date": "January 20, 2025 at 12:54:58 a.m. GMT",
            "authority": "https://gitlab.eclipse.org/eclipsefdn/emo-team/iplab/-/issues/19024",
            "scancode-version": "31.2.1",
            "licenses-discovered": [
                "MIT",
                "CC-BY-4.0",
                "CC-BY-4.0 AND CC-BY-NC-SA-4.0 AND CC-BY-SA-4.0 AND MIT",
                "OFL-1.1"
            ],
            "copyrights": [
                "(c) (c) (r) (R) (tm)",
                "(c) 2009-2010, Design Science, Inc.",
                "Copyright (c) 2009-2010 Design Science, Inc.",
                "Copyright (c) 2014-2018 Khan",
                "Copyright (c) 2014-2018 Khan Academy <www.khanacademy.org>",
                "Copyright (c) 2015 John Agan",
                "Copyright (c) 2020 Elvis Wolcott",
                "Copyright (c) Facebook, Inc.",
                "Copyright (c) Facebook, Inc. and its affiliates",
                "copyright Props ReactNode"
            ],
            "file-count": 3714,
            "sha256": "57d219848bc62c7557db052d488d660facbe4103543388f3409815c15fbfba03",
            "source": "https://github.com/facebook/docusaurus/archive/refs/tags/v3.7.0.zip",
            "status": "restricted"
        }
    ]
}