{
    "id": "maven/mavencentral/io.fabric8/kubernetes-model-autoscaling/6.4.0",
    "license": "Apache-2.0",
    "authority": "https://gitlab.eclipse.org/eclipsefdn/emo-team/iplab/-/issues/6598",
    "source": "https://search.maven.org/remotecontent?filepath=io/fabric8/kubernetes-model-autoscaling/6.4.0/kubernetes-model-autoscaling-6.4.0-sources.jar",
    "status": "approved",
    "scans": [
        {
            "date": "January 24, 2023 at 8:53:52 a.m. GMT",
            "authority": "https://gitlab.eclipse.org/eclipsefdn/emo-team/iplab/-/issues/6598",
            "scancode-version": "31.2.1",
            "licenses-discovered": [
                "Apache-2.0"
            ],
            "copyrights": [
                "Copyright (c) 2015 Red Hat, Inc."
            ],
            "file-count": 305,
            "sha256": "478d4bf28ad1dab1bb7af782a2ac44aa6160f74d641428408b7064469071a0f5",
            "source": "https://search.maven.org/remotecontent?filepath=io/fabric8/kubernetes-model-autoscaling/6.4.0/kubernetes-model-autoscaling-6.4.0-sources.jar",
            "status": "approved"
        }
    ]
}