{
    "id": "npm/npmjs/-/unist-util-generated/2.0.1",
    "license": "MIT",
    "authority": "https://gitlab.eclipse.org/eclipsefdn/emo-team/iplab/-/issues/6645",
    "source": "https://registry.yarnpkg.com/unist-util-generated/-/unist-util-generated-2.0.1.tgz",
    "status": "approved",
    "scans": [
        {
            "date": "January 25, 2023 at 10:58:06 a.m. GMT",
            "authority": "https://gitlab.eclipse.org/eclipsefdn/emo-team/iplab/-/issues/6645",
            "scancode-version": "31.2.1",
            "licenses-discovered": [
                "MIT"
            ],
            "copyrights": [
                "(c) Titus Wormer",
                "Copyright (c) 2016 Titus Wormer <tituswormer@gmail.com>"
            ],
            "file-count": 7,
            "sha256": "41535c4819e00c1a790a442d4cbdf94b1c864a20584063a2f65dc3adbe5a03ee",
            "source": "https://registry.yarnpkg.com/unist-util-generated/-/unist-util-generated-2.0.1.tgz",
            "status": "approved"
        }
    ]
}