{
    "id": "maven/mavencentral/jakarta.activation/jakarta.activation-api/2.1.1",
    "license": "BSD-3-Clause OR EPL-2.0 OR GPL-2.0-only WITH Classpath-Exception-2.0",
    "authority": "https://gitlab.eclipse.org/eclipsefdn/emo-team/iplab/-/issues/8015",
    "source": "https://search.maven.org/remotecontent?filepath=jakarta/activation/jakarta.activation-api/2.1.1/jakarta.activation-api-2.1.1-sources.jar",
    "status": "approved",
    "scans": [
        {
            "date": "April 28, 2023 at 10:39:10 a.m. GMT",
            "authority": "https://gitlab.eclipse.org/eclipsefdn/emo-team/iplab/-/issues/8015",
            "scancode-version": "31.2.1",
            "licenses-discovered": [
                "BSD-3-Clause",
                "(EPL-2.0 AND BSD-3-Clause AND GPL-2.0-only) AND LicenseRef-scancode-unknown-spdx"
            ],
            "copyrights": [
                "Copyright (c) 1997, 2021 Oracle and/or its affiliates",
                "Copyright (c) 1997, 2022 Oracle and/or its affiliates",
                "Copyright (c) 2018 Oracle and/or its affiliates",
                "Copyright (c) 2019, current.year Eclipse Foundation",
                "Copyright (c) 2021 Oracle and/or its affiliates"
            ],
            "file-count": 36,
            "sha256": "4179671d80c24732db4834407282cd578fdc541ff0d842a8e9507dd6387f7fed",
            "source": "https://search.maven.org/remotecontent?filepath=jakarta/activation/jakarta.activation-api/2.1.1/jakarta.activation-api-2.1.1-sources.jar",
            "status": "restricted"
        }
    ]
}
