{
    "id": "pypi/pypi/-/websockets/14.1",
    "license": "BSD-3-Clause AND (Apache-2.0 AND PSF-2.0)",
    "authority": "https://gitlab.eclipse.org/eclipsefdn/emo-team/iplab/-/issues/17503",
    "source": "https://files.pythonhosted.org/packages/f4/1b/380b883ce05bb5f45a905b61790319a28958a9ab1e4b6b95ff5464b60ca1/websockets-14.1.tar.gz",
    "status": "approved",
    "scans": [
        {
            "date": "November 27, 2024 at 2:10:50 p.m. GMT",
            "authority": "https://gitlab.eclipse.org/eclipsefdn/emo-team/iplab/-/issues/17503",
            "scancode-version": "31.2.1",
            "licenses-discovered": [
                "BSD-3-Clause",
                "Apache-2.0 AND PSF-2.0 AND Python-2.0"
            ],
            "copyrights": [
                "Copyright (c) Aymeric Augustin and contributors"
            ],
            "file-count": 74,
            "sha256": "398b10c77d471c0aab20a845e7a60076b6390bfdaac7a6d2edb0d2c59d75e8d8",
            "source": "https://files.pythonhosted.org/packages/f4/1b/380b883ce05bb5f45a905b61790319a28958a9ab1e4b6b95ff5464b60ca1/websockets-14.1.tar.gz",
            "status": "restricted"
        }
    ]
}