{
    "id": "maven/mavencentral/org.mariadb.jdbc/mariadb-java-client/1.5.9",
    "license": "BSD-3-Clause AND LGPL-2.1-or-later",
    "licenses-discovered": [
        "BSD-3-Clause",
        "LGPL-2.1-or-later"
    ],
    "file-count": 163,
    "scancode-version": "30.1.0",
    "authority": "https://gitlab.eclipse.org/eclipsefdn/emo-team/iplab/-/issues/2278",
    "source": "https://search.maven.org/remotecontent?filepath=org/mariadb/jdbc/mariadb-java-client/1.5.9/mariadb-java-client-1.5.9-sources.jar",
    "status": "restricted"
}