{
    "id": "pypi/pypi/-/setuptools/75.1.0",
    "license": "MIT AND BSD-3-Clause AND (Apache-2.0 OR BSD-2-Clause) AND (MIT OR OFL-1.1) AND LGPL-3.0-or-later AND Python-2.0.1 AND LGPL-3.0-or-later AND MPL-2.0",
    "authority": "https://gitlab.eclipse.org/eclipsefdn/emo-team/iplab/-/issues/16674",
    "source": "https://files.pythonhosted.org/packages/27/b8/f21073fde99492b33ca357876430822e4800cdf522011f18041351dfa74b/setuptools-75.1.0.tar.gz",
    "status": "approved",
    "scans": [
        {
            "date": "October 15, 2024, 6:04:19 a.m. GMT",
            "authority": "https://gitlab.eclipse.org/eclipsefdn/emo-team/iplab/-/issues/16674",
            "scancode-version": "31.2.1",
            "licenses-discovered": [
                "MIT",
                "Python-2.0",
                "BSD-3-Clause",
                "BSD-3-Clause AND GPL-3.0-only AND MIT",
                "LicenseRef-scancode-unknown",
                "LGPL-2.1-or-later",
                "LGPL-3.0-or-later",
                "LGPL-3.0-only",
                "Apache-2.0",
                "Apache-2.0 AND BSD-2-Clause AND BSD-3-Clause",
                "Apache-2.0 AND BSD-3-Clause",
                "BSD-2-Clause",
                "BSD-3-Clause AND Python-2.0 AND Python-2.0.1"
            ],
            "copyrights": [
                "Copyright (c) 1991 - 1995, Stichting Mathematisch Centrum Amsterdam, The Netherlands",
                "Copyright (c) 1995-2001 Corporation for National Research Initiatives",
                "Copyright (c) 2001, 2002, 2003, 2004, 2005, 2006, 2007, 2008, 2009, 2010, 2011, 2012, 2013, 2014, 2015, 2016, 2017, 2018, 2019, 2020, 2021, 2022, 2023 Python Software Foundation",
                "Copyright (c) 2002 Lars Gustaebel <lars@gustaebel.de>",
                "Copyright (c) 2007 Free Software Foundation, Inc. <https://fsf.org/>",
                "Copyright (c) 2010 Paul Dyson",
                "Copyright (c) 2010-202x The platformdirs",
                "Copyright (c) 2012 Daniel Holth <dholth@fastmail.fm> and contributors",
                "Copyright (c) 2012 Erik Rose",
                "Copyright (c) 2018', jaraco.path.build(basic, prefix root)",
                "Copyright (c) 2021 Taneli Hukkinen",
                "Copyright (c) Alex Gronholm",
                "Copyright (c) Anderson Bravalheri",
                "Copyright (c) Donald Stufft and individual contributors",
                "Copyright 2014-2015 Nathan West",
                "Copyright 2014-2016 Nathan West",
                "Copyright 2021 Taneli Hukkinen",
                "copyright 2014 s"
            ],
            "file-count": 631,
            "sha256": "d59a21b17a275fb872a9c3dae73963160ae079f1049ed956880cd7c09b120538",
            "source": "https://files.pythonhosted.org/packages/27/b8/f21073fde99492b33ca357876430822e4800cdf522011f18041351dfa74b/setuptools-75.1.0.tar.gz",
            "status": "restricted"
        }
    ]
}