{
    "id": "npm/npmjs/@babel/plugin-transform-modules-commonjs/7.22.5",
    "license": "MIT",
    "authority": "https://gitlab.eclipse.org/eclipsefdn/emo-team/iplab/-/issues/9021",
    "source": "https://registry.npmjs.org/@babel/plugin-transform-modules-commonjs/-/plugin-transform-modules-commonjs-7.22.5.tgz",
    "status": "approved",
    "scans": [
        {
            "date": "June 15, 2023 at 2:09:21 p.m. GMT",
            "authority": "https://gitlab.eclipse.org/eclipsefdn/emo-team/iplab/-/issues/9021",
            "scancode-version": "31.2.1",
            "licenses-discovered": [
                "MIT"
            ],
            "copyrights": [
                "Copyright (c) 2014-present Sebastian McKenzie and other contributors"
            ],
            "file-count": 7,
            "sha256": "52367871b6a53d68a0209a9178fa8f58b82da2237b6eeb0ce8e3fe9ca7207b73",
            "source": "https://registry.npmjs.org/@babel/plugin-transform-modules-commonjs/-/plugin-transform-modules-commonjs-7.22.5.tgz",
            "status": "approved"
        }
    ]
}