{
    "id": "maven/mavencentral/org.apache.jena/jena-querybuilder/5.0.0",
    "license": "Apache-2.0",
    "authority": "https://gitlab.eclipse.org/eclipsefdn/emo-team/iplab/-/issues/19060",
    "source": "https://repo1.maven.org/maven2/org/apache/jena/jena-querybuilder/5.0.0/jena-querybuilder-5.0.0-sources.jar",
    "status": "approved",
    "scans": [
        {
            "date": "January 20, 2025 at 2:52:39 p.m. GMT",
            "authority": "https://gitlab.eclipse.org/eclipsefdn/emo-team/iplab/-/issues/19060",
            "scancode-version": "31.2.1",
            "licenses-discovered": [
                "Apache-2.0"
            ],
            "copyrights": [
            ],
            "file-count": 51,
            "sha256": "c87be9fba9355193e03f0b6db742ed44df75bf150e52efd7867c20ced6eb2e17",
            "source": "https://repo1.maven.org/maven2/org/apache/jena/jena-querybuilder/5.0.0/jena-querybuilder-5.0.0-sources.jar",
            "status": "approved"
        }
    ]
}