{
    "id": "maven/mavencentral/org.hibernate.orm/hibernate-core/6.6.2.Final",
    "license": "(EPL-2.0 OR BSD-3-Clause) AND LGPL-2.1-or-later AND MIT",
    "authority": "https://gitlab.eclipse.org/eclipsefdn/emo-team/iplab/-/issues/17553",
    "source": "https://repo1.maven.org/maven2/org/hibernate/orm/hibernate-core/6.6.2.Final/hibernate-core-6.6.2.Final-sources.jar",
    "status": "approved",
    "scans": [
        {
            "date": "November 29, 2024 at 5:16:25 a.m. GMT",
            "authority": "https://gitlab.eclipse.org/eclipsefdn/emo-team/iplab/-/issues/17553",
            "scancode-version": "31.2.1",
            "licenses-discovered": [
                "LGPL-2.1-only",
                "LGPL-2.0-or-later",
                "LGPL-2.1-or-later",
                "LGPL-2.1-only AND LicenseRef-scancode-proprietary-license",
                "Apache-2.0 AND LGPL-2.1-only",
                "MIT",
                "CC-PDDC AND LGPL-2.1-only",
                "EPL-2.0 OR BSD-3-Clause",
                "LGPL-2.1-only AND LicenseRef-scancode-generic-exception"
            ],
            "copyrights": [
                "Copyright (c) 2008, 2020 Oracle and/or its affiliates",
                "Copyright (c) 2022 Oracle and/or its affiliates",
                "Copyright 2004-present by the Checker Framework"
            ],
            "file-count": 5237,
            "sha256": "7dab0ceabfbefa9792f2a79950a6ecb810d858cc2b95a5d15be94e3816d9475a",
            "source": "https://repo1.maven.org/maven2/org/hibernate/orm/hibernate-core/6.6.2.Final/hibernate-core-6.6.2.Final-sources.jar",
            "status": "restricted"
        }
    ]
}