{
    "id": "maven/mavencentral/com.fasterxml.jackson.dataformat/jackson-dataformat-xml/2.16.0",
    "license": "Apache-2.0",
    "authority": "https://gitlab.eclipse.org/eclipsefdn/emo-team/iplab/-/issues/12438",
    "source": "https://repo1.maven.org/maven2/com/fasterxml/jackson/dataformat/jackson-dataformat-xml/2.16.0/jackson-dataformat-xml-2.16.0-sources.jar",
    "status": "approved",
    "scans": [
        {
            "date": "December 21, 2023 at 3:40:27 p.m. GMT",
            "authority": "https://gitlab.eclipse.org/eclipsefdn/emo-team/iplab/-/issues/12438",
            "scancode-version": "31.2.1",
            "licenses-discovered": [
                "Apache-2.0"
            ],
            "copyrights": [
            ],
            "file-count": 50,
            "sha256": "bd70cd323d3ba7f5c1b013c3429afa6c4c634ddc6daa0a975defc42eef289acc",
            "source": "https://repo1.maven.org/maven2/com/fasterxml/jackson/dataformat/jackson-dataformat-xml/2.16.0/jackson-dataformat-xml-2.16.0-sources.jar",
            "status": "approved"
        }
    ]
}