{
    "id": "maven/mavencentral/androidx.core/core-ktx/1.12.0",
    "license": "Apache-2.0",
    "authority": "https://gitlab.eclipse.org/eclipsefdn/emo-team/iplab/-/issues/11170",
    "source": "https://dl.google.com/android/maven2/androidx/core/core-ktx/1.12.0/core-ktx-1.12.0-sources.jar",
    "status": "approved",
    "scans": [
        {
            "date": "October 25, 2023 at 9:40:01 a.m. GMT",
            "authority": "https://gitlab.eclipse.org/eclipsefdn/emo-team/iplab/-/issues/11170",
            "scancode-version": "31.2.1",
            "licenses-discovered": [
                "Apache-2.0"
            ],
            "copyrights": [
                "Copyright (c) 2017 The Android Open Source Project",
                "Copyright (c) 2018 The Android Open Source Project",
                "Copyright (c) 20188 The Android Open Source Project",
                "Copyright (c) 2019 The Android Open Source Project",
                "Copyright 2018 The Android Open Source Project",
                "Copyright 2022 The Android Open Source Project"
            ],
            "file-count": 58,
            "sha256": "0c6d6a21f2cc8def077ab9443a150fa898744d42084f4a29d459b8b00c1b957e",
            "source": "https://dl.google.com/android/maven2/androidx/core/core-ktx/1.12.0/core-ktx-1.12.0-sources.jar",
            "status": "approved"
        }
    ]
}