{
    "id": "npm/npmjs/-/heap/0.2.7",
    "license": "MIT",
    "authority": "https://gitlab.eclipse.org/eclipsefdn/emo-team/iplab/-/issues/11149",
    "source": "https://registry.yarnpkg.com/heap/-/heap-0.2.7.tgz",
    "status": "approved",
    "scans": [
        {
            "date": "October 24, 2023 at 1:25:27 p.m. GMT",
            "authority": "https://gitlab.eclipse.org/eclipsefdn/emo-team/iplab/-/issues/11149",
            "scancode-version": "31.2.1",
            "licenses-discovered": [
                "Python-2.0",
                "MIT"
            ],
            "copyrights": [
            ],
            "file-count": 10,
            "sha256": "091e62101e93e9a8089ca14c833c958fb1b8225f59086bb6e2b72110ec1de42a",
            "source": "https://registry.yarnpkg.com/heap/-/heap-0.2.7.tgz",
            "status": "restricted"
        }
    ]
}
