{
    "id": "npm/npmjs/-/tsconfck/3.1.1",
    "license": "MIT",
    "authority": "https://gitlab.eclipse.org/eclipsefdn/emo-team/iplab/-/issues/16028",
    "source": "https://github.com/dominikg/tsconfck/archive/refs/tags/tsconfck@3.1.1.zip",
    "status": "approved",
    "scans": [
        {
            "date": "August 28, 2024 at 12:52:50 p.m. GMT",
            "authority": "https://gitlab.eclipse.org/eclipsefdn/emo-team/iplab/-/issues/16028",
            "scancode-version": "31.2.1",
            "licenses-discovered": [
                "MIT"
            ],
            "copyrights": [
                "Copyright (c) 2021-present dominikg and contributors (https://github.com/dominikg/tsconfck/graphs/contributors)",
                "Copyright (c) Sindre Sorhus <sindresorhus@gmail.com> (https://sindresorhus.com)"
            ],
            "file-count": 368,
            "sha256": "0c453dace8912693b9e2ee3ec412a456dcc206d379b0fab14c0504041686741b",
            "source": "https://github.com/dominikg/tsconfck/archive/refs/tags/tsconfck@3.1.1.zip",
            "status": "approved"
        }
    ]
}