{
    "id": "maven/mavencentral/org.springframework/spring-aspects/5.2.22.RELEASE",
    "license": "Apache-2.0",
    "authority": "https://gitlab.eclipse.org/eclipsefdn/emo-team/iplab/-/issues/6261",
    "source": "https://search.maven.org/remotecontent?filepath=org/springframework/spring-aspects/5.2.22.RELEASE/spring-aspects-5.2.22.RELEASE-sources.jar",
    "status": "approved",
    "scans": [
        {
            "date": "January 10, 2023 at 5:03:36 p.m. GMT",
            "authority": "https://gitlab.eclipse.org/eclipsefdn/emo-team/iplab/-/issues/6261",
            "scancode-version": "31.2.1",
            "licenses-discovered": [
                "Apache-2.0"
            ],
            "copyrights": [
                "Copyright 2002-2012 the original author or authors",
                "Copyright 2002-2013 the original author or authors",
                "Copyright 2002-2014 the original author or authors",
                "Copyright 2002-2015 the original author or authors",
                "Copyright 2002-2016 the original author or authors",
                "Copyright 2002-2017 the original author or authors",
                "Copyright 2002-2018 the original author or authors",
                "Copyright 2002-2020 the original author or authors"
            ],
            "file-count": 23,
            "sha256": "8a34ba696f6b2c137ead68f650c4cadbdb1e7c5ee7793980d4216d21a92f12aa",
            "source": "https://search.maven.org/remotecontent?filepath=org/springframework/spring-aspects/5.2.22.RELEASE/spring-aspects-5.2.22.RELEASE-sources.jar",
            "status": "approved"
        }
    ]
}