{
    "id": "maven/mavencentral/org.apache.groovy/groovy-bom/4.0.11",
    "license": "Apache-2.0",
    "authority": "https://gitlab.eclipse.org/eclipsefdn/emo-team/iplab/-/issues/9266",
    "source": "https://repo.maven.apache.org/maven2/org/apache/groovy/groovy-bom/4.0.11/groovy-bom-4.0.11.pom",
    "status": "approved",
    "scans": [
        {
            "date": "July 5, 2023 at 9:44:39 p.m. GMT",
            "authority": "https://gitlab.eclipse.org/eclipsefdn/emo-team/iplab/-/issues/9266",
            "scancode-version": "31.2.1",
            "licenses-discovered": [
                "Apache-2.0"
            ],
            "copyrights": [
            ],
            "file-count": 1,
            "sha256": "27553a483d0f46df6aa86a1ce1f4126dca34aa957b2f88aaeb63136fd847fe18",
            "source": "https://repo.maven.apache.org/maven2/org/apache/groovy/groovy-bom/4.0.11/groovy-bom-4.0.11.pom",
            "status": "approved"
        }
    ]
}