{
    "id": "maven/mavencentral/com.nimbusds/nimbus-jose-jwt/10.0.1",
    "license": "Apache-2.0",
    "authority": "https://gitlab.eclipse.org/eclipsefdn/emo-team/iplab/-/issues/18354",
    "source": "https://repo1.maven.org/maven2/com/nimbusds/nimbus-jose-jwt/10.0.1/nimbus-jose-jwt-10.0.1-sources.jar",
    "status": "approved",
    "scans": [
        {
            "date": "January 8, 2025 at 8:33:24 a.m. GMT",
            "authority": "https://gitlab.eclipse.org/eclipsefdn/emo-team/iplab/-/issues/18354",
            "scancode-version": "31.2.1",
            "licenses-discovered": [
                "Apache-2.0"
            ],
            "copyrights": [
                "Copyright 2012-2016, Connect2id Ltd and contributors",
                "Copyright 2012-2016, Connect2id Ltd.",
                "Copyright 2012-2018, Connect2id Ltd and contributors",
                "Copyright 2012-2018, Connect2id Ltd.",
                "Copyright 2012-2019, Connect2id Ltd and contributors",
                "Copyright 2012-2019, Connect2id Ltd.",
                "Copyright 2012-2020, Connect2id Ltd.",
                "Copyright 2012-2021, Connect2id Ltd and contributors",
                "Copyright 2012-2021, Connect2id Ltd.",
                "Copyright 2012-2022, Connect2id Ltd.",
                "Copyright 2012-2023, Connect2id Ltd and contributors",
                "Copyright 2012-2023, Connect2id Ltd.",
                "Copyright 2012-2024, Connect2id Ltd and contributors",
                "Copyright 2012-2024, Connect2id Ltd."
            ],
            "file-count": 287,
            "sha256": "9f4c976ca3a1220eac8156ca18e4ba33bdddf110862ea4df2e7e557d972212d8",
            "source": "https://repo1.maven.org/maven2/com/nimbusds/nimbus-jose-jwt/10.0.1/nimbus-jose-jwt-10.0.1-sources.jar",
            "status": "approved"
        }
    ]
}