{
    "id": "maven/mavencentral/org.geotools/gt-process/32.0",
    "license": "LGPL-2.1-only",
    "authority": "https://gitlab.eclipse.org/eclipsefdn/emo-team/iplab/-/issues/16200",
    "source": "https://repo.osgeo.org/repository/geotools-releases/org/geotools/gt-process/32.0/gt-process-32.0-sources.jar",
    "status": "approved",
    "scans": [
        {
            "date": "September 19, 2024, 2:13:34 p.m. GMT",
            "authority": "https://gitlab.eclipse.org/eclipsefdn/emo-team/iplab/-/issues/16200",
            "scancode-version": "31.2.1",
            "licenses-discovered": [
                "LGPL-2.1-only"
            ],
            "copyrights": [
                "(c) 2007 TOPP - www.openplans.org",
                "(c) 2008, Open Source Geospatial Foundation",
                "(c) 2008-2016, Open Source Geospatial Foundation",
                "(c) 2009, Open Source Geospatial Foundation",
                "(c) 2009-2011, Open Source Geospatial Foundation",
                "(c) 2011-2012, Open Source Geospatial Foundation",
                "(c) 2016, Open Source Geospatial Foundation",
                "(c) 2019, Open Source Geospatial Foundation"
            ],
            "file-count": 38,
            "sha256": "e6220d29475f5a6fb4a344c281437e3a0781215c1b4b620e06c21537f8f4275f",
            "source": "https://repo.osgeo.org/repository/geotools-releases/org/geotools/gt-process/32.0/gt-process-32.0-sources.jar",
            "status": "approved"
        }
    ]
}