{
    "id": "npm/npmjs/@typescript-eslint/typescript-estree/7.0.1",
    "license": "BSD-2-Clause AND (BSD-2-Clause AND ISC AND MIT) AND MIT",
    "authority": "https://gitlab.eclipse.org/eclipsefdn/emo-team/iplab/-/issues/13217",
    "source": "https://github.com/typescript-eslint/typescript-eslint/archive/refs/tags/v7.0.1.zip",
    "status": "approved",
    "scans": [
        {
            "date": "February 13, 2024 at 11:16:37 a.m. GMT",
            "authority": "https://gitlab.eclipse.org/eclipsefdn/emo-team/iplab/-/issues/13217",
            "scancode-version": "31.2.1",
            "licenses-discovered": [
                "BSD-2-Clause",
                "BSD-2-Clause AND ISC AND MIT",
                "MIT"
            ],
            "copyrights": [
                "Copyright (c) 2016 unional",
                "Copyright (c) 2019 typescript-eslint and other contributors",
                "Copyright (c) 2021 typescript-eslint and other contributors",
                "Copyright (c) 2023 typescript-eslint and other contributors",
                "Copyright JS Foundation and other contributors, https://js.foundation",
                "Copyright Joyent, Inc. and other Node contributors"
            ],
            "file-count": 6977,
            "sha256": "d942760a5a7138a5ae17bf506365f1e003e6e3851bfd7d162f8f8e37a1570ae9",
            "source": "https://github.com/typescript-eslint/typescript-eslint/archive/refs/tags/v7.0.1.zip",
            "status": "approved"
        }
    ]
}