{
    "id": "maven/mavencentral/org.mockito/mockito-core/5.16.0",
    "license": "MIT AND (Apache-2.0 AND MIT) AND Apache-2.0",
    "authority": "https://gitlab.eclipse.org/eclipsefdn/emo-team/iplab/-/issues/19856",
    "source": "https://repo1.maven.org/maven2/org/mockito/mockito-core/5.16.0/mockito-core-5.16.0-sources.jar",
    "status": "approved",
    "scans": [
        {
            "date": "March 4, 2025 at 7:18:28 a.m. GMT",
            "authority": "https://gitlab.eclipse.org/eclipsefdn/emo-team/iplab/-/issues/19856",
            "scancode-version": "31.2.1",
            "licenses-discovered": [
                "MIT",
                "Apache-2.0 AND MIT",
                "Apache-2.0"
            ],
            "copyrights": [
                "Copyright (c) 2007 Mockito",
                "Copyright (c) 2015 Mockito",
                "Copyright (c) 2016 Mockito",
                "Copyright (c) 2017 Mockito",
                "Copyright (c) 2018 Mockito",
                "Copyright (c) 2019 Mockito",
                "Copyright (c) 2020 Mockito",
                "Copyright (c) 2021 Mockito",
                "Copyright (c) 2022 Mockito",
                "Copyright (c) 2023 Mockito",
                "Copyright (c) 2024 Mockito",
                "Copyright (c) 2025 Mockito"
            ],
            "file-count": 481,
            "sha256": "036f930846d8c6003bea913d6b15b509f0cc273934b6938ca0e8c3b6c54b5dc9",
            "source": "https://repo1.maven.org/maven2/org/mockito/mockito-core/5.16.0/mockito-core-5.16.0-sources.jar",
            "status": "approved"
        }
    ]
}