{
    "id": "npm/npmjs/@chevrotain/regexp-to-ast/11.0.3",
    "license": "Apache-2.0 AND CC0-1.0",
    "authority": "https://gitlab.eclipse.org/eclipsefdn/emo-team/iplab/-/issues/11630",
    "source": "https://github.com/Chevrotain/chevrotain/archive/refs/tags/v11.0.3.zip",
    "status": "approved",
    "scans": [
        {
            "date": "November 21, 2023 at 11:42:44 a.m. GMT",
            "authority": "https://gitlab.eclipse.org/eclipsefdn/emo-team/iplab/-/issues/11630",
            "scancode-version": "31.2.1",
            "licenses-discovered": [
                "Apache-2.0",
                "CC0-1.0"
            ],
            "copyrights": [
                "Copyright (c) 2018-present SAP SE"
            ],
            "file-count": 367,
            "sha256": "42f447a83da50a20daff1e6c9138f858b9c03d67a4a768419efdca405c2f644e",
            "source": "https://github.com/Chevrotain/chevrotain/archive/refs/tags/v11.0.3.zip",
            "status": "approved"
        }
    ]
}