{
    "id": "maven/mavencentral/io.opentelemetry.proto/opentelemetry-proto/1.0.0-alpha",
    "license": "Apache-2.0",
    "authority": "https://gitlab.eclipse.org/eclipsefdn/emo-team/iplab/-/issues/10044",
    "source": "https://repo.maven.apache.org/maven2/io/opentelemetry/proto/opentelemetry-proto/1.0.0-alpha/opentelemetry-proto-1.0.0-alpha-sources.jar",
    "status": "approved",
    "scans": [
        {
            "date": "August 12, 2023 at 10:35:36 a.m. GMT",
            "authority": "https://gitlab.eclipse.org/eclipsefdn/emo-team/iplab/-/issues/10044",
            "scancode-version": "31.2.1",
            "licenses-discovered": [
            ],
            "copyrights": [
            ],
            "file-count": 92,
            "sha256": "e0f204b2675deab4ec4bbcf7190cc14f58de7a63b4b595f6047cb69a373c9b19",
            "source": "https://repo.maven.apache.org/maven2/io/opentelemetry/proto/opentelemetry-proto/1.0.0-alpha/opentelemetry-proto-1.0.0-alpha-sources.jar",
            "status": "restricted"
        }
    ]
}
