{
    "id": "project/ecd.opensmartclide/eclipse-opensmartclide/smartclide-Che-REST-Client/e652c4327b6dfc6dc0a602a42216264ad5d300b6",
    "license": "EPL-2.0",
    "authority": "https://gitlab.eclipse.org/eclipsefdn/emo-team/iplab/-/issues/6877",
    "source": "https://github.com/eclipse-opensmartclide/smartclide-Che-REST-Client/archive/e652c4327b6dfc6dc0a602a42216264ad5d300b6.zip",
    "status": "restricted",
    "scans": [
        {
            "date": "January 30, 2023 at 6:46:43 p.m. GMT",
            "authority": "https://gitlab.eclipse.org/eclipsefdn/emo-team/iplab/-/issues/6877",
            "scancode-version": "31.2.1",
            "licenses-discovered": [
                "EPL-2.0"
            ],
            "copyrights": [
            ],
            "file-count": 2,
            "sha256": "dfbf16f35f528d947571da5b788b9a4b13fd24e8b7f7a7c83a7f5d3f55aefa56",
            "source": "https://github.com/eclipse-opensmartclide/smartclide-Che-REST-Client/archive/e652c4327b6dfc6dc0a602a42216264ad5d300b6.zip",
            "status": "restricted"
        }
    ]
}