{
    "id": "pypi/pypi/-/ssh-import-id/5.10",
    "license": "GPL-3.0-only",
    "authority": "https://gitlab.eclipse.org/eclipsefdn/emo-team/iplab/-/issues/6296",
    "source": "https://files.pythonhosted.org/packages/36/6e/7aaf68f975256a45fc00b237d94ce5404ffdd7e825108a1bad9218dcaf52/ssh-import-id-5.10.tar.gz",
    "status": "approved",
    "scans": [
        {
            "date": "January 12, 2023 at 8:30:42 p.m. GMT",
            "authority": "https://gitlab.eclipse.org/eclipsefdn/emo-team/iplab/-/issues/6296",
            "scancode-version": "31.2.1",
            "licenses-discovered": [
                "GPL-3.0-only"
            ],
            "copyrights": [
                "Copyright (c) 2013 Casey Marshall <casey.marshall@gmail.com>",
                "Copyright (c) 2013 Dustin Kirkland <dustin.kirkland@gmail.com>",
                "Copyright (c) 2013-16 Dustin Kirkland <dustin.kirkland@gmail.com>",
                "Copyright (c) 2016 Dustin Kirkland <dustin.kirkland@gmail.com>"
            ],
            "file-count": 15,
            "sha256": "c63181db0b4f7db76cfa7617c4be6ba50d0e66dad4786a3bb35d559cbd962d2d",
            "source": "https://files.pythonhosted.org/packages/36/6e/7aaf68f975256a45fc00b237d94ce5404ffdd7e825108a1bad9218dcaf52/ssh-import-id-5.10.tar.gz",
            "status": "restricted"
        }
    ]
}
