{
    "id": "maven/mavencentral/androidx.arch.core/core-runtime/2.0.0",
    "license": "Apache-2.0",
    "authority": "https://gitlab.eclipse.org/eclipsefdn/emo-team/iplab/-/issues/19587",
    "source": "https://dl.google.com/android/maven2/androidx/arch/core/core-runtime/2.0.0/core-runtime-2.0.0-sources.jar",
    "status": "approved",
    "scans": [
        {
            "date": "February 27, 2025 at 11:14:27 a.m. GMT",
            "authority": "https://gitlab.eclipse.org/eclipsefdn/emo-team/iplab/-/issues/19587",
            "scancode-version": "31.2.1",
            "licenses-discovered": [
                "Apache-2.0"
            ],
            "copyrights": [
                "Copyright (c) 2017 The Android Open Source Project"
            ],
            "file-count": 4,
            "sha256": "8bcdf8dd52ec0f36c7ff2592a56e1e8802713d8dd1314a036b428d86463859da",
            "source": "https://dl.google.com/android/maven2/androidx/arch/core/core-runtime/2.0.0/core-runtime-2.0.0-sources.jar",
            "status": "approved"
        }
    ]
}