{
    "id": "npm/npmjs/@mui/x-data-grid/5.6.1",
    "license": "MIT",
    "licenses-discovered": [
        "LicenseRef-scancode-commercial-license AND MIT",
        "MIT",
        "OFL-1.1",
        "LicenseRef-scancode-unknown AND MIT"
    ],
    "copyrights": [
        "Copyright (c) Material-UI SAS",
        "Copyright IBM Corp.",
        "Copyright JS Foundation and other contributors <https://js.foundation/>",
        "Copyright Jeremy Ashkenas, DocumentCloud and Investigative Reporters & Editors"
    ],
    "file-count": 1658,
    "scancode-version": "30.1.0",
    "authority": "https://gitlab.eclipse.org/eclipsefdn/emo-team/iplab/-/issues/2999",
    "source": "https://github.com/mui/mui-x/archive/v5.6.1.zip",
    "status": "approved"
}
