{
    "id": "p2/orbit/p2.eclipse.plugin/wrapped.org.apache.ant.ant-javamail/1.10.14",
    "license": "Apache-2.0 AND LicenseRef-Public-domain AND W3C",
    "authority": "https://gitlab.eclipse.org/eclipsefdn/emo-team/iplab/-/issues/10655",
    "source": "https://repo.maven.apache.org/maven2/org/apache/ant/ant-javamail/1.10.14/ant-javamail-1.10.14-sources.jar",
    "status": "approved",
    "scans": [
        {
            "date": "September 25, 2023 at 9:12:32 p.m. GMT",
            "authority": "https://gitlab.eclipse.org/eclipsefdn/emo-team/iplab/-/issues/10655",
            "scancode-version": "31.2.1",
            "licenses-discovered": [
                "Apache-2.0 AND SAX-PD AND W3C",
                "Apache-2.0"
            ],
            "copyrights": [
            ],
            "file-count": 3,
            "sha256": "61a7c5d588594d55c5f8f7b7c250c2f9a1c96f3d99c59c073e38c4473e9fd112",
            "source": "https://repo.maven.apache.org/maven2/org/apache/ant/ant-javamail/1.10.14/ant-javamail-1.10.14-sources.jar",
            "status": "restricted"
        }
    ]
}
