{
    "license": "MIT",
    "file-count": 27,
    "authority": "https://gitlab.eclipse.org/eclipsefdn/emo-team/iplab/-/issues/1118",
    "scancode-version": "21.3.31",
    "licenses-discovered": [
        "MIT"
    ],
    "id": "npm/npmjs/webassemblyjs/wast-parser/1.8.5",
    "source": "https://registry.yarnpkg.com/@webassemblyjs/wast-parser/-/wast-parser-1.8.5.tgz",
    "status": "approved"
}