{
    "id": "project/automotive.openxilenv/eclipse-openxilenv/openxilenv/2774d4807d784addb4975aebfd9b83777ae34c5b",
    "license": "Apache-2.0",
    "authority": "https://gitlab.eclipse.org/eclipsefdn/emo-team/iplab/-/issues/9986",
    "source": "https://github.com/eclipse-openxilenv/openxilenv/archive/2774d4807d784addb4975aebfd9b83777ae34c5b.zip",
    "status": "approved",
    "scans": [
        {
            "date": "August 9, 2023 at 5:10:04 p.m. GMT",
            "authority": "https://gitlab.eclipse.org/eclipsefdn/emo-team/iplab/-/issues/9986",
            "scancode-version": "31.2.1",
            "licenses-discovered": [
                "Apache-2.0"
            ],
            "copyrights": [
            ],
            "file-count": 1,
            "sha256": "c3c32563801e605b98fa5b710b557bc4f62a15daeb34e08d8ad95e2022819739",
            "source": "https://github.com/eclipse-openxilenv/openxilenv/archive/2774d4807d784addb4975aebfd9b83777ae34c5b.zip",
            "status": "restricted"
        }
    ]
}
