{
    "id": "npm/npmjs/-/meow/12.1.1",
    "license": "MIT",
    "authority": "https://gitlab.eclipse.org/eclipsefdn/emo-team/iplab/-/issues/14421",
    "source": "https://github.com/sindresorhus/meow/archive/refs/tags/v12.1.1.zip",
    "status": "approved",
    "scans": [
        {
            "date": "April 17, 2024 at 9:24:49 p.m. GMT",
            "authority": "https://gitlab.eclipse.org/eclipsefdn/emo-team/iplab/-/issues/14421",
            "scancode-version": "31.2.1",
            "licenses-discovered": [
                "MIT",
                "JSON"
            ],
            "copyrights": [
                "Copyright (c) Sindre Sorhus <sindresorhus@gmail.com> (https://sindresorhus.com)"
            ],
            "file-count": 41,
            "sha256": "b1451a515e8466c9efb1f92bbcab9ba08fffbcaf69cea67087d8f7330e1b07e4",
            "source": "https://github.com/sindresorhus/meow/archive/refs/tags/v12.1.1.zip",
            "status": "restricted"
        }
    ]
}
