{
    "id": "nuget/nuget/-/Serilog.Settings.Configuration/8.0.0",
    "license": "Apache-2.0",
    "authority": "https://gitlab.eclipse.org/eclipsefdn/emo-team/iplab/-/issues/13988",
    "source": "https://github.com/serilog/serilog-settings-configuration/archive/refs/tags/v8.0.0.zip",
    "status": "approved",
    "scans": [
        {
            "date": "March 21, 2024 at 4:24:03 p.m. GMT",
            "authority": "https://gitlab.eclipse.org/eclipsefdn/emo-team/iplab/-/issues/13988",
            "scancode-version": "31.2.1",
            "licenses-discovered": [
                "Apache-2.0"
            ],
            "copyrights": [
                "Copyright 2013-2016 Serilog"
            ],
            "file-count": 86,
            "sha256": "297cb03b8a3e8cf3c083e7056de91cd5160644d0c09a5d2bb9fb65df655bfd0f",
            "source": "https://github.com/serilog/serilog-settings-configuration/archive/refs/tags/v8.0.0.zip",
            "status": "approved"
        }
    ]
}