{
    "id": "npm/npmjs/-/eslint-plugin-vue/9.32.0",
    "license": "MIT",
    "authority": "https://gitlab.eclipse.org/eclipsefdn/emo-team/iplab/-/issues/17759",
    "source": "https://github.com/vuejs/eslint-plugin-vue/archive/refs/tags/v9.32.0.zip",
    "status": "approved",
    "scans": [
        {
            "date": "December 5, 2024 at 9:06:12 a.m. GMT",
            "authority": "https://gitlab.eclipse.org/eclipsefdn/emo-team/iplab/-/issues/17759",
            "scancode-version": "31.2.1",
            "licenses-discovered": [
                "MIT"
            ],
            "copyrights": [
                "Copyright (c) 2014 Yannick Croissant",
                "Copyright (c) 2017 Toru Nagashima",
                "copyright 2016 Toru Nagashima",
                "copyright 2017 Toru Nagashima",
                "copyright 2017 Xie Ding E De Mao",
                "copyright 2018 Michal Sajnog",
                "copyright 2020 Flo Edelmann",
                "copyright 2021 Flo Edelmann",
                "copyright 2021 Yosuke Ota",
                "copyright 2022 Yosuke Ota",
                "copyright 2023 Perry Song",
                "copyright 2023- Wei Ran"
            ],
            "file-count": 1552,
            "sha256": "8b0098a1d5e2f2e245e71a47322f68c23d7aa2f59073d959c4fa39d665cad839",
            "source": "https://github.com/vuejs/eslint-plugin-vue/archive/refs/tags/v9.32.0.zip",
            "status": "approved"
        }
    ]
}