{
    "id": "maven/mavencentral/org.flywaydb/flyway-core/10.7.2",
    "license": "Apache-2.0",
    "authority": "https://gitlab.eclipse.org/eclipsefdn/emo-team/iplab/-/issues/13235",
    "source": "https://repo1.maven.org/maven2/org/flywaydb/flyway-core/10.7.2/flyway-core-10.7.2-sources.jar",
    "status": "approved",
    "scans": [
        {
            "date": "February 14, 2024 at 3:24:48 p.m. GMT",
            "authority": "https://gitlab.eclipse.org/eclipsefdn/emo-team/iplab/-/issues/13235",
            "scancode-version": "31.2.1",
            "licenses-discovered": [
                "Apache-2.0"
            ],
            "copyrights": [
                "Copyright (c) Red Gate Software Ltd 2010-2024"
            ],
            "file-count": 420,
            "sha256": "0290d5be7f2a6799d6c8ce519c25313b02afd0a5a8aeb8f7fdd0e7731fb7c3fb",
            "source": "https://repo1.maven.org/maven2/org/flywaydb/flyway-core/10.7.2/flyway-core-10.7.2-sources.jar",
            "status": "approved"
        }
    ]
}