{
    "id": "maven/mavencentral/org.apache.lucene/lucene-spatial3d/8.9.0",
    "license": "Apache-2.0",
    "authority": "https://gitlab.eclipse.org/eclipsefdn/emo-team/iplab/-/issues/6140",
    "source": "https://search.maven.org/remotecontent?filepath=org/apache/lucene/lucene-spatial3d/8.9.0/lucene-spatial3d-8.9.0-sources.jar",
    "status": "approved",
    "scans": [
        {
            "date": "January 6, 2023 at 11:26:02 p.m. GMT",
            "authority": "https://gitlab.eclipse.org/eclipsefdn/emo-team/iplab/-/issues/6140",
            "scancode-version": "31.2.1",
            "licenses-discovered": [
                "Apache-2.0"
            ],
            "copyrights": [
            ],
            "file-count": 105,
            "sha256": "cf7a1452bfe1c8e05dbe78dba1bbbe3e064c10617aecec8404970653512da382",
            "source": "https://search.maven.org/remotecontent?filepath=org/apache/lucene/lucene-spatial3d/8.9.0/lucene-spatial3d-8.9.0-sources.jar",
            "status": "approved"
        }
    ]
}