{
    "id": "nuget/nuget/-/Swashbuckle.AspNetCore.SwaggerGen/7.0.0",
    "license": "MIT AND Apache-2.0",
    "authority": "https://gitlab.eclipse.org/eclipsefdn/emo-team/iplab/-/issues/17611",
    "source": "https://github.com/domaindrivendev/Swashbuckle.AspNetCore/archive/refs/tags/v7.0.0.zip",
    "status": "approved",
    "scans": [
        {
            "date": "December 3, 2024 at 12:15:35 p.m. GMT",
            "authority": "https://gitlab.eclipse.org/eclipsefdn/emo-team/iplab/-/issues/17611",
            "scancode-version": "31.2.1",
            "licenses-discovered": [
                "MIT",
                "Apache-2.0"
            ],
            "copyrights": [
                "Copyright (c) 2016 Richard Morris",
                "Copyright (c) 2016-$( System.DateTime ::Now.ToString(yyyy)) Richard Morris"
            ],
            "file-count": 563,
            "sha256": "dead23e19827b39d5d4c6e8a9f04f61434512b31ab584fd432fef2b22112ec3b",
            "source": "https://github.com/domaindrivendev/Swashbuckle.AspNetCore/archive/refs/tags/v7.0.0.zip",
            "status": "approved"
        }
    ]
}