{
    "id": "maven/mavencentral/org.jooq/jooq-meta/3.18.4",
    "license": "Apache-2.0",
    "authority": "https://gitlab.eclipse.org/eclipsefdn/emo-team/iplab/-/issues/9641",
    "source": "https://repo.maven.apache.org/maven2/org/jooq/jooq-meta/3.18.4/jooq-meta-3.18.4-sources.jar",
    "status": "approved",
    "scans": [
        {
            "date": "July 19, 2023 at 12:24:15 p.m. GMT",
            "authority": "https://gitlab.eclipse.org/eclipsefdn/emo-team/iplab/-/issues/9641",
            "scancode-version": "31.2.1",
            "licenses-discovered": [
                "Apache-2.0"
            ],
            "copyrights": [
            ],
            "file-count": 312,
            "sha256": "11fae2a8ded650fa6ead3f41e406394cfc315f27e7dac8bf5e6d01c06bb8f494",
            "source": "https://repo.maven.apache.org/maven2/org/jooq/jooq-meta/3.18.4/jooq-meta-3.18.4-sources.jar",
            "status": "approved"
        }
    ]
}