{
    "license": "Apache-2.0",
    "file-count": 520,
    "authority": "https://gitlab.eclipse.org/eclipsefdn/emo-team/iplab/-/issues/1149",
    "scancode-version": "21.3.31",
    "licenses-discovered": [
        "Apache-2.0"
    ],
    "id": "maven/mavencentral/com.amazonaws/aws-java-sdk-codedeploy/1.11.519",
    "source": "https://search.maven.org/remotecontent?filepath=com/amazonaws/aws-java-sdk-codedeploy/1.11.519/aws-java-sdk-codedeploy-1.11.519-sources.jar",
    "status": "approved"
}