{
    "id": "maven/mavencentral/org.apache.logging.log4j/log4j-slf4j2-impl/2.20.0",
    "license": "Apache-2.0",
    "authority": "https://gitlab.eclipse.org/eclipsefdn/emo-team/iplab/-/issues/8801",
    "source": "https://repo.maven.apache.org/maven2/org/apache/logging/log4j/log4j-slf4j2-impl/2.20.0/log4j-slf4j2-impl-2.20.0-sources.jar",
    "status": "approved",
    "scans": [
        {
            "date": "June 12, 2023 at 5:02:31 p.m. GMT",
            "authority": "https://gitlab.eclipse.org/eclipsefdn/emo-team/iplab/-/issues/8801",
            "scancode-version": "31.2.1",
            "licenses-discovered": [
                "Apache-2.0"
            ],
            "copyrights": [
            ],
            "file-count": 14,
            "sha256": "a97b23d6b705b0632699550eff12dd35998511733b8ec744d8fd97612ff6f473",
            "source": "https://repo.maven.apache.org/maven2/org/apache/logging/log4j/log4j-slf4j2-impl/2.20.0/log4j-slf4j2-impl-2.20.0-sources.jar",
            "status": "approved"
        }
    ]
}