{
    "id": "maven/mavencentral/io.fabric8/kubernetes-model-common/6.5.0",
    "license": "Apache-2.0",
    "authority": "https://gitlab.eclipse.org/eclipsefdn/emo-team/iplab/-/issues/7356",
    "source": "https://search.maven.org/remotecontent?filepath=io/fabric8/kubernetes-model-common/6.5.0/kubernetes-model-common-6.5.0-sources.jar",
    "status": "approved",
    "scans": [
        {
            "date": "March 14, 2023 at 10:26:22 a.m. GMT",
            "authority": "https://gitlab.eclipse.org/eclipsefdn/emo-team/iplab/-/issues/7356",
            "scancode-version": "31.2.1",
            "licenses-discovered": [
                "Apache-2.0"
            ],
            "copyrights": [
                "Copyright (c) 2015 Red Hat, Inc."
            ],
            "file-count": 21,
            "sha256": "23edfe072d6b01fea708d09f4bd29387d46851c7ef87262236ef467218da4faf",
            "source": "https://search.maven.org/remotecontent?filepath=io/fabric8/kubernetes-model-common/6.5.0/kubernetes-model-common-6.5.0-sources.jar",
            "status": "approved"
        }
    ]
}