{
    "id": "pypi/pypi/-/idna/3.6",
    "license": "BSD-3-Clause AND Unicode-TOU",
    "authority": "https://gitlab.eclipse.org/eclipsefdn/emo-team/iplab/-/issues/13089",
    "source": "https://files.pythonhosted.org/packages/bf/3f/ea4b9117521a1e9c50344b909be7886dd00a519552724809bb1f486986c2/idna-3.6.tar.gz",
    "status": "approved",
    "scans": [
        {
            "date": "February 1, 2024 at 8:23:40 p.m. GMT",
            "authority": "https://gitlab.eclipse.org/eclipsefdn/emo-team/iplab/-/issues/13089",
            "scancode-version": "31.2.1",
            "licenses-discovered": [
                "BSD-3-Clause",
                "LicenseRef-scancode-unicode"
            ],
            "copyrights": [
                "(c) 2019 Unicode(r), Inc.",
                "Copyright (c) 2013-2023, Kim Davies and contributors"
            ],
            "file-count": 21,
            "sha256": "9ecdbbd083b06798ae1e86adcbfe8ab1479cf864e4ee30fe4e46a003d12491ca",
            "source": "https://files.pythonhosted.org/packages/bf/3f/ea4b9117521a1e9c50344b909be7886dd00a519552724809bb1f486986c2/idna-3.6.tar.gz",
            "status": "restricted"
        }
    ]
}
