{
    "id": "p2/orbit/p2.eclipse.plugin/org.apache.lucene.sandbox/9.8.0.v20230929-1030",
    "license": "Apache-2.0",
    "authority": "https://gitlab.eclipse.org/eclipsefdn/emo-team/iplab/-/issues/10766",
    "source": "https://repo.maven.apache.org/maven2/org/apache/lucene/lucene-sandbox/9.8.0/lucene-sandbox-9.8.0-sources.jar",
    "status": "approved",
    "scans": [
        {
            "date": "September 29, 2023 at 4:13:42 p.m. GMT",
            "authority": "https://gitlab.eclipse.org/eclipsefdn/emo-team/iplab/-/issues/10766",
            "scancode-version": "31.2.1",
            "licenses-discovered": [
                "Apache-2.0"
            ],
            "copyrights": [
            ],
            "file-count": 54,
            "sha256": "3289e4fbb8b0565c3620c0a46be3687fc19cf1e29ca2942dc12cbf27a5303f89",
            "source": "https://repo.maven.apache.org/maven2/org/apache/lucene/lucene-sandbox/9.8.0/lucene-sandbox-9.8.0-sources.jar",
            "status": "approved"
        }
    ]
}