{
    "id": "maven/mavencentral/org.typelevel/cats-free_2.13/2.1.1",
    "license": "MIT",
    "licenses-discovered": [
    ],
    "copyrights": [
    ],
    "file-count": 11,
    "scancode-version": "31.2.1",
    "authority": "https://gitlab.eclipse.org/eclipsefdn/emo-team/iplab/-/issues/4487",
    "source": "https://search.maven.org/remotecontent?filepath=org/typelevel/cats-free_2.13/2.1.1/cats-free_2.13-2.1.1-sources.jar",
    "status": "approved"
}
