{
    "id": "maven/mavencentral/androidx.lifecycle/lifecycle-viewmodel-ktx/2.6.1",
    "license": "Apache-2.0",
    "authority": "https://gitlab.eclipse.org/eclipsefdn/emo-team/iplab/-/issues/10385",
    "source": "https://dl.google.com/android/maven2/androidx/lifecycle/lifecycle-viewmodel-ktx/2.6.1/lifecycle-viewmodel-ktx-2.6.1-sources.jar",
    "status": "approved",
    "scans": [
        {
            "date": "September 11, 2023 at 9:40:32 p.m. GMT",
            "authority": "https://gitlab.eclipse.org/eclipsefdn/emo-team/iplab/-/issues/10385",
            "scancode-version": "31.2.1",
            "licenses-discovered": [
                "Apache-2.0"
            ],
            "copyrights": [
                "Copyright 2018 The Android Open Source Project"
            ],
            "file-count": 2,
            "sha256": "dc9b84fecf2d5c7eade2d86e75a5c407c81209698e001fe822a5ed1896571d67",
            "source": "https://dl.google.com/android/maven2/androidx/lifecycle/lifecycle-viewmodel-ktx/2.6.1/lifecycle-viewmodel-ktx-2.6.1-sources.jar",
            "status": "approved"
        }
    ]
}