{
    "id": "maven/mavencentral/com.pinterest.ktlint/ktlint-reporter-checkstyle/0.49.0",
    "license": "MIT",
    "authority": "https://gitlab.eclipse.org/eclipsefdn/emo-team/iplab/-/issues/10189",
    "source": "https://repo.maven.apache.org/maven2/com/pinterest/ktlint/ktlint-reporter-checkstyle/0.49.0/ktlint-reporter-checkstyle-0.49.0-sources.jar",
    "status": "approved",
    "scans": [
        {
            "date": "August 23, 2023 at 1:42:56 p.m. GMT",
            "authority": "https://gitlab.eclipse.org/eclipsefdn/emo-team/iplab/-/issues/10189",
            "scancode-version": "31.2.1",
            "licenses-discovered": [
            ],
            "copyrights": [
            ],
            "file-count": 4,
            "sha256": "bee2eb29ed16e15716da52ffba7c4b53cf7c9f465b3dc7e23eb3ac553a140766",
            "source": "https://repo.maven.apache.org/maven2/com/pinterest/ktlint/ktlint-reporter-checkstyle/0.49.0/ktlint-reporter-checkstyle-0.49.0-sources.jar",
            "status": "restricted"
        }
    ]
}
