{
    "id": "maven/mavencentral/org.apache.jena/apache-jena-libs/5.0.0",
    "license": "Apache-2.0",
    "authority": "https://gitlab.eclipse.org/eclipsefdn/emo-team/iplab/-/issues/19059",
    "source": "https://search.maven.org/remotecontent?filepath=org/apache/jena/apache-jena-libs/5.0.0/apache-jena-libs-5.0.0.pom",
    "status": "approved",
    "scans": [
        {
            "date": "January 20, 2025 at 2:51:19 p.m. GMT",
            "authority": "https://gitlab.eclipse.org/eclipsefdn/emo-team/iplab/-/issues/19059",
            "scancode-version": "31.2.1",
            "licenses-discovered": [
                "Apache-2.0"
            ],
            "copyrights": [
            ],
            "file-count": 1,
            "sha256": "be07e7f8b01e67867ba03aca2d647c4b9c89db9c0630095daac1347bcba0ecae",
            "source": "https://search.maven.org/remotecontent?filepath=org/apache/jena/apache-jena-libs/5.0.0/apache-jena-libs-5.0.0.pom",
            "status": "approved"
        }
    ]
}