{
    "id": "maven/mavencentral/org.apache.activemq/activemq-client/5.17.2",
    "license": "Apache-2.0",
    "licenses-discovered": [
        "Apache-2.0"
    ],
    "copyrights": [
        "Copyright The Apache Software Foundation"
    ],
    "file-count": 756,
    "scancode-version": "30.1.0",
    "authority": "https://gitlab.eclipse.org/eclipsefdn/emo-team/iplab/-/issues/3383",
    "source": "https://search.maven.org/remotecontent?filepath=org/apache/activemq/activemq-client/5.17.2/activemq-client-5.17.2-sources.jar",
    "status": "approved"
}