{
    "license": "MIT",
    "file-count": 422,
    "authority": "https://gitlab.eclipse.org/eclipsefdn/emo-team/iplab/-/issues/1279",
    "scancode-version": "21.3.31",
    "licenses-discovered": [
        "MIT"
    ],
    "id": "npm/npmjs/typescript-eslint/eslint-plugin/4.25.0",
    "source": "https://registry.yarnpkg.com/@typescript-eslint/eslint-plugin/-/eslint-plugin-4.25.0.tgz",
    "status": "approved"
}