{
    "id": "maven/mavencentral/org.testcontainers/spock/1.17.5",
    "license": "MIT",
    "licenses-discovered": [
    ],
    "copyrights": [
    ],
    "file-count": 5,
    "scancode-version": "31.2.1",
    "authority": "https://gitlab.eclipse.org/eclipsefdn/emo-team/iplab/-/issues/4708",
    "source": "https://search.maven.org/remotecontent?filepath=org/testcontainers/spock/1.17.5/spock-1.17.5-sources.jar",
    "status": "approved"
}
