{
    "id": "npm/npmjs/@stylistic/eslint-plugin/4.2.0",
    "license": "MIT",
    "authority": "https://gitlab.eclipse.org/eclipsefdn/emo-team/iplab/-/issues/19859",
    "source": "https://github.com/eslint-stylistic/eslint-stylistic/archive/refs/tags/v4.2.0.zip",
    "status": "approved",
    "scans": [
        {
            "date": "March 4, 2025 at 9:11:35 a.m. GMT",
            "authority": "https://gitlab.eclipse.org/eclipsefdn/emo-team/iplab/-/issues/19859",
            "scancode-version": "31.2.1",
            "licenses-discovered": [
                "MIT"
            ],
            "copyrights": [
                "(c) 2023-PRESENT ESLint Stylistic",
                "(c) OpenJS Foundation and other contributors, <www.openjsf.org>",
                "Copyright (c) 2014 Yannick Croissant",
                "Copyright (c) 2014 by Vitaly Puzrin",
                "Copyright (c) 2019 typescript-eslint and other contributors",
                "Copyright (c) 2023-PRESENT ESLint Stylistic",
                "Copyright (c) 2023-PRESENT eslint-stylistic and other contributors",
                "Copyright OpenJS Foundation and other contributors, <www.openjsf.org>",
                "Copyright OpenJS Foundation and other contributors, www.openjsf.org",
                "copyright 2015 Gyandeep Singh",
                "copyright 2015 Vitaly Puzrin"
            ],
            "file-count": 894,
            "sha256": "81cc4b3e77caef45c45e2d99663655749d8f27dec57bba886eaeacddb0177514",
            "source": "https://github.com/eslint-stylistic/eslint-stylistic/archive/refs/tags/v4.2.0.zip",
            "status": "approved"
        }
    ]
}