{
    "id": "p2/orbit/p2.eclipse-plugin/org.junit.jupiter.api/5.8.2",
    "license": "EPL-2.0",
    "licenses-discovered": [
        "EPL-2.0"
    ],
    "copyrights": [
        "Copyright 2015-2021 the original author or authors"
    ],
    "file-count": 143,
    "scancode-version": "31.2.1",
    "authority": "https://gitlab.eclipse.org/eclipsefdn/emo-team/iplab/-/issues/3844",
    "source": "https://search.maven.org/remotecontent?filepath=org/junit/jupiter/junit-jupiter-api/5.8.2/junit-jupiter-api-5.8.2-sources.jar",
    "status": "approved"
}