{
    "id": "maven/mavencentral/org.apache.maven.resolver/maven-resolver-util/2.0.3",
    "license": "Apache-2.0",
    "authority": "https://gitlab.eclipse.org/eclipsefdn/emo-team/iplab/-/issues/17018",
    "source": "https://repo1.maven.org/maven2/org/apache/maven/resolver/maven-resolver-util/2.0.3/maven-resolver-util-2.0.3-sources.jar",
    "status": "approved",
    "scans": [
        {
            "date": "November 4, 2024, 7:31:11 a.m. GMT",
            "authority": "https://gitlab.eclipse.org/eclipsefdn/emo-team/iplab/-/issues/17018",
            "scancode-version": "31.2.1",
            "licenses-discovered": [
                "Apache-2.0"
            ],
            "copyrights": [
            ],
            "file-count": 110,
            "sha256": "d6e083ff9c79950f7950859b55e72b5e9d0f1a8bb13605267e5cf442adf32762",
            "source": "https://repo1.maven.org/maven2/org/apache/maven/resolver/maven-resolver-util/2.0.3/maven-resolver-util-2.0.3-sources.jar",
            "status": "approved"
        }
    ]
}