{
    "id": "maven/mavencentral/org.testcontainers/vault/1.18.0",
    "license": "MIT",
    "authority": "https://gitlab.eclipse.org/eclipsefdn/emo-team/iplab/-/issues/7927",
    "source": "https://search.maven.org/remotecontent?filepath=org/testcontainers/vault/1.18.0/vault-1.18.0-sources.jar",
    "status": "approved",
    "scans": [
        {
            "date": "April 25, 2023 at 3:14:32 p.m. GMT",
            "authority": "https://gitlab.eclipse.org/eclipsefdn/emo-team/iplab/-/issues/7927",
            "scancode-version": "31.2.1",
            "licenses-discovered": [
            ],
            "copyrights": [
            ],
            "file-count": 3,
            "sha256": "e7c19f87ccb0af479219ed93b5bdab0582dac6e77dc07d4b325bf1a955f2fa4c",
            "source": "https://search.maven.org/remotecontent?filepath=org/testcontainers/vault/1.18.0/vault-1.18.0-sources.jar",
            "status": "restricted"
        }
    ]
}
