{
    "id": "go/golang/-/github.com%2Fhashicorp%2Fterraform-plugin-log/v0.9.0",
    "license": "MPL-2.0 AND (MPL-1.1 AND MPL-2.0)",
    "authority": "https://gitlab.eclipse.org/eclipsefdn/emo-team/iplab/-/issues/14437",
    "source": "https://proxy.golang.org/github.com%2Fhashicorp%2Fterraform-plugin-log/@v/v0.9.0.zip",
    "status": "approved",
    "scans": [
        {
            "date": "April 18, 2024 at 4:12:54 p.m. GMT",
            "authority": "https://gitlab.eclipse.org/eclipsefdn/emo-team/iplab/-/issues/14437",
            "scancode-version": "31.2.1",
            "licenses-discovered": [
                "MPL-2.0",
                "MPL-1.1 AND MPL-2.0"
            ],
            "copyrights": [
                "Copyright (c) 2021 HashiCorp, Inc."
            ],
            "file-count": 87,
            "sha256": "c858df874cfb252eb34225de51aa05406e35216e03a86c54c5e927c37e8d25a3",
            "source": "https://proxy.golang.org/github.com%2Fhashicorp%2Fterraform-plugin-log/@v/v0.9.0.zip",
            "status": "approved"
        }
    ]
}