{
    "license": "Apache-2.0 AND BSD-3-Clause AND CDDL-1.0 AND EPL-2.0 AND GPL-2.0-only WITH Classpath-exception-2.0 AND MIT",
    "file-count": 15,
    "authority": "https://gitlab.eclipse.org/eclipsefdn/emo-team/iplab/-/issues/1903",
    "scancode-version": "30.1.0",
    "licenses-discovered": [
        "Apache-2.0",
        "BSD-3-Clause",
        "CDDL-1.0",
        "Classpath-exception-2.0",
        "EPL-2.0",
        "GPL-2.0-only",
        "LicenseRef-scancode-free-unknown",
        "MIT"
    ],
    "id": "maven/mavencentral/org.apache.cxf/cxf-tools-wadlto-jaxrs/3.3.0",
    "source": "https://search.maven.org/remotecontent?filepath=org/apache/cxf/cxf-tools-wadlto-jaxrs/3.3.0/cxf-tools-wadlto-jaxrs-3.3.0-sources.jar",
    "status": "approved"
}
