{
    "id": "npm/npmjs/-/is-finalizationregistry/1.1.0",
    "license": "MIT",
    "authority": "https://gitlab.eclipse.org/eclipsefdn/emo-team/iplab/-/issues/17700",
    "source": "https://github.com/inspect-js/is-finalizationregistry/archive/refs/tags/v1.1.0.zip",
    "status": "approved",
    "scans": [
        {
            "date": "December 4, 2024 at 5:45:47 p.m. GMT",
            "authority": "https://gitlab.eclipse.org/eclipsefdn/emo-team/iplab/-/issues/17700",
            "scancode-version": "31.2.1",
            "licenses-discovered": [
                "MIT"
            ],
            "copyrights": [
                "Copyright (c) 2020 Inspect JS"
            ],
            "file-count": 17,
            "sha256": "c6f462bb875065999e34bb3653ef73ba73f8cee0c1f5ce4a2cf320e7f1b97a4e",
            "source": "https://github.com/inspect-js/is-finalizationregistry/archive/refs/tags/v1.1.0.zip",
            "status": "approved"
        }
    ]
}