{
    "id": "maven/mavencentral/org.webjars.npm/heap/0.2.6",
    "license": "LicenseRef-Python",
    "authority": "https://gitlab.eclipse.org/eclipsefdn/emo-team/iplab/-/issues/6774",
    "source": "https://search.maven.org/remotecontent?filepath=org/webjars/npm/heap/0.2.6/heap-0.2.6-sources.jar",
    "status": "approved",
    "scans": [
        {
            "date": "January 27, 2023 at 10:40:18 p.m. GMT",
            "authority": "https://gitlab.eclipse.org/eclipsefdn/emo-team/iplab/-/issues/6774",
            "scancode-version": "31.2.1",
            "licenses-discovered": [
            ],
            "copyrights": [
            ],
            "file-count": 0,
            "sha256": "8739c76e681f900923b900c9df0ef75cf421d39cabb54650c4b9ad19b6a76d85",
            "source": "https://search.maven.org/remotecontent?filepath=org/webjars/npm/heap/0.2.6/heap-0.2.6-sources.jar",
            "status": "restricted"
        }
    ]
}
