{
    "id": "maven/mavencentral/org.apache.lucene/lucene-core/8.11.1",
    "license": "Apache-2.0 AND MIT AND BSD-3-Clause",
    "licenses-discovered": [
        "Apache-2.0",
        "Apache-2.0 AND BSD-3-Clause AND NCSA",
        "Apache-2.0 AND ISC",
        "Apache-2.0 AND LicenseRef-scancode-sunpro",
        "Apache-2.0 AND ICU AND LicenseRef-scancode-unicode-mappings",
        "BSD-3-Clause",
        "Apache-2.0 AND MIT",
        "BSD-2-Clause"
    ],
    "copyrights": [
        "Copyright (c) Anders Moeller",
        "Copyright (c) Center for Intelligent Information Retrieval, University of Massachusetts, Amherst",
        "Copyright (c) Dawid Weiss",
        "Copyright (c) Dawid Weiss, Marcin Milkowski",
        "Copyright (c) Dr Martin Porter",
        "Copyright (c) International Business Machines Corporation and others",
        "Copyright (c) Jean-Philippe Barrette-LaPierre, <jpb@rrette.com>",
        "Copyright (c) Mapbox",
        "Copyright (c) Richard Boulton",
        "Copyright (c) Wm. Randolph Franklin",
        "Copyright (c) Yann Collet",
        "Copyright (c) Zygmunt Saloni, Wlodzimierz Gruszczynski, Marcin Wolinski, Robert Wolosz",
        "Copyright (c) by Sun Microsystems, Inc.",
        "Copyright The Apache Software Foundation",
        "Copyright Unicode, Inc.",
        "copyright by www.imdict.net"
    ],
    "file-count": 975,
    "scancode-version": "30.1.0",
    "authority": "https://gitlab.eclipse.org/eclipsefdn/emo-team/iplab/-/issues/2769",
    "source": "https://search.maven.org/remotecontent?filepath=org/apache/lucene/lucene-core/8.11.1/lucene-core-8.11.1-sources.jar",
    "status": "approved"
}
