{
    "id": "maven/mavencentral/io.grpc/protoc-gen-grpc-java/1.56.1",
    "license": "Apache-2.0",
    "authority": "https://gitlab.eclipse.org/eclipsefdn/emo-team/iplab/-/issues/10492",
    "source": "https://github.com/grpc/grpc-java/archive/refs/tags/v1.56.1.zip",
    "status": "approved",
    "scans": [
        {
            "date": "September 12, 2023 at 8:15:41 a.m. GMT",
            "authority": "https://gitlab.eclipse.org/eclipsefdn/emo-team/iplab/-/issues/10492",
            "scancode-version": "31.2.1",
            "licenses-discovered": [
                "Apache-2.0"
            ],
            "copyrights": [
                "Copyright (c) 2011 The Android Open Source Project",
                "Copyright (c) 2012 Square, Inc.",
                "Copyright (c) 2012 The Android Open Source Project",
                "Copyright (c) 2013 Square, Inc.",
                "Copyright (c) 2014 Square, Inc.",
                "Copyright (c) 2015 Square, Inc.",
                "Copyright (c) 2015-2021 the original",
                "Copyright 2013 Twitter, Inc.",
                "Copyright 2014 The Netty Project",
                "Copyright 2014 The gRPC",
                "Copyright 2015 The gRPC",
                "Copyright 2015 gRPC",
                "Copyright 2015 the original author or authors",
                "Copyright 2015-2016 The gRPC",
                "Copyright 2015-2016 gRPC",
                "Copyright 2016 The gRPC",
                "Copyright 2016,2022 The gRPC",
                "Copyright 2016-2020 Istio",
                "Copyright 2017 The gRPC",
                "Copyright 2018 The gRPC",
                "Copyright 2018 gRPC",
                "Copyright 2018, gRPC",
                "Copyright 2019 The Netty Project",
                "Copyright 2019 The gRPC",
                "Copyright 2019, gRPC",
                "Copyright 2020 Google LLC",
                "Copyright 2020 The gRPC",
                "Copyright 2021 Higher Frequency Trading http://www.higherfrequencytrading.com",
                "Copyright 2021 The gRPC",
                "Copyright 2021, gRPC",
                "Copyright 2022 The gRPC",
                "Copyright 2023 The gRPC",
                "Copyright 2023 gRPC",
                "Copyright 2023, gRPC",
                "Copyright Istio Authors"
            ],
            "file-count": 2032,
            "sha256": "b8fb7ae4824fb5a5ae6e6fa26ffe2ad7ab48406fdeee54e8965a3b5948dd957e",
            "source": "https://github.com/grpc/grpc-java/archive/refs/tags/v1.56.1.zip",
            "status": "approved"
        }
    ]
}