{
    "id": "maven/mavencentral/org.codehaus.plexus/plexus-component-annotations/2.2.0",
    "license": "Apache-2.0",
    "authority": "https://gitlab.eclipse.org/eclipsefdn/emo-team/iplab/-/issues/12549",
    "source": "https://repo1.maven.org/maven2/org/codehaus/plexus/plexus-component-annotations/2.2.0/plexus-component-annotations-2.2.0-sources.jar",
    "status": "approved",
    "scans": [
        {
            "date": "December 26, 2023 at 6:26:03 a.m. GMT",
            "authority": "https://gitlab.eclipse.org/eclipsefdn/emo-team/iplab/-/issues/12549",
            "scancode-version": "31.2.1",
            "licenses-discovered": [
                "Apache-2.0"
            ],
            "copyrights": [
                "Copyright (c) 2007 the original author or authors"
            ],
            "file-count": 6,
            "sha256": "205bdeb24bb48dec548232b6faddff33a6d5800a1bafc9ed7e563845fd0eb736",
            "source": "https://repo1.maven.org/maven2/org/codehaus/plexus/plexus-component-annotations/2.2.0/plexus-component-annotations-2.2.0-sources.jar",
            "status": "approved"
        }
    ]
}