{
    "id": "maven/mavencentral/org.codehaus.plexus/plexus-compiler-manager/2.13.0",
    "license": "MIT",
    "authority": "https://gitlab.eclipse.org/eclipsefdn/emo-team/iplab/-/issues/5916",
    "source": "https://search.maven.org/remotecontent?filepath=org/codehaus/plexus/plexus-compiler-manager/2.13.0/plexus-compiler-manager-2.13.0-sources.jar",
    "status": "approved",
    "scans": [
        {
            "date": "December 21, 2022 at 8:58:42 a.m. GMT",
            "authority": "https://gitlab.eclipse.org/eclipsefdn/emo-team/iplab/-/issues/5916",
            "scancode-version": "31.2.1",
            "licenses-discovered": [
                "MIT"
            ],
            "copyrights": [
                "Copyright (c) 2005, The Codehaus"
            ],
            "file-count": 6,
            "sha256": "7daa5535d8e5639d6149265f9ea6328f93b9f628231577c5fc8a07f692a129e8",
            "source": "https://search.maven.org/remotecontent?filepath=org/codehaus/plexus/plexus-compiler-manager/2.13.0/plexus-compiler-manager-2.13.0-sources.jar",
            "status": "approved"
        }
    ]
}