{
    "id": "maven/mavencentral/org.bouncycastle/bcpkix-jdk18on/1.75",
    "license": "MIT",
    "authority": "https://gitlab.eclipse.org/eclipsefdn/emo-team/iplab/-/issues/9166",
    "source": "https://repo.maven.apache.org/maven2/org/bouncycastle/bcpkix-jdk18on/1.75/bcpkix-jdk18on-1.75-sources.jar",
    "status": "approved",
    "scans": [
        {
            "date": "June 22, 2023 at 8:49:36 a.m. GMT",
            "authority": "https://gitlab.eclipse.org/eclipsefdn/emo-team/iplab/-/issues/9166",
            "scancode-version": "31.2.1",
            "licenses-discovered": [
            ],
            "copyrights": [
            ],
            "file-count": 669,
            "sha256": "bd621657020f859beff0c8279aef31380c18438596964da2c77a0542126bf780",
            "source": "https://repo.maven.apache.org/maven2/org/bouncycastle/bcpkix-jdk18on/1.75/bcpkix-jdk18on-1.75-sources.jar",
            "status": "restricted"
        }
    ]
}
