{
    "id": "npm/npmjs/-/jsdom/19.0.0",
    "license": "MIT AND LGPL-2.0-or-later",
    "licenses-discovered": [
        "MIT",
        "LGPL-2.0-or-later"
    ],
    "copyrights": [
        "Copyright (c) Apple Inc.",
        "Copyright (c) Elijah Insua",
        "Copyright (c) Lars Knoll (knoll@kde.org)"
    ],
    "file-count": 464,
    "scancode-version": "30.1.0",
    "authority": "https://gitlab.eclipse.org/eclipsefdn/emo-team/iplab/-/issues/3302",
    "source": "https://registry.npmjs.org/jsdom/-/jsdom-19.0.0.tgz",
    "status": "approved"
}
