{
    "id": "maven/mavencentral/com.puppycrawl.tools/checkstyle/10.19.0",
    "license": "LGPL-2.1-or-later AND (Apache-2.0 AND LGPL-2.1-or-later) AND Apache-2.0",
    "authority": "https://gitlab.eclipse.org/eclipsefdn/emo-team/iplab/-/issues/16922",
    "source": "https://repo1.maven.org/maven2/com/puppycrawl/tools/checkstyle/10.19.0/checkstyle-10.19.0-sources.jar",
    "status": "approved",
    "scans": [
        {
            "date": "October 29, 2024, 12:49:33 a.m. GMT",
            "authority": "https://gitlab.eclipse.org/eclipsefdn/emo-team/iplab/-/issues/16922",
            "scancode-version": "31.2.1",
            "licenses-discovered": [
                "LGPL-2.1-or-later",
                "Apache-2.0 AND LGPL-2.1-or-later",
                "Apache-2.0"
            ],
            "copyrights": [
                "Copyright (c) 2001-2024 the original author or authors",
                "Copyright (c) 2002 Oliver Burn",
                "Copyright 2006 The Apache Software Foundation"
            ],
            "file-count": 866,
            "sha256": "4d8ba4f93093d07da197e39a1940d799350db8c614b78321f6f32e0ff427db42",
            "source": "https://repo1.maven.org/maven2/com/puppycrawl/tools/checkstyle/10.19.0/checkstyle-10.19.0-sources.jar",
            "status": "approved"
        }
    ]
}