{
    "id": "maven/mavencentral/software.amazon.awssdk/protocol-core/2.22.12",
    "license": "Apache-2.0",
    "authority": "https://gitlab.eclipse.org/eclipsefdn/emo-team/iplab/-/issues/12648",
    "source": "https://repo1.maven.org/maven2/software/amazon/awssdk/protocol-core/2.22.12/protocol-core-2.22.12-sources.jar",
    "status": "approved",
    "scans": [
        {
            "date": "January 7, 2024 at 11:33:23 p.m. GMT",
            "authority": "https://gitlab.eclipse.org/eclipsefdn/emo-team/iplab/-/issues/12648",
            "scancode-version": "31.2.1",
            "licenses-discovered": [
                "Apache-2.0"
            ],
            "copyrights": [
                "Copyright Amazon.com, Inc. or its affiliates"
            ],
            "file-count": 16,
            "sha256": "333fe7b1d1335d4e07883a20aee1d473d95db5f5a59ff26cf35b9bbc1069f848",
            "source": "https://repo1.maven.org/maven2/software/amazon/awssdk/protocol-core/2.22.12/protocol-core-2.22.12-sources.jar",
            "status": "approved"
        }
    ]
}