{
    "id": "maven/mavencentral/org.springframework/spring-aop/6.0.2",
    "license": "Apache-2.0",
    "authority": "https://gitlab.eclipse.org/eclipsefdn/emo-team/iplab/-/issues/5940",
    "source": "https://search.maven.org/remotecontent?filepath=org/springframework/spring-aop/6.0.2/spring-aop-6.0.2-sources.jar",
    "status": "approved",
    "scans": [
        {
            "date": "December 21, 2022 at 4:39:07 p.m. GMT",
            "authority": "https://gitlab.eclipse.org/eclipsefdn/emo-team/iplab/-/issues/5940",
            "scancode-version": "31.2.1",
            "licenses-discovered": [
                "Apache-2.0"
            ],
            "copyrights": [
                "Copyright 2002-2006 the original author or authors",
                "Copyright 2002-2007 the original author or authors",
                "Copyright 2002-2008 the original author or authors",
                "Copyright 2002-2012 the original author or authors",
                "Copyright 2002-2013 the original author or authors",
                "Copyright 2002-2014 the original author or authors",
                "Copyright 2002-2015 the original author or authors",
                "Copyright 2002-2016 the original author or authors",
                "Copyright 2002-2017 the original author or authors",
                "Copyright 2002-2018 the original author or authors",
                "Copyright 2002-2019 the original author or authors",
                "Copyright 2002-2020 the original author or authors",
                "Copyright 2002-2021 the original author or authors",
                "Copyright 2002-2022 the original author or authors"
            ],
            "file-count": 227,
            "sha256": "d7cbd6dcf3c26b65d33f436db16a9b0f5ce3280fe1a7e7413626c6b38c5766ef",
            "source": "https://search.maven.org/remotecontent?filepath=org/springframework/spring-aop/6.0.2/spring-aop-6.0.2-sources.jar",
            "status": "approved"
        }
    ]
}