{
    "id": "maven/mavencentral/biz.aQute.bnd/bndlib/2.4.0",
    "license": "Apache-2.0",
    "authority": "https://gitlab.eclipse.org/eclipsefdn/emo-team/iplab/-/issues/15612",
    "source": "https://repo1.maven.org/maven2/biz/aQute/bnd/bndlib/2.4.0/bndlib-2.4.0-sources.jar",
    "status": "approved",
    "scans": [
        {
            "date": "July 3, 2024 at 6:36:04 p.m. GMT",
            "authority": "https://gitlab.eclipse.org/eclipsefdn/emo-team/iplab/-/issues/15612",
            "scancode-version": "31.2.1",
            "licenses-discovered": [
                "Apache-2.0",
                "Apache-2.0 AND BSD-2-Clause AND BSD-3-Clause AND CDDL-1.0 AND EPL-1.0 AND GPL-2.0-only AND GPL-3.0-only AND LGPL-2.1-only",
                "Apache-2.0 AND LicenseRef-scancode-free-unknown",
                "BSD-2-Clause AND BSD-2-Clause-Views AND BSD-3-Clause",
                "BSD-3-Clause",
                "CDDL-1.0 AND CDDL-1.1",
                "CPL-1.0 AND LicenseRef-scancode-free-unknown AND LicenseRef-scancode-unknown",
                "EPL-1.0",
                "GPL-2.0-only",
                "GPL-3.0-only",
                "LGPL-2.1-only",
                "MIT",
                "MPL-2.0",
                "LicenseRef-scancode-josl-1.0"
            ],
            "copyrights": [
                "Copyright (c) 2000 Gatespace AB.",
                "Copyright (c) OSGi Alliance (2006, 2012)",
                "Copyright (c) OSGi Alliance (2010, 2012)",
                "Copyright (c) OSGi Alliance (2011)",
                "Copyright (c) OSGi Alliance (2011, 2012)",
                "Copyright (c) OSGi Alliance (2011, 2013)",
                "Copyright (c) OSGi Alliance (2012)",
                "Copyright (c) OSGi Alliance (2012, 2014)",
                "Copyright (c) OSGi Alliance (2013)",
                "Copyright (c) OSGi Alliance (2013, 2014)",
                "Copyright (c) OSGi Alliance (2014)",
                "OSGi (c) 2002"
            ],
            "file-count": 518,
            "sha256": "47ffa4e52fcf7ff83bd06412f6f02ce76be27b3f499c30102f0ee57725cb7cc2",
            "source": "https://repo1.maven.org/maven2/biz/aQute/bnd/bndlib/2.4.0/bndlib-2.4.0-sources.jar",
            "status": "restricted"
        }
    ]
}