{
    "id": "maven/mavencentral/com.vladsch.flexmark/flexmark-ext-typographic/0.64.8",
    "license": "BSD-2-Clause AND CC-BY-SA-4.0",
    "authority": "https://gitlab.eclipse.org/eclipsefdn/emo-team/iplab/-/issues/11253",
    "source": "https://repo.maven.apache.org/maven2/com/vladsch/flexmark/flexmark-ext-typographic/0.64.8/flexmark-ext-typographic-0.64.8-sources.jar",
    "status": "approved",
    "scans": [
        {
            "date": "October 27, 2023 at 5:00:28 a.m. GMT",
            "authority": "https://gitlab.eclipse.org/eclipsefdn/emo-team/iplab/-/issues/11253",
            "scancode-version": "31.2.1",
            "licenses-discovered": [
            ],
            "copyrights": [
            ],
            "file-count": 18,
            "sha256": "a687c04138b7466b299ae0290ff2b24255ee2060faeda0876a541cd1ddece919",
            "source": "https://repo.maven.apache.org/maven2/com/vladsch/flexmark/flexmark-ext-typographic/0.64.8/flexmark-ext-typographic-0.64.8-sources.jar",
            "status": "restricted"
        }
    ]
}
