{
    "license": "MIT",
    "file-count": 15,
    "authority": "https://gitlab.eclipse.org/eclipsefdn/emo-team/iplab/-/issues/1550",
    "scancode-version": "30.1.0",
    "licenses-discovered": [
        "MIT"
    ],
    "id": "npm/npmjs/-/globals/13.12.0",
    "source": "https://github.com/sindresorhus/globals/archive/v13.12.0.zip",
    "status": "approved"
}