{
    "id": "maven/mavencentral/org.geotools.xsd/gt-xsd-ows/28.2",
    "license": "LGPL-2.1-only",
    "authority": "https://gitlab.eclipse.org/eclipsefdn/emo-team/iplab/-/issues/7193",
    "source": "https://repo.osgeo.org/repository/geotools-releases/org/geotools/xsd/gt-xsd-ows/28.2/gt-xsd-ows-28.2-sources.jar",
    "status": "approved",
    "scans": [
        {
            "date": "February 23, 2023 at 5:37:53 p.m. GMT",
            "authority": "https://gitlab.eclipse.org/eclipsefdn/emo-team/iplab/-/issues/7193",
            "scancode-version": "31.2.1",
            "licenses-discovered": [
                "LGPL-2.1-only"
            ],
            "copyrights": [
                "(c) 2002-2008, Open Source Geospatial Foundation",
                "(c) 2002-2014, Open Source Geospatial Foundation",
                "(c) 2002-2020, Open Source Geospatial Foundation",
                "(c) 2007-2008, Open Source Geospatial Foundation",
                "(c) 2007-2014, Open Source Geospatial Foundation",
                "(c) 2008, Open Source Geospatial Foundation",
                "(c) 2014, Open Source Geospatial Foundation",
                "(c) 2019, Open Source Geospatial Foundation",
                "(c) 2021, Open Source Geospatial Foundation",
                "Copyright (c) 2005 Open Geospatial Consortium, Inc.",
                "Copyright (c) 2006 Open Geospatial Consortium, Inc.",
                "Copyright (c) 2009 Open Geospatial Consortium. To"
            ],
            "file-count": 89,
            "sha256": "2391b1d4c941b661779357e7980bcf99e228dab471769fedfa8bee136b041fbd",
            "source": "https://repo.osgeo.org/repository/geotools-releases/org/geotools/xsd/gt-xsd-ows/28.2/gt-xsd-ows-28.2-sources.jar",
            "status": "approved"
        }
    ]
}