{
    "id": "maven/mavencentral/org.apache.lucene/lucene-analysis-common/9.8.0",
    "license": "Apache-2.0 AND (Apache-2.0 AND BSD-2-Clause) AND (Apache-2.0 AND BSD-3-Clause) AND BSD-3-Clause AND LicenseRef-Permission-Notice AND LicenseRef-Python AND ICU AND (GPL-2.0-only OR LGPL-2.1-only OR MPL-1.1 OR CC-BY-4.0 OR Apache-2.0) AND BSD-2-Clause AND Unicode AND NAIST-2003",
    "authority": "https://gitlab.eclipse.org/eclipsefdn/emo-team/iplab/-/issues/10734",
    "source": "https://repo.maven.apache.org/maven2/org/apache/lucene/lucene-analysis-common/9.8.0/lucene-analysis-common-9.8.0-sources.jar",
    "status": "approved",
    "scans": [
        {
            "date": "September 29, 2023 at 6:44:47 p.m. GMT",
            "authority": "https://gitlab.eclipse.org/eclipsefdn/emo-team/iplab/-/issues/10734",
            "scancode-version": "31.2.1",
            "licenses-discovered": [
                "Apache-2.0",
                "Apache-2.0 AND BSD-3-Clause",
                "Apache-2.0 AND LPPL-1.3c",
                "BSD-3-Clause"
            ],
            "copyrights": [
                "Copyright (c) 2001, Dr Martin Porter",
                "Copyright (c) 2003, Center for Intelligent Information Retrieval, University of Massachusetts, Amherst",
                "Copyright (c) 2004,2005, Richard Boulton",
                "Copyright (c) 2005, Jacques Savoy",
                "Copyright (c) 2006,2007,2009,2010,2011,2014-2019, Olly Betts",
                "Copyright (c) 2013, Yoshiki Shibukawa",
                "Copyright 2003, CIIR University of Massachusetts Amherst (http://ciir.cs.umass.edu)",
                "Copyright 2008, Luicid Imagination, Inc."
            ],
            "file-count": 551,
            "sha256": "009d0469c7bc490e578789d293e0c0550e1fc33eea66f9484fe979d6e79ba0e5",
            "source": "https://repo.maven.apache.org/maven2/org/apache/lucene/lucene-analysis-common/9.8.0/lucene-analysis-common-9.8.0-sources.jar",
            "status": "restricted"
        }
    ]
}
