{
    "id": "npm/npmjs/-/node-abi/3.48.0",
    "license": "MIT",
    "authority": "https://gitlab.eclipse.org/eclipsefdn/emo-team/iplab/-/issues/11028",
    "source": "https://github.com/electron/node-abi/archive/refs/tags/v3.48.0.zip",
    "status": "approved",
    "scans": [
        {
            "date": "October 10, 2023 at 4:29:36 p.m. GMT",
            "authority": "https://gitlab.eclipse.org/eclipsefdn/emo-team/iplab/-/issues/11028",
            "scancode-version": "31.2.1",
            "licenses-discovered": [
                "MIT"
            ],
            "copyrights": [
                "Copyright (c) 2016 Lukas Geiger"
            ],
            "file-count": 16,
            "sha256": "6b2f97a52dfbe71dc3509d467c3ff30b3ea57663b818115840e4b78b8730a4c3",
            "source": "https://github.com/electron/node-abi/archive/refs/tags/v3.48.0.zip",
            "status": "approved"
        }
    ]
}