{
    "id": "maven/mavencentral/org.apache.accumulo/accumulo-server-base/2.0.0",
    "license": "Apache-2.0",
    "authority": "https://gitlab.eclipse.org/eclipsefdn/emo-team/iplab/-/issues/5090",
    "source": "https://search.maven.org/remotecontent?filepath=org/apache/accumulo/accumulo-server-base/2.0.0/accumulo-server-base-2.0.0-sources.jar",
    "status": "approved",
    "scans": [
        {
            "date": "November 24, 2022 at 5:27:36 p.m. GMT",
            "authority": "https://gitlab.eclipse.org/eclipsefdn/emo-team/iplab/-/issues/5090",
            "scancode-version": "31.2.1",
            "licenses-discovered": [
                "Apache-2.0"
            ],
            "copyrights": [
            ],
            "file-count": 187,
            "sha256": "b10de1d50eb6c7cb99109f88e598da82b03b543e98d5991ed6486d19ce0b9caa",
            "source": "https://search.maven.org/remotecontent?filepath=org/apache/accumulo/accumulo-server-base/2.0.0/accumulo-server-base-2.0.0-sources.jar",
            "status": "approved"
        }
    ]
}