{
    "license": "MIT",
    "file-count": 28,
    "authority": "https://gitlab.eclipse.org/eclipsefdn/emo-team/iplab/-/issues/1262",
    "scancode-version": "21.3.31",
    "licenses-discovered": [
        "MIT"
    ],
    "id": "npm/npmjs/babel/traverse/7.6.0",
    "source": "https://registry.yarnpkg.com/@babel/traverse/-/traverse-7.6.0.tgz",
    "status": "approved"
}