{
    "id": "crate/cratesio/-/bstr/1.6.0",
    "license": "Apache-2.0 AND MIT",
    "authority": "https://gitlab.eclipse.org/eclipsefdn/emo-team/iplab/-/issues/10130",
    "source": "https://crates.io/api/v1/crates/bstr/1.6.0/download",
    "status": "approved",
    "scans": [
        {
            "date": "August 21, 2023 at 3:53:00 p.m. GMT",
            "authority": "https://gitlab.eclipse.org/eclipsefdn/emo-team/iplab/-/issues/10130",
            "scancode-version": "31.2.1",
            "licenses-discovered": [
                "Apache-2.0 AND MIT",
                "Apache-2.0",
                "MIT",
                "Apache-2.0 AND LicenseRef-scancode-unicode AND MIT",
                "LicenseRef-scancode-unicode"
            ],
            "copyrights": [
                "(c) 2021 Unicode(r), Inc.",
                "Copyright (c) 1991-2019 Unicode, Inc.",
                "Copyright (c) 2018-2019 Andrew Gallant"
            ],
            "file-count": 68,
            "sha256": "6798148dccfbff0fae41c7574d2fa8f1ef3492fba0face179de5d8d447d67b05",
            "source": "https://crates.io/api/v1/crates/bstr/1.6.0/download",
            "status": "restricted"
        }
    ]
}
