{
    "id": "maven/mavencentral/org.apache.xmlgraphics/batik-util/1.18",
    "license": "Apache-2.0",
    "authority": "https://gitlab.eclipse.org/eclipsefdn/emo-team/iplab/-/issues/16578",
    "source": "https://repo1.maven.org/maven2/org/apache/xmlgraphics/batik-util/1.18/batik-util-1.18-sources.jar",
    "status": "approved",
    "scans": [
        {
            "date": "October 9, 2024, 2:48:47 p.m. GMT",
            "authority": "https://gitlab.eclipse.org/eclipsefdn/emo-team/iplab/-/issues/16578",
            "scancode-version": "31.2.1",
            "licenses-discovered": [
                "Apache-2.0"
            ],
            "copyrights": [
            ],
            "file-count": 60,
            "sha256": "54438f5a4dfe0dad566f76098f9595ba0eb87511fc0a173e6dc6c9914f48f1cd",
            "source": "https://repo1.maven.org/maven2/org/apache/xmlgraphics/batik-util/1.18/batik-util-1.18-sources.jar",
            "status": "approved"
        }
    ]
}