{
    "id": "npm/npmjs/-/rc-segmented/2.7.0",
    "license": "MIT",
    "authority": "https://gitlab.eclipse.org/eclipsefdn/emo-team/iplab/-/issues/18944",
    "source": "https://registry.yarnpkg.com/rc-segmented/-/rc-segmented-2.7.0.tgz",
    "status": "approved",
    "scans": [
        {
            "date": "January 19, 2025 at 11:48:30 a.m. GMT",
            "authority": "https://gitlab.eclipse.org/eclipsefdn/emo-team/iplab/-/issues/18944",
            "scancode-version": "31.2.1",
            "licenses-discovered": [
                "MIT"
            ],
            "copyrights": [
                "Copyright (c) 2019-present afc163"
            ],
            "file-count": 14,
            "sha256": "23f8fe9456631fac1ffa22cf1ad7df041c2b3b37094adef81ba2f23f4a4ee7bc",
            "source": "https://registry.yarnpkg.com/rc-segmented/-/rc-segmented-2.7.0.tgz",
            "status": "approved"
        }
    ]
}