{
    "id": "maven/mavencentral/org.apache.jena/jena-dboe-base/4.9.0",
    "license": "Apache-2.0",
    "authority": "https://gitlab.eclipse.org/eclipsefdn/emo-team/iplab/-/issues/14705",
    "source": "https://repo1.maven.org/maven2/org/apache/jena/jena-dboe-base/4.9.0/jena-dboe-base-4.9.0-sources.jar",
    "status": "approved",
    "scans": [
        {
            "date": "May 14, 2024 at 7:40:48 a.m. GMT",
            "authority": "https://gitlab.eclipse.org/eclipsefdn/emo-team/iplab/-/issues/14705",
            "scancode-version": "31.2.1",
            "licenses-discovered": [
                "Apache-2.0"
            ],
            "copyrights": [
            ],
            "file-count": 77,
            "sha256": "9f1bd4d78650096ca12026d4fc2bc695fef861e72601ff421b4732ce27b3c992",
            "source": "https://repo1.maven.org/maven2/org/apache/jena/jena-dboe-base/4.9.0/jena-dboe-base-4.9.0-sources.jar",
            "status": "approved"
        }
    ]
}