{
    "id": "maven/mavencentral/io.kotest/kotest-extensions-jvm/5.6.2",
    "license": "Apache-2.0",
    "authority": "https://gitlab.eclipse.org/eclipsefdn/emo-team/iplab/-/issues/10190",
    "source": "https://repo.maven.apache.org/maven2/io/kotest/kotest-extensions-jvm/5.6.2/kotest-extensions-jvm-5.6.2-sources.jar",
    "status": "approved",
    "scans": [
        {
            "date": "August 23, 2023 at 1:41:26 p.m. GMT",
            "authority": "https://gitlab.eclipse.org/eclipsefdn/emo-team/iplab/-/issues/10190",
            "scancode-version": "31.2.1",
            "licenses-discovered": [
                "Apache-2.0"
            ],
            "copyrights": [
            ],
            "file-count": 10,
            "sha256": "b70197e61663b66412d49ca8472d995f68274a687e75ac712aa8573b3c9047ae",
            "source": "https://repo.maven.apache.org/maven2/io/kotest/kotest-extensions-jvm/5.6.2/kotest-extensions-jvm-5.6.2-sources.jar",
            "status": "approved"
        }
    ]
}