{
    "id": "npm/npmjs/@mui/x-date-pickers/5.0.0",
    "license": "MIT",
    "licenses-discovered": [
        "LicenseRef-scancode-commercial-license AND MIT",
        "MIT"
    ],
    "copyrights": [
        "Copyright (c) Material-UI SAS"
    ],
    "file-count": 766,
    "scancode-version": "30.1.0",
    "authority": "https://gitlab.eclipse.org/eclipsefdn/emo-team/iplab/-/issues/3247",
    "source": "https://registry.npmjs.org/@mui/x-date-pickers/-/x-date-pickers-5.0.0.tgz",
    "status": "approved"
}
