{
    "id": "maven/mavencentral/org.kie.workbench.forms/kie-wb-common-forms-adf-engine-client/7.63.0",
    "license": "Apache-2.0",
    "licenses-discovered": [
        "Apache-2.0"
    ],
    "copyrights": [
        "Copyright Red Hat, Inc. and/or its affiliates"
    ],
    "file-count": 12,
    "scancode-version": "30.1.0",
    "authority": "https://gitlab.eclipse.org/eclipsefdn/emo-team/iplab/-/issues/2872",
    "source": "https://search.maven.org/remotecontent?filepath=org/kie/workbench/forms/kie-wb-common-forms-adf-engine-client/7.63.0.Final/kie-wb-common-forms-adf-engine-client-7.63.0.Final-sources.jar",
    "status": "approved"
}