{
    "id": "go/golang/golang.org%2Fx/arch/v0.0.0-20210923205945-b76863e36670",
    "license": "BSD-3-Clause AND MIT AND Apache-2.0",
    "authority": "https://gitlab.eclipse.org/eclipsefdn/emo-team/iplab/-/issues/12016",
    "source": "https://proxy.golang.org/golang.org%2Fx/arch/@v/v0.0.0-20210923205945-b76863e36670.zip",
    "status": "approved",
    "scans": [
        {
            "date": "December 14, 2023 at 5:53:48 a.m. GMT",
            "authority": "https://gitlab.eclipse.org/eclipsefdn/emo-team/iplab/-/issues/12016",
            "scancode-version": "31.2.1",
            "licenses-discovered": [
                "BSD-3-Clause",
                "MIT",
                "Apache-2.0 AND LicenseRef-scancode-intel-confidential",
                "Apache-2.0"
            ],
            "copyrights": [
                "Copyright (c) 1994-1999 Lucent Technologies Inc. Power PC",
                "Copyright (c) 1995-2004 C H Forsyth (forsyth@terzarima.net)",
                "Copyright (c) 2000-2004 Lucent Technologies Inc. and others",
                "Copyright (c) 2015 The Go Authors",
                "Copyright (c) 2016 Intel Corporation",
                "Copyright (c) 2017 Intel Corporation",
                "Copyright (c) 2017, Intel Corporation",
                "Copyright 2014 The Go Authors",
                "Copyright 2015 The Go Authors",
                "Copyright 2016 The Go Authors",
                "Copyright 2017 The Go Authors",
                "Copyright 2018 The Go Authors",
                "Copyright 2019 The Go Authors",
                "Copyright 2021 The Go Authors",
                "Portions Copyright (c) 1997-1999 Vita Nuova Limited",
                "Portions Copyright (c) 2000-2007 Vita Nuova Holdings Limited (www.vitanuova.com)",
                "Portions Copyright (c) 2009 The Go Authors"
            ],
            "file-count": 118,
            "sha256": "04fa299ae956ce2edb9fd924a2ccb63a273ae7fe3ec659d9a1cf6dadbc849813",
            "source": "https://proxy.golang.org/golang.org%2Fx/arch/@v/v0.0.0-20210923205945-b76863e36670.zip",
            "status": "restricted"
        }
    ]
}
