{
    "id": "maven/mavencentral/co.fs2/fs2-io_2.13/3.10.2",
    "license": "MIT",
    "authority": "https://gitlab.eclipse.org/eclipsefdn/emo-team/iplab/-/issues/14682",
    "source": "https://repo1.maven.org/maven2/co/fs2/fs2-io_2.13/3.10.2/fs2-io_2.13-3.10.2-sources.jar",
    "status": "approved",
    "scans": [
        {
            "date": "May 11, 2024 at 8:32:56 p.m. GMT",
            "authority": "https://gitlab.eclipse.org/eclipsefdn/emo-team/iplab/-/issues/14682",
            "scancode-version": "31.2.1",
            "licenses-discovered": [
                "MIT"
            ],
            "copyrights": [
                "Copyright (c) 2013 Functional Streams"
            ],
            "file-count": 73,
            "sha256": "ba02cdf1bae68393ed29f88380cff2863d088eaccb0e723e6a007b60ab831604",
            "source": "https://repo1.maven.org/maven2/co/fs2/fs2-io_2.13/3.10.2/fs2-io_2.13-3.10.2-sources.jar",
            "status": "approved"
        }
    ]
}