{
    "id": "maven/mavencentral/org.flowable/flowable-identitylink-service-api/6.8.0",
    "license": "Apache-2.0",
    "authority": "https://gitlab.eclipse.org/eclipsefdn/emo-team/iplab/-/issues/6442",
    "source": "https://search.maven.org/remotecontent?filepath=org/flowable/flowable-identitylink-service-api/6.8.0/flowable-identitylink-service-api-6.8.0-sources.jar",
    "status": "approved",
    "scans": [
        {
            "date": "January 23, 2023 at 8:19:42 p.m. GMT",
            "authority": "https://gitlab.eclipse.org/eclipsefdn/emo-team/iplab/-/issues/6442",
            "scancode-version": "31.2.1",
            "licenses-discovered": [
                "Apache-2.0"
            ],
            "copyrights": [
            ],
            "file-count": 7,
            "sha256": "fa4455d8275c37df269fa26d3664fe6b0d1dee0305f975f574b20a9f703f7ede",
            "source": "https://search.maven.org/remotecontent?filepath=org/flowable/flowable-identitylink-service-api/6.8.0/flowable-identitylink-service-api-6.8.0-sources.jar",
            "status": "approved"
        }
    ]
}