{
    "id": "npm/npmjs/@webassemblyjs/wasm-opt/1.11.5",
    "license": "MIT",
    "authority": "https://gitlab.eclipse.org/eclipsefdn/emo-team/iplab/-/issues/7967",
    "source": "https://registry.npmjs.org/@webassemblyjs/wasm-opt/-/wasm-opt-1.11.5.tgz",
    "status": "approved",
    "scans": [
        {
            "date": "April 26, 2023 at 12:59:09 p.m. GMT",
            "authority": "https://gitlab.eclipse.org/eclipsefdn/emo-team/iplab/-/issues/7967",
            "scancode-version": "31.2.1",
            "licenses-discovered": [
                "MIT"
            ],
            "copyrights": [
            ],
            "file-count": 3,
            "sha256": "a5e5da48e353928bb41584e68b3f4759152da1d0e7867a1c67a1567580ca8f55",
            "source": "https://registry.npmjs.org/@webassemblyjs/wasm-opt/-/wasm-opt-1.11.5.tgz",
            "status": "approved"
        }
    ]
}