{
    "id": "maven/mavencentral/io.cucumber/junit-xml-formatter/0.4.0",
    "license": "MIT",
    "authority": "https://gitlab.eclipse.org/eclipsefdn/emo-team/iplab/-/issues/14644",
    "source": "https://repo1.maven.org/maven2/io/cucumber/junit-xml-formatter/0.4.0/junit-xml-formatter-0.4.0-sources.jar",
    "status": "approved",
    "scans": [
        {
            "date": "May 7, 2024 at 11:12:43 p.m. GMT",
            "authority": "https://gitlab.eclipse.org/eclipsefdn/emo-team/iplab/-/issues/14644",
            "scancode-version": "31.2.1",
            "licenses-discovered": [
            ],
            "copyrights": [
            ],
            "file-count": 7,
            "sha256": "a77edc34e7adde5631f381a926f2a55b914c60493f36a44219580ef77bd17a2b",
            "source": "https://repo1.maven.org/maven2/io/cucumber/junit-xml-formatter/0.4.0/junit-xml-formatter-0.4.0-sources.jar",
            "status": "restricted"
        }
    ]
}