{
    "id": "npm/npmjs/@mui/x-data-grid/6.20.1",
    "license": "MIT",
    "authority": "https://gitlab.eclipse.org/eclipsefdn/emo-team/iplab/-/issues/15481",
    "source": "https://github.com/mui/mui-x/archive/refs/tags/v6.20.1.zip",
    "status": "approved",
    "scans": [
        {
            "date": "June 24, 2024 at 11:15:19 a.m. GMT",
            "authority": "https://gitlab.eclipse.org/eclipsefdn/emo-team/iplab/-/issues/15481",
            "scancode-version": "31.2.1",
            "licenses-discovered": [
                "MIT",
                "LicenseRef-scancode-commercial-license AND MIT",
                "LicenseRef-scancode-commercial-license AND LicenseRef-scancode-proprietary-license AND MIT",
                "OFL-1.1",
                "LicenseRef-scancode-unknown AND MIT",
                "ISC",
                "LicenseRef-scancode-proprietary-license",
                "LicenseRef-scancode-commercial-license"
            ],
            "copyrights": [
                "Copyright (c) 2017 Dmitriy Kovalenko",
                "Copyright (c) 2017 Evgeny Poberezkin",
                "Copyright (c) 2020 Material-UI SAS",
                "Copyright 2017-2021 Indian Type Foundry",
                "Copyright 2018 IBM Corp."
            ],
            "file-count": 4002,
            "sha256": "4b9701b96d37d0683f09749e532dcd55ed991e47f03579a19f8a629a92f5de43",
            "source": "https://github.com/mui/mui-x/archive/refs/tags/v6.20.1.zip",
            "status": "restricted"
        }
    ]
}