{
    "id": "maven/mavencentral/org.bytedeco/flycapture/2.13.3.31-1.5.8",
    "license": "LicenseRef-scancode-commercial-license AND (Apache-2.0 AND (GPL-2.0-or-later WITH Classpath-exception-2.0))",
    "authority": "https://gitlab.eclipse.org/eclipsefdn/emo-team/iplab/-/issues/6772",
    "source": "https://search.maven.org/remotecontent?filepath=org/bytedeco/flycapture/2.13.3.31-1.5.8/flycapture-2.13.3.31-1.5.8-sources.jar",
    "status": "restricted",
    "scans": [
        {
            "date": "January 27, 2023 at 10:41:30 p.m. GMT",
            "authority": "https://gitlab.eclipse.org/eclipsefdn/emo-team/iplab/-/issues/6772",
            "scancode-version": "31.2.1",
            "licenses-discovered": [
                "LicenseRef-scancode-commercial-license",
                "Apache-2.0 AND (GPL-2.0-or-later WITH Classpath-exception-2.0)"
            ],
            "copyrights": [
                "Copyright (c) 2001-2018 FLIR Systems, Inc.",
                "Copyright (c) 2014-2017 Samuel Audet, Jarek Sacha",
                "Copyright (c) 2014-2020 Samuel Audet, Jarek Sacha",
                "Copyright (c) 2017 FLIR Integrated Imaging Solutions, Inc."
            ],
            "file-count": 113,
            "sha256": "88231f4004155a312e99891de04be17b9724c5c9a8178a26f53929afc23044fa",
            "source": "https://search.maven.org/remotecontent?filepath=org/bytedeco/flycapture/2.13.3.31-1.5.8/flycapture-2.13.3.31-1.5.8-sources.jar",
            "status": "restricted"
        }
    ]
}