{
    "id": "npm/npmjs/@types/http-errors/2.0.2",
    "license": "MIT",
    "authority": "https://gitlab.eclipse.org/eclipsefdn/emo-team/iplab/-/issues/10815",
    "source": "https://registry.yarnpkg.com/@types/http-errors/-/http-errors-2.0.2.tgz",
    "status": "approved",
    "scans": [
        {
            "date": "October 2, 2023 at 11:58:50 p.m. GMT",
            "authority": "https://gitlab.eclipse.org/eclipsefdn/emo-team/iplab/-/issues/10815",
            "scancode-version": "31.2.1",
            "licenses-discovered": [
                "MIT"
            ],
            "copyrights": [
                "Copyright (c) Microsoft Corporation"
            ],
            "file-count": 4,
            "sha256": "940b3659d9d38da0db03c84f21cd8eb65e9a3d0e991c40db072ca40ec91467e3",
            "source": "https://registry.yarnpkg.com/@types/http-errors/-/http-errors-2.0.2.tgz",
            "status": "approved"
        }
    ]
}