{
    "license": "BSD-3-Clause AND MIT",
    "file-count": 4175,
    "authority": "https://gitlab.eclipse.org/eclipsefdn/emo-team/iplab/-/issues/1716",
    "scancode-version": "30.1.0",
    "licenses-discovered": [
        "GPL-3.0-only",
        "BSD-3-Clause",
        "MIT",
        "LicenseRef-scancode-unknown-license-reference",
        "ISC"
    ],
    "id": "npm/npmjs/-/mapbox-gl/1.10.1",
    "source": "https://github.com/mapbox/mapbox-gl-js/archive/v1.10.1.zip",
    "status": "approved"
}
