{
    "id": "maven/mavencentral/es.weso/srdf_2.12/0.1.107",
    "license": "MIT",
    "authority": "https://gitlab.eclipse.org/eclipsefdn/emo-team/iplab/-/issues/8888",
    "source": "https://repo.maven.apache.org/maven2/es/weso/srdf_2.12/0.1.107/srdf_2.12-0.1.107-sources.jar",
    "status": "approved",
    "scans": [
        {
            "date": "June 14, 2023 at 6:06:54 p.m. GMT",
            "authority": "https://gitlab.eclipse.org/eclipsefdn/emo-team/iplab/-/issues/8888",
            "scancode-version": "31.2.1",
            "licenses-discovered": [
            ],
            "copyrights": [
            ],
            "file-count": 32,
            "sha256": "55a27f6196f0bf101fb0a312a9c214123583c74a711f63a0b34fb6672a39d577",
            "source": "https://repo.maven.apache.org/maven2/es/weso/srdf_2.12/0.1.107/srdf_2.12-0.1.107-sources.jar",
            "status": "restricted"
        }
    ]
}
