{
    "id": "npm/npmjs/-/sinon/15.0.4",
    "license": "BSD-3-Clause AND MIT AND ISC",
    "authority": "https://gitlab.eclipse.org/eclipsefdn/emo-team/iplab/-/issues/8310",
    "source": "https://github.com/sinonjs/sinon/archive/v15.0.4.zip",
    "status": "approved",
    "scans": [
        {
            "date": "May 4, 2023 at 5:38:58 p.m. GMT",
            "authority": "https://gitlab.eclipse.org/eclipsefdn/emo-team/iplab/-/issues/8310",
            "scancode-version": "31.2.1",
            "licenses-discovered": [
                "BSD-3-Clause",
                "MIT",
                "ISC"
            ],
            "copyrights": [
                "Copyright (c) 2010-2017, Christian Johansen, christian@cjohansen.no",
                "Copyright 2011-2016 Twitter, Inc."
            ],
            "file-count": 286,
            "sha256": "819904ffee7e49fce98966bd74fc81503756ae9e13d6fa3cfcc0d21bf7968c3b",
            "source": "https://github.com/sinonjs/sinon/archive/v15.0.4.zip",
            "status": "approved"
        }
    ]
}