{
    "id": "maven/mavencentral/com.vaadin/vaadin-lumo-theme/24.3.7",
    "license": "Apache-2.0",
    "authority": "https://gitlab.eclipse.org/eclipsefdn/emo-team/iplab/-/issues/13729",
    "source": "https://repo1.maven.org/maven2/com/vaadin/vaadin-lumo-theme/24.3.7/vaadin-lumo-theme-24.3.7-sources.jar",
    "status": "approved",
    "scans": [
        {
            "date": "March 15, 2024 at 2:23:45 p.m. GMT",
            "authority": "https://gitlab.eclipse.org/eclipsefdn/emo-team/iplab/-/issues/13729",
            "scancode-version": "31.2.1",
            "licenses-discovered": [
                "Apache-2.0"
            ],
            "copyrights": [
                "Copyright 2000-2023 Vaadin Ltd."
            ],
            "file-count": 6,
            "sha256": "26b124eb06453dcb1de31593d7ff708efc4cd9024748f59792690c95bccfd09d",
            "source": "https://repo1.maven.org/maven2/com/vaadin/vaadin-lumo-theme/24.3.7/vaadin-lumo-theme-24.3.7-sources.jar",
            "status": "approved"
        }
    ]
}