{
    "id": "npm/npmjs/-/postgresql-client/2.0.0",
    "license": "MIT",
    "licenses-discovered": [
        "MIT"
    ],
    "file-count": 169,
    "scancode-version": "30.1.0",
    "authority": "https://gitlab.eclipse.org/eclipsefdn/emo-team/iplab/-/issues/2118",
    "source": "https://registry.npmjs.org/postgresql-client/-/postgresql-client-2.0.0.tgz",
    "status": "approved"
}