{
    "id": "maven/mavencentral/io.fabric8/openshift-model-config/6.6.0",
    "license": "Apache-2.0",
    "authority": "https://gitlab.eclipse.org/eclipsefdn/emo-team/iplab/-/issues/8341",
    "source": "https://search.maven.org/remotecontent?filepath=io/fabric8/openshift-model-config/6.6.0/openshift-model-config-6.6.0-sources.jar",
    "status": "approved",
    "scans": [
        {
            "date": "May 5, 2023 at 5:45:56 a.m. GMT",
            "authority": "https://gitlab.eclipse.org/eclipsefdn/emo-team/iplab/-/issues/8341",
            "scancode-version": "31.2.1",
            "licenses-discovered": [
                "Apache-2.0"
            ],
            "copyrights": [
                "Copyright (c) 2015 Red Hat, Inc."
            ],
            "file-count": 652,
            "sha256": "c8b6df397aa76fbaa6fd3dfb99e4a4b7aaca8d37c7a79475f0f6219341653c9b",
            "source": "https://search.maven.org/remotecontent?filepath=io/fabric8/openshift-model-config/6.6.0/openshift-model-config-6.6.0-sources.jar",
            "status": "approved"
        }
    ]
}