{
    "license": "Apache-2.0 AND BSD-3-Clause",
    "file-count": 364,
    "authority": "https://gitlab.eclipse.org/eclipsefdn/emo-team/iplab/-/issues/1811",
    "scancode-version": "30.1.0",
    "licenses-discovered": [
        "Apache-2.0",
        "BSD-3-Clause",
        "LicenseRef-scancode-warranty-disclaimer"
    ],
    "id": "p2/orbit/p2.eclipse-plugin/net.bytebuddy.byte-buddy/1.12.2",
    "source": "https://search.maven.org/remotecontent?filepath=net/bytebuddy/byte-buddy/1.12.2/byte-buddy-1.12.2-sources.jar",
    "status": "approved"
}
