{
    "id": "npm/npmjs/-/css-has-pseudo/7.0.2",
    "license": "MIT-0",
    "authority": "https://gitlab.eclipse.org/eclipsefdn/emo-team/iplab/-/issues/18988",
    "source": "https://registry.yarnpkg.com/css-has-pseudo/-/css-has-pseudo-7.0.2.tgz",
    "status": "approved",
    "scans": [
        {
            "date": "January 19, 2025 at 8:16:55 p.m. GMT",
            "authority": "https://gitlab.eclipse.org/eclipsefdn/emo-team/iplab/-/issues/18988",
            "scancode-version": "31.2.1",
            "licenses-discovered": [
                "MIT-0"
            ],
            "copyrights": [
                "Copyright (c) CSSTools Contributors"
            ],
            "file-count": 12,
            "sha256": "cc872994f91406c4d026218c30951138704e975498d5e0d0660a394c340766b1",
            "source": "https://registry.yarnpkg.com/css-has-pseudo/-/css-has-pseudo-7.0.2.tgz",
            "status": "approved"
        }
    ]
}