{
    "id": "p2/orbit/p2.eclipse.plugin/org.apache.poi.ooxml.schemas/5.2.4.v20231007-1530",
    "license": "Apache-2.0 AND MIT AND Apache-2.0 AND W3C-19980720",
    "authority": "https://gitlab.eclipse.org/eclipsefdn/emo-team/iplab/-/issues/10947",
    "source": "https://download.eclipse.org/tools/orbit/simrel/orbit-aggregation/milestone/S202310110718/plugins/org.apache.poi.ooxml.schemas.source_5.2.4.v20231007-1530.jar",
    "status": "approved",
    "scans": [
        {
            "date": "October 11, 2023 at 10:58:03 p.m. GMT",
            "authority": "https://gitlab.eclipse.org/eclipsefdn/emo-team/iplab/-/issues/10947",
            "scancode-version": "31.2.1",
            "licenses-discovered": [
                "Apache-2.0 AND MIT",
                "Apache-2.0",
                "W3C-19980720"
            ],
            "copyrights": [
                "(c) 2008 VeriSign, Inc.",
                "Copyright (c) 2000-2002 Microsoft Corporation",
                "Copyright (c) 2002-2023 EPFL",
                "Copyright (c) 2011-2023 Lightbend, Inc.",
                "Copyright (c) 2015 Inbot",
                "Copyright (c) 2015-2021 the original",
                "Copyright (c) Microsoft Corporation",
                "Copyright 2001 The Internet Society and W3C (Massachusetts Institute of Technology, Institut National de Recherche en Informatique et en Automatique, Keio University)"
            ],
            "file-count": 14369,
            "sha256": "fd8204135519fea90ccf6e5ac1da8c9625b5eb84d502d208564d485c69566a51",
            "source": "https://download.eclipse.org/tools/orbit/simrel/orbit-aggregation/milestone/S202310110718/plugins/org.apache.poi.ooxml.schemas.source_5.2.4.v20231007-1530.jar",
            "status": "approved"
        }
    ]
}