{
    "id": "go/golang/cloud.google.com/go/v0.60.0",
    "license": "Apache-2.0 AND (Apache-2.0 AND BSD-3-Clause) AND BSD-2-Clause",
    "authority": "https://gitlab.eclipse.org/eclipsefdn/emo-team/iplab/-/issues/12232",
    "source": "https://proxy.golang.org/cloud.google.com/go/@v/v0.60.0.zip",
    "status": "approved",
    "scans": [
        {
            "date": "December 21, 2023 at 7:29:42 a.m. GMT",
            "authority": "https://gitlab.eclipse.org/eclipsefdn/emo-team/iplab/-/issues/12232",
            "scancode-version": "31.2.1",
            "licenses-discovered": [
                "Apache-2.0",
                "Apache-2.0 AND BSD-3-Clause",
                "BSD-2-Clause"
            ],
            "copyrights": [
                "Copyright (c) 1996-1998 John D. Polstra",
                "Copyright (c) 2001 David E. O'Brien",
                "Copyright 2014 Google LLC",
                "Copyright 2016 Google LLC",
                "Copyright 2017 Google LLC",
                "Copyright 2017, Google LLC",
                "Copyright 2018 Google Inc.",
                "Copyright 2018 Google LLC",
                "Copyright 2019 Google LLC",
                "Copyright 2020 Google LLC",
                "Copyright 2020, Google LLC",
                "Portions Copyright 2018 Google LLC."
            ],
            "file-count": 595,
            "sha256": "01c2e1b50b568697e9cd5e2d1117e677e3544eed522d0141af3d96c099d85744",
            "source": "https://proxy.golang.org/cloud.google.com/go/@v/v0.60.0.zip",
            "status": "approved"
        }
    ]
}