{
    "id": "go/golang/github.com%2Fcontainerd/cgroups/v1.1.0",
    "license": "Apache-2.0",
    "authority": "https://gitlab.eclipse.org/eclipsefdn/emo-team/iplab/-/issues/13188",
    "source": "https://proxy.golang.org/github.com%2Fcontainerd/cgroups/@v/v1.1.0.zip",
    "status": "approved",
    "scans": [
        {
            "date": "February 8, 2024 at 7:02:35 a.m. GMT",
            "authority": "https://gitlab.eclipse.org/eclipsefdn/emo-team/iplab/-/issues/13188",
            "scancode-version": "31.2.1",
            "licenses-discovered": [
                "Apache-2.0"
            ],
            "copyrights": [
            ],
            "file-count": 73,
            "sha256": "901c0ce3004f40e7caae994f02cdec4bb9bff82f758f19e24df4ac5fed727a0e",
            "source": "https://proxy.golang.org/github.com%2Fcontainerd/cgroups/@v/v1.1.0.zip",
            "status": "approved"
        }
    ]
}