{
    "id": "npm/npmjs/-/postcss-discard-overridden/4.0.1",
    "license": "MIT",
    "licenses-discovered": [
        "MIT"
    ],
    "copyrights": [
        "Copyright 2016 Justineo <justice360@gmail.com>"
    ],
    "file-count": 12,
    "scancode-version": "31.2.1",
    "authority": "https://gitlab.eclipse.org/eclipsefdn/emo-team/iplab/-/issues/4509",
    "source": "https://registry.npmjs.org/postcss-discard-overridden/-/postcss-discard-overridden-4.0.1.tgz",
    "status": "approved"
}