{
    "id": "maven/mavencentral/org.geotools.ogc/org.w3.xlink/23.3",
    "license": "LGPL-2.1-only",
    "authority": "https://gitlab.eclipse.org/eclipsefdn/emo-team/iplab/-/issues/5065",
    "source": "https://repo.osgeo.org/repository/geotools-releases/org/geotools/ogc/org.w3.xlink/23.3/org.w3.xlink-23.3-sources.jar",
    "status": "approved",
    "scans": [
        {
            "date": "November 24, 2022 at 5:52:48 p.m. GMT",
            "authority": "https://gitlab.eclipse.org/eclipsefdn/emo-team/iplab/-/issues/5065",
            "scancode-version": "31.2.1",
            "licenses-discovered": [
            ],
            "copyrights": [
            ],
            "file-count": 25,
            "sha256": "7fd4a8452e220f50b349bcc9f36da1f024cfcf3250387f82118aebdacd273679",
            "source": "https://repo.osgeo.org/repository/geotools-releases/org/geotools/ogc/org.w3.xlink/23.3/org.w3.xlink-23.3-sources.jar",
            "status": "restricted"
        }
    ]
}
