{
    "id": "maven/mavencentral/org.apache.lucene/lucene-queryparser/9.11.0",
    "license": "Apache-2.0",
    "authority": "https://gitlab.eclipse.org/eclipsefdn/emo-team/iplab/-/issues/15136",
    "source": "https://repo1.maven.org/maven2/org/apache/lucene/lucene-queryparser/9.11.0/lucene-queryparser-9.11.0-sources.jar",
    "status": "approved",
    "scans": [
        {
            "date": "June 7, 2024 at 3:30:46 p.m. GMT",
            "authority": "https://gitlab.eclipse.org/eclipsefdn/emo-team/iplab/-/issues/15136",
            "scancode-version": "31.2.1",
            "licenses-discovered": [
                "Apache-2.0"
            ],
            "copyrights": [
            ],
            "file-count": 251,
            "sha256": "dfe0653001574834babc00bd0b2fb44483fe9b455cea1712d88b9505aad4711d",
            "source": "https://repo1.maven.org/maven2/org/apache/lucene/lucene-queryparser/9.11.0/lucene-queryparser-9.11.0-sources.jar",
            "status": "approved"
        }
    ]
}