{
    "id": "maven/mavencentral/org.graalvm.sdk/graal-sdk/21.3.5",
    "license": "UPL-1.0",
    "authority": "https://gitlab.eclipse.org/eclipsefdn/emo-team/iplab/-/issues/6717",
    "source": "https://search.maven.org/remotecontent?filepath=org/graalvm/sdk/graal-sdk/21.3.5/graal-sdk-21.3.5-sources.jar",
    "status": "approved",
    "scans": [
        {
            "date": "January 27, 2023 at 9:28:46 a.m. GMT",
            "authority": "https://gitlab.eclipse.org/eclipsefdn/emo-team/iplab/-/issues/6717",
            "scancode-version": "31.2.1",
            "licenses-discovered": [
                "UPL-1.0"
            ],
            "copyrights": [
                "Copyright (c) 2007, 2019, Oracle and/or its affiliates",
                "Copyright (c) 2009, 2020, Oracle and/or its affiliates",
                "Copyright (c) 2011, 2019, Oracle and/or its affiliates",
                "Copyright (c) 2012, 2018, Oracle and/or its affiliates",
                "Copyright (c) 2012, 2019, Oracle and/or its affiliates",
                "Copyright (c) 2013, 2019, Oracle and/or its affiliates",
                "Copyright (c) 2013, 2020, Oracle and/or its affiliates",
                "Copyright (c) 2013, 2021, Oracle and/or its affiliates",
                "Copyright (c) 2014, 2019, Oracle and/or its affiliates",
                "Copyright (c) 2014, 2021, Oracle and/or its affiliates",
                "Copyright (c) 2015, 2019, Oracle and/or its affiliates",
                "Copyright (c) 2016, 2020, Oracle and/or its affiliates",
                "Copyright (c) 2017, 2018, Oracle and/or its affiliates",
                "Copyright (c) 2017, 2019, Oracle and/or its affiliates",
                "Copyright (c) 2017, 2020, Oracle and/or its affiliates",
                "Copyright (c) 2017, 2021, Oracle and/or its affiliates",
                "Copyright (c) 2017, 2022, Oracle and/or its affiliates",
                "Copyright (c) 2018, 2019, Oracle and/or its affiliates",
                "Copyright (c) 2018, 2020, Oracle and/or its affiliates",
                "Copyright (c) 2018, 2021, Oracle and/or its affiliates",
                "Copyright (c) 2018, Oracle and/or its affiliates",
                "Copyright (c) 2019, 2020, Oracle and/or its affiliates",
                "Copyright (c) 2019, 2021, Oracle and/or its affiliates",
                "Copyright (c) 2019, Oracle and/or its affiliates",
                "Copyright (c) 2020, 2020, Oracle and/or its affiliates",
                "Copyright (c) 2020, 2021, Oracle and/or its affiliates",
                "Copyright (c) 2020, Oracle and/or its affiliates",
                "Copyright (c) 2021, 2022, Oracle and/or its affiliates",
                "Copyright (c) 2021, Oracle and/or its affiliates"
            ],
            "file-count": 172,
            "sha256": "7491a7e69bff04866b347fcaf78bde3bc2ec85a0c0701ac7127eb43b27f5b079",
            "source": "https://search.maven.org/remotecontent?filepath=org/graalvm/sdk/graal-sdk/21.3.5/graal-sdk-21.3.5-sources.jar",
            "status": "approved"
        }
    ]
}