{
    "id": "npm/npmjs/-/immer/9.0.19",
    "license": "MIT",
    "authority": "https://gitlab.eclipse.org/eclipsefdn/emo-team/iplab/-/issues/7037",
    "source": "https://github.com/immerjs/immer/archive/v9.0.19.zip",
    "status": "approved",
    "scans": [
        {
            "date": "February 7, 2023 at 7:21:38 p.m. GMT",
            "authority": "https://gitlab.eclipse.org/eclipsefdn/emo-team/iplab/-/issues/7037",
            "scancode-version": "31.2.1",
            "licenses-discovered": [
                "MIT"
            ],
            "copyrights": [
                "Copyright (c) 2017 Michel Weststrate",
                "Copyright (c) 2022 Michel"
            ],
            "file-count": 155,
            "sha256": "b9e5714931da4962a462dad1593817701fc7aca4e24ec84044fa7892318ec82f",
            "source": "https://github.com/immerjs/immer/archive/v9.0.19.zip",
            "status": "approved"
        }
    ]
}