{
    "id": "maven/mavencentral/org.geotools/gt-referencing/30.4",
    "license": "LGPL-2.0-or-later AND LGPL-2.1-only",
    "authority": "https://gitlab.eclipse.org/eclipsefdn/emo-team/iplab/-/issues/15583",
    "source": "https://repo.osgeo.org/repository/geotools-releases/org/geotools/gt-referencing/30.4/gt-referencing-30.4-sources.jar",
    "status": "approved",
    "scans": [
        {
            "date": "July 3, 2024 at 3:16:02 p.m. GMT",
            "authority": "https://gitlab.eclipse.org/eclipsefdn/emo-team/iplab/-/issues/15583",
            "scancode-version": "31.2.1",
            "licenses-discovered": [
                "LGPL-2.0-or-later",
                "LGPL-2.1-only",
                "LGPL-2.1-only AND LicenseRef-scancode-other-permissive",
                "LGPL-2.0-or-later AND LGPL-2.1-only",
                "LGPL-2.1-or-later"
            ],
            "copyrights": [
                "(c) 1998-2008, Open Source Geospatial Foundation",
                "(c) 1999-2008, Open Source Geospatial Foundation",
                "(c) 1999-2015, Open Source Geospatial Foundation",
                "(c) 1999-2016, Open Source Geospatial Foundation",
                "(c) 2000-2008, Open Source Geospatial Foundation",
                "(c) 2000-2016, Open Source Geospatial Foundation",
                "(c) 2001-2008, Open Source Geospatial Foundation",
                "(c) 2001-2015, Open Source Geospatial Foundation",
                "(c) 2002-2008, Open Source Geospatial Foundation",
                "(c) 2002-2012, Open Source Geospatial Foundation",
                "(c) 2002-2015, Open Source Geospatial Foundation",
                "(c) 2003-2008, Open Source Geospatial Foundation",
                "(c) 2004, Open Source Geospatial Foundation",
                "(c) 2004-2008, Open Source Geospatial Foundation",
                "(c) 2004-2011, Open Source Geospatial Foundation",
                "(c) 2004-2015, Open Source Geospatial Foundation",
                "(c) 2005 - 2015, Open Source Geospatial Foundation",
                "(c) 2005-2008, Open Source Geospatial Foundation",
                "(c) 2005-2015, Open Source Geospatial Foundation",
                "(c) 2005-2016, Open Source Geospatial Foundation",
                "(c) 2006-2008, Open Source Geospatial Foundation",
                "(c) 2006-2012, Open Source Geospatial Foundation",
                "(c) 2006-2016, Open Source Geospatial Foundation",
                "(c) 2007-2008, Open Source Geospatial Foundation",
                "(c) 2007-2015, Open Source Geospatial Foundation",
                "(c) 2009, Open Source Geospatial Foundation",
                "(c) 2012, Open Source Geospatial Foundation",
                "(c) 2014, Open Source Geospatial Foundation",
                "(c) 2015, Open Source Geospatial Foundation",
                "(c) 2016, Open Source Geospatial Foundation",
                "(c) 2017, Open Source Geospatial Foundation",
                "(c) 2018, Open Source Geospatial Foundation",
                "(c) 2019, Open Source Geospatial Foundation",
                "(c) 2020, Open Source Geospatial Foundation",
                "(c) 2021, Open Source Geospatial Foundation",
                "(c) 2023, Open Source Geospatial Foundation"
            ],
            "file-count": 346,
            "sha256": "ef25776062b88a303b7b30986a40fd1d7d33cd72c7851f94514824aead0df998",
            "source": "https://repo.osgeo.org/repository/geotools-releases/org/geotools/gt-referencing/30.4/gt-referencing-30.4-sources.jar",
            "status": "restricted"
        }
    ]
}