{
    "id": "p2/orbit/p2.eclipse.plugin/org.apache.lucene.queryparser/9.10.0.v20240221-0830",
    "license": "Apache-2.0",
    "authority": "https://gitlab.eclipse.org/eclipsefdn/emo-team/iplab/-/issues/13363",
    "source": "https://repo1.maven.org/maven2/org/apache/lucene/lucene-queryparser/9.10.0/lucene-queryparser-9.10.0-sources.jar",
    "status": "approved",
    "scans": [
        {
            "date": "February 21, 2024 at 12:26:55 p.m. GMT",
            "authority": "https://gitlab.eclipse.org/eclipsefdn/emo-team/iplab/-/issues/13363",
            "scancode-version": "31.2.1",
            "licenses-discovered": [
                "Apache-2.0"
            ],
            "copyrights": [
            ],
            "file-count": 251,
            "sha256": "7911a83f8943382c3293ad43149fceb46209b43c076689139e5476006105ff2a",
            "source": "https://repo1.maven.org/maven2/org/apache/lucene/lucene-queryparser/9.10.0/lucene-queryparser-9.10.0-sources.jar",
            "status": "approved"
        }
    ]
}