{
    "id": "maven/mavencentral/jakarta.xml.ws/jakarta.xml.ws-api/3.0.1",
    "license": "BSD-3-Clause",
    "authority": "https://gitlab.eclipse.org/eclipsefdn/emo-team/iplab/-/issues/13378",
    "source": "https://repo1.maven.org/maven2/jakarta/xml/ws/jakarta.xml.ws-api/3.0.1/jakarta.xml.ws-api-3.0.1-sources.jar",
    "status": "approved",
    "scans": [
        {
            "date": "February 23, 2024 at 9:08:40 a.m. GMT",
            "authority": "https://gitlab.eclipse.org/eclipsefdn/emo-team/iplab/-/issues/13378",
            "scancode-version": "31.2.1",
            "licenses-discovered": [
                "BSD-3-Clause"
            ],
            "copyrights": [
                "Copyright (c) 1997, 2021 Oracle and/or its affiliates",
                "Copyright (c) 2005, 2020 Oracle and/or its affiliates",
                "Copyright (c) 2005, 2021 Oracle and/or its affiliates",
                "Copyright (c) 2007, 2020 Oracle and/or its affiliates",
                "Copyright (c) 2009, 2020 Oracle and/or its affiliates",
                "Copyright (c) 2015, 2020 Oracle and/or its affiliates",
                "Copyright (c) 2017, 2018 Oracle and/or its affiliates",
                "Copyright (c) 2017, 2020 Oracle and/or its affiliates",
                "Copyright (c) 2018, 2019 Oracle and/or its affiliates",
                "Copyright (c) 2018, 2020 Oracle and/or its affiliates",
                "Copyright (c) 2019, current.year Eclipse Foundation",
                "Copyright (c) 2020 Oracle and/or its affiliates"
            ],
            "file-count": 74,
            "sha256": "b6116e7cf6ad4949a4cba024a90c686daa53e406b1c04226418eb59ef2afb5e5",
            "source": "https://repo1.maven.org/maven2/jakarta/xml/ws/jakarta.xml.ws-api/3.0.1/jakarta.xml.ws-api-3.0.1-sources.jar",
            "status": "approved"
        }
    ]
}