{
    "id": "maven/mavencentral/org.codelibs.elasticsearch.module/ingest-user-agent/7.15.2",
    "license": "Elastic-2.0 OR SSPL-1.0",
    "authority": "https://gitlab.eclipse.org/eclipsefdn/emo-team/iplab/-/issues/6430",
    "source": "https://maven.codelibs.org/org/codelibs/elasticsearch/module/ingest-user-agent/7.15.2/ingest-user-agent-7.15.2-sources.jar",
    "status": "approved",
    "scans": [
        {
            "date": "February 1, 2023 at 5:06:02 a.m. GMT",
            "authority": "https://gitlab.eclipse.org/eclipsefdn/emo-team/iplab/-/issues/6430",
            "scancode-version": "31.2.1",
            "licenses-discovered": [
                "Elastic-2.0 AND SSPL-1.0"
            ],
            "copyrights": [
                "Copyright Elasticsearch B.V."
            ],
            "file-count": 6,
            "sha256": "478d64f61b23c0ab350a40e2784381ca38f63105ef7d0b2ce27324cab563178e",
            "source": "https://maven.codelibs.org/org/codelibs/elasticsearch/module/ingest-user-agent/7.15.2/ingest-user-agent-7.15.2-sources.jar",
            "status": "approved"
        }
    ]
}
