{
    "id": "npm/npmjs/@esbuild/android-x64/0.24.0",
    "license": "Apache-2.0 AND MIT AND BSD-3-Clause AND (BSD-2-Clause AND BSD-3-Clause)",
    "authority": "https://gitlab.eclipse.org/eclipsefdn/emo-team/iplab/-/issues/17580",
    "source": "https://github.com/evanw/esbuild/archive/refs/tags/v0.24.0.zip",
    "status": "approved",
    "scans": [
        {
            "date": "November 29, 2024 at 12:59:00 p.m. GMT",
            "authority": "https://gitlab.eclipse.org/eclipsefdn/emo-team/iplab/-/issues/17580",
            "scancode-version": "31.2.1",
            "licenses-discovered": [
                "Apache-2.0",
                "MIT",
                "BSD-3-Clause",
                "BSD-2-Clause AND BSD-3-Clause"
            ],
            "copyrights": [
                "(c) Evil Software Corp",
                "(c) Good Software",
                "(c) Good Software Corp",
                "(c) expectPrintedTarget t, 2019",
                "Copyright (c) 2009 The Go Authors",
                "Copyright (c) 2016 Caleb Spare",
                "Copyright (c) 2020 Evan Wallace",
                "Copyright (c) Microsoft Corporation",
                "Copyright 2012-2019 (c) Mihai Bazon <mihai.bazon@gmail.com>"
            ],
            "file-count": 322,
            "sha256": "b80e2a841ee108c4d85ed59fe93041a7057c5767d2caffe2600a05c0a8864f30",
            "source": "https://github.com/evanw/esbuild/archive/refs/tags/v0.24.0.zip",
            "status": "approved"
        }
    ]
}