{
    "license": "MIT",
    "file-count": 5,
    "authority": "https://gitlab.eclipse.org/eclipsefdn/emo-team/iplab/-/issues/1267",
    "scancode-version": "21.3.31",
    "licenses-discovered": [
        "MIT"
    ],
    "id": "npm/npmjs/webassemblyjs/floating-point-hex-parser/1.8.5",
    "source": "https://registry.yarnpkg.com/@webassemblyjs/floating-point-hex-parser/-/floating-point-hex-parser-1.8.5.tgz",
    "status": "approved"
}