{
    "id": "maven/mavencentral/org.apache.camel/camel-dataset/3.14.4",
    "license": "Apache-2.0",
    "licenses-discovered": [
        "Apache-2.0"
    ],
    "copyrights": [
    ],
    "file-count": 31,
    "scancode-version": "30.1.0",
    "authority": "https://gitlab.eclipse.org/eclipsefdn/emo-team/iplab/-/issues/3397",
    "source": "https://search.maven.org/remotecontent?filepath=org/apache/camel/camel-dataset/3.14.4/camel-dataset-3.14.4-sources.jar",
    "status": "approved"
}