{
    "id": "go/golang/github.com%2Fform3tech-oss/jwt-go/v3.2.3",
    "license": "MIT",
    "authority": "https://gitlab.eclipse.org/eclipsefdn/emo-team/iplab/-/issues/6044",
    "source": "https://github.com/form3tech-oss/jwt-go/archive/refs/tags/v3.2.3.zip",
    "status": "approved",
    "scans": [
        {
            "date": "January 6, 2023 at 8:05:57 p.m. GMT",
            "authority": "https://gitlab.eclipse.org/eclipsefdn/emo-team/iplab/-/issues/6044",
            "scancode-version": "31.2.1",
            "licenses-discovered": [
                "MIT"
            ],
            "copyrights": [
                "Copyright (c) 2012 Dave Grijalva"
            ],
            "file-count": 51,
            "sha256": "b7d98d2eb8c96576568a7e3ecca561a6adcd6bbe9597b8662b8085a15337f5e5",
            "source": "https://github.com/form3tech-oss/jwt-go/archive/refs/tags/v3.2.3.zip",
            "status": "approved"
        }
    ]
}