{
    "id": "git/github/grpc/grpc/v1.50.1",
    "license": "Apache-2.0 AND BSD-3-Clause AND MPL-2.0 AND ISC AND NTP AND MIT AND BSD-2-Clause",
    "authority": "https://gitlab.eclipse.org/eclipsefdn/emo-team/iplab/-/issues/8712",
    "source": "https://github.com/grpc/grpc/archive/refs/tags/v1.50.1.zip",
    "status": "approved",
    "scans": [
        {
            "date": "June 6, 2023 at 8:41:05 a.m. GMT",
            "authority": "https://gitlab.eclipse.org/eclipsefdn/emo-team/iplab/-/issues/8712",
            "scancode-version": "31.2.1",
            "licenses-discovered": [
                "Apache-2.0",
                "Apache-2.0 AND BSD-3-Clause AND MPL-2.0",
                "Apache-2.0 AND BSD-3-Clause",
                "MPL-2.0",
                "ISC",
                "BSD-3-Clause AND LicenseRef-scancode-protobuf",
                "BSD-3-Clause",
                "NTP",
                "MIT",
                "BSD-2-Clause"
            ],
            "copyrights": [
                "(c) (c) I",
                "(c) 1999 Entrust.net Limited",
                "(c) 1999 Entrust.net Limited Label Entrust.net Premium 2048 Secure Server CA Serial",
                "(c) 2006 Entrust, Inc.",
                "(c) 2006 Entrust, Inc. Label Entrust Root Certification",
                "(c) 2009 Entrust, Inc. - for",
                "(c) 2012 Entrust, Inc. - for",
                "(c) 2015 Entrust, Inc. - for",
                "(c) 2018 gRPC.",
                "Copyright (c) 1995, 1996, 1997, and 1998 WIDE Project",
                "Copyright (c) 2004, 2006-2010 Michael Roth <mroth@nessie.de>",
                "Copyright (c) 2004-2009 Michael Roth <mroth@nessie.de>",
                "Copyright (c) 2004-2010 Michael Roth <mroth@nessie.de>",
                "Copyright (c) 2006-2008 Michael Roth <mroth@nessie.de>",
                "Copyright (c) 2009 - 2013 by Daniel Stenberg",
                "Copyright (c) 2009-2021, Google LLC",
                "Copyright (c) 2009-2022, Google LLC",
                "Copyright (c) 2012-2020 Yann Collet",
                "Copyright (c) 2018 https://github.com/grpc/grpc/blob/master/AUTHORS",
                "Copyright (c) 2018, Google Inc.",
                "Copyright (c) 2019 Yibo Cai",
                "Copyright 2007 Google Inc.",
                "Copyright 2008 Google Inc.",
                "Copyright 2012 The gRPC",
                "Copyright 2012 gRPC",
                "Copyright 2013 Google Inc.",
                "Copyright 2014 Google Inc.",
                "Copyright 2014, Google Inc.",
                "Copyright 2015 The gRPC",
                "Copyright 2015 gRPC",
                "Copyright 2015, Google Inc.",
                "Copyright 2015-2016 gRPC",
                "Copyright 2015-2017 gRPC",
                "Copyright 2016 Google Inc.",
                "Copyright 2016 The Chromium Authors",
                "Copyright 2016 The gRPC",
                "Copyright 2016 gRPC",
                "Copyright 2016, Google Inc.",
                "Copyright 2017 The gRPC",
                "Copyright 2017 gRPC",
                "Copyright 2018 The Bazel Authors",
                "Copyright 2018 The gRPC",
                "Copyright 2018 gRPC",
                "Copyright 2018, gRPC",
                "Copyright 2019 The Bazel Authors",
                "Copyright 2019 The gRPC",
                "Copyright 2019 gRPC",
                "Copyright 2019 the gRPC",
                "Copyright 2019, Google Inc.",
                "Copyright 2020 The gRPC",
                "Copyright 2020 gRPC",
                "Copyright 2020 the gRPC",
                "Copyright 2021 The gRPC",
                "Copyright 2021 gRPC",
                "Copyright 2021 the gRPC",
                "Copyright 2021, Google Inc.",
                "Copyright 2022 The gRPC",
                "Copyright 2022 gRPC",
                "Copyright 2022 the gRPC",
                "copyright 2020, The gRPC",
                "copyrighted by Bloomberg Finance",
                "copyrighted by Red Hat Inc."
            ],
            "file-count": 9463,
            "sha256": "13df210199d89b62cc48d6b24ba202815a3d8bf7d91c1cc38353702712b3d716",
            "source": "https://github.com/grpc/grpc/archive/refs/tags/v1.50.1.zip",
            "status": "restricted"
        }
    ]
}
