{
    "id": "npm/npmjs/-/chroma-js/2.1.0",
    "license": "Apache-2.0 AND BSD-3-Clause AND MIT",
    "authority": "https://gitlab.eclipse.org/eclipsefdn/emo-team/iplab/-/issues/5904",
    "source": "https://github.com/gka/chroma.js/archive/v2.1.0.zip",
    "status": "approved",
    "scans": [
        {
            "date": "December 16, 2022 at 11:50:09 p.m. GMT",
            "authority": "https://gitlab.eclipse.org/eclipsefdn/emo-team/iplab/-/issues/5904",
            "scancode-version": "31.2.1",
            "licenses-discovered": [
                "Apache-2.0 AND BSD-3-Clause",
                "GPL-1.0-or-later AND GPL-3.0-only",
                "MIT",
                "Apache-2.0"
            ],
            "copyrights": [
                "(c) 2005, 2014 jQuery Foundation, Inc.",
                "Copyright (c) 2002 Cynthia Brewer, Mark Harrower, and The Pennsylvania State University",
                "Copyright (c) 2011-2019, Gregor Aisch",
                "copyright (c) by Marijn Haverbeke and others"
            ],
            "file-count": 166,
            "sha256": "1c365c9b45054b64aeedc32e53b4ddda976fa6e7ce49d6d4df0449af8f79a9fb",
            "source": "https://github.com/gka/chroma.js/archive/v2.1.0.zip",
            "status": "restricted"
        }
    ]
}
