{
    "id": "maven/mavencentral/gov.nist.math/jama/1.0.3",
    "license": "LicenseRef-Public-Domain",
    "authority": "https://gitlab.eclipse.org/eclipsefdn/emo-team/iplab/-/issues/19338",
    "source": "https://repo1.maven.org/maven2/gov/nist/math/jama/1.0.3/jama-1.0.3-sources.jar",
    "status": "approved",
    "scans": [
        {
            "date": "February 6, 2025 at 1:06:55 a.m. GMT",
            "authority": "https://gitlab.eclipse.org/eclipsefdn/emo-team/iplab/-/issues/19338",
            "scancode-version": "31.2.1",
            "licenses-discovered": [
            ],
            "copyrights": [
            ],
            "file-count": 11,
            "sha256": "5691d17d91efb78697cf7470f10b319cafa6be2fbbc1fa98b978e11ce9fd9356",
            "source": "https://repo1.maven.org/maven2/gov/nist/math/jama/1.0.3/jama-1.0.3-sources.jar",
            "status": "restricted"
        }
    ]
}