{
    "id": "maven/mavencentral/com.fasterxml.jackson.core/jackson-core/2.4.0",
    "license": "Apache-2.0",
    "authority": "https://gitlab.eclipse.org/eclipsefdn/emo-team/iplab/-/issues/17343",
    "source": "https://repo1.maven.org/maven2/com/fasterxml/jackson/core/jackson-core/2.4.0/jackson-core-2.4.0-sources.jar",
    "status": "approved",
    "scans": [
        {
            "date": "November 19, 2024, 8:11:12 p.m. GMT",
            "authority": "https://gitlab.eclipse.org/eclipsefdn/emo-team/iplab/-/issues/17343",
            "scancode-version": "31.2.1",
            "licenses-discovered": [
                "Apache-2.0"
            ],
            "copyrights": [
                "(c) Override public ObjectCodec",
                "Copyright (c) 2007- Tatu Saloranta, tatu.saloranta@iki.fi"
            ],
            "file-count": 83,
            "sha256": "206ce99901b0bb8f20775c0d8888415c85aa7e2a8ae6098c9ee3689371975a1d",
            "source": "https://repo1.maven.org/maven2/com/fasterxml/jackson/core/jackson-core/2.4.0/jackson-core-2.4.0-sources.jar",
            "status": "approved"
        }
    ]
}