{
    "id": "pypi/pypi/-/nbclassic/1.0.0",
    "license": "Apache-2.0 AND BSD-3-Clause AND (BSD-3-Clause AND MIT) AND (Apache-2.0 AND BSD-3-Clause) AND CC-BY-3.0 AND OFL-1.1 AND MIT",
    "authority": "https://gitlab.eclipse.org/eclipsefdn/emo-team/iplab/-/issues/15011",
    "source": "https://files.pythonhosted.org/packages/8b/11/6e6084bad2b2f8faa787bd5f72fd1171c741801a03872b518965d7653ba5/nbclassic-1.0.0.tar.gz",
    "status": "approved",
    "scans": [
        {
            "date": "May 29, 2024 at 4:14:43 p.m. GMT",
            "authority": "https://gitlab.eclipse.org/eclipsefdn/emo-team/iplab/-/issues/15011",
            "scancode-version": "31.2.1",
            "licenses-discovered": [
                "BSD-3-Clause",
                "BSD-2-Clause",
                "BSD-3-Clause AND Python-2.0",
                "BSD-3-Clause AND MIT",
                "MIT",
                "CC-BY-3.0 AND MIT",
                "Apache-2.0",
                "Apache-2.0 AND CC-BY-3.0",
                "MIT AND TCL",
                "CC-BY-3.0",
                "MIT AND OFL-1.1",
                "Apache-2.0 AND BSD-3-Clause AND MIT"
            ],
            "copyrights": [
                "(c) 2009-2022 Jeremy Ashkenas, Julian Gonggrijp, and DocumentCloud and Investigative Reporters & Editors Underscore",
                "(c) Ia (c)",
                "(c) Ivan Sagalaev <Maniac@SoftwareManiacs.Org> Adapted from GitHub",
                "(c) JS Foundation and other contributors",
                "Copyright (c) 2004, John Gruber http://daringfireball.net",
                "Copyright (c) 2007 Cybozu Labs, Inc.",
                "Copyright (c) 2008-2015, IPython Development Team",
                "Copyright (c) 2009-2018 The MathJax Consortium",
                "Copyright (c) 2010-2018 The MathJax Consortium",
                "Copyright (c) 2011 Fabrice Bellard",
                "Copyright (c) 2011 by MarkLogic Corporation",
                "Copyright (c) 2011-2015 The MathJax Consortium",
                "Copyright (c) 2011-2018, Christopher Jeffrey (https://github.com/chjj/)",
                "Copyright (c) 2011-2022, Christopher Jeffrey",
                "Copyright (c) 2011-2022, Christopher Jeffrey. (MIT Licensed) https://github.com/markedjs/marked",
                "Copyright (c) 2012 Google Inc.",
                "Copyright (c) 2012-2013, Christopher Jeffrey (MIT License) https://github.com/chjj/term.js",
                "Copyright (c) 2013-present, Facebook, Inc.",
                "Copyright (c) 2014 The xterm.js authors",
                "Copyright (c) 2014, Facebook, Inc.",
                "Copyright (c) 2014-2017, Jon Schlinkert",
                "Copyright (c) 2014-present, Facebook, Inc.",
                "Copyright (c) 2015-, Jupyter Development Team",
                "Copyright (c) 2015-2019 Martin Hensel",
                "Copyright (c) 2017 ORGANIZATION",
                "Copyright (c) 2018+, MarkedJS (https://github.com/markedjs/)",
                "Copyright (c) 2019 RunningCoder.org",
                "Copyright (c) 2020 Project Jupyter Contributors",
                "Copyright (c) Alexandru Marasteanu",
                "Copyright (c) IPython Development Team",
                "Copyright (c) Jupyter Development Team",
                "Copyright (c) Sindre Sorhus <sindresorhus@gmail.com> (sindresorhus.com)",
                "Copyright 2007-2012 Steven Levithan",
                "Copyright 2011-2014 Twitter, Inc.",
                "Copyright 2011-2019 Twitter, Inc.",
                "Copyright 2012-2013 Ulrich Sossou",
                "Copyright 2014-2019 Volker Sorge",
                "Copyright Dave Gandy 2016",
                "Copyright jQuery Foundation and other contributors",
                "copyright (c) 2015 by Calin Barbat",
                "copyright (c) 2015 by Grzegorz Mazur Loosely",
                "copyright (c) 2016 Jared Dean, SAS Institute",
                "copyright (c) 2020 Denis Pushkarev",
                "copyright (c) HicknHack Software Gmbh",
                "copyright (c) by Lennart Ochel",
                "copyright (c) by Marijn Haverbeke and others",
                "copyright 2011-2019 Twitter, Inc.",
                "copyright 2015, Jupyter Team, https://jupyter.org",
                "copyright AtomicPages LLC 2014"
            ],
            "file-count": 30751,
            "sha256": "0ae11eb2319455d805596bf320336cda9554b41d99ab9a3c31bf8180bffa30e3",
            "source": "https://files.pythonhosted.org/packages/8b/11/6e6084bad2b2f8faa787bd5f72fd1171c741801a03872b518965d7653ba5/nbclassic-1.0.0.tar.gz",
            "status": "restricted"
        }
    ]
}