{
    "id": "maven/mavencentral/org.geotools/gt-process-feature/31.0",
    "license": "LGPL-2.1-only",
    "authority": "https://gitlab.eclipse.org/eclipsefdn/emo-team/iplab/-/issues/13898",
    "source": "https://repo.osgeo.org/repository/geotools-releases/org/geotools/gt-process-feature/31.0/gt-process-feature-31.0-sources.jar",
    "status": "approved",
    "scans": [
        {
            "date": "March 19, 2024 at 8:53:56 p.m. GMT",
            "authority": "https://gitlab.eclipse.org/eclipsefdn/emo-team/iplab/-/issues/13898",
            "scancode-version": "31.2.1",
            "licenses-discovered": [
                "LGPL-2.1-only"
            ],
            "copyrights": [
                "(c) 2001-2007 TOPP - www.openplans.org",
                "(c) 2007-2011 Refractions Research",
                "(c) 2008, Open Source Geospatial Foundation",
                "(c) 2008-2011 TOPP - www.openplans.org",
                "(c) 2008-2011, Open Source Geospatial Foundation",
                "(c) 2011, Open Source Geospatial Foundation",
                "(c) 2011-2016, Open Source Geospatial Foundation",
                "(c) 2012, Open Source Geospatial Foundation",
                "(c) 2016, Open Source Geospatial Foundation",
                "(c) 2017, Open Source Geospatial Foundation",
                "(c) 2019, Open Source Geospatial Foundation",
                "(c) 2020, Open Source Geospatial Foundation"
            ],
            "file-count": 51,
            "sha256": "3d8a74997a4fcc9c64868e74d699e499e83988b7a057ff3cd6b6f514d69eff19",
            "source": "https://repo.osgeo.org/repository/geotools-releases/org/geotools/gt-process-feature/31.0/gt-process-feature-31.0-sources.jar",
            "status": "approved"
        }
    ]
}