{
    "id": "pypi/pypi/-/statsmodels/0.14.3",
    "license": "BSD-3-Clause AND BSD-2-Clause AND PSF-2.0 AND (MIT OR GPL-2.0-only) AND MIT AND NCSA AND LicenseRef-Public-domain AND LicenseRef-Permission-Notice",
    "authority": "https://gitlab.eclipse.org/eclipsefdn/emo-team/iplab/-/issues/16874",
    "source": "https://files.pythonhosted.org/packages/05/d0/cf49ceca73f459b9b848ca2ce2a884ac8823284bc8b78aec161417d7bd78/statsmodels-0.14.3.tar.gz",
    "status": "approved",
    "scans": [
        {
            "date": "October 26, 2024, 5:21:01 p.m. GMT",
            "authority": "https://gitlab.eclipse.org/eclipsefdn/emo-team/iplab/-/issues/16874",
            "scancode-version": "31.2.1",
            "licenses-discovered": [
                "BSD-3-Clause AND BSD-3-Clause-Clear AND MIT",
                "BSD-3-Clause",
                "MIT",
                "GPL-1.0-or-later AND MIT",
                "BSD-2-Clause",
                "BSD-2-Clause AND BSD-3-Clause",
                "BSD-3-Clause AND NCSA"
            ],
            "copyrights": [
                "(c) 2019 Kevin Sheppard",
                "(c) County of a City",
                "COPYRIGHT Intern. J. Epidemiol. (1992)",
                "Copyright (c) 2001, 2002 Enthought, Inc.",
                "Copyright (c) 2002- (year)d John D. Hunter",
                "Copyright (c) 2003-2009 SciPy Developers",
                "Copyright (c) 2005-2009 Matt Kruse (javascripttoolbox.com)",
                "Copyright (c) 2005-2009, NumPy Developers",
                "Copyright (c) 2005-2015, NumPy Developers",
                "Copyright (c) 2006, Jonathan E. Taylor",
                "Copyright (c) 2006-2008 Scipy Developers",
                "Copyright (c) 2007 - 2010 Scikit-Learn Developers",
                "Copyright (c) 2008 Erik Tollerud (etolleru@uci.edu)",
                "Copyright (c) 2008, Attilio Meucci",
                "Copyright (c) 2008-2009 AQR Capital Management, LLC",
                "Copyright (c) 2009-2018 statsmodels",
                "Copyright (c) 2011 BSD, Roger Lew",
                "Copyright (c) 2011, Roger Lew",
                "Copyright (c) 2013 Ana Martinez Pardo <anamartinezpardo@gmail.com>",
                "Copyright (c) 2015, Martin van der Schans",
                "Copyright (c) 2018, Federal Reserve Bank of New York",
                "Copyright (c) 2019 Kevin Sheppard",
                "Copyright Forever Chris Wanstrath, Kyle Neath",
                "copyright 2009-2023, Josef Perktold, Skipper Seabold, Jonathan Taylor"
            ],
            "file-count": 2202,
            "sha256": "ecf3502643fa93aabe5f0bdf238efb59609517c4d60a811632d31fcdce86c2d2",
            "source": "https://files.pythonhosted.org/packages/05/d0/cf49ceca73f459b9b848ca2ce2a884ac8823284bc8b78aec161417d7bd78/statsmodels-0.14.3.tar.gz",
            "status": "restricted"
        }
    ]
}