{
    "id": "maven/mavencentral/org.springdoc/springdoc-openapi-starter-webmvc-ui/2.8.1",
    "license": "Apache-2.0",
    "authority": "https://gitlab.eclipse.org/eclipsefdn/emo-team/iplab/-/issues/18211",
    "source": "https://repo1.maven.org/maven2/org/springdoc/springdoc-openapi-starter-webmvc-ui/2.8.1/springdoc-openapi-starter-webmvc-ui-2.8.1-sources.jar",
    "status": "approved",
    "scans": [
        {
            "date": "January 7, 2025 at 7:52:55 a.m. GMT",
            "authority": "https://gitlab.eclipse.org/eclipsefdn/emo-team/iplab/-/issues/18211",
            "scancode-version": "31.2.1",
            "licenses-discovered": [
                "Apache-2.0"
            ],
            "copyrights": [
                "Copyright 2019-2025 the original author or authors"
            ],
            "file-count": 14,
            "sha256": "e0bf79b233667de2c2b4375ef697b792a9c47e5e12b602eebdf63a1779a93342",
            "source": "https://repo1.maven.org/maven2/org/springdoc/springdoc-openapi-starter-webmvc-ui/2.8.1/springdoc-openapi-starter-webmvc-ui-2.8.1-sources.jar",
            "status": "approved"
        }
    ]
}