{
    "id": "maven/mavencentral/io.opentelemetry/opentelemetry-sdk-extension-autoconfigure/1.19.0-alpha",
    "license": "Apache-2.0",
    "authority": "https://gitlab.eclipse.org/eclipsefdn/emo-team/iplab/-/issues/5227",
    "source": "https://search.maven.org/remotecontent?filepath=io/opentelemetry/opentelemetry-sdk-extension-autoconfigure/1.19.0-alpha/opentelemetry-sdk-extension-autoconfigure-1.19.0-alpha-sources.jar",
    "status": "approved",
    "scans": [
        {
            "date": "November 28, 2022 at 11:56:52 p.m. GMT",
            "authority": "https://gitlab.eclipse.org/eclipsefdn/emo-team/iplab/-/issues/5227",
            "scancode-version": "31.2.1",
            "licenses-discovered": [
                "Apache-2.0"
            ],
            "copyrights": [
            ],
            "file-count": 17,
            "sha256": "4ebe61cbd4d1710c656fb9706de94202f023719159790aeb8255b83babb921b9",
            "source": "https://search.maven.org/remotecontent?filepath=io/opentelemetry/opentelemetry-sdk-extension-autoconfigure/1.19.0-alpha/opentelemetry-sdk-extension-autoconfigure-1.19.0-alpha-sources.jar",
            "status": "approved"
        }
    ]
}