{
    "id": "maven/mavencentral/net.jsign/jsign-crypto/7.0",
    "license": "Apache-2.0",
    "authority": "https://gitlab.eclipse.org/eclipsefdn/emo-team/iplab/-/issues/19045",
    "source": "https://repo1.maven.org/maven2/net/jsign/jsign-crypto/7.0/jsign-crypto-7.0-sources.jar",
    "status": "approved",
    "scans": [
        {
            "date": "January 20, 2025 at 8:33:02 a.m. GMT",
            "authority": "https://gitlab.eclipse.org/eclipsefdn/emo-team/iplab/-/issues/19045",
            "scancode-version": "31.2.1",
            "licenses-discovered": [
                "Apache-2.0"
            ],
            "copyrights": [
                "Copyright 2012 Emmanuel Bourg",
                "Copyright 2014 Florent Daigniere",
                "Copyright 2017 Emmanuel Bourg",
                "Copyright 2021 Emmanuel Bourg",
                "Copyright 2022 Emmanuel Bourg",
                "Copyright 2023 Emmanuel Bourg",
                "Copyright 2023 Maria Merkel",
                "Copyright 2023 Vincent Malmedy",
                "Copyright 2024 Bjorn Kautler",
                "Copyright 2024 Eatay Mizrachi",
                "Copyright 2024 Emmanuel Bourg"
            ],
            "file-count": 49,
            "sha256": "ca9fb509b61302835028d33219e70bdfcd1bbf5e014cd7638f853ca4155359b6",
            "source": "https://repo1.maven.org/maven2/net/jsign/jsign-crypto/7.0/jsign-crypto-7.0-sources.jar",
            "status": "approved"
        }
    ]
}