{
    "id": "npm/npmjs/-/extract-text-webpack-plugin/3.0.2",
    "license": "MIT",
    "licenses-discovered": [
        "MIT"
    ],
    "file-count": 169,
    "scancode-version": "30.1.0",
    "authority": "https://gitlab.eclipse.org/eclipsefdn/emo-team/iplab/-/issues/1971",
    "source": "https://github.com/webpack-contrib/extract-text-webpack-plugin/archive/v3.0.2.zip",
    "status": "approved"
}