{
    "id": "maven/mavencentral/org.springframework.boot/spring-boot-starter/3.3.5",
    "license": "Apache-2.0",
    "authority": "https://gitlab.eclipse.org/eclipsefdn/emo-team/iplab/-/issues/16895",
    "source": "https://repo1.maven.org/maven2/org/springframework/boot/spring-boot-starter/3.3.5/spring-boot-starter-3.3.5-sources.jar",
    "status": "approved",
    "scans": [
        {
            "date": "October 28, 2024, 6:37:47 a.m. GMT",
            "authority": "https://gitlab.eclipse.org/eclipsefdn/emo-team/iplab/-/issues/16895",
            "scancode-version": "31.2.1",
            "licenses-discovered": [
                "Apache-2.0"
            ],
            "copyrights": [
            ],
            "file-count": 2,
            "sha256": "10a044d3b51764303c14fc307a4a13babd40909697d5541bd9cb91637e965f11",
            "source": "https://repo1.maven.org/maven2/org/springframework/boot/spring-boot-starter/3.3.5/spring-boot-starter-3.3.5-sources.jar",
            "status": "approved"
        }
    ]
}