{
    "id": "maven/mavencentral/org.geotools/gt-render/23.3",
    "license": "LGPL-2.1-only",
    "authority": "https://gitlab.eclipse.org/eclipsefdn/emo-team/iplab/-/issues/5088",
    "source": "https://repo.osgeo.org/repository/geotools-releases/org/geotools/gt-render/23.3/gt-render-23.3-sources.jar",
    "status": "approved",
    "scans": [
        {
            "date": "November 24, 2022 at 5:28:49 p.m. GMT",
            "authority": "https://gitlab.eclipse.org/eclipsefdn/emo-team/iplab/-/issues/5088",
            "scancode-version": "31.2.1",
            "licenses-discovered": [
                "LGPL-2.1-only"
            ],
            "copyrights": [
                "(c) 2001-2008, Open Source Geospatial Foundation",
                "(c) 2002-2008, Open Source Geospatial Foundation",
                "(c) 2002-2011, Open Source Geospatial Foundation",
                "(c) 2002-2015, Open Source Geospatial Foundation",
                "(c) 2002-2016, Open Source Geospatial Foundation",
                "(c) 2003-2008, Open Source Geospatial Foundation",
                "(c) 2003-2008, Open Source Geospatial Foundation, OSGeo http://osgeo.org",
                "(c) 2003-2011, Open Source Geospatial Foundation",
                "(c) 2003-2015, Open Source Geospatial Foundation",
                "(c) 2003-2016, Open Source Geospatial Foundation",
                "(c) 2003-2018, Open Source Geospatial Foundation, OSGeo http://osgeo.org",
                "(c) 2004-2008, Open Source Geospatial Foundation",
                "(c) 2004-2015, Open Source Geospatial Foundation",
                "(c) 2004-2016, Open Source Geospatial Foundation",
                "(c) 2005-2008, Open Source Geospatial Foundation",
                "(c) 2005-2015, Open Source Geospatial Foundation",
                "(c) 2008, Open Source Geospatial Foundation",
                "(c) 2010-2011, Open Source Geospatial Foundation",
                "(c) 2011, Open Source Geospatial Foundation",
                "(c) 2013, Open Source Geospatial Foundation",
                "(c) 2013-2016, Open Source Geospatial Foundation",
                "(c) 2014 - 2015, Open Source Geospatial Foundation",
                "(c) 2014, Open Source Geospatial Foundation",
                "(c) 2014-2016, Open Source Geospatial Foundation",
                "(c) 2015, Open Source Geospatial Foundation",
                "(c) 2016, Open Source Geospatial Foundation",
                "(c) 2017, Open Source Geospatial Foundation",
                "(c) 2018, Open Source Geospatial Foundation",
                "(c) 2019, Open Source Geospatial Foundation"
            ],
            "file-count": 160,
            "sha256": "72748fbbae506ec53f2319a51b75f73ea2f959ae36f39ce7a1948850332b93b9",
            "source": "https://repo.osgeo.org/repository/geotools-releases/org/geotools/gt-render/23.3/gt-render-23.3-sources.jar",
            "status": "approved"
        }
    ]
}