{
    "id": "p2/orbit/p2.eclipse-plugin/org.apache.tika.core/1.24.1",
    "license": "Apache-2.0",
    "licenses-discovered": [
        "Apache-2.0 AND LicenseRef-scancode-bsd-simplified-darwin AND LicenseRef-scancode-iptc-2006",
        "Apache-2.0"
    ],
    "copyrights": [
        "Copyright (c) Ian F. Darwin 1986, 1987, 1989, 1990, 1991, 1992, 1994, 1995",
        "Copyright 2010 International Press Telecommunications Council",
        "Copyright 2016 Norconex Inc.",
        "Copyright Owner, Image Creator",
        "Copyright Owner, Image Supplier",
        "parts Copyright 2010 International Press Telecommunications Council"
    ],
    "file-count": 288,
    "scancode-version": "31.2.1",
    "authority": "https://gitlab.eclipse.org/eclipsefdn/emo-team/iplab/-/issues/3920",
    "source": "https://search.maven.org/remotecontent?filepath=org/apache/tika/tika-core/1.24.1/tika-core-1.24.1-sources.jar",
    "status": "approved"
}
