{
    "id": "go/golang/github.com%2FMicrosoft/go-winio/v0.6.1",
    "license": "MIT AND BSD-3-Clause",
    "authority": "https://gitlab.eclipse.org/eclipsefdn/emo-team/iplab/-/issues/10746",
    "source": "https://github.com/Microsoft/go-winio/archive/refs/tags/v0.6.1.zip",
    "status": "approved",
    "scans": [
        {
            "date": "September 29, 2023 at 6:03:06 p.m. GMT",
            "authority": "https://gitlab.eclipse.org/eclipsefdn/emo-team/iplab/-/issues/10746",
            "scancode-version": "31.2.1",
            "licenses-discovered": [
                "MIT",
                "BSD-3-Clause"
            ],
            "copyrights": [
                "Copyright (c) 2015 Microsoft",
                "Copyright 2013 The Go Authors"
            ],
            "file-count": 97,
            "sha256": "8ffcd6b17d70cca073e83be6124d55db72fb24c4079d71c02d74368fe3810b81",
            "source": "https://github.com/Microsoft/go-winio/archive/refs/tags/v0.6.1.zip",
            "status": "approved"
        }
    ]
}