{
    "id": "maven/mavencentral/org.activiti/activiti-spring-process-extensions/8.6.0",
    "license": "Apache-2.0",
    "authority": "https://gitlab.eclipse.org/eclipsefdn/emo-team/iplab/-/issues/15927",
    "source": "https://maven.alfresco.com/nexus/service/local/repositories/activiti-releases/content//org/activiti/activiti-spring-process-extensions/8.6.0/activiti-spring-process-extensions-8.6.0-sources.jar",
    "status": "approved",
    "scans": [
        {
            "date": "August 14, 2024 at 5:35:26 p.m. GMT",
            "authority": "https://gitlab.eclipse.org/eclipsefdn/emo-team/iplab/-/issues/15927",
            "scancode-version": "31.2.1",
            "licenses-discovered": [
                "Apache-2.0"
            ],
            "copyrights": [
                "Copyright 2010-2020 Alfresco Software, Ltd."
            ],
            "file-count": 27,
            "sha256": "7183ae9af43aee27e0e62cfa8559350672b987400a5d895e75463de1c64fa771",
            "source": "https://maven.alfresco.com/nexus/service/local/repositories/activiti-releases/content//org/activiti/activiti-spring-process-extensions/8.6.0/activiti-spring-process-extensions-8.6.0-sources.jar",
            "status": "approved"
        }
    ]
}