{
    "id": "npm/npmjs/-/rc-picker/4.3.0",
    "license": "MIT",
    "authority": "https://gitlab.eclipse.org/eclipsefdn/emo-team/iplab/-/issues/13830",
    "source": "https://registry.yarnpkg.com/rc-picker/-/rc-picker-4.3.0.tgz",
    "status": "approved",
    "scans": [
        {
            "date": "March 18, 2024 at 3:27:07 a.m. GMT",
            "authority": "https://gitlab.eclipse.org/eclipsefdn/emo-team/iplab/-/issues/13830",
            "scancode-version": "31.2.1",
            "licenses-discovered": [
                "MIT"
            ],
            "copyrights": [
                "Copyright (c) 2019-present afc163"
            ],
            "file-count": 561,
            "sha256": "d25ccff428fe9f1a8713caf51d14614a2aa8ba8c4dabfaebbe6f8a633b9dfa58",
            "source": "https://registry.yarnpkg.com/rc-picker/-/rc-picker-4.3.0.tgz",
            "status": "approved"
        }
    ]
}