{
    "id": "maven/mavencentral/io.kotest/kotest-assertions-api/5.6.2",
    "license": "Apache-2.0",
    "authority": "https://gitlab.eclipse.org/eclipsefdn/emo-team/iplab/-/issues/10196",
    "source": "https://repo.maven.apache.org/maven2/io/kotest/kotest-assertions-api/5.6.2/kotest-assertions-api-5.6.2-sources.jar",
    "status": "approved",
    "scans": [
        {
            "date": "August 23, 2023 at 1:35:17 p.m. GMT",
            "authority": "https://gitlab.eclipse.org/eclipsefdn/emo-team/iplab/-/issues/10196",
            "scancode-version": "31.2.1",
            "licenses-discovered": [
            ],
            "copyrights": [
            ],
            "file-count": 2,
            "sha256": "642031f124ff92527811d7a47d1a69322906357c2b59b00f7e8195dd912fa9ff",
            "source": "https://repo.maven.apache.org/maven2/io/kotest/kotest-assertions-api/5.6.2/kotest-assertions-api-5.6.2-sources.jar",
            "status": "restricted"
        }
    ]
}
