{
    "id": "maven/mavencentral/org.apache.kerby/kerby-util/2.0.3",
    "license": "Apache-2.0",
    "authority": "https://gitlab.eclipse.org/eclipsefdn/emo-team/iplab/-/issues/19729",
    "source": "https://repo1.maven.org/maven2/org/apache/kerby/kerby-util/2.0.3/kerby-util-2.0.3-sources.jar",
    "status": "approved",
    "scans": [
        {
            "date": "March 1, 2025 at 1:17:21 a.m. GMT",
            "authority": "https://gitlab.eclipse.org/eclipsefdn/emo-team/iplab/-/issues/19729",
            "scancode-version": "31.2.1",
            "licenses-discovered": [
                "Apache-2.0"
            ],
            "copyrights": [
            ],
            "file-count": 26,
            "sha256": "9bcdfc179fdd7815681113fbd8e25e3ee4d54c9dd5f30ea35076fecadc4f72fe",
            "source": "https://repo1.maven.org/maven2/org/apache/kerby/kerby-util/2.0.3/kerby-util-2.0.3-sources.jar",
            "status": "approved"
        }
    ]
}