{
    "id": "maven/mavencentral/io.openmanufacturing/sds-aspect-meta-model-resolver/2.1.3",
    "license": "MPL-2.0",
    "authority": "https://gitlab.eclipse.org/eclipsefdn/emo-team/iplab/-/issues/9781",
    "source": "https://repo.maven.apache.org/maven2/io/openmanufacturing/sds-aspect-meta-model-resolver/2.1.3/sds-aspect-meta-model-resolver-2.1.3-sources.jar",
    "status": "approved",
    "scans": [
        {
            "date": "July 26, 2023 at 12:17:53 p.m. GMT",
            "authority": "https://gitlab.eclipse.org/eclipsefdn/emo-team/iplab/-/issues/9781",
            "scancode-version": "31.2.1",
            "licenses-discovered": [
                "MPL-2.0"
            ],
            "copyrights": [
                "Copyright (c) 2021 Robert Bosch Manufacturing Solutions GmbH",
                "Copyright (c) 2022 Robert Bosch Manufacturing Solutions GmbH"
            ],
            "file-count": 21,
            "sha256": "90ecd26d0c671ff218d36264caab79e92b376c6ae4e0fb096a3282f51184b2e7",
            "source": "https://repo.maven.apache.org/maven2/io/openmanufacturing/sds-aspect-meta-model-resolver/2.1.3/sds-aspect-meta-model-resolver-2.1.3-sources.jar",
            "status": "approved"
        }
    ]
}