{
    "id": "pypi/pypi/-/black/24.3.0",
    "license": "MIT AND Python-2.0",
    "authority": "https://gitlab.eclipse.org/eclipsefdn/emo-team/iplab/-/issues/14460",
    "source": "https://files.pythonhosted.org/packages/8f/5f/bac24a952668c7482cfdb4ebf91ba57a796c9da8829363a772040c1a3312/black-24.3.0.tar.gz",
    "status": "approved",
    "scans": [
        {
            "date": "April 19, 2024 at 4:08:20 a.m. GMT",
            "authority": "https://gitlab.eclipse.org/eclipsefdn/emo-team/iplab/-/issues/14460",
            "scancode-version": "31.2.1",
            "licenses-discovered": [
                "MIT",
                "Python-2.0"
            ],
            "copyrights": [
                "(c) 2019 Reece Hart",
                "Copyright (c) 1991 - 1995, Stichting Mathematisch Centrum Amsterdam, The Netherlands",
                "Copyright (c) 1995-2001 Corporation for National Research Initiatives",
                "Copyright (c) 2001, 2002, 2003, 2004, 2005, 2006 Python Software Foundation",
                "Copyright (c) 2001, 2002, 2003, 2004, 2005, 2006, 2007, 2008, 2009, 2010, 2011, 2012, 2013, 2014, 2015, 2016, 2017, 2018 Python Software Foundation",
                "Copyright (c) 2018 Lukasz Langa",
                "Copyright 2004-2005 Elemental Security, Inc.",
                "Copyright 2006 Google, Inc.",
                "copyright 2018-Present, Lukasz Langa and contributors"
            ],
            "file-count": 389,
            "sha256": "a0c9c4a0771afc6919578cec71ce82a3e31e054904e7197deacbc9382671c41f",
            "source": "https://files.pythonhosted.org/packages/8f/5f/bac24a952668c7482cfdb4ebf91ba57a796c9da8829363a772040c1a3312/black-24.3.0.tar.gz",
            "status": "restricted"
        }
    ]
}
