{
    "id": "maven/mavencentral/org.jruby/jruby-base/9.4.5.0",
    "license": "(EPL-2.0 OR GPL-2.0-or-later OR LGPL-2.1-or-later) AND (EPL-2.0 OR GPL-2.0-only OR LGPL-2.1-only) AND Ruby AND (Ruby OR BSD-2-Clause) AND BSD-3-Clause AND BSD-2-Clause AND BSD-4-Clause AND CC-BY-2.0 AND CC-BY-4.0 AND CC-PDDC AND MIT AND (CPL-1.0 OR GPL-2.0-or-later OR LGPL-2.1-or-later) AND EPL-1.0 AND (EPL-1.0 OR GPL-2.0-or-later OR LGPL-2.1-or-later) AND GPL-2.0-only AND Apache-2.0 AND Ruby AND LicenseRef-Permission-Notice AND LicenseRef-Public-domain AND Zlib",
    "authority": "https://gitlab.eclipse.org/eclipsefdn/emo-team/iplab/-/issues/15802",
    "source": "https://repo1.maven.org/maven2/org/jruby/jruby-base/9.4.5.0/jruby-base-9.4.5.0-sources.jar",
    "status": "approved",
    "scans": [
        {
            "date": "July 24, 2024 at 4:41:48 p.m. GMT",
            "authority": "https://gitlab.eclipse.org/eclipsefdn/emo-team/iplab/-/issues/15802",
            "scancode-version": "31.2.1",
            "licenses-discovered": [
                "EPL-2.0 AND GPL-2.0-or-later AND LGPL-2.1-or-later",
                "MIT",
                "BSD-2-Clause",
                "Apache-2.0 AND BSD-3-Clause AND EPL-1.0 AND EPL-2.0 AND GPL-2.0-only AND LGPL-2.1-only AND LicenseRef-scancode-unknown AND Linux-syscall-note AND MIT AND Ruby AND Zlib",
                "BSD-2-Clause AND Ruby",
                "CPL-1.0 AND GPL-2.0-or-later AND LGPL-2.1-or-later",
                "Apache-2.0",
                "BSD-2-Clause AND EPL-2.0 AND GPL-2.0-or-later AND LGPL-2.1-or-later",
                "CC0-1.0 AND EPL-2.0 AND GPL-2.0-or-later AND LGPL-2.1-or-later",
                "EPL-1.0 AND GPL-2.0-or-later AND LGPL-2.1-or-later",
                "CC-PDDC AND EPL-2.0 AND GPL-2.0-or-later AND LGPL-2.1-or-later",
                "CC-PDDC",
                "EPL-1.0"
            ],
            "copyrights": [
                "(c) 2002 ats@cs.rit.edu",
                "(c) 2002-2004 ats@cs.rit.edu",
                "Copyright (c) 1989, 1991 Free Software Foundation, Inc.",
                "Copyright (c) 1991, 1999 Free Software Foundation, Inc.",
                "Copyright (c) 1993-2013 Yukihiro Matsumoto",
                "Copyright (c) 1995-2013 Jean-loup Gailly and Mark Adler",
                "Copyright (c) 2000 - 2006 The Legion Of The Bouncy Castle",
                "Copyright (c) 2000, 2001 Markus Friedl",
                "Copyright (c) 2000-2011 INRIA, France Telecom",
                "Copyright (c) 2000-2011 ymnk, JCraft,Inc.",
                "Copyright (c) 2001 Alan Moore <alan_moore@gmx.net>",
                "Copyright (c) 2001 Benoit Cerrina <b.cerrina@wanadoo.fr>",
                "Copyright (c) 2001 Chad Fowler <chadfowler@chadfowler.com>",
                "Copyright (c) 2001 Ed Sinjiashvili <slorcim@users.sourceforge.net>",
                "Copyright (c) 2001- s The JRuby Community",
                "Copyright (c) 2001-2002 Benoit Cerrina <b.cerrina@wanadoo.fr>",
                "Copyright (c) 2001-2002 Jan Arne Petersen <jpetersen@uni-bonn.de>",
                "Copyright (c) 2001-2004 Jan Arne Petersen <jpetersen@uni-bonn.de>",
                "Copyright (c) 2001-2011 The JRuby Community",
                "Copyright (c) 2001-2015 The JRuby Community",
                "Copyright (c) 2001-2020 JRuby",
                "Copyright (c) 2002 Anders Bengtsson <ndrsbngtssn@yahoo.se>",
                "Copyright (c) 2002 Benoit Cerrina <b.cerrina@wanadoo.fr>",
                "Copyright (c) 2002 Don Schwartz <schwardo@users.sourceforge.net>",
                "Copyright (c) 2002 Jan Arne Petersen <jpetersen@uni-bonn.de>",
                "Copyright (c) 2002 Jason Voegele <jason@jvoegele.com>",
                "Copyright (c) 2002, 2009 Jan Arne Petersen <jpetersen@uni-bonn.de>",
                "Copyright (c) 2002-2004 Anders Bengtsson <ndrsbngtssn@yahoo.se>",
                "Copyright (c) 2002-2004 Jan Arne Petersen <jpetersen@uni-bonn.de>",
                "Copyright (c) 2002-2004 Thomas E Enebo <enebo@acm.org>",
                "Copyright (c) 2002-2005 Thomas E Enebo <enebo@acm.org>",
                "Copyright (c) 2002-2006 Thomas E Enebo <enebo@acm.org>",
                "Copyright (c) 2002-2007 Anders Bengtsson <ndrsbngtssn@yahoo.se>",
                "Copyright (c) 2002-2011 JRuby Community",
                "Copyright (c) 2002-2012, the original author or authors",
                "Copyright (c) 2003 Joey Gibson <joey@joeygibson.com>",
                "Copyright (c) 2003 Thomas E Enebo <enebo@acm.org>",
                "Copyright (c) 2003, 2004 Jim Weirich",
                "Copyright (c) 2003-2004 Thomas E Enebo <enebo@acm.org>",
                "Copyright (c) 2004 Anders Bengtsson <ndrsbngtssn@yahoo.se>",
                "Copyright (c) 2004 Charles O Nutter <headius@headius.com>",
                "Copyright (c) 2004 David Corbin <dcorbin@users.sourceforge.net>",
                "Copyright (c) 2004 Jan Arne Petersen <jpetersen@uni-bonn.de>",
                "Copyright (c) 2004 Joey Gibson <joey@joeygibson.com>",
                "Copyright (c) 2004 Stefan Matthias Aust <sma@3plus4.de>",
                "Copyright (c) 2004 Thomas E Enebo <enebo@acm.org>",
                "Copyright (c) 2004-2005 Charles O Nutter <headius@headius.com>",
                "Copyright (c) 2004-2005 David Corbin <dcorbin@users.sourceforge.net>",
                "Copyright (c) 2004-2005 Thomas E Enebo <enebo@acm.org>",
                "Copyright (c) 2004-2005, 2009 Charles O Nutter <headius@headius.com>",
                "Copyright (c) 2004-2006 Charles O Nutter <headius@headius.com>",
                "Copyright (c) 2004-2006 Thomas E Enebo <enebo@acm.org>",
                "Copyright (c) 2004-2007 Charles O Nutter <headius@headius.com>",
                "Copyright (c) 2004-2007 Thomas E Enebo <enebo@acm.org>",
                "Copyright (c) 2004-2009 Thomas E Enebo <enebo@acm.org>",
                "Copyright (c) 2004-2011 Thomas E Enebo <enebo@acm.org>",
                "Copyright (c) 2005 Charles O Nutter <headius@headius.com>",
                "Copyright (c) 2005 David Corbin <dcorbin@users.sf.net>",
                "Copyright (c) 2005 David Corbin <dcorbin@users.sourceforge.net>",
                "Copyright (c) 2005 Derek Berner <derek.berner@state.nm.us>",
                "Copyright (c) 2005 Jason Voegele <jason@jvoegele.com>",
                "Copyright (c) 2005 Kiel Hodges <jruby-devel@selfsosoft.com>",
                "Copyright (c) 2005 Thomas E Enebo <enebo@acm.org>",
                "Copyright (c) 2005 Thomas E. Enebo <enebo@acm.org>",
                "Copyright (c) 2005 Tim Azzopardi <tim@tigerfive.com>",
                "Copyright (c) 2005 Zach Dennis <zdennis@mktec.com>",
                "Copyright (c) 2005-2008 Charles O Nutter <headius@headius.com>",
                "Copyright (c) 2006",
                "Copyright (c) 2006 Anders Bengtsson <ndrsbngtssn@yahoo.se>",
                "Copyright (c) 2006 Antti Karanta <Antti.Karanta@napa.fi>",
                "Copyright (c) 2006 Antti Karanta <antti.karanta@napa.fi>",
                "Copyright (c) 2006 Charles O Nutter <headius@headius.com>",
                "Copyright (c) 2006 Charles Oliver Nutter <headius@headius.com>",
                "Copyright (c) 2006 Daniel Steer <damian.steer@hp.com>",
                "Copyright (c) 2006 Dave Brosius <dbrosius@mebigfatguy.com>",
                "Copyright (c) 2006 Derek Berner <derek.berner@state.nm.us>",
                "Copyright (c) 2006 Evan Buswell <ebuswell@gmail.com>",
                "Copyright (c) 2006 Evan Buswell <evan@heron.sytes.net>",
                "Copyright (c) 2006 Kresten Krab Thorup <krab@gnu.org>",
                "Copyright (c) 2006 Lukas Felber <lfelber@hsr.ch>",
                "Copyright (c) 2006 Michael Studman <codehaus@michaelstudman.com>",
                "Copyright (c) 2006 Michael Studman <me@michaelstudman.com>",
                "Copyright (c) 2006 Miguel Covarrubias <mlcovarrubias@gmail.com>",
                "Copyright (c) 2006 Mirko Stocker <me@misto.ch>",
                "Copyright (c) 2006 Nick Sieger",
                "Copyright (c) 2006 Nick Sieger <nicksieger@gmail.com>",
                "Copyright (c) 2006 Ola Bini <Ola.Bini@ki.se>",
                "Copyright (c) 2006 Ola Bini <ola.bini@ki.se>",
                "Copyright (c) 2006 Ola Bini <ola@ologix.com>",
                "Copyright (c) 2006 Peter K Chan <peter@oaktop.com>",
                "Copyright (c) 2006 The JRuby Community <www.jruby.org>",
                "Copyright (c) 2006 Thomas Corbat <tcorbat@hsr.ch>",
                "Copyright (c) 2006 Thomas E Enebo <enebo@acm.org>",
                "Copyright (c) 2006 Tim Azzopardi <tim@tigerfive.com>",
                "Copyright (c) 2006, 2007 Ola Bini <ola@ologix.com>",
                "Copyright (c) 2006-2007 Charles Nutter <headius@headius.com>",
                "Copyright (c) 2006-2007 Miguel Covarrubias <mlcovarrubias@gmail.com>",
                "Copyright (c) 2006-2007 Mirko Stocker <me@misto.ch>",
                "Copyright (c) 2006-2007 Thomas E Enebo <enebo@acm.org>",
                "Copyright (c) 2006-2008 Charles O Nutter <headius@headius.com>",
                "Copyright (c) 2007",
                "Copyright (c) 2007 Charles O Nutter <headius@headius.com>",
                "Copyright (c) 2007 Charles Oliver Nutter <headius@headius.com>",
                "Copyright (c) 2007 Damian Steer <pldms@mac.com>",
                "Copyright (c) 2007 JRuby Community",
                "Copyright (c) 2007 Miguel Covarrubias <mlcovarrubias@gmail.com>",
                "Copyright (c) 2007 Mirko Stocker <me@misto.ch>",
                "Copyright (c) 2007 Nick Sieger <nicksieger@gmail.com>",
                "Copyright (c) 2007 Ola Bini <ola.bini@gmail.com>",
                "Copyright (c) 2007 Ola Bini <ola@ologix.com>",
                "Copyright (c) 2007 The JRuby Community",
                "Copyright (c) 2007 Thomas E Enebo <enebo@acm.org>",
                "Copyright (c) 2007 Vladimir Sizikov <vsizikov@gmail.com>",
                "Copyright (c) 2007 William N Dortch <bill.dortch@gmail.com>",
                "Copyright (c) 2007, 2008 Ola Bini <ola@ologix.com>",
                "Copyright (c) 2007-2010 JRuby Community",
                "Copyright (c) 2007-2010 JRuby Team <team@jruby.org>",
                "Copyright (c) 2007-2011 JRuby Team <team@jruby.org>",
                "Copyright (c) 2007-2011 Koichiro Ohba <koichiro@meadowy.org>",
                "Copyright (c) 2007-2011 Nick Sieger <nicksieger@gmail.com>",
                "Copyright (c) 2007-2012 Charles Oliver Nutter <headius@headius.com>",
                "Copyright (c) 2007-2018 The JRuby project",
                "Copyright (c) 2008",
                "Copyright (c) 2008 Alexander von Gernler",
                "Copyright (c) 2008 Charles O Nutter <headius@headius.com>",
                "Copyright (c) 2008 JRuby project",
                "Copyright (c) 2008 Joseph LaFata <joe@quibb.org>",
                "Copyright (c) 2008 Ola Bini <ola.bini@gmail.com>",
                "Copyright (c) 2008 The JRuby Community <www.jruby.org>",
                "Copyright (c) 2008 Thomas E Enebo <enebo@acm.org>",
                "Copyright (c) 2008 Vladimir Sizikov <vsizikov@gmail.com>",
                "Copyright (c) 2008, 2009 JRuby project",
                "Copyright (c) 2008-2009 Joseph LaFata <joe@quibb.org>",
                "Copyright (c) 2008-2009, Petr Kobalicek <kobalicek.petr@gmail.com>",
                "Copyright (c) 2008-2012 Charles Oliver Nutter <headius@headius.com>",
                "Copyright (c) 2008-2013 Charles Oliver Nutter <headius@headius.com>",
                "Copyright (c) 2008-2017 Thomas E Enebo <enebo@acm.org>",
                "Copyright (c) 2009",
                "Copyright (c) 2009 Aaron Patterson",
                "Copyright (c) 2009 Aurelian Oancea <aurelian@locknet.ro>",
                "Copyright (c) 2009 Charles O Nutter <headius@headius.com>",
                "Copyright (c) 2009 Charles Oliver Nutter <headius@headius.com>",
                "Copyright (c) 2009 Hongli Lai <hongli@phusion.nl>",
                "Copyright (c) 2009 JRuby project",
                "Copyright (c) 2009 Joseph LaFata <joe@quibb.org>",
                "Copyright (c) 2009 Sun Microsystems, Inc",
                "Copyright (c) 2009 Thomas E. Enebo <tom.enebo@gmail.com>",
                "Copyright (c) 2009 Vladimir Sizikov <vsizikov@gmail.com>",
                "Copyright (c) 2009 Yoko Harada <yokolet@gmail.com>",
                "Copyright (c) 2009-2010 Yoko Harada <yokolet@gmail.com>",
                "Copyright (c) 2009-2011 Yoko Harada <yokolet@gmail.com>",
                "Copyright (c) 2009-2011 Yoko Harada <yokolet@gmail.com> , CloudBees, Inc.",
                "Copyright (c) 2009-2012 Yoko Harada <yokolet@gmail.com>",
                "Copyright (c) 2009-2013 Yoko Harada <yokolet@gmail.com>",
                "Copyright (c) 2010 Charles O Nutter <headius@headius.com>",
                "Copyright (c) 2010 Charles Oliver Nutter <headius@headius.com>",
                "Copyright (c) 2010 JRuby project",
                "Copyright (c) 2010 Joshua Go <joshuago@gmail.com>",
                "Copyright (c) 2010 Ola Bini <ola.bini@gmail.com>",
                "Copyright (c) 2010 Thomas E Enebo (tom.enebo@gmail.com)",
                "Copyright (c) 2010 Thomas E Enebo <tom.enebo@gmail.com>",
                "Copyright (c) 2010 Wayne Meissner",
                "Copyright (c) 2010 Yoko Harada <yokolet@gmail.com>",
                "Copyright (c) 2010,2011 Damien Miller",
                "Copyright (c) 2011 Charles O Nutter <headius@headius.com>",
                "Copyright (c) 2011 David Pollak <feeder.of.the.bears@gmail.com>",
                "Copyright (c) 2011 Koichiro Ohba <koichiro@meadowy.org>",
                "Copyright (c) 2011 Nick Sieger <nicksieger@gmail.com>",
                "Copyright (c) 2011 Wayne Meissner",
                "Copyright (c) 2011 Yoko Harada <yokolet@gmail.com>",
                "Copyright (c) 2012 The JRuby Community <www.jruby.org>",
                "Copyright (c) 2013 Benoit Daloze <eregontp@gmail.com>",
                "Copyright (c) 2013 JRuby",
                "Copyright (c) 2013 The JRuby Community",
                "Copyright (c) 2013 The JRuby Team <jruby@jruby.org>",
                "Copyright (c) 2013 The JRuby team <jruby@jruby.org>",
                "Copyright (c) 2013-2015 Charles O Nutter <headius@headius.com>",
                "Copyright (c) 2013-2017 The JRuby Team (jruby@jruby.org)",
                "Copyright (c) 2014 Oracle and/or its affiliates",
                "Copyright (c) 2014 The JRuby Team (admin@jruby.org)",
                "Copyright (c) 2014 Timur Duehr <tduehr@gmail.com>",
                "Copyright (c) 2015 JRuby",
                "Copyright (c) 2015 Oracle and/or its affiliates",
                "Copyright (c) 2015 The JRuby Team",
                "Copyright (c) 2015 The JRuby Team (jruby@jruby.org)",
                "Copyright (c) 2015-2015 The JRuby Community",
                "Copyright (c) 2016 Karol Bucek",
                "Copyright (c) 2016 The JRuby Team",
                "Copyright (c) 2016-2017 Karol Bucek",
                "Copyright (c) 2017 The JRuby Team",
                "Copyright (c) 2017, 2020 Oracle and/or its affiliates",
                "Copyright (c) 2017-2018 The JRuby Team",
                "Copyright (c) 2018 The JRuby Team",
                "Copyright (c) 2019 The JRuby Team",
                "Copyright (c) 2020 The JRuby Team",
                "Copyright (c) 2021 The JRuby Team",
                "Copyright 2013 Jan Van Besien",
                "copyrighted by the Free Software Foundation",
                "partial_quotient (c) . Here"
            ],
            "file-count": 1808,
            "sha256": "0b6517c5b0f98d4e576c75e01212f08c23839fb1d1db02bc7032b1f5b5f49015",
            "source": "https://repo1.maven.org/maven2/org/jruby/jruby-base/9.4.5.0/jruby-base-9.4.5.0-sources.jar",
            "status": "restricted"
        }
    ]
}