{
    "id": "npm/npmjs/@types/selenium-webdriver/3.0.16",
    "license": "MIT",
    "licenses-discovered": [
        "MIT"
    ],
    "file-count": 13,
    "scancode-version": "30.1.0",
    "authority": "https://gitlab.eclipse.org/eclipsefdn/emo-team/iplab/-/issues/2185",
    "source": "https://registry.npmjs.org/@types/selenium-webdriver/-/selenium-webdriver-3.0.16.tgz",
    "status": "approved"
}