{
    "id": "pypi/pypi/-/sphinxcontrib-htmlhelp/2.1.0",
    "license": "BSD-2-Clause AND BSD-3-Clause",
    "authority": "https://gitlab.eclipse.org/eclipsefdn/emo-team/iplab/-/issues/19874",
    "source": "https://files.pythonhosted.org/packages/43/93/983afd9aa001e5201eab16b5a444ed5b9b0a7a010541e0ddfbbfd0b2470c/sphinxcontrib_htmlhelp-2.1.0.tar.gz",
    "status": "approved",
    "scans": [
        {
            "date": "March 4, 2025 at 9:42:31 a.m. GMT",
            "authority": "https://gitlab.eclipse.org/eclipsefdn/emo-team/iplab/-/issues/19874",
            "scancode-version": "31.2.1",
            "licenses-discovered": [
                "BSD-2-Clause",
                "BSD-3-Clause",
                "BSD-2-Clause AND BSD-3-Clause"
            ],
            "copyrights": [
                "Copyright (c) 2007-2019 by the Sphinx team (see https://github.com/sphinx-doc/sphinx/blob/master/AUTHORS)",
                "Copyright (c) 2019 ORGANIZATION"
            ],
            "file-count": 132,
            "sha256": "c9e2916ace8aad64cc13a0d233ee22317f2b9025b9cf3295249fa985cc7082e9",
            "source": "https://files.pythonhosted.org/packages/43/93/983afd9aa001e5201eab16b5a444ed5b9b0a7a010541e0ddfbbfd0b2470c/sphinxcontrib_htmlhelp-2.1.0.tar.gz",
            "status": "approved"
        }
    ]
}