{
    "license": "MIT",
    "file-count": 4,
    "authority": "https://gitlab.eclipse.org/eclipsefdn/emo-team/iplab/-/issues/1116",
    "scancode-version": "21.3.31",
    "licenses-discovered": [
        "MIT"
    ],
    "id": "npm/npmjs/babel/highlight/7.12.13",
    "source": "https://registry.yarnpkg.com/@babel/highlight/-/highlight-7.12.13.tgz",
    "status": "approved"
}