{
    "id": "npm/npmjs/@types/react-dom/18.2.3",
    "license": "MIT",
    "authority": "https://gitlab.eclipse.org/eclipsefdn/emo-team/iplab/-/issues/8256",
    "source": "https://registry.npmjs.org/@types/react-dom/-/react-dom-18.2.3.tgz",
    "status": "approved",
    "scans": [
        {
            "date": "May 4, 2023 at 8:37:50 p.m. GMT",
            "authority": "https://gitlab.eclipse.org/eclipsefdn/emo-team/iplab/-/issues/8256",
            "scancode-version": "31.2.1",
            "licenses-discovered": [
                "MIT"
            ],
            "copyrights": [
                "Copyright (c) Microsoft Corporation"
            ],
            "file-count": 9,
            "sha256": "cc7cd8921baafa707daa1de3d26730dc97c798a0c2699d16e6ab594d358fe2a5",
            "source": "https://registry.npmjs.org/@types/react-dom/-/react-dom-18.2.3.tgz",
            "status": "approved"
        }
    ]
}