{
    "id": "maven/mavencentral/com.sun.woodstock.dependlibs/dojo-ajax-nodemo/1.12.4",
    "license": "(AFL-2.1 AND BSD-3-Clause) AND BSD-3-Clause AND Apache-2.0 AND Unicode-TOU",
    "authority": "https://gitlab.eclipse.org/eclipsefdn/emo-team/iplab/-/issues/5290",
    "source": "https://search.maven.org/remotecontent?filepath=com/sun/woodstock/dependlibs/dojo-ajax-nodemo/1.12.4/dojo-ajax-nodemo-1.12.4.jar",
    "status": "approved",
    "scans": [
        {
            "date": "December 2, 2022 at 4:16:05 p.m. GMT",
            "authority": "https://gitlab.eclipse.org/eclipsefdn/emo-team/iplab/-/issues/5290",
            "scancode-version": "31.2.1",
            "licenses-discovered": [
                "AFL-2.1 AND BSD-3-Clause",
                "BSD-3-Clause",
                "Apache-2.0",
                "LicenseRef-scancode-unicode"
            ],
            "copyrights": [
                "Copyright (c) 1991-2007 Unicode, Inc.",
                "Copyright (c) 2003-2004 Lawrence E. Rosen",
                "Copyright (c) 2004-2016, The JS Foundation",
                "Copyright (c) 2005-2016, The JS Foundation",
                "Copyright (c) 2005-2017, The JS Foundation",
                "Copyright (c) 2007, Yahoo! Inc.",
                "Copyright (c) the JS Foundation",
                "Copyright 2006-2007 OpenAjax Alliance",
                "parts Copyright (c) 2007, Yahoo! Inc."
            ],
            "file-count": 1250,
            "sha256": "06b91e534fd4e46da587ea758aa20eefdee86a600e6605581c827d35cd3f10a2",
            "source": "https://search.maven.org/remotecontent?filepath=com/sun/woodstock/dependlibs/dojo-ajax-nodemo/1.12.4/dojo-ajax-nodemo-1.12.4.jar",
            "status": "restricted"
        }
    ]
}
