{
    "id": "npm/npmjs/-/pacote/15.2.0",
    "license": "ISC AND (ISC AND MIT)",
    "authority": "https://gitlab.eclipse.org/eclipsefdn/emo-team/iplab/-/issues/8751",
    "source": "https://github.com/npm/pacote/archive/refs/tags/v15.2.0.zip",
    "status": "approved",
    "scans": [
        {
            "date": "June 9, 2023 at 10:41:05 a.m. GMT",
            "authority": "https://gitlab.eclipse.org/eclipsefdn/emo-team/iplab/-/issues/8751",
            "scancode-version": "31.2.1",
            "licenses-discovered": [
                "ISC",
                "ISC AND MIT"
            ],
            "copyrights": [
                "Copyright (c) Isaac Z. Schlueter and Contributors",
                "Copyright (c) Isaac Z. Schlueter, Kat Marchan, npm, Inc., and Contributors",
                "Copyright Isaac Z. Schlueter and Contributors"
            ],
            "file-count": 119,
            "sha256": "ab14005a87fea139f88d8a9c1c85ddcee105084b742e9532211733394c5c239d",
            "source": "https://github.com/npm/pacote/archive/refs/tags/v15.2.0.zip",
            "status": "approved"
        }
    ]
}