{
    "id": "maven/mavencentral/org.apache.camel/camel-api/3.22.2",
    "license": "Apache-2.0",
    "authority": "https://gitlab.eclipse.org/eclipsefdn/emo-team/iplab/-/issues/14935",
    "source": "https://repo1.maven.org/maven2/org/apache/camel/camel-api/3.22.2/camel-api-3.22.2-sources.jar",
    "status": "approved",
    "scans": [
        {
            "date": "May 29, 2024 at 10:20:03 a.m. GMT",
            "authority": "https://gitlab.eclipse.org/eclipsefdn/emo-team/iplab/-/issues/14935",
            "scancode-version": "31.2.1",
            "licenses-discovered": [
                "Apache-2.0"
            ],
            "copyrights": [
            ],
            "file-count": 506,
            "sha256": "a384aa48fae62094b9cb6cc3d1d9ed50d09a3d5da1ef5a36a4f46497d4a1da0e",
            "source": "https://repo1.maven.org/maven2/org/apache/camel/camel-api/3.22.2/camel-api-3.22.2-sources.jar",
            "status": "approved"
        }
    ]
}