{
    "id": "npm/npmjs/-/chromatic/11.5.4",
    "license": "MIT AND (BSD-2-Clause AND ISC AND MIT)",
    "authority": "https://gitlab.eclipse.org/eclipsefdn/emo-team/iplab/-/issues/15478",
    "source": "https://github.com/chromaui/chromatic-cli/archive/refs/tags/v11.5.4.zip",
    "status": "approved",
    "scans": [
        {
            "date": "June 24, 2024 at 10:41:50 a.m. GMT",
            "authority": "https://gitlab.eclipse.org/eclipsefdn/emo-team/iplab/-/issues/15478",
            "scancode-version": "31.2.1",
            "licenses-discovered": [
                "MIT",
                "BSD-2-Clause AND ISC AND MIT"
            ],
            "copyrights": [
                "Copyright (c) Chroma Software Inc."
            ],
            "file-count": 403,
            "sha256": "2f7c9967c2987d5bb190f32000f60712a1d2dbf4e94337e8dc1c31c77656d33e",
            "source": "https://github.com/chromaui/chromatic-cli/archive/refs/tags/v11.5.4.zip",
            "status": "approved"
        }
    ]
}