{
    "id": "maven/mavencentral/org.apache.lucene/lucene-backward-codecs/9.4.1",
    "license": "Apache-2.0",
    "licenses-discovered": [
        "Apache-2.0"
    ],
    "copyrights": [
    ],
    "file-count": 114,
    "scancode-version": "31.2.1",
    "authority": "https://gitlab.eclipse.org/eclipsefdn/emo-team/iplab/-/issues/4394",
    "source": "https://search.maven.org/remotecontent?filepath=org/apache/lucene/lucene-backward-codecs/9.4.1/lucene-backward-codecs-9.4.1-sources.jar",
    "status": "approved"
}