{
    "id": "maven/mavencentral/com.fasterxml.jackson.jakarta.rs/jackson-jakarta-rs-base/2.16.0",
    "license": "Apache-2.0",
    "authority": "https://gitlab.eclipse.org/eclipsefdn/emo-team/iplab/-/issues/11851",
    "source": "https://repo1.maven.org/maven2/com/fasterxml/jackson/jakarta/rs/jackson-jakarta-rs-base/2.16.0/jackson-jakarta-rs-base-2.16.0-sources.jar",
    "status": "approved",
    "scans": [
        {
            "date": "December 8, 2023 at 3:28:01 p.m. GMT",
            "authority": "https://gitlab.eclipse.org/eclipsefdn/emo-team/iplab/-/issues/11851",
            "scancode-version": "31.2.1",
            "licenses-discovered": [
                "Apache-2.0"
            ],
            "copyrights": [
            ],
            "file-count": 22,
            "sha256": "438d76821bac142f730cabba919bfb4de348f5f5dc81e01792150b56f6569cc1",
            "source": "https://repo1.maven.org/maven2/com/fasterxml/jackson/jakarta/rs/jackson-jakarta-rs-base/2.16.0/jackson-jakarta-rs-base-2.16.0-sources.jar",
            "status": "approved"
        }
    ]
}