{
    "id": "maven/mavencentral/org.apache.lucene/lucene-queryparser/9.8.0",
    "license": "Apache-2.0",
    "authority": "https://gitlab.eclipse.org/eclipsefdn/emo-team/iplab/-/issues/10765",
    "source": "https://repo.maven.apache.org/maven2/org/apache/lucene/lucene-queryparser/9.8.0/lucene-queryparser-9.8.0-sources.jar",
    "status": "approved",
    "scans": [
        {
            "date": "September 29, 2023 at 4:17:05 p.m. GMT",
            "authority": "https://gitlab.eclipse.org/eclipsefdn/emo-team/iplab/-/issues/10765",
            "scancode-version": "31.2.1",
            "licenses-discovered": [
                "Apache-2.0"
            ],
            "copyrights": [
            ],
            "file-count": 251,
            "sha256": "53f0286f51921853bb256c4d36ed125224a2c94ffb004785da27dfd6bf469050",
            "source": "https://repo.maven.apache.org/maven2/org/apache/lucene/lucene-queryparser/9.8.0/lucene-queryparser-9.8.0-sources.jar",
            "status": "approved"
        }
    ]
}