{
    "id": "maven/mavencentral/com.consol.citrus/citrus-base/3.4.0",
    "license": "Apache-2.0",
    "authority": "https://gitlab.eclipse.org/eclipsefdn/emo-team/iplab/-/issues/7849",
    "source": "https://search.maven.org/remotecontent?filepath=com/consol/citrus/citrus-base/3.4.0/citrus-base-3.4.0-sources.jar",
    "status": "approved",
    "scans": [
        {
            "date": "April 11, 2023 at 7:57:54 a.m. GMT",
            "authority": "https://gitlab.eclipse.org/eclipsefdn/emo-team/iplab/-/issues/7849",
            "scancode-version": "31.2.1",
            "licenses-discovered": [
                "Apache-2.0"
            ],
            "copyrights": [
                "Copyright 2006-2010 the original author or authors",
                "Copyright 2006-2011 the original author or authors",
                "Copyright 2006-2012 the original author or authors",
                "Copyright 2006-2013 the original author or authors",
                "Copyright 2006-2014 the original author or authors",
                "Copyright 2006-2015 the original author or authors",
                "Copyright 2006-2016 the original author or authors",
                "Copyright 2006-2017 the original author or authors",
                "Copyright 2006-2018 ConSol Software GmbH.",
                "Copyright 2006-2018 the original author or authors",
                "Copyright 2006-2019 the original author or authors",
                "Copyright 2020 the original author or authors",
                "Copyright 2021 the original author or authors",
                "Copyright 2022 the original author or authors"
            ],
            "file-count": 293,
            "sha256": "734b20afdf462b05f342350c3d59ad9bbd51abb78dc55247f5a70744568abdff",
            "source": "https://search.maven.org/remotecontent?filepath=com/consol/citrus/citrus-base/3.4.0/citrus-base-3.4.0-sources.jar",
            "status": "approved"
        }
    ]
}