{
    "id": "npm/npmjs/@webassemblyjs/helper-wasm-section/1.11.5",
    "license": "MIT",
    "authority": "https://gitlab.eclipse.org/eclipsefdn/emo-team/iplab/-/issues/7960",
    "source": "https://registry.npmjs.org/@webassemblyjs/helper-wasm-section/-/helper-wasm-section-1.11.5.tgz",
    "status": "approved",
    "scans": [
        {
            "date": "April 26, 2023 at 1:02:44 p.m. GMT",
            "authority": "https://gitlab.eclipse.org/eclipsefdn/emo-team/iplab/-/issues/7960",
            "scancode-version": "31.2.1",
            "licenses-discovered": [
                "MIT"
            ],
            "copyrights": [
            ],
            "file-count": 5,
            "sha256": "ad96fb84146e4bcaf0f2f8c2caf2d8dfb1d9d61ee68c7255713a4c9dff7e9e94",
            "source": "https://registry.npmjs.org/@webassemblyjs/helper-wasm-section/-/helper-wasm-section-1.11.5.tgz",
            "status": "approved"
        }
    ]
}