{
    "id": "maven/mavencentral/org.apache.lucene/lucene-analyzers-nori/8.4.1",
    "license": "Apache-2.0",
    "licenses-discovered": [
        "Apache-2.0",
        "Apache-2.0 AND BSD-2-Clause AND BSD-3-Clause AND CC-BY-SA-3.0 AND ICU AND LGPL-2.0-or-later AND LicenseRef-scancode-other-copyleft AND LicenseRef-scancode-unicode-mappings AND MIT AND Python-2.0"
    ],
    "copyrights": [
        "Copyright (c) Anders Moeller",
        "Copyright (c) Center for Intelligent Information Retrieval, University of Massachusetts, Amherst",
        "Copyright (c) Dawid Weiss",
        "Copyright (c) Dawid Weiss, Marcin Milkowski",
        "Copyright (c) Dr Martin Porter",
        "Copyright (c) International Business Machines Corporation and others",
        "Copyright (c) Jean-Philippe Barrette-LaPierre, <jpb@rrette.com>",
        "Copyright (c) Richard Boulton",
        "Copyright (c) Zygmunt Saloni, Wlodzimierz Gruszczynski, Marcin Wolinski, Robert Wolosz",
        "Copyright The Apache Software Foundation",
        "Copyright Unicode, Inc.",
        "copyright by www.imdict.net"
    ],
    "file-count": 54,
    "scancode-version": "30.1.0",
    "authority": "https://gitlab.eclipse.org/eclipsefdn/emo-team/iplab/-/issues/3050",
    "source": "https://search.maven.org/remotecontent?filepath=org/apache/lucene/lucene-analyzers-nori/8.4.1/lucene-analyzers-nori-8.4.1-sources.jar",
    "status": "approved"
}
