{
    "id": "maven/mavencentral/com.google.re2j/re2j/1.6",
    "license": "BSD-3-Clause",
    "authority": "https://gitlab.eclipse.org/eclipsefdn/emo-team/iplab/-/issues/6532",
    "source": "https://search.maven.org/remotecontent?filepath=com/google/re2j/re2j/1.6/re2j-1.6-sources.jar",
    "status": "approved",
    "scans": [
        {
            "date": "January 24, 2023 at 12:11:17 a.m. GMT",
            "authority": "https://gitlab.eclipse.org/eclipsefdn/emo-team/iplab/-/issues/6532",
            "scancode-version": "31.2.1",
            "licenses-discovered": [
                "BSD-3-Clause"
            ],
            "copyrights": [
                "Copyright (c) 2020 The Go Authors",
                "Copyright (c) 2021 The Go Authors"
            ],
            "file-count": 22,
            "sha256": "93cddb0d06f582f6133d0a6d713efae558a1cfb92646cbd27ade5e7912134a95",
            "source": "https://search.maven.org/remotecontent?filepath=com/google/re2j/re2j/1.6/re2j-1.6-sources.jar",
            "status": "approved"
        }
    ]
}