{
    "id": "npm/npmjs/-/react-toastify/10.0.4",
    "license": "MIT",
    "authority": "https://gitlab.eclipse.org/eclipsefdn/emo-team/iplab/-/issues/13093",
    "source": "https://github.com/fkhadra/react-toastify/archive/refs/tags/v10.0.4.zip",
    "status": "approved",
    "scans": [
        {
            "date": "February 2, 2024 at 7:49:51 a.m. GMT",
            "authority": "https://gitlab.eclipse.org/eclipsefdn/emo-team/iplab/-/issues/13093",
            "scancode-version": "31.2.1",
            "licenses-discovered": [
                "MIT"
            ],
            "copyrights": [
                "Copyright (c) 2023 Fadi Khadra"
            ],
            "file-count": 89,
            "sha256": "371188b6342f889afccc83f79f565772823a391fe74af445899c116f563e7efa",
            "source": "https://github.com/fkhadra/react-toastify/archive/refs/tags/v10.0.4.zip",
            "status": "approved"
        }
    ]
}