{
    "id": "maven/mavencentral/org.geotools/gt-grid/32.0",
    "license": "LGPL-2.1-only",
    "authority": "https://gitlab.eclipse.org/eclipsefdn/emo-team/iplab/-/issues/16219",
    "source": "https://repo.osgeo.org/repository/geotools-releases/org/geotools/gt-grid/32.0/gt-grid-32.0-sources.jar",
    "status": "approved",
    "scans": [
        {
            "date": "September 19, 2024, 3:01:07 p.m. GMT",
            "authority": "https://gitlab.eclipse.org/eclipsefdn/emo-team/iplab/-/issues/16219",
            "scancode-version": "31.2.1",
            "licenses-discovered": [
                "LGPL-2.1-only"
            ],
            "copyrights": [
                "(c) 2010, Open Source Geospatial Foundation",
                "(c) 2011, Open Source Geospatial Foundation",
                "(c) 2019, Open Source Geospatial Foundation"
            ],
            "file-count": 31,
            "sha256": "ed998a6bf6d6d7b66d52e7d0f0b6f1c1fee84fd3ca322e59eddecf920a3828e7",
            "source": "https://repo.osgeo.org/repository/geotools-releases/org/geotools/gt-grid/32.0/gt-grid-32.0-sources.jar",
            "status": "approved"
        }
    ]
}