{
    "id": "maven/mavencentral/org.apache.maven.plugins/maven-failsafe-plugin/3.1.0",
    "license": "Apache-2.0",
    "authority": "https://gitlab.eclipse.org/eclipsefdn/emo-team/iplab/-/issues/8379",
    "source": "https://search.maven.org/remotecontent?filepath=org/apache/maven/plugins/maven-failsafe-plugin/3.1.0/maven-failsafe-plugin-3.1.0-sources.jar",
    "status": "approved",
    "scans": [
        {
            "date": "May 9, 2023 at 5:56:58 a.m. GMT",
            "authority": "https://gitlab.eclipse.org/eclipsefdn/emo-team/iplab/-/issues/8379",
            "scancode-version": "31.2.1",
            "licenses-discovered": [
                "Apache-2.0"
            ],
            "copyrights": [
            ],
            "file-count": 9,
            "sha256": "383c2053f23216dbb0efd619e82f32cb1dff43b67c8f2458e8c0b8a9b9de0ba3",
            "source": "https://search.maven.org/remotecontent?filepath=org/apache/maven/plugins/maven-failsafe-plugin/3.1.0/maven-failsafe-plugin-3.1.0-sources.jar",
            "status": "approved"
        }
    ]
}