{
    "id": "maven/mavencentral/androidx.compose.ui/ui-geometry/1.5.0",
    "license": "Apache-2.0",
    "authority": "https://gitlab.eclipse.org/eclipsefdn/emo-team/iplab/-/issues/10486",
    "source": "https://dl.google.com/android/maven2/androidx/compose/ui/ui-geometry/1.5.0/ui-geometry-1.5.0-sources.jar",
    "status": "approved",
    "scans": [
        {
            "date": "September 12, 2023 at 8:21:11 a.m. GMT",
            "authority": "https://gitlab.eclipse.org/eclipsefdn/emo-team/iplab/-/issues/10486",
            "scancode-version": "31.2.1",
            "licenses-discovered": [
                "Apache-2.0"
            ],
            "copyrights": [
                "Copyright 2019 The Android Open Source Project",
                "Copyright 2020 The Android Open Source Project"
            ],
            "file-count": 8,
            "sha256": "aa7c9a7dce2fefc48a97971b717d672d582e2341ce611062b2911fa44dea4aa4",
            "source": "https://dl.google.com/android/maven2/androidx/compose/ui/ui-geometry/1.5.0/ui-geometry-1.5.0-sources.jar",
            "status": "approved"
        }
    ]
}