{
    "id": "crate/cratesio/-/z-serial/0.2.0",
    "license": "Apache-2.0 AND EPL-2.0 AND (EPL-2.0 OR Apache-2.0)",
    "licenses-discovered": [
        "Apache-2.0 AND EPL-2.0",
        "EPL-2.0 OR Apache-2.0"
    ],
    "copyrights": [
        "Copyright (c) 2022 ZettaScale Technology"
    ],
    "file-count": 11,
    "scancode-version": "31.2.1",
    "authority": "https://gitlab.eclipse.org/eclipsefdn/emo-team/iplab/-/issues/4253",
    "source": "https://crates.io/api/v1/crates/z-serial/0.2.0/download",
    "status": "approved"
}