{
    "id": "maven/mavencentral/org.apache.pekko/pekko-protobuf-v3_2.13/1.1.3",
    "license": "Apache-2.0 AND BSD-3-Clause",
    "authority": "https://gitlab.eclipse.org/eclipsefdn/emo-team/iplab/-/issues/19541",
    "source": "https://repo1.maven.org/maven2/org/apache/pekko/pekko-protobuf-v3_2.13/1.1.3/pekko-protobuf-v3_2.13-1.1.3-sources.jar",
    "status": "approved",
    "scans": [
        {
            "date": "February 25, 2025 at 8:12:50 a.m. GMT",
            "authority": "https://gitlab.eclipse.org/eclipsefdn/emo-team/iplab/-/issues/19541",
            "scancode-version": "31.2.1",
            "licenses-discovered": [
                "LicenseRef-scancode-protobuf",
                "Apache-2.0"
            ],
            "copyrights": [
                "Copyright 2008, Google Inc."
            ],
            "file-count": 3,
            "sha256": "46342fdeed5eacb11dcc4407bd3d21fb8b91704fd0fcb826239aae090b5bf475",
            "source": "https://repo1.maven.org/maven2/org/apache/pekko/pekko-protobuf-v3_2.13/1.1.3/pekko-protobuf-v3_2.13-1.1.3-sources.jar",
            "status": "restricted"
        }
    ]
}