{
    "id": "maven/mavencentral/org.apache.camel/camel-file/3.22.2",
    "license": "Apache-2.0",
    "authority": "https://gitlab.eclipse.org/eclipsefdn/emo-team/iplab/-/issues/14915",
    "source": "https://repo1.maven.org/maven2/org/apache/camel/camel-file/3.22.2/camel-file-3.22.2-sources.jar",
    "status": "approved",
    "scans": [
        {
            "date": "May 29, 2024 at 9:44:52 a.m. GMT",
            "authority": "https://gitlab.eclipse.org/eclipsefdn/emo-team/iplab/-/issues/14915",
            "scancode-version": "31.2.1",
            "licenses-discovered": [
                "Apache-2.0"
            ],
            "copyrights": [
            ],
            "file-count": 78,
            "sha256": "baa1f391372cb5a5efc31fbe57cade2fada58e1fe9aa58b5ce2531400c7206f6",
            "source": "https://repo1.maven.org/maven2/org/apache/camel/camel-file/3.22.2/camel-file-3.22.2-sources.jar",
            "status": "approved"
        }
    ]
}