{
    "id": "npm/npmjs/@angular/language-server/16.1.4",
    "license": "MIT",
    "authority": "https://gitlab.eclipse.org/eclipsefdn/emo-team/iplab/-/issues/9409",
    "source": "https://github.com/angular/vscode-ng-language-service/archive/refs/tags/v16.1.4.zip",
    "status": "approved",
    "scans": [
        {
            "date": "July 14, 2023 at 2:11:41 p.m. GMT",
            "authority": "https://gitlab.eclipse.org/eclipsefdn/emo-team/iplab/-/issues/9409",
            "scancode-version": "31.2.1",
            "licenses-discovered": [
                "MIT"
            ],
            "copyrights": [
                "Copyright (c) 2014-2016 Google, Inc. http://angular.io",
                "Copyright Google Inc",
                "Copyright Google Inc."
            ],
            "file-count": 173,
            "sha256": "417352718ce7dc2ca7da7c58fb45c3073e981627c6dfed3ea324c0a3a7fab147",
            "source": "https://github.com/angular/vscode-ng-language-service/archive/refs/tags/v16.1.4.zip",
            "status": "approved"
        }
    ]
}