{
    "id": "npm/npmjs/-/jsrsasign/10.4.1",
    "license": "BSD-2-Clause AND MIT",
    "licenses-discovered": [
        "MIT",
        "BSD-2-Clause"
    ],
    "file-count": 13,
    "scancode-version": "30.1.0",
    "authority": "https://gitlab.eclipse.org/eclipsefdn/emo-team/iplab/-/issues/2084",
    "source": "https://registry.npmjs.org/jsrsasign/-/jsrsasign-10.4.1.tgz",
    "status": "approved"
}