{
    "id": "maven/mavencentral/org.mock-server/mockserver-netty/5.15.0",
    "license": "Apache-2.0",
    "authority": "https://gitlab.eclipse.org/eclipsefdn/emo-team/iplab/-/issues/9276",
    "source": "https://repo.maven.apache.org/maven2/org/mock-server/mockserver-netty/5.15.0/mockserver-netty-5.15.0-sources.jar",
    "status": "approved",
    "scans": [
        {
            "date": "July 6, 2023 at 4:09:15 p.m. GMT",
            "authority": "https://gitlab.eclipse.org/eclipsefdn/emo-team/iplab/-/issues/9276",
            "scancode-version": "31.2.1",
            "licenses-discovered": [
                "Apache-2.0 AND LGPL-3.0-only",
                "OFL-1.1",
                "BSD-3-Clause AND MIT"
            ],
            "copyrights": [
                "(c) Dustin Diaz 2015",
                "(c) Sindre Sorhus",
                "Copyright (c) 2011, Dan Sayers (i@iotic.com)",
                "Copyright (c) 2013-present, Facebook, Inc.",
                "Copyright (c) 2014-present, Facebook, Inc.",
                "Copyright (c) Facebook, Inc. and its affiliates",
                "Copyright 2014-2015, Facebook, Inc.",
                "Copyright 2015, Yahoo! Inc.",
                "Copyright Jeremy Ashkenas, DocumentCloud and Investigative Reporters & Editors",
                "Copyright OpenJS Foundation and other contributors <https://openjsf.org/>",
                "Copyright jQuery Foundation and other contributors <https://jquery.org/>",
                "copyright (c) 2020 Denis Pushkarev"
            ],
            "file-count": 57,
            "sha256": "8f6607425b28b94914bd5cffedd3f35af800d889ac0a8ee41ea0f4ed51f808c7",
            "source": "https://repo.maven.apache.org/maven2/org/mock-server/mockserver-netty/5.15.0/mockserver-netty-5.15.0-sources.jar",
            "status": "approved"
        }
    ]
}
