{
    "id": "crate/cratesio/-/napi/2.16.0",
    "license": "MIT",
    "authority": "https://gitlab.eclipse.org/eclipsefdn/emo-team/iplab/-/issues/17792",
    "source": "https://crates.io/api/v1/crates/napi/2.16.0/download",
    "status": "approved",
    "scans": [
        {
            "date": "December 10, 2024 at 9:45:27 p.m. GMT",
            "authority": "https://gitlab.eclipse.org/eclipsefdn/emo-team/iplab/-/issues/17792",
            "scancode-version": "31.2.1",
            "licenses-discovered": [
                "MIT"
            ],
            "copyrights": [
            ],
            "file-count": 68,
            "sha256": "54a63d0570e4c3e0daf7a8d380563610e159f538e20448d6c911337246f40e84",
            "source": "https://crates.io/api/v1/crates/napi/2.16.0/download",
            "status": "approved"
        }
    ]
}