{
    "id": "git/github/go-martini/martini/22fa46961aab",
    "license": "MIT",
    "licenses-discovered": [
        "MIT"
    ],
    "copyrights": [
        "Copyright (c) Jeremy Saenz"
    ],
    "file-count": 31,
    "scancode-version": "30.1.0",
    "authority": "https://gitlab.eclipse.org/eclipsefdn/emo-team/iplab/-/issues/3613",
    "source": "https://github.com/go-martini/martini/archive/22fa46961aab.zip",
    "status": "approved"
}