{
    "id": "npm/npmjs/@babel/plugin-transform-export-namespace-from/7.23.3",
    "license": "MIT AND (BSD-2-Clause AND ISC AND MIT) AND BSD-2-Clause AND BSD-3-Clause",
    "authority": "https://gitlab.eclipse.org/eclipsefdn/emo-team/iplab/-/issues/11544",
    "source": "https://github.com/babel/babel/archive/refs/tags/v7.23.3.zip",
    "status": "approved",
    "scans": [
        {
            "date": "November 17, 2023 at 12:10:59 a.m. GMT",
            "authority": "https://gitlab.eclipse.org/eclipsefdn/emo-team/iplab/-/issues/11544",
            "scancode-version": "31.2.1",
            "licenses-discovered": [
                "MIT",
                "BSD-2-Clause AND ISC AND MIT",
                "BSD-2-Clause",
                "BSD-3-Clause"
            ],
            "copyrights": [
                "(c) 2014-2023 Denis Pushkarev",
                "Copyright (c) 2011-2017 KARASZI Istvan <github@spam.raszi.hu>",
                "Copyright (c) 2012 Yusuke Suzuki <utatane.tea@gmail.com>",
                "Copyright (c) 2012-2013 Ecma International",
                "Copyright (c) 2012-2014 by various contributors",
                "Copyright (c) 2014-2015 Jason Quense <jason@quense.me>",
                "Copyright (c) 2014-present Sebastian McKenzie and other contributors",
                "Copyright (c) 2014-present, Facebook, Inc.",
                "Copyright (c) 2015 Jed Watson",
                "Copyright (c) jQuery Foundation, Inc. and Contributors",
                "Copyright 2013-2015, Facebook, Inc.",
                "Copyright 2020 Bloomberg Finance L.P.",
                "Copyright JS Foundation and other contributors",
                "Copyright OpenJS Foundation and other contributors"
            ],
            "file-count": 30200,
            "sha256": "314b294c41ea3f6468cdc2cd364486ed6ab9bb895d172463ec2a96ea78a193d0",
            "source": "https://github.com/babel/babel/archive/refs/tags/v7.23.3.zip",
            "status": "approved"
        }
    ]
}