{
    "id": "maven/mavencentral/org.geotools/gt-cql/28.1",
    "license": "LGPL-2.1-only",
    "authority": "https://gitlab.eclipse.org/eclipsefdn/emo-team/iplab/-/issues/6684",
    "source": "https://repo.osgeo.org/repository/geotools-releases/org/geotools/gt-cql/28.1/gt-cql-28.1-sources.jar",
    "status": "approved",
    "scans": [
        {
            "date": "January 26, 2023 at 3:29:37 p.m. GMT",
            "authority": "https://gitlab.eclipse.org/eclipsefdn/emo-team/iplab/-/issues/6684",
            "scancode-version": "31.2.1",
            "licenses-discovered": [
                "LGPL-2.1-only"
            ],
            "copyrights": [
                "(c) 2002-2008, Open Source Geospatial Foundation",
                "(c) 2004-2008, Open Source Geospatial Foundation",
                "(c) 2006-2008, Open Source Geospatial Foundation",
                "(c) 2006-2016, Open Source Geospatial Foundation"
            ],
            "file-count": 60,
            "sha256": "91789232f15a0ff17fd3f0ab496b71ddbbf5cb608950559ef6597a48c3bb30b2",
            "source": "https://repo.osgeo.org/repository/geotools-releases/org/geotools/gt-cql/28.1/gt-cql-28.1-sources.jar",
            "status": "approved"
        }
    ]
}