{
    "id": "npm/npmjs/@loaders.gl/loader-utils/3.3.2",
    "license": "Apache-2.0 AND MIT AND BSD-2-Clause AND BSD-3-Clause AND BSD-2-Clause-Views AND Apache-2.0 AND CC-BY-4.0 AND ISC AND JSON AND LGPL-2.1-only AND LicenseRef-Public-domain AND Unlicense",
    "authority": "https://gitlab.eclipse.org/eclipsefdn/emo-team/iplab/-/issues/7851",
    "source": "https://github.com/visgl/loaders.gl/archive/v3.3.2.zip",
    "status": "approved",
    "scans": [
        {
            "date": "April 12, 2023 at 1:59:43 p.m. GMT",
            "authority": "https://gitlab.eclipse.org/eclipsefdn/emo-team/iplab/-/issues/7851",
            "scancode-version": "31.2.1",
            "licenses-discovered": [
                "Apache-2.0 AND MIT",
                "MIT",
                "BSD-3-Clause",
                "BSD-2-Clause-Views",
                "Apache-2.0",
                "BSD-3-Clause AND JSON AND LicenseRef-scancode-other-permissive AND MIT AND Zlib",
                "BSD-3-Clause AND MIT",
                "BSD-2-Clause",
                "ISC",
                "CC-BY-4.0",
                "BSD-2-Clause AND BSD-3-Clause",
                "AFL-2.1 AND Apache-2.0 AND BSD-3-Clause AND CC-BY-NC-SA-3.0 AND GPL-2.0-only AND GPL-3.0-only AND JSON AND LGPL-2.1-only AND LicenseRef-scancode-happy-bunny AND LicenseRef-scancode-proprietary-license AND LicenseRef-scancode-unknown AND MIT AND NTP-0 AND WTFPL",
                "LGPL-2.0-or-later",
                "BSD-3-Clause AND ISC",
                "ISC AND MIT",
                "LicenseRef-scancode-proprietary-license",
                "CC-BY-SA-3.0",
                "BSD-2-Clause-Views AND MIT",
                "BSD-2-Clause AND MIT",
                "BSD-3-Clause AND LicenseRef-scancode-mit-xfig AND MIT",
                "BSD-2-Clause AND ISC AND MIT"
            ],
            "copyrights": [
                "(c) 2011 T. Jameson Little",
                "(c) 2020 Brian Todd Button",
                "(c) Dean McNamee <dean@gmail.com> , 2013",
                "(c) by rapidlasso GmbH",
                "Copyright (c) 1994 Anthony Dekker",
                "Copyright (c) 2002 JSON.org",
                "Copyright (c) 2006-2013 Alexander Chemeris",
                "Copyright (c) 2009 Mateusz Loskot <mateusz@loskot.net>",
                "Copyright (c) 2009 Thomas Robinson <280north.com>",
                "Copyright (c) 2010 Nodejitsu Inc. <http://www.twitter.com/nodejitsu>",
                "Copyright (c) 2010-2011 Pau Ramon <masylum@gmail.com>",
                "Copyright (c) 2010-2019 three.js authors",
                "Copyright (c) 2011 Andriy Bazyuta <andriy.bazyuta@gmail.com>",
                "Copyright (c) 2011 Ariya Hidayat (http://ariya.ofilabs.com/about) (twitter ariyahidayat (http://twitter.com/ariyahidayat))",
                "Copyright (c) 2011 Chris Leishman <chris@leishman.org>",
                "Copyright (c) 2011 Cristiano Oliveira <ocean.cris@gmail.com>",
                "Copyright (c) 2011 Dai Akatsuka",
                "Copyright (c) 2011 Damian Suarez <damian@learnboost.com>",
                "Copyright (c) 2011 Dotan Nahum (http://gplus.to/dotan) jondot (http://twitter.com/jondot)",
                "Copyright (c) 2011 Einar Otto Stangvik <einaros@gmail.com>",
                "Copyright (c) 2011 Enrico Marino <enrico.marino@email.com>",
                "Copyright (c) 2011 Firebase.co - http://www.firebase.co",
                "Copyright (c) 2011 Firebase.co and Contributors - http://www.firebase.co",
                "Copyright (c) 2011 Frantisek Haba <hello@frantisekhaba.com>",
                "Copyright (c) 2011 Guillermo Rauch <guillermo@learnboost.com>",
                "Copyright (c) 2011 Jake Luer <jake@alogicalparadox.com>",
                "Copyright (c) 2011 Jed Schmidt, http://jed.is",
                "Copyright (c) 2011 LearnBoost <tj@learnboost.com>",
                "Copyright (c) 2011 Nolan Caudill",
                "Copyright (c) 2011 Peter Magnusson <kmpm@birchroad.net>",
                "Copyright (c) 2011 Petr Janda",
                "Copyright (c) 2011 Pope-Industries <alex@pope-industries.com>",
                "Copyright (c) 2011 Robert Katzki <robert@katzki.de>",
                "Copyright (c) 2011 TJ Holowaychuk <tj@vision-media.ca>",
                "Copyright (c) 2011 by Maciej Malecki",
                "Copyright (c) 2011 by Roland Poulter",
                "Copyright (c) 2011 by Thom Blake",
                "Copyright (c) 2011 dreamerslab <ben@dreamerslab.com>",
                "Copyright (c) 2011 nuno job",
                "Copyright (c) 2011, Lloyd Hilaiel <lloyd@hilaiel.com>",
                "Copyright (c) 2011-2014, Markus Schutz",
                "Copyright (c) 2011-2017, Markus Schutz",
                "Copyright (c) 2012 Pierre Curto",
                "Copyright (c) 2013 Christian Schwarz",
                "Copyright (c) 2013 Christian Schwarz Reference https://www.ogc.org/standards/sfa",
                "Copyright (c) 2013-2016, Michael Bostock",
                "Copyright (c) 2014 Uday Verma, uday.karan@gmail.com",
                "Copyright (c) 2014, Brandon Jones",
                "Copyright (c) 2014, Mapbox",
                "Copyright (c) 2015 - 2017 Uber Technologies, Inc.",
                "Copyright (c) 2015 THL A29 Limited",
                "Copyright (c) 2015 THL A29 Limited, a Tencent company, and Milo",
                "Copyright (c) 2015 THL A29 Limited, a Tencent company, and Milo Yip",
                "Copyright (c) 2015 Uber Technologies, Inc.",
                "Copyright (c) 2015, Brandon Jones, Colin MacKenzie",
                "Copyright (c) 2015, Mapbox",
                "Copyright (c) 2016 cheminfo",
                "Copyright (c) 2016-17 Karl Cheng",
                "Copyright (c) 2016-2021, by Arseny Kapoulkine (arseny.kapoulkine@gmail.com)",
                "Copyright (c) 2017",
                "Copyright (c) 2017 Tarek Sherif",
                "Copyright (c) 2017 ironSource Ltd.",
                "Copyright (c) 2018-2019 HERE Europe B.V.",
                "Copyright (c) 2019 Uber Technologies, Inc.",
                "Copyright (c) 2019, Geodan",
                "Copyright (c) 2019, Mapbox",
                "Copyright (c) 2019, Michael Fogleman, Vladimir Agafonkin",
                "Copyright (c) Isaac Z. Schlueter",
                "Copyright (c) Isaac Z. Schlueter and Contributors",
                "Copyright (c) Tom Bell",
                "Copyright (c) Vsevolod Strukchinsky <floatdrop@gmail.com>",
                "Copyright 2005-2016 OpenLayers Contributors",
                "Copyright 2011 AppsAttic (http://www.appsattic.com/)",
                "Copyright 2011 Brock Whitten",
                "Copyright 2011 Twitter, Inc.",
                "Copyright 2011, Jeremy Bornstein <jeremy@jeremy.org>",
                "Copyright 2011, StatusNet Inc.",
                "Copyright 2011-2018 CesiumJS",
                "Copyright 2016 The Draco Authors",
                "Copyright 2017 Google Inc.",
                "Copyright 2017 The Draco Authors",
                "Copyright 2017 Yahoo Inc.",
                "Copyright 2018 The Draco Authors",
                "Copyright 2022 Foursquare Labs, Inc.",
                "Viewpoint Datalabs International, Inc. Copyright 1996",
                "copyright (c) 2011 by Kris Walker (kris@kixx.name)",
                "parts Copyright (c) 2010-2018 three.js",
                "parts Copyright (c) 2013 Sencha Labs"
            ],
            "file-count": 3947,
            "sha256": "93f130fe5a2b621f0bbe180faefc6e7e2d6af49afe7b56b3dd7219da3bd2d2a3",
            "source": "https://github.com/visgl/loaders.gl/archive/v3.3.2.zip",
            "status": "restricted"
        }
    ]
}
