{
    "id": "maven/mavencentral/org.osgi/org.osgi.service.component/1.5.1-RC1",
    "license": "Apache-2.0",
    "authority": "https://gitlab.eclipse.org/eclipsefdn/emo-team/iplab/-/issues/5389",
    "source": "https://search.maven.org/remotecontent?filepath=org/osgi/org.osgi.service.component/1.5.1-RC1/org.osgi.service.component-1.5.1-RC1-sources.jar",
    "status": "approved",
    "scans": [
        {
            "date": "December 7, 2022 at 3:32:20 p.m. GMT",
            "authority": "https://gitlab.eclipse.org/eclipsefdn/emo-team/iplab/-/issues/5389",
            "scancode-version": "31.2.1",
            "licenses-discovered": [
                "Apache-2.0"
            ],
            "copyrights": [
            ],
            "file-count": 23,
            "sha256": "aed94401e3a7a49a7bef2aef8ba3e04899fb2ac021d5c0729765bb5cb58f70ba",
            "source": "https://search.maven.org/remotecontent?filepath=org/osgi/org.osgi.service.component/1.5.1-RC1/org.osgi.service.component-1.5.1-RC1-sources.jar",
            "status": "approved"
        }
    ]
}