{
    "id": "maven/mavencentral/org.geckoprojects.emf.utils/org.gecko.emf.json/1.5.1",
    "license": "EPL-2.0",
    "authority": "https://gitlab.eclipse.org/eclipsefdn/emo-team/iplab/-/issues/18884",
    "source": "https://repo1.maven.org/maven2/org/geckoprojects/emf/utils/org.gecko.emf.json/1.5.1/org.gecko.emf.json-1.5.1-sources.jar",
    "status": "approved",
    "scans": [
        {
            "date": "January 17, 2025 at 4:56:23 p.m. GMT",
            "authority": "https://gitlab.eclipse.org/eclipsefdn/emo-team/iplab/-/issues/18884",
            "scancode-version": "31.2.1",
            "licenses-discovered": [
                "EPL-2.0"
            ],
            "copyrights": [
                "Copyright (c) 2012 - 2022 Data In Motion and others"
            ],
            "file-count": 10,
            "sha256": "3c86dadfd3c2420f0a126b07e8a23626d066186f05711aaa872dcbf5f2bdacf0",
            "source": "https://repo1.maven.org/maven2/org/geckoprojects/emf/utils/org.gecko.emf.json/1.5.1/org.gecko.emf.json-1.5.1-sources.jar",
            "status": "approved"
        }
    ]
}