{
    "id": "npm/npmjs/@mui/private-theming/5.16.2",
    "license": "MIT",
    "authority": "https://gitlab.eclipse.org/eclipsefdn/emo-team/iplab/-/issues/15717",
    "source": "https://github.com/mui/material-ui/archive/refs/tags/v5.16.2.zip",
    "status": "approved",
    "scans": [
        {
            "date": "July 17, 2024 at 12:37:05 p.m. GMT",
            "authority": "https://gitlab.eclipse.org/eclipsefdn/emo-team/iplab/-/issues/15717",
            "scancode-version": "31.2.1",
            "licenses-discovered": [
                "MIT",
                "LGPL-2.0-or-later AND MIT",
                "LicenseRef-scancode-commercial-license",
                "OFL-1.1",
                "LicenseRef-scancode-free-unknown",
                "CC-BY-3.0",
                "JSON AND MIT"
            ],
            "copyrights": [
                "(c) Your company",
                "Copyright (c) 2014 Call-Em-All",
                "Copyright (c) color inherit https://mui.com/",
                "Copyright 2017-2021 Indian Type Foundry",
                "Copyright 2018 IBM Corp.",
                "Copyright 2020"
            ],
            "file-count": 43107,
            "sha256": "765612a01fa1220696c2f5ac17eaf22f42dbce151d832df4a919b5ac13f961dd",
            "source": "https://github.com/mui/material-ui/archive/refs/tags/v5.16.2.zip",
            "status": "restricted"
        }
    ]
}