{
    "id": "npm/npmjs/@typescript-eslint/typescript-estree/7.10.0",
    "license": "BSD-2-Clause AND MIT AND (BSD-2-Clause AND ISC AND MIT)",
    "authority": "https://gitlab.eclipse.org/eclipsefdn/emo-team/iplab/-/issues/14838",
    "source": "https://github.com/typescript-eslint/typescript-eslint/archive/refs/tags/v7.10.0.zip",
    "status": "approved",
    "scans": [
        {
            "date": "May 21, 2024 at 9:20:54 a.m. GMT",
            "authority": "https://gitlab.eclipse.org/eclipsefdn/emo-team/iplab/-/issues/14838",
            "scancode-version": "31.2.1",
            "licenses-discovered": [
                "BSD-2-Clause",
                "MIT",
                "BSD-2-Clause AND ISC AND MIT"
            ],
            "copyrights": [
                "Copyright (c) 2016 unional",
                "Copyright (c) 2019 typescript-eslint and other contributors",
                "Copyright (c) 2021 typescript-eslint and other contributors",
                "Copyright (c) 2023 typescript-eslint and other contributors",
                "Copyright JS Foundation and other contributors, https://js.foundation",
                "Copyright Joyent, Inc. and other Node contributors",
                "Pp (c) Ac",
                "Tv (c) Gn"
            ],
            "file-count": 7095,
            "sha256": "f03c20ce08a8e9bad5999933de6dd4bf7d4c694f61716fefbebfb698da9754ce",
            "source": "https://github.com/typescript-eslint/typescript-eslint/archive/refs/tags/v7.10.0.zip",
            "status": "approved"
        }
    ]
}