{
    "id": "maven/mavencentral/software.amazon.awssdk/protocol-core/2.30.2",
    "license": "Apache-2.0",
    "authority": "https://gitlab.eclipse.org/eclipsefdn/emo-team/iplab/-/issues/19168",
    "source": "https://repo1.maven.org/maven2/software/amazon/awssdk/protocol-core/2.30.2/protocol-core-2.30.2-sources.jar",
    "status": "approved",
    "scans": [
        {
            "date": "January 22, 2025 at 3:33:53 a.m. GMT",
            "authority": "https://gitlab.eclipse.org/eclipsefdn/emo-team/iplab/-/issues/19168",
            "scancode-version": "31.2.1",
            "licenses-discovered": [
                "Apache-2.0"
            ],
            "copyrights": [
                "Copyright Amazon.com, Inc. or its affiliates"
            ],
            "file-count": 17,
            "sha256": "28d919c9903a93198b67c43187765d2693b42e5a019418b75bea240c2260bd23",
            "source": "https://repo1.maven.org/maven2/software/amazon/awssdk/protocol-core/2.30.2/protocol-core-2.30.2-sources.jar",
            "status": "approved"
        }
    ]
}