{
    "id": "maven/mavencentral/io.fabric8/kubernetes-httpclient-okhttp/6.5.0",
    "license": "Apache-2.0",
    "authority": "https://gitlab.eclipse.org/eclipsefdn/emo-team/iplab/-/issues/7368",
    "source": "https://search.maven.org/remotecontent?filepath=io/fabric8/kubernetes-httpclient-okhttp/6.5.0/kubernetes-httpclient-okhttp-6.5.0-sources.jar",
    "status": "approved",
    "scans": [
        {
            "date": "March 14, 2023 at 10:11:23 a.m. GMT",
            "authority": "https://gitlab.eclipse.org/eclipsefdn/emo-team/iplab/-/issues/7368",
            "scancode-version": "31.2.1",
            "licenses-discovered": [
                "Apache-2.0"
            ],
            "copyrights": [
                "Copyright (c) 2015 Red Hat, Inc."
            ],
            "file-count": 8,
            "sha256": "f9c3c5223ce0adede1e00da48ca81e8125fed11730e4a352dab40a538186254f",
            "source": "https://search.maven.org/remotecontent?filepath=io/fabric8/kubernetes-httpclient-okhttp/6.5.0/kubernetes-httpclient-okhttp-6.5.0-sources.jar",
            "status": "approved"
        }
    ]
}