{
    "id": "maven/mavencentral/net.sf.tweety/graphs/1.12",
    "license": "LGPL-3.0-or-later",
    "authority": "https://gitlab.eclipse.org/eclipsefdn/emo-team/iplab/-/issues/17238",
    "source": "https://repo1.maven.org/maven2/net/sf/tweety/graphs/1.12/graphs-1.12-sources.jar",
    "status": "approved",
    "scans": [
        {
            "date": "November 14, 2024, 8:38:32 p.m. GMT",
            "authority": "https://gitlab.eclipse.org/eclipsefdn/emo-team/iplab/-/issues/17238",
            "scancode-version": "31.2.1",
            "licenses-discovered": [
                "LGPL-3.0-or-later"
            ],
            "copyrights": [
                "Copyright 2016 The TweetyProject Team <http://tweetyproject.org/contact/>",
                "Copyright 2019 The TweetyProject Team <http://tweetyproject.org/contact/>"
            ],
            "file-count": 14,
            "sha256": "71f8a37c0172912300c371202d557f5ff644dd4f37383a61af218f93661269d8",
            "source": "https://repo1.maven.org/maven2/net/sf/tweety/graphs/1.12/graphs-1.12-sources.jar",
            "status": "approved"
        }
    ]
}