{
    "id": "maven/mavencentral/org.geotools/gt-jdbc/22.1",
    "license": "LGPL-2.0-or-later AND LGPL-2.1-only",
    "authority": "https://gitlab.eclipse.org/eclipsefdn/emo-team/iplab/-/issues/4877",
    "source": "https://repo.osgeo.org/repository/geotools-releases/org/geotools/gt-jdbc/22.1/gt-jdbc-22.1-sources.jar",
    "status": "approved",
    "scans": [
        {
            "date": "November 16, 2022 at 12:12:32 a.m. GMT",
            "authority": "https://gitlab.eclipse.org/eclipsefdn/emo-team/iplab/-/issues/4877",
            "scancode-version": "31.2.1",
            "licenses-discovered": [
                "LGPL-2.0-or-later",
                "LGPL-2.1-only"
            ],
            "copyrights": [
                "(c) 2002-2008, Open Source Geospatial Foundation",
                "(c) 2002-2009, Open Source Geospatial Foundation",
                "(c) 2002-2010, Open Source Geospatial Foundation",
                "(c) 2002-2011, Open Source Geospatial Foundation",
                "(c) 2002-2013, Open Source Geospatial Foundation",
                "(c) 2002-2015, Open Source Geospatial Foundation",
                "(c) 2002-2016, Open Source Geospatial Foundation",
                "(c) 2003-2008, Open Source Geospatial Foundation",
                "(c) 2004-2008, Open Source Geospatial Foundation",
                "(c) 2006-2008, Open Source Geospatial Foundation",
                "(c) 2008 - 2016, Open Source Geospatial Foundation",
                "(c) 2008, Open Source Geospatial Foundation",
                "(c) 2008-2015, Open Source Geospatial Foundation",
                "(c) 2014, Open Source Geospatial Foundation",
                "(c) 2015, Open Source Geospatial Foundation",
                "(c) 2017, Open Source Geospatial Foundation",
                "(c) 2019, Open Source Geospatial Foundation"
            ],
            "file-count": 70,
            "sha256": "ac91e69285aaa49fd4ef1903c0e48ee051260cd2668c8b6e78113d5325e21376",
            "source": "https://repo.osgeo.org/repository/geotools-releases/org/geotools/gt-jdbc/22.1/gt-jdbc-22.1-sources.jar",
            "status": "restricted"
        },
        {
            "date": "November 16, 2022 at 1:53:12 a.m. GMT",
            "authority": "https://gitlab.eclipse.org/eclipsefdn/emo-team/iplab/-/issues/4877",
            "scancode-version": "31.2.1",
            "licenses-discovered": [
                "LGPL-2.0-or-later",
                "LGPL-2.1-only"
            ],
            "copyrights": [
                "(c) 2002-2008, Open Source Geospatial Foundation",
                "(c) 2002-2009, Open Source Geospatial Foundation",
                "(c) 2002-2010, Open Source Geospatial Foundation",
                "(c) 2002-2011, Open Source Geospatial Foundation",
                "(c) 2002-2013, Open Source Geospatial Foundation",
                "(c) 2002-2015, Open Source Geospatial Foundation",
                "(c) 2002-2016, Open Source Geospatial Foundation",
                "(c) 2003-2008, Open Source Geospatial Foundation",
                "(c) 2004-2008, Open Source Geospatial Foundation",
                "(c) 2006-2008, Open Source Geospatial Foundation",
                "(c) 2008 - 2016, Open Source Geospatial Foundation",
                "(c) 2008, Open Source Geospatial Foundation",
                "(c) 2008-2015, Open Source Geospatial Foundation",
                "(c) 2014, Open Source Geospatial Foundation",
                "(c) 2015, Open Source Geospatial Foundation",
                "(c) 2017, Open Source Geospatial Foundation",
                "(c) 2019, Open Source Geospatial Foundation"
            ],
            "file-count": 70,
            "sha256": "ac91e69285aaa49fd4ef1903c0e48ee051260cd2668c8b6e78113d5325e21376",
            "source": "https://repo.osgeo.org/repository/geotools-releases/org/geotools/gt-jdbc/22.1/gt-jdbc-22.1-sources.jar",
            "status": "approved"
        }
    ]
}