{
    "id": "npm/npmjs/@nrwl/nx-linux-arm64-musl/15.7.0",
    "license": "MIT",
    "authority": "https://gitlab.eclipse.org/eclipsefdn/emo-team/iplab/-/issues/7131",
    "source": "https://registry.npmjs.org/@nrwl/nx-linux-arm64-musl/-/nx-linux-arm64-musl-15.7.0.tgz",
    "status": "approved",
    "scans": [
        {
            "date": "February 14, 2023 at 3:16:19 p.m. GMT",
            "authority": "https://gitlab.eclipse.org/eclipsefdn/emo-team/iplab/-/issues/7131",
            "scancode-version": "31.2.1",
            "licenses-discovered": [
                "MIT"
            ],
            "copyrights": [
                "Copyright (c) 2017-2023 Narwhal Technologies Inc."
            ],
            "file-count": 3,
            "sha256": "2e91f51ebd7d7630dd7d06b68d6dc1ed6dc5db78bb1b32ced8d956b937b04233",
            "source": "https://registry.npmjs.org/@nrwl/nx-linux-arm64-musl/-/nx-linux-arm64-musl-15.7.0.tgz",
            "status": "approved"
        }
    ]
}