{
    "id": "maven/mavencentral/org.json4s/json4s-native-core_2.12/4.0.7",
    "license": "Apache-2.0",
    "authority": "https://gitlab.eclipse.org/eclipsefdn/emo-team/iplab/-/issues/19711",
    "source": "https://repo1.maven.org/maven2/org/json4s/json4s-native-core_2.12/4.0.7/json4s-native-core_2.12-4.0.7-sources.jar",
    "status": "approved",
    "scans": [
        {
            "date": "March 1, 2025 at 12:49:16 a.m. GMT",
            "authority": "https://gitlab.eclipse.org/eclipsefdn/emo-team/iplab/-/issues/19711",
            "scancode-version": "31.2.1",
            "licenses-discovered": [
                "Apache-2.0"
            ],
            "copyrights": [
                "Copyright 2009-2010 WorldWide Conferencing, LLC"
            ],
            "file-count": 5,
            "sha256": "8e356b77f167e3c4d35fd1be40697f8cbfb5c434a4be896cb2fdcf1f116282ae",
            "source": "https://repo1.maven.org/maven2/org/json4s/json4s-native-core_2.12/4.0.7/json4s-native-core_2.12-4.0.7-sources.jar",
            "status": "approved"
        }
    ]
}