{
    "id": "maven/mavencentral/com.google.cloud/google-cloud-iamcredentials/2.24.0",
    "license": "Apache-2.0",
    "authority": "https://gitlab.eclipse.org/eclipsefdn/emo-team/iplab/-/issues/10577",
    "source": "https://repo.maven.apache.org/maven2/com/google/cloud/google-cloud-iamcredentials/2.24.0/google-cloud-iamcredentials-2.24.0-sources.jar",
    "status": "approved",
    "scans": [
        {
            "date": "September 18, 2023 at 11:00:45 a.m. GMT",
            "authority": "https://gitlab.eclipse.org/eclipsefdn/emo-team/iplab/-/issues/10577",
            "scancode-version": "31.2.1",
            "licenses-discovered": [
                "Apache-2.0"
            ],
            "copyrights": [
                "Copyright 2023 Google LLC"
            ],
            "file-count": 14,
            "sha256": "62afde41956d7732756bc6c3b185759941c9a0b00cd8270266c126c98c9c9a0f",
            "source": "https://repo.maven.apache.org/maven2/com/google/cloud/google-cloud-iamcredentials/2.24.0/google-cloud-iamcredentials-2.24.0-sources.jar",
            "status": "approved"
        }
    ]
}