{
    "id": "go/golang/google.golang.org/grpc/v1.23.0",
    "license": "Apache-2.0",
    "authority": "https://gitlab.eclipse.org/eclipsefdn/emo-team/iplab/-/issues/6096",
    "source": "https://proxy.golang.org/google.golang.org/grpc/@v/v1.23.0.zip",
    "status": "approved",
    "scans": [
        {
            "date": "January 6, 2023 at 7:06:24 a.m. GMT",
            "authority": "https://gitlab.eclipse.org/eclipsefdn/emo-team/iplab/-/issues/6096",
            "scancode-version": "31.2.1",
            "licenses-discovered": [
                "Apache-2.0"
            ],
            "copyrights": [
                "Copyright 2014 gRPC",
                "Copyright 2015 gRPC",
                "Copyright 2015-2016 gRPC",
                "Copyright 2016 gRPC",
                "Copyright 2017 gRPC",
                "Copyright 2018 gRPC",
                "Copyright 2019 gRPC"
            ],
            "file-count": 418,
            "sha256": "78fe066557a014f328f695df561a0f026b9c8fa704be8bc5d424409f3bc89064",
            "source": "https://proxy.golang.org/google.golang.org/grpc/@v/v1.23.0.zip",
            "status": "approved"
        }
    ]
}