{
    "id": "maven/mavencentral/org.jboss.arquillian.core/arquillian-core-impl-base/1.8.0.Final",
    "license": "Apache-2.0",
    "authority": "https://gitlab.eclipse.org/eclipsefdn/emo-team/iplab/-/issues/14288",
    "source": "https://repo1.maven.org/maven2/org/jboss/arquillian/core/arquillian-core-impl-base/1.8.0.Final/arquillian-core-impl-base-1.8.0.Final-sources.jar",
    "status": "approved",
    "scans": [
        {
            "date": "April 12, 2024 at 5:19:09 p.m. GMT",
            "authority": "https://gitlab.eclipse.org/eclipsefdn/emo-team/iplab/-/issues/14288",
            "scancode-version": "31.2.1",
            "licenses-discovered": [
                "Apache-2.0"
            ],
            "copyrights": [
                "Copyright 2009 Red Hat Inc. and/or its affiliates and other contributors by the authors",
                "Copyright 2010 Red Hat Inc. and/or its affiliates and other contributors by the authors",
                "Copyright 2011 Red Hat Inc. and/or its affiliates and other contributors as indicated by the authors tag",
                "Copyright 2014 Red Hat Inc. and/or its affiliates and other contributors by the authors"
            ],
            "file-count": 24,
            "sha256": "433ab9d63a77d02f3231ee2225fdcc0d4126be40a4e5f97efd5189998546f9b9",
            "source": "https://repo1.maven.org/maven2/org/jboss/arquillian/core/arquillian-core-impl-base/1.8.0.Final/arquillian-core-impl-base-1.8.0.Final-sources.jar",
            "status": "approved"
        }
    ]
}