{
    "id": "npm/npmjs/@lerna/package/6.0.3",
    "license": "MIT",
    "licenses-discovered": [
        "MIT"
    ],
    "copyrights": [
        "Copyright (c) 2015-present Lerna"
    ],
    "file-count": 4,
    "scancode-version": "31.2.1",
    "authority": "https://gitlab.eclipse.org/eclipsefdn/emo-team/iplab/-/issues/4608",
    "source": "https://registry.npmjs.org/@lerna/package/-/package-6.0.3.tgz",
    "status": "approved"
}