{
    "id": "npm/npmjs/-/flux/4.0.3",
    "license": "BSD-3-Clause AND (BSD-3-Clause AND MIT)",
    "authority": "https://gitlab.eclipse.org/eclipsefdn/emo-team/iplab/-/issues/6620",
    "source": "https://registry.yarnpkg.com/flux/-/flux-4.0.3.tgz",
    "status": "approved",
    "scans": [
        {
            "date": "January 25, 2023 at 11:31:20 p.m. GMT",
            "authority": "https://gitlab.eclipse.org/eclipsefdn/emo-team/iplab/-/issues/6620",
            "scancode-version": "31.2.1",
            "licenses-discovered": [
                "BSD-3-Clause",
                "BSD-3-Clause AND MIT"
            ],
            "copyrights": [
                "(c) Sindre Sorhus",
                "Copyright (c) 2013-present, Facebook, Inc.",
                "Copyright (c) 2014-present, Facebook, Inc.",
                "Copyright (c) Facebook, Inc. and its affiliates"
            ],
            "file-count": 25,
            "sha256": "2ebab80546d23c6cccbcd0a0dd5a611c2313efccfec54a55ff5715a427f38036",
            "source": "https://registry.yarnpkg.com/flux/-/flux-4.0.3.tgz",
            "status": "approved"
        }
    ]
}