{
    "id": "npm/npmjs/@vue/language-core/2.2.0",
    "license": "MIT",
    "authority": "https://gitlab.eclipse.org/eclipsefdn/emo-team/iplab/-/issues/18009",
    "source": "https://github.com/vuejs/language-tools/archive/refs/tags/v2.2.0.zip",
    "status": "approved",
    "scans": [
        {
            "date": "December 29, 2024 at 10:40:45 p.m. GMT",
            "authority": "https://gitlab.eclipse.org/eclipsefdn/emo-team/iplab/-/issues/18009",
            "scancode-version": "31.2.1",
            "licenses-discovered": [
                "MIT"
            ],
            "copyrights": [
                "Copyright (c) 2021-present Johnson Chu",
                "Copyright (c) 2023-present Johnson Chu"
            ],
            "file-count": 642,
            "sha256": "019a85cb0806940031a9b534099f5de6463513a9e99be24430557eb4ef2c1b47",
            "source": "https://github.com/vuejs/language-tools/archive/refs/tags/v2.2.0.zip",
            "status": "approved"
        }
    ]
}