{
    "id": "pypi/pypi/-/jupyter_server/2.6.0",
    "license": "BSD-3-Clause AND BSD-2-Clause AND MIT",
    "authority": "https://gitlab.eclipse.org/eclipsefdn/emo-team/iplab/-/issues/15023",
    "source": "https://files.pythonhosted.org/packages/ef/59/ba1556d910d6b608d203ca033ed4eef4489415f6afeb4e27fc7d7d56d257/jupyter_server-2.6.0.tar.gz",
    "status": "approved",
    "scans": [
        {
            "date": "May 29, 2024 at 4:40:15 p.m. GMT",
            "authority": "https://gitlab.eclipse.org/eclipsefdn/emo-team/iplab/-/issues/15023",
            "scancode-version": "31.2.1",
            "licenses-discovered": [
                "BSD-3-Clause",
                "BSD-2-Clause",
                "MIT"
            ],
            "copyrights": [
                "Copyright (c) 2001-2015, IPython Development Team",
                "Copyright (c) 2015-, Jupyter Development Team",
                "Copyright (c) 2017 ORGANIZATION",
                "Copyright (c) Jupyter Development Team",
                "Copyright 2011-2019 Twitter, Inc.",
                "copyright 2020, Jupyter Team, https://jupyter.org"
            ],
            "file-count": 335,
            "sha256": "ae4af349f030ed08dd78cb7ac1a03a92d886000380c9ea6283f3c542a81f4b06",
            "source": "https://files.pythonhosted.org/packages/ef/59/ba1556d910d6b608d203ca033ed4eef4489415f6afeb4e27fc7d7d56d257/jupyter_server-2.6.0.tar.gz",
            "status": "approved"
        }
    ]
}