{
    "id": "npm/npmjs/-/chromium-bidi/0.4.4",
    "license": "Apache-2.0",
    "authority": "https://gitlab.eclipse.org/eclipsefdn/emo-team/iplab/-/issues/7200",
    "source": "https://github.com/GoogleChromeLabs/chromium-bidi/archive/v0.4.4.zip",
    "status": "approved",
    "scans": [
        {
            "date": "February 24, 2023 at 2:31:46 p.m. GMT",
            "authority": "https://gitlab.eclipse.org/eclipsefdn/emo-team/iplab/-/issues/7200",
            "scancode-version": "31.2.1",
            "licenses-discovered": [
                "Apache-2.0"
            ],
            "copyrights": [
                "Copyright (c) Microsoft Corporation",
                "Copyright 2020 Google Inc.",
                "Copyright 2021 Google LLC.",
                "Copyright 2022 Google LLC.",
                "Copyright 2023 Google LLC."
            ],
            "file-count": 151,
            "sha256": "12f8f217dcf4855c60c0283b1b93001513f78051661f5aae911aeba603f9f46e",
            "source": "https://github.com/GoogleChromeLabs/chromium-bidi/archive/v0.4.4.zip",
            "status": "approved"
        }
    ]
}