{
    "id": "maven/mavencentral/de.fraunhofer.iosb.ilt.faaast.service/starter/1.0.1",
    "license": "Apache-2.0",
    "authority": "https://gitlab.eclipse.org/eclipsefdn/emo-team/iplab/-/issues/15691",
    "source": "https://repo1.maven.org/maven2/de/fraunhofer/iosb/ilt/faaast/service/starter/1.0.1/starter-1.0.1-sources.jar",
    "status": "approved",
    "scans": [
        {
            "date": "July 11, 2024 at 8:49:24 a.m. GMT",
            "authority": "https://gitlab.eclipse.org/eclipsefdn/emo-team/iplab/-/issues/15691",
            "scancode-version": "31.2.1",
            "licenses-discovered": [
                "Apache-2.0"
            ],
            "copyrights": [
                "Copyright (c) 2021 Fraunhofer IOSB"
            ],
            "file-count": 13,
            "sha256": "6ba3a018b6d2ee1af4d5aa5f4407d900684ed3df7a44657995487189de7703b3",
            "source": "https://repo1.maven.org/maven2/de/fraunhofer/iosb/ilt/faaast/service/starter/1.0.1/starter-1.0.1-sources.jar",
            "status": "approved"
        }
    ]
}