{
    "id": "npm/npmjs/@pnpm/resolver-base/11.1.0",
    "license": "MIT",
    "authority": "https://gitlab.eclipse.org/eclipsefdn/emo-team/iplab/-/issues/13342",
    "source": "https://registry.npmjs.org/@pnpm/resolver-base/-/resolver-base-11.1.0.tgz",
    "status": "approved",
    "scans": [
        {
            "date": "February 20, 2024 at 4:40:02 a.m. GMT",
            "authority": "https://gitlab.eclipse.org/eclipsefdn/emo-team/iplab/-/issues/13342",
            "scancode-version": "31.2.1",
            "licenses-discovered": [
            ],
            "copyrights": [
            ],
            "file-count": 1,
            "sha256": "35eb81406452364aa2baf4c60cd78a630c9083c38874fd0228a73c60faea25eb",
            "source": "https://github.com/pnpm/pnpm/pull/11.1.0.patch",
            "status": "restricted"
        },
        {
            "date": "March 16, 2024 at 6:58:50 p.m. GMT",
            "authority": "https://gitlab.eclipse.org/eclipsefdn/emo-team/iplab/-/issues/13342",
            "scancode-version": "31.2.1",
            "licenses-discovered": [
                "MIT"
            ],
            "copyrights": [
                "Copyright (c) 2015-2016 Rico Sta. Cruz and other contributors",
                "Copyright (c) 2016-2024 Zoltan Kochan and other contributors"
            ],
            "file-count": 6,
            "sha256": "4f476414872c08554be300494bf20997a60088add072dac470b55bb1bff74244",
            "source": "https://registry.npmjs.org/@pnpm/resolver-base/-/resolver-base-11.1.0.tgz",
            "status": "approved"
        }
    ]
}