{
    "id": "maven/mavencentral/com.google.api.grpc/proto-google-cloud-secretmanager-v1beta2/2.51.0",
    "license": "Apache-2.0",
    "authority": "https://gitlab.eclipse.org/eclipsefdn/emo-team/iplab/-/issues/16726",
    "source": "https://repo1.maven.org/maven2/com/google/api/grpc/proto-google-cloud-secretmanager-v1beta2/2.51.0/proto-google-cloud-secretmanager-v1beta2-2.51.0-sources.jar",
    "status": "approved",
    "scans": [
        {
            "date": "October 15, 2024, 5:54:41 p.m. GMT",
            "authority": "https://gitlab.eclipse.org/eclipsefdn/emo-team/iplab/-/issues/16726",
            "scancode-version": "31.2.1",
            "licenses-discovered": [
                "Apache-2.0"
            ],
            "copyrights": [
                "Copyright 2024 Google LLC"
            ],
            "file-count": 59,
            "sha256": "17f11f79e93901dc06650d5d1c23b08e0bb9cfe3e83aa044a85742c8a922a420",
            "source": "https://repo1.maven.org/maven2/com/google/api/grpc/proto-google-cloud-secretmanager-v1beta2/2.51.0/proto-google-cloud-secretmanager-v1beta2-2.51.0-sources.jar",
            "status": "approved"
        }
    ]
}