{
    "id": "maven/mavencentral/org.slf4j/jcl-over-slf4j/2.0.9",
    "license": "MIT AND Apache-2.0",
    "authority": "https://gitlab.eclipse.org/eclipsefdn/emo-team/iplab/-/issues/11889",
    "source": "https://repo1.maven.org/maven2/org/slf4j/jcl-over-slf4j/2.0.9/jcl-over-slf4j-2.0.9-sources.jar",
    "status": "approved",
    "scans": [
        {
            "date": "December 13, 2023 at 7:29:11 a.m. GMT",
            "authority": "https://gitlab.eclipse.org/eclipsefdn/emo-team/iplab/-/issues/11889",
            "scancode-version": "31.2.1",
            "licenses-discovered": [
                "MIT",
                "Apache-2.0"
            ],
            "copyrights": [
                "Copyright (c) 2004-2022 QOS.ch Sarl (Switzerland)",
                "Copyright 2001-2004 The Apache Software Foundation"
            ],
            "file-count": 15,
            "sha256": "1c4cae4dbe1fd84f1bb991e73e601893deec2884774b4d6cc4736c2dc070c990",
            "source": "https://repo1.maven.org/maven2/org/slf4j/jcl-over-slf4j/2.0.9/jcl-over-slf4j-2.0.9-sources.jar",
            "status": "approved"
        }
    ]
}