{
    "id": "maven/mavencentral/org.commonmark/commonmark-ext-heading-anchor/0.24.0",
    "license": "BSD-2-Clause",
    "authority": "https://gitlab.eclipse.org/eclipsefdn/emo-team/iplab/-/issues/16826",
    "source": "https://repo1.maven.org/maven2/org/commonmark/commonmark-ext-heading-anchor/0.24.0/commonmark-ext-heading-anchor-0.24.0-sources.jar",
    "status": "approved",
    "scans": [
        {
            "date": "October 21, 2024, 3:51:25 p.m. GMT",
            "authority": "https://gitlab.eclipse.org/eclipsefdn/emo-team/iplab/-/issues/16826",
            "scancode-version": "31.2.1",
            "licenses-discovered": [
                "BSD-2-Clause"
            ],
            "copyrights": [
                "Copyright (c) 2015, Atlassian Pty Ltd"
            ],
            "file-count": 8,
            "sha256": "02498670317202f1cdf4246c939a69499982748c2090cdd800d2f5c4a440a7ec",
            "source": "https://repo1.maven.org/maven2/org/commonmark/commonmark-ext-heading-anchor/0.24.0/commonmark-ext-heading-anchor-0.24.0-sources.jar",
            "status": "approved"
        }
    ]
}