{
    "id": "maven/mavencentral/software.amazon.awssdk/json-utils/2.25.1",
    "license": "Apache-2.0",
    "authority": "https://gitlab.eclipse.org/eclipsefdn/emo-team/iplab/-/issues/13698",
    "source": "https://repo1.maven.org/maven2/software/amazon/awssdk/json-utils/2.25.1/json-utils-2.25.1-sources.jar",
    "status": "approved",
    "scans": [
        {
            "date": "March 14, 2024 at 12:22:04 p.m. GMT",
            "authority": "https://gitlab.eclipse.org/eclipsefdn/emo-team/iplab/-/issues/13698",
            "scancode-version": "31.2.1",
            "licenses-discovered": [
                "Apache-2.0"
            ],
            "copyrights": [
                "Copyright Amazon.com, Inc. or its affiliates"
            ],
            "file-count": 15,
            "sha256": "4f77d2dad2814dc1ed22b65420660d143f7996b81af654ef7fbdbe48b67a5f68",
            "source": "https://repo1.maven.org/maven2/software/amazon/awssdk/json-utils/2.25.1/json-utils-2.25.1-sources.jar",
            "status": "approved"
        }
    ]
}