{
    "id": "npm/npmjs/@nrwl/nx-linux-x64-gnu/15.9.3",
    "license": "MIT",
    "authority": "https://gitlab.eclipse.org/eclipsefdn/emo-team/iplab/-/issues/8273",
    "source": "https://registry.npmjs.org/@nrwl/nx-linux-x64-gnu/-/nx-linux-x64-gnu-15.9.3.tgz",
    "status": "approved",
    "scans": [
        {
            "date": "May 4, 2023 at 2:30:17 p.m. GMT",
            "authority": "https://gitlab.eclipse.org/eclipsefdn/emo-team/iplab/-/issues/8273",
            "scancode-version": "31.2.1",
            "licenses-discovered": [
                "MIT"
            ],
            "copyrights": [
                "Copyright (c) 2017-2023 Narwhal Technologies Inc."
            ],
            "file-count": 3,
            "sha256": "a486a65065958dfe37d131f4281fbc91b4fae1d9cc8d937f57fa23736bc5d744",
            "source": "https://registry.npmjs.org/@nrwl/nx-linux-x64-gnu/-/nx-linux-x64-gnu-15.9.3.tgz",
            "status": "approved"
        }
    ]
}