{
    "id": "maven/mavencentral/org.apache.activemq/activemq-camel/5.16.7",
    "license": "Apache-2.0",
    "authority": "https://gitlab.eclipse.org/eclipsefdn/emo-team/iplab/-/issues/11501",
    "source": "https://repo1.maven.org/maven2/org/apache/activemq/activemq-camel/5.16.7/activemq-camel-5.16.7-sources.jar",
    "status": "approved",
    "scans": [
        {
            "date": "November 10, 2023 at 3:48:44 p.m. GMT",
            "authority": "https://gitlab.eclipse.org/eclipsefdn/emo-team/iplab/-/issues/11501",
            "scancode-version": "31.2.1",
            "licenses-discovered": [
                "Apache-2.0"
            ],
            "copyrights": [
            ],
            "file-count": 38,
            "sha256": "c53adaa39b4153f992f23d10c1b1bdc27df4cfdb022345e90e23e6f2da183aa1",
            "source": "https://repo1.maven.org/maven2/org/apache/activemq/activemq-camel/5.16.7/activemq-camel-5.16.7-sources.jar",
            "status": "approved"
        }
    ]
}