{
    "id": "maven/mavencentral/org.osgi/org.osgi.service.serviceloader/1.0.0",
    "license": "Apache-1.1 AND Apache-2.0",
    "authority": "https://gitlab.eclipse.org/eclipsefdn/emo-team/iplab/-/issues/17671",
    "source": "https://repo1.maven.org/maven2/org/osgi/org.osgi.service.serviceloader/1.0.0/org.osgi.service.serviceloader-1.0.0-sources.jar",
    "status": "approved",
    "scans": [
        {
            "date": "December 4, 2024 at 12:22:47 p.m. GMT",
            "authority": "https://gitlab.eclipse.org/eclipsefdn/emo-team/iplab/-/issues/17671",
            "scancode-version": "31.2.1",
            "licenses-discovered": [
                "Apache-1.1",
                "Apache-2.0"
            ],
            "copyrights": [
                "Copyright (c) OSGi Alliance (2000, 2015)",
                "Copyright (c) OSGi Alliance (2012, 2013)",
                "Copyright (c) OSGi Alliance (2012, 2014)"
            ],
            "file-count": 6,
            "sha256": "7d4783b570cd118263bc6a807c0a7c183b1db451442ffcb8a36310ad24a91743",
            "source": "https://repo1.maven.org/maven2/org/osgi/org.osgi.service.serviceloader/1.0.0/org.osgi.service.serviceloader-1.0.0-sources.jar",
            "status": "approved"
        }
    ]
}