{
    "id": "maven/mavencentral/org.apache.olingo/olingo-odata2-annotation-processor-api/2.0.13",
    "license": "Apache-2.0",
    "authority": "https://gitlab.eclipse.org/eclipsefdn/emo-team/iplab/-/issues/11321",
    "source": "https://repo.maven.apache.org/maven2/org/apache/olingo/olingo-odata2-annotation-processor-api/2.0.13/olingo-odata2-annotation-processor-api-2.0.13-sources.jar",
    "status": "approved",
    "scans": [
        {
            "date": "October 26, 2023 at 7:22:41 p.m. GMT",
            "authority": "https://gitlab.eclipse.org/eclipsefdn/emo-team/iplab/-/issues/11321",
            "scancode-version": "31.2.1",
            "licenses-discovered": [
                "Apache-2.0"
            ],
            "copyrights": [
            ],
            "file-count": 4,
            "sha256": "6e5bffab62915613c20a69df83e056c7d868a0752732c7e6ea04c55a4552058d",
            "source": "https://repo.maven.apache.org/maven2/org/apache/olingo/olingo-odata2-annotation-processor-api/2.0.13/olingo-odata2-annotation-processor-api-2.0.13-sources.jar",
            "status": "approved"
        }
    ]
}