{
    "id": "pypi/pypi/-/grpcio/1.63.0",
    "license": "Apache-2.0 AND BSD-3-Clause AND MPL-2.0 AND ISC AND OpenSSL AND LicenseRef-Permission-Notice AND Zlib AND (Apache-2.0 WITH LLVM-exception) AND MIT AND NTP AND LicenseRef-Public-domain AND LicenseRef-SSLeay",
    "authority": "https://gitlab.eclipse.org/eclipsefdn/emo-team/iplab/-/issues/14692",
    "source": "https://files.pythonhosted.org/packages/0c/2a/23943e19b4bbbdad60a9d881e44cd53bb48b31c7419ebb7b983edfbbb708/grpcio-1.63.0.tar.gz",
    "status": "approved",
    "scans": [
        {
            "date": "May 14, 2024 at 4:41:30 a.m. GMT",
            "authority": "https://gitlab.eclipse.org/eclipsefdn/emo-team/iplab/-/issues/14692",
            "scancode-version": "31.2.1",
            "licenses-discovered": [
                "Apache-2.0",
                "Apache-2.0 AND BSD-3-Clause AND MPL-2.0",
                "MPL-2.0",
                "ISC",
                "Apache-2.0 AND LicenseRef-scancode-unknown",
                "Zlib",
                "Apache-2.0 AND LicenseRef-scancode-generic-exception",
                "BSD-3-Clause",
                "ISC AND OpenSSL",
                "BSD-3-Clause AND GPL-2.0-only AND OpenSSL",
                "BSD-3-Clause AND GPL-1.0-or-later AND OpenSSL",
                "LicenseRef-scancode-ssleay-windows",
                "LicenseRef-scancode-openssl AND LicenseRef-scancode-ssleay-windows",
                "LicenseRef-scancode-openssl",
                "OpenSSL",
                "LicenseRef-scancode-openssl AND LicenseRef-scancode-openssl-nokia-psk-contribution AND LicenseRef-scancode-ssleay-windows",
                "LicenseRef-scancode-openssl AND LicenseRef-scancode-openssl-nokia-psk-contribution AND LicenseRef-scancode-ssleay-windows AND OpenSSL",
                "LicenseRef-scancode-proprietary-license AND LicenseRef-scancode-ssleay-windows",
                "LicenseRef-scancode-openssl-nokia-psk-contribution AND LicenseRef-scancode-ssleay-windows",
                "NTP",
                "BSD-3-Clause AND LicenseRef-scancode-unknown",
                "Apache-2.0 WITH LLVM-exception",
                "LicenseRef-scancode-x11-lucent",
                "MIT",
                "BSD-2-Clause",
                "LicenseRef-scancode-mit-old-style",
                "LicenseRef-scancode-info-zip-2009-01"
            ],
            "copyrights": [
                "(c) 1999 Entrust.net Limited",
                "(c) 1999 Entrust.net Limited Label Entrust.net Premium 2048 Secure Server CA Serial",
                "(c) 2006 Entrust, Inc.",
                "(c) 2006 Entrust, Inc. Label Entrust Root Certification",
                "(c) 2009 Entrust, Inc. - for",
                "(c) 2012 Entrust, Inc. - for",
                "(c) 2015 Entrust, Inc. - for",
                "Copyright (c) 1987-2001 The Regents of the University of California",
                "Copyright (c) 1990-2000 Info-ZIP.",
                "Copyright (c) 1995, 1996, 1997, and 1998 WIDE Project",
                "Copyright (c) 1995-1997 Eric Young (eay@cryptsoft.com)",
                "Copyright (c) 1995-1998 Eric Young (eay@cryptsoft.com)",
                "Copyright (c) 1995-2003 Mark Adler",
                "Copyright (c) 1995-2003, 2010 Mark Adler",
                "Copyright (c) 1995-2003, 2010, 2014, 2016 Jean-loup Gailly, Mark Adler",
                "Copyright (c) 1995-2005, 2010 Mark Adler",
                "Copyright (c) 1995-2005, 2014, 2016 Jean-loup Gailly, Mark Adler",
                "Copyright (c) 1995-2006, 2010, 2011, 2016 Jean-loup Gailly",
                "Copyright (c) 1995-2006, 2011, 2016 Jean-loup Gailly",
                "Copyright (c) 1995-2008 Mark Adler",
                "Copyright (c) 1995-2010 Jean-loup Gailly, Brian Raiter and Gilles Vollant",
                "Copyright (c) 1995-2011, 2016 Mark Adler",
                "Copyright (c) 1995-2016 Jean-loup Gailly, Mark Adler",
                "Copyright (c) 1995-2017 Jean-loup Gailly",
                "Copyright (c) 1995-2017 Mark Adler",
                "Copyright (c) 1995-2018 Jean-loup Gailly",
                "Copyright (c) 1995-2019 Mark Adler",
                "Copyright (c) 1995-2021 Jean-loup Gailly",
                "Copyright (c) 1995-2022 Jean-loup Gailly, Mark Adler",
                "Copyright (c) 1995-2022 Mark Adler",
                "Copyright (c) 1995-2023 Jean-loup Gailly and Mark Adler",
                "Copyright (c) 1995-2023 Mark Adler",
                "Copyright (c) 1996,1999 by Internet Software Consortium",
                "Copyright (c) 1996-1999 by Internet Software Consortium",
                "Copyright (c) 1997 Christian Michelsen Research AS Advanced Computing",
                "Copyright (c) 1998 - 2010 Gilles Vollant, Even Rouault, Mathias Svensson",
                "Copyright (c) 1998-2000 The OpenSSL Project",
                "Copyright (c) 1998-2001 The OpenSSL Project",
                "Copyright (c) 1998-2002 The OpenSSL Project",
                "Copyright (c) 1998-2003 The OpenSSL Project",
                "Copyright (c) 1998-2004 The OpenSSL Project",
                "Copyright (c) 1998-2005 Gilles Vollant",
                "Copyright (c) 1998-2005 The OpenSSL Project",
                "Copyright (c) 1998-2006 The OpenSSL Project",
                "Copyright (c) 1998-2007 The OpenSSL Project",
                "Copyright (c) 1998-2010 Gilles Vollant (minizip) http://www.winimage.com/zLibDll/minizip.html",
                "Copyright (c) 1998-2011 The OpenSSL Project",
                "Copyright (c) 1999 The OpenSSL Project",
                "Copyright (c) 1999-2002 The OpenSSL Project",
                "Copyright (c) 1999-2003 The OpenSSL Project",
                "Copyright (c) 1999-2004 The OpenSSL Project",
                "Copyright (c) 1999-2005 The OpenSSL Project",
                "Copyright (c) 1999-2007 The OpenSSL Project",
                "Copyright (c) 1999-2008 The OpenSSL Project",
                "Copyright (c) 2000 The OpenSSL Project",
                "Copyright (c) 2000-2002 The OpenSSL Project",
                "Copyright (c) 2000-2003 The OpenSSL Project",
                "Copyright (c) 2000-2005 The OpenSSL Project",
                "Copyright (c) 2001 The OpenSSL Project",
                "Copyright (c) 2001-2011 The OpenSSL Project",
                "Copyright (c) 2002 by Lucent Technologies",
                "Copyright (c) 2002-2006 The OpenSSL Project",
                "Copyright (c) 2002-2013 Mark Adler",
                "Copyright (c) 2003 Mark Adler",
                "Copyright (c) 2003 The OpenSSL Project",
                "Copyright (c) 2003, 2005, 2008, 2010, 2012 Mark Adler",
                "Copyright (c) 2003, 2012 Mark Adler",
                "Copyright (c) 2003, 2012, 2013 Mark Adler",
                "Copyright (c) 2003-2010 Mark Adler",
                "Copyright (c) 2004 - 2011 by Daniel Stenberg",
                "Copyright (c) 2004 - 2012 by Daniel Stenberg",
                "Copyright (c) 2004 - 2013 by Daniel Stenberg",
                "Copyright (c) 2004 The OpenSSL Project",
                "Copyright (c) 2004 by Daniel Stenberg",
                "Copyright (c) 2004 by Internet Systems Consortium, Inc.",
                "Copyright (c) 2004, 2005, 2012 Mark Adler",
                "Copyright (c) 2004, 2008, 2012 Mark Adler",
                "Copyright (c) 2004, 2008, 2012, 2016, 2019 Mark Adler",
                "Copyright (c) 2004, 2010 Mark Adler",
                "Copyright (c) 2004-2009 by Daniel Stenberg",
                "Copyright (c) 2004-2010 by Daniel Stenberg",
                "Copyright (c) 2004-2011 by Daniel Stenberg",
                "Copyright (c) 2004-2017 Mark Adler",
                "Copyright (c) 2004-2017 by Daniel Stenberg",
                "Copyright (c) 2004-2019 Mark Adler",
                "Copyright (c) 2005 - 2010, Daniel Stenberg",
                "Copyright (c) 2005 The OpenSSL Project",
                "Copyright (c) 2005 by Dominick Meglio",
                "Copyright (c) 2005, 2012, 2018, 2023 Mark Adler",
                "Copyright (c) 2005, 2013 by Dominick Meglio",
                "Copyright (c) 2005-2013 by Daniel Stenberg",
                "Copyright (c) 2006 The OpenSSL Project",
                "Copyright (c) 2006, Network Resonance, Inc.",
                "Copyright (c) 2006,2007 The OpenSSL Project",
                "Copyright (c) 2007, 2008, 2012, 2018 Mark Adler",
                "Copyright (c) 2007-2008 Even Rouault",
                "Copyright (c) 2007-2013 by Daniel Stenberg",
                "Copyright (c) 2008 The OpenSSL Project",
                "Copyright (c) 2008 by Daniel Stenberg",
                "Copyright (c) 2008-2013 by Daniel Stenberg",
                "Copyright (c) 2009 - 2013 by Daniel Stenberg",
                "Copyright (c) 2009 - 2021 by Daniel Stenberg",
                "Copyright (c) 2009 by Jakub Hrozek <jhrozek@redhat.com>",
                "Copyright (c) 2009-2010 Mathias Svensson http://result42.com",
                "Copyright (c) 2009-2013 by Daniel Stenberg",
                "Copyright (c) 2010 Jeremy Lal <kapouer@melix.org>",
                "Copyright (c) 2010 The OpenSSL Project",
                "Copyright (c) 2010-2012 by Daniel Stenberg",
                "Copyright (c) 2010-2013 by Daniel Stenberg",
                "Copyright (c) 2011 The OpenSSL Project",
                "Copyright (c) 2011, 2016 Mark Adler",
                "Copyright (c) 2011, RTFM, Inc.",
                "Copyright (c) 2012 Marko Kreen <markokr@gmail.com>",
                "Copyright (c) 2012 The Chromium Authors",
                "Copyright (c) 2012 The OpenSSL Project",
                "Copyright (c) 2012 by Gilles Chehade <gilles@openbsd.org>",
                "Copyright (c) 2012, Intel Corporation",
                "Copyright (c) 2012-2020 Yann Collet",
                "Copyright (c) 2013 The OpenSSL Project",
                "Copyright (c) 2014 The OpenSSL Project",
                "Copyright (c) 2014, Google Inc.",
                "Copyright (c) 2014, Intel Corporation",
                "Copyright (c) 2015 The OpenSSL Project",
                "Copyright (c) 2015, Google Inc.",
                "Copyright (c) 2015, Intel Inc.",
                "Copyright (c) 2016, Google Inc.",
                "Copyright (c) 2017 - 2018 by Christian Ammer",
                "Copyright (c) 2017 by John Schember <john@nachtimwald.com>",
                "Copyright (c) 2017, Google Inc.",
                "Copyright (c) 2017, the HRSS authors",
                "Copyright (c) 2018 Mark Adler",
                "Copyright (c) 2018 The Android Open Source Project",
                "Copyright (c) 2018 by John Schember <john@nachtimwald.com>",
                "Copyright (c) 2018, Google Inc.",
                "Copyright (c) 2019 by Andrew Selivanov",
                "Copyright (c) 2019, Google Inc.",
                "Copyright (c) 2020, Arm Ltd.",
                "Copyright (c) 2020, Google Inc.",
                "Copyright (c) 2021 Permission",
                "Copyright (c) 2021 by Brad House",
                "Copyright (c) 2021, Google Inc.",
                "Copyright (c) 2022, Google Inc.",
                "Copyright (c) 2022, Robert Nagy <robert.nagy@gmail.com>",
                "Copyright (c) 2023, Google Inc.",
                "Copyright (c) 2023, Google LLC",
                "Copyright (c) 2024, Google Inc.",
                "Copyright 1995-2016 The OpenSSL Project Authors",
                "Copyright 1995-2017 The OpenSSL Project Authors",
                "Copyright 1995-2023 Jean-loup Gailly and Mark Adler",
                "Copyright 1995-2023 Mark Adler",
                "Copyright 1998 by the Massachusetts Institute of Technology",
                "Copyright 1998, 2011 by the Massachusetts Institute of Technology",
                "Copyright 1998, 2011, 2013 by the Massachusetts Institute of Technology",
                "Copyright 1998-2004 Gilles Vollant - http://www.winimage.com/zLibDll",
                "Copyright 1999-2005 The RE2 Authors",
                "Copyright 2000 by the Massachusetts Institute of Technology",
                "Copyright 2000-2016 The OpenSSL Project Authors",
                "Copyright 2001-2010 The RE2 Authors",
                "Copyright 2002 Sun Microsystems, Inc.",
                "Copyright 2002-2009 The RE2 Authors",
                "Copyright 2003-2009 Google Inc.",
                "Copyright 2003-2009 The RE2 Authors",
                "Copyright 2003-2010 Google Inc.",
                "Copyright 2004 The RE2 Authors",
                "Copyright 2005 Dominick Meglio",
                "Copyright 2005 Google Inc.",
                "Copyright 2005 Nokia",
                "Copyright 2005 The RE2 Authors",
                "Copyright 2005 by Dominick Meglio",
                "Copyright 2005, Google Inc.",
                "Copyright 2006 The RE2 Authors",
                "Copyright 2006, Google Inc.",
                "Copyright 2006-2007 The RE2 Authors",
                "Copyright 2006-2008 The RE2 Authors",
                "Copyright 2006-2017 The OpenSSL Project Authors",
                "Copyright 2007 The RE2 Authors",
                "Copyright 2007, Google Inc.",
                "Copyright 2007-2016 The OpenSSL Project Authors",
                "Copyright 2008 Google Inc.",
                "Copyright 2008 The RE2 Authors",
                "Copyright 2008, Google Inc.",
                "Copyright 2009 Google Inc.",
                "Copyright 2009 The RE2 Authors",
                "Copyright 2009, Google Inc.",
                "Copyright 2010 Google Inc.",
                "Copyright 2010 The Chromium Authors",
                "Copyright 2010 The RE2 Authors",
                "Copyright 2010, Google Inc.",
                "Copyright 2011 The Chromium Authors",
                "Copyright 2012-2016 The OpenSSL Project Authors",
                "Copyright 2013, Google Inc.",
                "Copyright 2013-2016 The OpenSSL Project Authors",
                "Copyright 2014 The Chromium Authors",
                "Copyright 2014-2016 The OpenSSL Project Authors",
                "Copyright 2014-2020 The OpenSSL Project Authors",
                "Copyright 2015 Google Inc.",
                "Copyright 2015 The Chromium Authors",
                "Copyright 2015 gRPC",
                "Copyright 2015, Google Inc.",
                "Copyright 2015-2016 The OpenSSL Project Authors",
                "Copyright 2015-2016 gRPC",
                "Copyright 2016 Brian Smith",
                "Copyright 2016 Google Inc.",
                "Copyright 2016 The Chromium Authors",
                "Copyright 2016 The RE2 Authors",
                "Copyright 2016 gRPC",
                "Copyright 2016, Google Inc.",
                "Copyright 2017 Google Inc.",
                "Copyright 2017 The Abseil Authors",
                "Copyright 2017 The Chromium Authors",
                "Copyright 2017 The OpenSSL Project Authors",
                "Copyright 2017 gRPC",
                "Copyright 2018 Google LLC.",
                "Copyright 2018 The Abseil Authors",
                "Copyright 2018 The Chromium Authors",
                "Copyright 2018 The RE2 Authors",
                "Copyright 2018 The gRPC",
                "Copyright 2018 gRPC",
                "Copyright 2018, Google Inc.",
                "Copyright 2018, Google LLC.",
                "Copyright 2019 Google LLC.",
                "Copyright 2019 The Abseil Authors",
                "Copyright 2019 The Chromium Authors",
                "Copyright 2019 The gRPC",
                "Copyright 2019 gRPC",
                "Copyright 2019, Google Inc.",
                "Copyright 2019, Google LLC.",
                "Copyright 2020 Google Inc.",
                "Copyright 2020 The Abseil Authors",
                "Copyright 2020 The gRPC",
                "Copyright 2020 by <danny.sonnenschein@platynum.ch>",
                "Copyright 2020 gRPC",
                "Copyright 2021 Google Inc.",
                "Copyright 2021 The Abseil Authors",
                "Copyright 2021 The Chromium Authors",
                "Copyright 2021 The gRPC",
                "Copyright 2021 gRPC",
                "Copyright 2021 the gRPC",
                "Copyright 2022 Google LLC",
                "Copyright 2022 The Abseil Authors",
                "Copyright 2022 The Chromium Authors",
                "Copyright 2022 The gRPC",
                "Copyright 2022 gRPC",
                "Copyright 2023 Google LLC",
                "Copyright 2023 Google LLC.",
                "Copyright 2023 The Abseil Authors",
                "Copyright 2023 The Chromium Authors",
                "Copyright 2023 The gRPC",
                "Copyright 2023 gRPC",
                "Copyright 2024 The Abseil Authors",
                "Copyright 2024 The gRPC",
                "Copyright 2024 gRPC",
                "Copyright Amazon.com, Inc. or its affiliates",
                "holder is Tim Hudson (tjh@cryptsoft.com)"
            ],
            "file-count": 4911,
            "sha256": "f3023e14805c61bc439fb40ca545ac3d5740ce66120a678a3c6c2c55b70343d1",
            "source": "https://files.pythonhosted.org/packages/0c/2a/23943e19b4bbbdad60a9d881e44cd53bb48b31c7419ebb7b983edfbbb708/grpcio-1.63.0.tar.gz",
            "status": "restricted"
        }
    ]
}