{
    "id": "maven/mavencentral/com.neovisionaries/nv-websocket-client/2.14",
    "license": "Apache-2.0",
    "authority": "https://gitlab.eclipse.org/eclipsefdn/emo-team/iplab/-/issues/14819",
    "source": "https://repo1.maven.org/maven2/com/neovisionaries/nv-websocket-client/2.14/nv-websocket-client-2.14-sources.jar",
    "status": "approved",
    "scans": [
        {
            "date": "May 20, 2024 at 10:43:08 p.m. GMT",
            "authority": "https://gitlab.eclipse.org/eclipsefdn/emo-team/iplab/-/issues/14819",
            "scancode-version": "31.2.1",
            "licenses-discovered": [
                "Apache-2.0"
            ],
            "copyrights": [
                "Copyright (c) 2015 Neo Visionaries Inc.",
                "Copyright (c) 2015-2016 Neo Visionaries Inc.",
                "Copyright (c) 2015-2017 Neo Visionaries Inc.",
                "Copyright (c) 2015-2018 Neo Visionaries Inc.",
                "Copyright (c) 2016 Neo Visionaries Inc.",
                "Copyright (c) 2016-2017 Neo Visionaries Inc.",
                "Copyright (c) 2017 Neo Visionaries Inc.",
                "Copyright (c) 2018 Neo Visionaries Inc."
            ],
            "file-count": 59,
            "sha256": "f2e8a34792b427481f4f9b263b83cd18f3b886f382b05f4ec4936c157908c831",
            "source": "https://repo1.maven.org/maven2/com/neovisionaries/nv-websocket-client/2.14/nv-websocket-client-2.14-sources.jar",
            "status": "approved"
        }
    ]
}