{
    "license": "Apache-2.0",
    "file-count": 25,
    "authority": "https://gitlab.eclipse.org/eclipsefdn/emo-team/iplab/-/issues/1900",
    "scancode-version": "30.1.0",
    "licenses-discovered": [
        "Apache-2.0",
        "BSD-3-Clause",
        "CDDL-1.0",
        "Classpath-exception-2.0",
        "EPL-2.0",
        "GPL-2.0-only",
        "LicenseRef-scancode-free-unknown"
    ],
    "id": "maven/mavencentral/org.apache.cxf/cxf-rt-rs-sse/3.3.0",
    "source": "https://search.maven.org/remotecontent?filepath=org/apache/cxf/cxf-rt-rs-sse/3.3.0/cxf-rt-rs-sse-3.3.0-sources.jar",
    "status": "approved"
}
