{
    "id": "maven/mavencentral/software.amazon.awssdk/netty-nio-client/2.29.6",
    "license": "Apache-2.0",
    "authority": "https://gitlab.eclipse.org/eclipsefdn/emo-team/iplab/-/issues/17094",
    "source": "https://repo1.maven.org/maven2/software/amazon/awssdk/netty-nio-client/2.29.6/netty-nio-client-2.29.6-sources.jar",
    "status": "approved",
    "scans": [
        {
            "date": "November 6, 2024, 3:18:11 a.m. GMT",
            "authority": "https://gitlab.eclipse.org/eclipsefdn/emo-team/iplab/-/issues/17094",
            "scancode-version": "31.2.1",
            "licenses-discovered": [
                "Apache-2.0"
            ],
            "copyrights": [
                "Copyright Amazon.com, Inc. or its affiliates"
            ],
            "file-count": 98,
            "sha256": "62be03c3c98e648e3df6f4a4581ce3165e4fe30988f2922e24d699348169734a",
            "source": "https://repo1.maven.org/maven2/software/amazon/awssdk/netty-nio-client/2.29.6/netty-nio-client-2.29.6-sources.jar",
            "status": "approved"
        }
    ]
}