{
    "id": "project/iot.keypop/eclipse-keypop/keypop-calypso-card-java-api/367e70c6ba9c5d2312840422a9fe333de1df4890",
    "license": "MIT",
    "authority": "https://gitlab.eclipse.org/eclipsefdn/emo-team/iplab/-/issues/9990",
    "source": "https://github.com/eclipse-keypop/keypop-calypso-card-java-api/archive/367e70c6ba9c5d2312840422a9fe333de1df4890.zip",
    "status": "approved",
    "scans": [
        {
            "date": "August 9, 2023 at 5:06:26 p.m. GMT",
            "authority": "https://gitlab.eclipse.org/eclipsefdn/emo-team/iplab/-/issues/9990",
            "scancode-version": "31.2.1",
            "licenses-discovered": [
                "MIT",
                "BSD-3-Clause AND MIT",
                "BSD-3-Clause"
            ],
            "copyrights": [
                "Copyright (c) $YEAR Calypso Networks Association https://calypsonet.org",
                "Copyright (c) 2023 Calypso Networks Association",
                "Copyright (c) 2023 Calypso Networks Association https://calypsonet.org"
            ],
            "file-count": 51,
            "sha256": "eae688960e7e52f4947f10f45bd4ef1fdc19822bd75d70db4ee616cbb30ec472",
            "source": "https://github.com/eclipse-keypop/keypop-calypso-card-java-api/archive/367e70c6ba9c5d2312840422a9fe333de1df4890.zip",
            "status": "restricted"
        }
    ]
}
