{
    "id": "pypi/pypi/-/protobuf/3.20.3",
    "license": "LicenseRef-scancode-protobuf AND BSD-3-Clause",
    "authority": "https://gitlab.eclipse.org/eclipsefdn/emo-team/iplab/-/issues/7833",
    "source": "https://files.pythonhosted.org/packages/55/5b/e3d951e34f8356e5feecacd12a8e3b258a1da6d9a03ad1770f28925f29bc/protobuf-3.20.3.tar.gz",
    "status": "approved",
    "scans": [
        {
            "date": "April 5, 2023 at 1:22:56 p.m. GMT",
            "authority": "https://gitlab.eclipse.org/eclipsefdn/emo-team/iplab/-/issues/7833",
            "scancode-version": "31.2.1",
            "licenses-discovered": [
                "LicenseRef-scancode-protobuf",
                "BSD-3-Clause"
            ],
            "copyrights": [
                "Copyright 2007 Google Inc.",
                "Copyright 2008 Google Inc."
            ],
            "file-count": 88,
            "sha256": "2e3427429c9cffebf259491be0af70189607f365c2f41c7c3764af6f337105f2",
            "source": "https://files.pythonhosted.org/packages/55/5b/e3d951e34f8356e5feecacd12a8e3b258a1da6d9a03ad1770f28925f29bc/protobuf-3.20.3.tar.gz",
            "status": "restricted"
        }
    ]
}
