{
    "id": "maven/mavencentral/org.apache.logging.log4j/log4j-to-slf4j/2.24.0",
    "license": "Apache-2.0",
    "authority": "https://gitlab.eclipse.org/eclipsefdn/emo-team/iplab/-/issues/16094",
    "source": "https://repo1.maven.org/maven2/org/apache/logging/log4j/log4j-to-slf4j/2.24.0/log4j-to-slf4j-2.24.0-sources.jar",
    "status": "approved",
    "scans": [
        {
            "date": "September 10, 2024, 2:52:02 p.m. GMT",
            "authority": "https://gitlab.eclipse.org/eclipsefdn/emo-team/iplab/-/issues/16094",
            "scancode-version": "31.2.1",
            "licenses-discovered": [
                "Apache-2.0"
            ],
            "copyrights": [
            ],
            "file-count": 13,
            "sha256": "b0fa6316c9224e4c988153b2c019fb30be138995ebef21c92000254b3452e6b9",
            "source": "https://repo1.maven.org/maven2/org/apache/logging/log4j/log4j-to-slf4j/2.24.0/log4j-to-slf4j-2.24.0-sources.jar",
            "status": "approved"
        }
    ]
}