{
    "id": "npm/npmjs/-/flow-parser/0.231.0",
    "license": "MIT",
    "authority": "https://gitlab.eclipse.org/eclipsefdn/emo-team/iplab/-/issues/14007",
    "source": "https://github.com/facebook/flow/archive/refs/tags/v0.231.0.zip",
    "status": "approved",
    "scans": [
        {
            "date": "March 22, 2024 at 3:58:43 p.m. GMT",
            "authority": "https://gitlab.eclipse.org/eclipsefdn/emo-team/iplab/-/issues/14007",
            "scancode-version": "31.2.1",
            "licenses-discovered": [
                "MIT",
                "CC-BY-4.0 AND MIT",
                "Apache-2.0",
                "Apache-2.0 AND MIT",
                "Apache-2.0 AND LicenseRef-scancode-philippe-de-muyter AND MIT",
                "ISC AND MIT",
                "LGPL-2.0-or-later AND OCaml-LGPL-linking-exception",
                "LGPL-2.1-only AND OCaml-LGPL-linking-exception",
                "BSD-2-Clause",
                "BSD-2-Clause AND BSD-3-Clause",
                "ISC",
                "LicenseRef-scancode-proprietary-license",
                "CC-BY-4.0"
            ],
            "copyrights": [
                "(c) Meta Platforms, Inc. and affiliates. Confidential",
                "(c) r 2016",
                "Copyright (c) 1991, 1999 Free Software Foundation, Inc.",
                "Copyright (c) 2011-2016, Yann Collet",
                "Copyright (c) 2011-2017, Yann Collet",
                "Copyright (c) 2011-present, Yann Collet",
                "Copyright (c) 2012-2016, Yann Collet",
                "Copyright (c) 2018-present, Facebook, Inc.",
                "Copyright (c) Isaac Z. Schlueter and Contributors",
                "Copyright (c) Meta Platforms, Inc. and affiliates",
                "Copyright (c) Microsoft Corporation",
                "Copyright (c) jQuery Foundation, Inc. and Contributors",
                "Copyright 1996 Institut National de Recherche en Informatique et en Automatique",
                "Copyright 2004-present Facebook",
                "Copyright 2005, 2013 by Alain Frisch and LexiFi",
                "Copyright 2005, 2014 by Alain Frisch and LexiFi",
                "Copyright INRIA",
                "Portions Copyright (c) Meta Platforms, Inc. and affiliates",
                "Portions copyright (c) World Wide Web Consortium, (Massachusetts Institute of Technology, European Research Consortium for Informatics and Mathematics, Keio University, Beihang)",
                "copyright Node.js contributors",
                "copyrighted by the Free Software Foundation"
            ],
            "file-count": 14628,
            "sha256": "17a5e5797da26329f7cda8086f6690bd6ab3da3c613dd1cd93112bc196b2333a",
            "source": "https://github.com/facebook/flow/archive/refs/tags/v0.231.0.zip",
            "status": "restricted"
        }
    ]
}
