{
    "id": "maven/mavencentral/com.azure.resourcemanager/azure-resourcemanager-authorization/2.29.0",
    "license": "MIT",
    "authority": "https://gitlab.eclipse.org/eclipsefdn/emo-team/iplab/-/issues/10026",
    "source": "https://repo.maven.apache.org/maven2/com/azure/resourcemanager/azure-resourcemanager-authorization/2.29.0/azure-resourcemanager-authorization-2.29.0-sources.jar",
    "status": "approved",
    "scans": [
        {
            "date": "August 11, 2023 at 2:53:16 p.m. GMT",
            "authority": "https://gitlab.eclipse.org/eclipsefdn/emo-team/iplab/-/issues/10026",
            "scancode-version": "31.2.1",
            "licenses-discovered": [
                "MIT"
            ],
            "copyrights": [
                "(c) 2008 VeriSign, Inc.",
                "Copyright (c) Microsoft Corporation"
            ],
            "file-count": 652,
            "sha256": "1bd48d01d22622a2b2cdb5c54f3beeab8a5baa2cb358eb5932d8301cf0ce1d14",
            "source": "https://repo.maven.apache.org/maven2/com/azure/resourcemanager/azure-resourcemanager-authorization/2.29.0/azure-resourcemanager-authorization-2.29.0-sources.jar",
            "status": "approved"
        }
    ]
}