{
    "id": "maven/mavencentral/androidx.fragment/fragment/1.3.6",
    "license": "Apache-2.0",
    "authority": "https://gitlab.eclipse.org/eclipsefdn/emo-team/iplab/-/issues/10441",
    "source": "https://dl.google.com/android/maven2/androidx/fragment/fragment/1.3.6/fragment-1.3.6-sources.jar",
    "status": "approved",
    "scans": [
        {
            "date": "September 11, 2023 at 8:30:50 p.m. GMT",
            "authority": "https://gitlab.eclipse.org/eclipsefdn/emo-team/iplab/-/issues/10441",
            "scancode-version": "31.2.1",
            "licenses-discovered": [
                "Apache-2.0"
            ],
            "copyrights": [
                "Copyright 2018 The Android Open Source Project",
                "Copyright 2019 The Android Open Source Project",
                "Copyright 2020 The Android Open Source Project"
            ],
            "file-count": 40,
            "sha256": "8e1a9fca9fb5c84576faaf290950f966c1a15cd6e58475882d65a4bbdcdd2d85",
            "source": "https://dl.google.com/android/maven2/androidx/fragment/fragment/1.3.6/fragment-1.3.6-sources.jar",
            "status": "approved"
        }
    ]
}