{
    "id": "maven/mavencentral/com.azure.resourcemanager/azure-resourcemanager-dns/2.47.0",
    "license": "MIT",
    "authority": "https://gitlab.eclipse.org/eclipsefdn/emo-team/iplab/-/issues/19270",
    "source": "https://repo1.maven.org/maven2/com/azure/resourcemanager/azure-resourcemanager-dns/2.47.0/azure-resourcemanager-dns-2.47.0-sources.jar",
    "status": "approved",
    "scans": [
        {
            "date": "February 4, 2025 at 5:50:05 a.m. GMT",
            "authority": "https://gitlab.eclipse.org/eclipsefdn/emo-team/iplab/-/issues/19270",
            "scancode-version": "31.2.1",
            "licenses-discovered": [
                "MIT"
            ],
            "copyrights": [
                "Copyright (c) Microsoft Corporation"
            ],
            "file-count": 93,
            "sha256": "75d83338d11338a2c398a47f3f2c957f0fc73406b0c8b2a27309ebb9c4a63356",
            "source": "https://repo1.maven.org/maven2/com/azure/resourcemanager/azure-resourcemanager-dns/2.47.0/azure-resourcemanager-dns-2.47.0-sources.jar",
            "status": "approved"
        }
    ]
}