{
    "id": "maven/mavencentral/com.twelvemonkeys.common/common-io/3.1.1",
    "license": "BSD-3-Clause",
    "authority": "https://gitlab.eclipse.org/eclipsefdn/emo-team/iplab/-/issues/6827",
    "source": "https://search.maven.org/remotecontent?filepath=com/twelvemonkeys/common/common-io/3.1.1/common-io-3.1.1-sources.jar",
    "status": "approved",
    "scans": [
        {
            "date": "January 27, 2023 at 9:07:05 p.m. GMT",
            "authority": "https://gitlab.eclipse.org/eclipsefdn/emo-team/iplab/-/issues/6827",
            "scancode-version": "31.2.1",
            "licenses-discovered": [
                "BSD-3-Clause"
            ],
            "copyrights": [
                "Copyright (c) 2008, Harald Kuhr",
                "Copyright (c) 2013, Harald Kuhr"
            ],
            "file-count": 50,
            "sha256": "331ed4b7e128a525a820a3c5315729e0ea86c08297c5f30c39e3999eb343b631",
            "source": "https://search.maven.org/remotecontent?filepath=com/twelvemonkeys/common/common-io/3.1.1/common-io-3.1.1-sources.jar",
            "status": "approved"
        }
    ]
}