{
    "id": "maven/mavencentral/io.opentelemetry.instrumentation/opentelemetry-instrumentation-annotations/1.27.0",
    "license": "Apache-2.0",
    "authority": "https://gitlab.eclipse.org/eclipsefdn/emo-team/iplab/-/issues/9270",
    "source": "https://repo.maven.apache.org/maven2/io/opentelemetry/instrumentation/opentelemetry-instrumentation-annotations/1.27.0/opentelemetry-instrumentation-annotations-1.27.0-sources.jar",
    "status": "approved",
    "scans": [
        {
            "date": "July 6, 2023 at 5:11:48 a.m. GMT",
            "authority": "https://gitlab.eclipse.org/eclipsefdn/emo-team/iplab/-/issues/9270",
            "scancode-version": "31.2.1",
            "licenses-discovered": [
                "Apache-2.0"
            ],
            "copyrights": [
            ],
            "file-count": 5,
            "sha256": "e8cae74eedf1bef75444c233f43a490df2e0d55de195871d704da3c9e809fd2d",
            "source": "https://repo.maven.apache.org/maven2/io/opentelemetry/instrumentation/opentelemetry-instrumentation-annotations/1.27.0/opentelemetry-instrumentation-annotations-1.27.0-sources.jar",
            "status": "approved"
        }
    ]
}