{
    "id": "git/github/golang/tools/ab21143f2384",
    "license": "Apache-2.0 AND BSD-3-Clause AND MIT AND (GPL-1.0-or-later OR MIT)",
    "licenses-discovered": [
        "Apache-2.0 AND BSD-3-Clause",
        "BSD-3-Clause",
        "MIT",
        "GPL-1.0-or-later AND MIT"
    ],
    "copyrights": [
        "Copyright (c) Jorn Zaefferer",
        "Copyright (c) Lucent Technologies Inc.",
        "Copyright (c) Lucent Technologies Inc. and others",
        "Copyright (c) The Go Authors",
        "Copyright jQuery Foundation and other contributors",
        "Portions Copyright (c) Bruce Ellis",
        "Portions Copyright (c) C H Forsyth (forsyth@terzarima.net)",
        "Portions Copyright (c) The Go Authors",
        "Portions Copyright (c) Vita Nuova Holdings Limited (www.vitanuova.com)",
        "Portions Copyright (c) Vita Nuova Limited"
    ],
    "file-count": 1068,
    "scancode-version": "30.1.0",
    "authority": "https://gitlab.eclipse.org/eclipsefdn/emo-team/iplab/-/issues/3685",
    "source": "https://github.com/golang/tools/archive/ab21143f2384.zip",
    "status": "approved"
}
