{
    "id": "maven/mavencentral/org.infinispan/infinispan-core/14.0.3.Final",
    "license": "Apache-2.0",
    "authority": "https://gitlab.eclipse.org/eclipsefdn/emo-team/iplab/-/issues/5974",
    "source": "https://search.maven.org/remotecontent?filepath=org/infinispan/infinispan-core/14.0.3.Final/infinispan-core-14.0.3.Final-sources.jar",
    "status": "approved",
    "scans": [
        {
            "date": "December 22, 2022 at 5:07:56 p.m. GMT",
            "authority": "https://gitlab.eclipse.org/eclipsefdn/emo-team/iplab/-/issues/5974",
            "scancode-version": "31.2.1",
            "licenses-discovered": [
                "Apache-2.0"
            ],
            "copyrights": [
                "(c) 2011 Red Hat Inc.",
                "(c) 2014 Red Hat Inc.",
                "Copyright (c) 2016-present, RxJava"
            ],
            "file-count": 1957,
            "sha256": "ff93f3bd34df13fa4eef28fc337a2cae377bb6fd6102887daf695d0be5848bda",
            "source": "https://search.maven.org/remotecontent?filepath=org/infinispan/infinispan-core/14.0.3.Final/infinispan-core-14.0.3.Final-sources.jar",
            "status": "approved"
        }
    ]
}