{
    "id": "maven/mavencentral/org.tallison/isoparser/1.9.41.2",
    "license": "EPL-1.0",
    "licenses-discovered": [
        "EPL-1.0"
    ],
    "file-count": 117,
    "scancode-version": "30.1.0",
    "authority": "https://gitlab.eclipse.org/eclipsefdn/emo-team/iplab/-/issues/2354",
    "source": "https://search.maven.org/remotecontent?filepath=org/tallison/isoparser/1.9.41.2/isoparser-1.9.41.2-sources.jar",
    "status": "approved"
}