{
    "id": "maven/mavencentral/io.grpc/grpc-auth/1.59.1",
    "license": "Apache-2.0",
    "authority": "https://gitlab.eclipse.org/eclipsefdn/emo-team/iplab/-/issues/12037",
    "source": "https://repo1.maven.org/maven2/io/grpc/grpc-auth/1.59.1/grpc-auth-1.59.1-sources.jar",
    "status": "approved",
    "scans": [
        {
            "date": "December 14, 2023 at 10:59:36 a.m. GMT",
            "authority": "https://gitlab.eclipse.org/eclipsefdn/emo-team/iplab/-/issues/12037",
            "scancode-version": "31.2.1",
            "licenses-discovered": [
                "Apache-2.0"
            ],
            "copyrights": [
                "Copyright 2014 The gRPC",
                "Copyright 2016 The gRPC",
                "Copyright 2017 The gRPC"
            ],
            "file-count": 5,
            "sha256": "2a49ce114fd26480151cfa857e6d157a15b0751a150f00485373f5cbe5709632",
            "source": "https://repo1.maven.org/maven2/io/grpc/grpc-auth/1.59.1/grpc-auth-1.59.1-sources.jar",
            "status": "approved"
        }
    ]
}