{
    "id": "maven/mavencentral/org.springframework.data/spring-data-jpa/3.4.0",
    "license": "Apache-2.0",
    "authority": "https://gitlab.eclipse.org/eclipsefdn/emo-team/iplab/-/issues/17568",
    "source": "https://repo1.maven.org/maven2/org/springframework/data/spring-data-jpa/3.4.0/spring-data-jpa-3.4.0-sources.jar",
    "status": "approved",
    "scans": [
        {
            "date": "November 29, 2024 at 6:02:25 a.m. GMT",
            "authority": "https://gitlab.eclipse.org/eclipsefdn/emo-team/iplab/-/issues/17568",
            "scancode-version": "31.2.1",
            "licenses-discovered": [
                "Apache-2.0"
            ],
            "copyrights": [
                "Copyright (c) 2011-2019 Pivotal Software, Inc.",
                "Copyright 2008-2024 the original author or authors",
                "Copyright 2011-2024 the original author or authors",
                "Copyright 2012-2024 the original author or authors",
                "Copyright 2013-2024 the original author or authors",
                "Copyright 2014-2024 the original author or authors",
                "Copyright 2015-2024 the original author or authors",
                "Copyright 2016-2024 the original author or authors",
                "Copyright 2017-2024 the original author or authors",
                "Copyright 2018-2024 the original author or authors",
                "Copyright 2019-2024 the original author or authors",
                "Copyright 2020-2024 the original author or authors",
                "Copyright 2021-2024 the original author or authors",
                "Copyright 2022-2024 the original author or authors",
                "Copyright 2023-2024 the original author or authors",
                "Copyright 2024 the original author or authors"
            ],
            "file-count": 222,
            "sha256": "3cdd095379fc831ebf57e6a6e6ec741d6928fb16e2784a317114afea73c0b8f3",
            "source": "https://repo1.maven.org/maven2/org/springframework/data/spring-data-jpa/3.4.0/spring-data-jpa-3.4.0-sources.jar",
            "status": "approved"
        }
    ]
}