{
    "id": "go/golang/contrib.go.opencensus.io%2Fexporter/stackdriver/v0.13.4",
    "license": "Apache-2.0",
    "authority": "https://gitlab.eclipse.org/eclipsefdn/emo-team/iplab/-/issues/12569",
    "source": "https://proxy.golang.org/contrib.go.opencensus.io%2Fexporter/stackdriver/@v/v0.13.4.zip",
    "status": "approved",
    "scans": [
        {
            "date": "December 26, 2023 at 9:54:07 a.m. GMT",
            "authority": "https://gitlab.eclipse.org/eclipsefdn/emo-team/iplab/-/issues/12569",
            "scancode-version": "31.2.1",
            "licenses-discovered": [
                "Apache-2.0"
            ],
            "copyrights": [
                "Copyright 2017, OpenCensus",
                "Copyright 2018, OpenCensus",
                "Copyright 2019, OpenCensus",
                "Copyright 2020, OpenCensus"
            ],
            "file-count": 72,
            "sha256": "6785a1ee024d748f7f859df294ec1e91354db08b7a5726a9291047eb4717a40f",
            "source": "https://proxy.golang.org/contrib.go.opencensus.io%2Fexporter/stackdriver/@v/v0.13.4.zip",
            "status": "approved"
        }
    ]
}