{
    "id": "crate/cratesio/-/rustls/0.22.4",
    "license": "Apache-2.0 AND ISC AND MIT",
    "authority": "https://gitlab.eclipse.org/eclipsefdn/emo-team/iplab/-/issues/14600",
    "source": "https://crates.io/api/v1/crates/rustls/0.22.4/download",
    "status": "approved",
    "scans": [
        {
            "date": "May 1, 2024 at 4:45:02 p.m. GMT",
            "authority": "https://gitlab.eclipse.org/eclipsefdn/emo-team/iplab/-/issues/14600",
            "scancode-version": "31.2.1",
            "licenses-discovered": [
                "Apache-2.0",
                "ISC",
                "MIT",
                "Apache-2.0 AND ISC AND MIT"
            ],
            "copyrights": [
                "(c) 2009 Entrust, Inc. - for",
                "(c) 2014 Entrust, Inc. - for",
                "Copyright (c) 2016 Joseph Birr-Pixton <jpixton@gmail.com>",
                "Copyright (c) 2016, Joseph Birr-Pixton <jpixton@gmail.com>"
            ],
            "file-count": 159,
            "sha256": "bf4ef73721ac7bcd79b2b315da7779d8fc09718c6b3d2d1b2d94850eb8c18432",
            "source": "https://crates.io/api/v1/crates/rustls/0.22.4/download",
            "status": "approved"
        }
    ]
}