{
    "id": "maven/mavencentral/org.geotools/gt-http/25.4",
    "license": "LGPL-2.1-only",
    "authority": "https://gitlab.eclipse.org/eclipsefdn/emo-team/iplab/-/issues/4455",
    "source": "https://repo.osgeo.org/repository/geotools-releases/org/geotools/gt-http/25.4/gt-http-25.4-sources.jar",
    "status": "approved",
    "scans": [
        {
            "date": "November 14, 2022 at 8:34:32 p.m. GMT",
            "authority": "https://gitlab.eclipse.org/eclipsefdn/emo-team/iplab/-/issues/4455",
            "scancode-version": "31.2.1",
            "licenses-discovered": [
                "LGPL-2.0-or-later",
                "LGPL-2.1-only"
            ],
            "copyrights": [
                "(c) 2004-2008, Open Source Geospatial Foundation",
                "(c) 2004-2011, Open Source Geospatial Foundation",
                "(c) 2019, Open Source Geospatial Foundation",
                "(c) 2020, Open Source Geospatial Foundation",
                "(c) 2021, Open Source Geospatial Foundation"
            ],
            "file-count": 19,
            "sha256": "6adf9948f75595e779d61bc03fa1e2a08dfaf570b56fd7bc2338130ba9feeddd",
            "source": "https://repo.osgeo.org/repository/geotools-releases/org/geotools/gt-http/25.4/gt-http-25.4-sources.jar",
            "status": "restricted"
        }
    ]
}
