{
    "id": "crate/cratesio/-/ring/0.17.5",
    "license": "ISC AND OpenSSL AND MIT AND (OpenSSL OR LicenseRef-Cryptogams) AND LicenseRef-Public-domain AND LicenseRef-SSLeay",
    "authority": "https://gitlab.eclipse.org/eclipsefdn/emo-team/iplab/-/issues/11393",
    "source": "https://crates.io/api/v1/crates/ring/0.17.5/download",
    "status": "approved",
    "scans": [
        {
            "date": "November 1, 2023 at 12:28:10 a.m. GMT",
            "authority": "https://gitlab.eclipse.org/eclipsefdn/emo-team/iplab/-/issues/11393",
            "scancode-version": "31.2.1",
            "licenses-discovered": [
                "ISC",
                "ISC AND LicenseRef-scancode-openssl AND LicenseRef-scancode-ssleay-windows AND MIT AND OpenSSL",
                "LicenseRef-scancode-ssleay-windows",
                "LicenseRef-scancode-openssl AND LicenseRef-scancode-ssleay-windows",
                "BSD-3-Clause AND OpenSSL",
                "BSD-3-Clause AND GPL-1.0-or-later AND OpenSSL",
                "OpenSSL",
                "BSD-3-Clause AND GPL-2.0-only AND OpenSSL",
                "LicenseRef-scancode-openssl",
                "MIT"
            ],
            "copyrights": [
                "Copyright (c) 1995-1997 Eric Young (eay@cryptsoft.com)",
                "Copyright (c) 1995-1998 Eric Young (eay@cryptsoft.com)",
                "Copyright (c) 1998-2001 The OpenSSL Project",
                "Copyright (c) 1998-2006 The OpenSSL Project",
                "Copyright (c) 1998-2011 The OpenSSL Project",
                "Copyright (c) 2002-2006 The OpenSSL Project",
                "Copyright (c) 2014 The OpenSSL Project",
                "Copyright (c) 2014, Google Inc.",
                "Copyright (c) 2014, Intel Corporation",
                "Copyright (c) 2015 CloudFlare, Inc.",
                "Copyright (c) 2015, CloudFlare Ltd.",
                "Copyright (c) 2015, Google Inc.",
                "Copyright (c) 2015, Intel Inc.",
                "Copyright (c) 2015-2016 the fiat-crypto",
                "Copyright (c) 2015-2020 the fiat-crypto",
                "Copyright (c) 2016, Google Inc.",
                "Copyright (c) 2019, Google Inc.",
                "Copyright (c) 2020, CloudFlare Ltd.",
                "Copyright (c) 2020, Google Inc.",
                "Copyright (c) 2023, Google Inc.",
                "Copyright 1995-2018 The OpenSSL Project Authors",
                "Copyright 1999-2018 The OpenSSL Project Authors",
                "Copyright 2002 Sun Microsystems, Inc.",
                "Copyright 2005-2016 The OpenSSL Project Authors",
                "Copyright 2007-2016 The OpenSSL Project Authors",
                "Copyright 2009-2016 The OpenSSL Project Authors",
                "Copyright 2010-2016 The OpenSSL Project Authors",
                "Copyright 2010-2018 The OpenSSL Project Authors",
                "Copyright 2011-2016 The OpenSSL Project Authors",
                "Copyright 2012-2016 The OpenSSL Project Authors",
                "Copyright 2013-2016 The OpenSSL Project Authors",
                "Copyright 2014-2016 The OpenSSL Project Authors",
                "Copyright 2014-2020 The OpenSSL Project Authors",
                "Copyright 2015 Brian Smith",
                "Copyright 2015-2016 Brian Smith",
                "Copyright 2015-2016 The OpenSSL Project Authors",
                "Copyright 2015-2017 Brian Smith",
                "Copyright 2015-2019 Brian Smith",
                "Copyright 2015-2020 The OpenSSL Project Authors",
                "Copyright 2015-2021 Brian Smith",
                "Copyright 2015-2022 Brian Smith",
                "Copyright 2015-2023 Brian Smith",
                "Copyright 2016 Brian Smith",
                "Copyright 2016 David Judd",
                "Copyright 2016 Simon Sapin",
                "Copyright 2016 The OpenSSL Project Authors",
                "Copyright 2016-2017 Brian Smith",
                "Copyright 2016-2019 Brian Smith",
                "Copyright 2016-2021 Brian Smith",
                "Copyright 2017 Brian Smith",
                "Copyright 2017-2023 Brian Smith",
                "Copyright 2018 Brian Smith",
                "Copyright 2018 Trent Clarke",
                "Copyright 2019 Brian Smith",
                "Copyright 2020 Brian Smith",
                "Copyright 2021 Brian Smith",
                "Copyright 2023 Brian Smith",
                "Portions Copyright (c) 2014, 2015, Google Inc.",
                "Portions Copyright (c) 2014, Google Inc.",
                "Portions Copyright (c) 2016, Google Inc.",
                "Portions Copyright 2020 Brian Smith",
                "holder is Tim Hudson (tjh@cryptsoft.com)"
            ],
            "file-count": 337,
            "sha256": "fb0205304757e5d899b9c2e448b867ffd03ae7f988002e47cd24954391394d0b",
            "source": "https://crates.io/api/v1/crates/ring/0.17.5/download",
            "status": "restricted"
        }
    ]
}
