{
    "id": "pypi/pypi/-/pep517/0.13.0",
    "license": "MIT AND Apache-2.0",
    "authority": "https://gitlab.eclipse.org/eclipsefdn/emo-team/iplab/-/issues/7840",
    "source": "https://files.pythonhosted.org/packages/4d/19/e11fcc88288f68ae48e3aa9cf5a6fd092a88e629cb723465666c44d487a0/pep517-0.13.0.tar.gz",
    "status": "approved",
    "scans": [
        {
            "date": "April 5, 2023 at 1:11:26 p.m. GMT",
            "authority": "https://gitlab.eclipse.org/eclipsefdn/emo-team/iplab/-/issues/7840",
            "scancode-version": "31.2.1",
            "licenses-discovered": [
                "MIT",
                "Apache-2.0"
            ],
            "copyrights": [
                "Copyright (c) 2008-2016 The pip",
                "Copyright (c) 2017 Thomas Kluyver",
                "Copyright 2012 Facebook",
                "copyright 2020, Thomas Kluyver"
            ],
            "file-count": 63,
            "sha256": "ae69927c5c172be1add9203726d4b84cf3ebad1edcd5f71fcdc746e66e829f59",
            "source": "https://files.pythonhosted.org/packages/4d/19/e11fcc88288f68ae48e3aa9cf5a6fd092a88e629cb723465666c44d487a0/pep517-0.13.0.tar.gz",
            "status": "approved"
        }
    ]
}