{
    "id": "maven/mavencentral/org.apache.activemq/artemis-stomp-protocol/2.27.1",
    "license": "Apache-2.0",
    "authority": "https://gitlab.eclipse.org/eclipsefdn/emo-team/iplab/-/issues/6733",
    "source": "https://search.maven.org/remotecontent?filepath=org/apache/activemq/artemis-stomp-protocol/2.27.1/artemis-stomp-protocol-2.27.1-sources.jar",
    "status": "approved",
    "scans": [
        {
            "date": "January 27, 2023 at 12:19:45 p.m. GMT",
            "authority": "https://gitlab.eclipse.org/eclipsefdn/emo-team/iplab/-/issues/6733",
            "scancode-version": "31.2.1",
            "licenses-discovered": [
                "Apache-2.0"
            ],
            "copyrights": [
            ],
            "file-count": 31,
            "sha256": "25bb2bb22d602198d21fd47af0bd4f33575bd14cc7de8a3aabd5b1481663b574",
            "source": "https://search.maven.org/remotecontent?filepath=org/apache/activemq/artemis-stomp-protocol/2.27.1/artemis-stomp-protocol-2.27.1-sources.jar",
            "status": "approved"
        }
    ]
}