{
    "id": "npm/npmjs/@types/react-slick/0.23.12",
    "license": "MIT",
    "authority": "https://gitlab.eclipse.org/eclipsefdn/emo-team/iplab/-/issues/11666",
    "source": "https://registry.yarnpkg.com/@types/react-slick/-/react-slick-0.23.12.tgz",
    "status": "approved",
    "scans": [
        {
            "date": "November 22, 2023 at 11:37:22 a.m. GMT",
            "authority": "https://gitlab.eclipse.org/eclipsefdn/emo-team/iplab/-/issues/11666",
            "scancode-version": "31.2.1",
            "licenses-discovered": [
                "MIT"
            ],
            "copyrights": [
                "Copyright (c) Microsoft Corporation"
            ],
            "file-count": 4,
            "sha256": "f5c2f55b96bac6253495d8a98027b193f4bb0f57c5908a704abcb470ba4ecbef",
            "source": "https://registry.yarnpkg.com/@types/react-slick/-/react-slick-0.23.12.tgz",
            "status": "approved"
        }
    ]
}