{
    "id": "maven/mavencentral/com.fasterxml.jackson.module/jackson-module-parameter-names/2.15.0",
    "license": "Apache-2.0",
    "authority": "https://gitlab.eclipse.org/eclipsefdn/emo-team/iplab/-/issues/8803",
    "source": "https://repo.maven.apache.org/maven2/com/fasterxml/jackson/module/jackson-module-parameter-names/2.15.0/jackson-module-parameter-names-2.15.0-sources.jar",
    "status": "approved",
    "scans": [
        {
            "date": "June 12, 2023 at 5:01:18 p.m. GMT",
            "authority": "https://gitlab.eclipse.org/eclipsefdn/emo-team/iplab/-/issues/8803",
            "scancode-version": "31.2.1",
            "licenses-discovered": [
                "Apache-2.0"
            ],
            "copyrights": [
            ],
            "file-count": 10,
            "sha256": "e91445d658133e85b1c4b8bd43956b122e845562c1a1598909238d33587014db",
            "source": "https://repo.maven.apache.org/maven2/com/fasterxml/jackson/module/jackson-module-parameter-names/2.15.0/jackson-module-parameter-names-2.15.0-sources.jar",
            "status": "approved"
        }
    ]
}