{
    "id": "maven/mavencentral/software.amazon.awssdk/retries/2.29.1",
    "license": "Apache-2.0",
    "authority": "https://gitlab.eclipse.org/eclipsefdn/emo-team/iplab/-/issues/17009",
    "source": "https://repo1.maven.org/maven2/software/amazon/awssdk/retries/2.29.1/retries-2.29.1-sources.jar",
    "status": "approved",
    "scans": [
        {
            "date": "November 1, 2024, 3:46:50 a.m. GMT",
            "authority": "https://gitlab.eclipse.org/eclipsefdn/emo-team/iplab/-/issues/17009",
            "scancode-version": "31.2.1",
            "licenses-discovered": [
                "Apache-2.0"
            ],
            "copyrights": [
                "Copyright Amazon.com, Inc. or its affiliates"
            ],
            "file-count": 23,
            "sha256": "b1833ecbb42b4f6fb25040ca4ede59f2bff0d4a609903bd8d6c28fdb00418b57",
            "source": "https://repo1.maven.org/maven2/software/amazon/awssdk/retries/2.29.1/retries-2.29.1-sources.jar",
            "status": "approved"
        }
    ]
}