{
    "license": "GPL-2.0-only with Classpath-exception-2.0",
    "file-count": 14,
    "authority": "https://gitlab.eclipse.org/eclipsefdn/emo-team/iplab/-/issues/962",
    "scancode-version": "21.3.31",
    "licenses-discovered": [
        "GPL-2.0-only",
        "LicenseRef-scancode-oracle-openjdk-classpath-exception-2.0",
        "Apache-2.0",
        "BSD-3-Clause",
        "MIT",
        "Classpath-exception-2.0"
    ],
    "id": "maven/mavencentral/org.openjdk.jmh/jmh-generator-annprocess/1.32",
    "source": "https://search.maven.org/remotecontent?filepath=org/openjdk/jmh/jmh-generator-annprocess/1.32/jmh-generator-annprocess-1.32-sources.jar",
    "status": "restricted",
    "workswith": [
        "technology.jgit"
    ]

}
