{
    "id": "maven/mavencentral/org.junit.platform/junit-platform-testkit/1.8.2",
    "license": "EPL-2.0",
    "licenses-discovered": [
        "EPL-2.0"
    ],
    "copyrights": [
        "Copyright the original author or authors"
    ],
    "file-count": 19,
    "scancode-version": "30.1.0",
    "authority": "https://gitlab.eclipse.org/eclipsefdn/emo-team/iplab/-/issues/3291",
    "source": "https://search.maven.org/remotecontent?filepath=org/junit/platform/junit-platform-testkit/1.8.2/junit-platform-testkit-1.8.2-sources.jar",
    "status": "approved"
}