{
    "id": "nuget/nuget/-/Testcontainers.PostgreSql/4.1.0",
    "license": "MIT",
    "authority": "https://gitlab.eclipse.org/eclipsefdn/emo-team/iplab/-/issues/17771",
    "source": "https://github.com/testcontainers/testcontainers-dotnet/archive/refs/tags/4.1.0.zip",
    "status": "approved",
    "scans": [
        {
            "date": "December 10, 2024 at 8:22:14 a.m. GMT",
            "authority": "https://gitlab.eclipse.org/eclipsefdn/emo-team/iplab/-/issues/17771",
            "scancode-version": "31.2.1",
            "licenses-discovered": [
                "MIT"
            ],
            "copyrights": [
                "Copyright (c) 2016-2023 Martin Donath <martin.donath@squidfunk.com>",
                "Copyright (c) 2019 - 2024 Andre Hofmeister"
            ],
            "file-count": 878,
            "sha256": "403a7a5afd3f5d57215dc277ce51a76170b8efae6363ecdadff3962ac8cc5bc1",
            "source": "https://github.com/testcontainers/testcontainers-dotnet/archive/refs/tags/4.1.0.zip",
            "status": "approved"
        }
    ]
}