{
    "id": "maven/mavencentral/io.vertx/vertx-web-graphql/4.3.4",
    "license": "Apache-2.0",
    "licenses-discovered": [
        "Apache-2.0"
    ],
    "copyrights": [
        "Copyright 2019 Red Hat, Inc.",
        "Copyright 2020 Red Hat, Inc.",
        "Copyright 2021 Red Hat, Inc."
    ],
    "file-count": 56,
    "scancode-version": "31.2.1",
    "authority": "https://gitlab.eclipse.org/eclipsefdn/emo-team/iplab/-/issues/4374",
    "source": "https://search.maven.org/remotecontent?filepath=io/vertx/vertx-web-graphql/4.3.4/vertx-web-graphql-4.3.4-sources.jar",
    "status": "approved"
}