{
    "id": "maven/mavencentral/org.sonatype.sisu/sisu-inject-bean/2.3.0",
    "license": "Apache-2.0 AND (Apache-2.0 AND EPL-1.0) AND BSD-3-Clause",
    "licenses-discovered": [
        "Apache-2.0",
        "Apache-2.0 AND EPL-1.0",
        "BSD-3-Clause"
    ],
    "file-count": 172,
    "scancode-version": "30.1.0",
    "authority": "https://gitlab.eclipse.org/eclipsefdn/emo-team/iplab/-/issues/2421",
    "source": "https://search.maven.org/remotecontent?filepath=org/sonatype/sisu/sisu-inject-bean/2.3.0/sisu-inject-bean-2.3.0-sources.jar",
    "status": "approved"
}