{
    "id": "p2/orbit/p2.eclipse-plugin/org.sonatype.sisu.sisu-inject-plexus/1.4.2",
    "license": "Apache-2.0 AND MIT",
    "licenses-discovered": [
        "Apache-2.0",
        "MIT"
    ],
    "file-count": 130,
    "scancode-version": "30.1.0",
    "authority": "https://gitlab.eclipse.org/eclipsefdn/emo-team/iplab/-/issues/2191",
    "source": "https://search.maven.org/remotecontent?filepath=org/sonatype/sisu/sisu-inject-plexus/1.4.2/sisu-inject-plexus-1.4.2-sources.jar",
    "status": "approved"
}