{
    "id": "npm/npmjs/-/resolve/2.0.0-next.4",
    "license": "MIT AND ISC",
    "licenses-discovered": [
        "MIT",
        "ISC"
    ],
    "copyrights": [
        "Copyright (c) James Halliday"
    ],
    "file-count": 129,
    "scancode-version": "30.1.0",
    "authority": "https://gitlab.eclipse.org/eclipsefdn/emo-team/iplab/-/issues/3078",
    "source": "https://github.com/browserify/resolve/archive/v2.0.0-next.4.zip",
    "status": "approved"
}