{
    "id": "npm/npmjs/@vue/compiler-core/3.4.3",
    "license": "MIT",
    "authority": "https://gitlab.eclipse.org/eclipsefdn/emo-team/iplab/-/issues/12582",
    "source": "https://github.com/vuejs/core/archive/refs/tags/v3.4.3.zip",
    "status": "approved",
    "scans": [
        {
            "date": "January 1, 2024 at 3:45:15 a.m. GMT",
            "authority": "https://gitlab.eclipse.org/eclipsefdn/emo-team/iplab/-/issues/12582",
            "scancode-version": "31.2.1",
            "licenses-discovered": [
                "MIT"
            ],
            "copyrights": [
                "Copyright (c) 2013-present, Yuxi",
                "Copyright (c) 2018-present, Yuxi",
                "Copyright 2010, 2011, Chris Winberry <chris@winberry.net>"
            ],
            "file-count": 655,
            "sha256": "37f2f03ddd1c42236f9fcf68479ecdd0bb7f391c455621e2f86eed53c26aabfb",
            "source": "https://github.com/vuejs/core/archive/refs/tags/v3.4.3.zip",
            "status": "approved"
        }
    ]
}