{
    "id": "npm/npmjs/@nrwl/cli/15.2.1",
    "license": "MIT",
    "authority": "https://gitlab.eclipse.org/eclipsefdn/emo-team/iplab/-/issues/5052",
    "source": "https://registry.npmjs.org/@nrwl/cli/-/cli-15.2.1.tgz",
    "status": "approved",
    "scans": [
        {
            "date": "November 23, 2022 at 1:26:21 p.m. GMT",
            "authority": "https://gitlab.eclipse.org/eclipsefdn/emo-team/iplab/-/issues/5052",
            "scancode-version": "31.2.1",
            "licenses-discovered": [
                "MIT"
            ],
            "copyrights": [
                "Copyright (c) 2017-2022 Narwhal Technologies Inc."
            ],
            "file-count": 9,
            "sha256": "42f846e06cadd71a85751c1220fba869b88626089d10e883cb4da4eb3ce3d4fb",
            "source": "https://registry.npmjs.org/@nrwl/cli/-/cli-15.2.1.tgz",
            "status": "approved"
        }
    ]
}