{
    "id": "maven/mavencentral/androidx.lifecycle/lifecycle-viewmodel-savedstate/2.5.1",
    "license": "Apache-2.0",
    "authority": "https://gitlab.eclipse.org/eclipsefdn/emo-team/iplab/-/issues/19596",
    "source": "https://dl.google.com/android/maven2/androidx/lifecycle/lifecycle-viewmodel-savedstate/2.5.1/lifecycle-viewmodel-savedstate-2.5.1-sources.jar",
    "status": "approved",
    "scans": [
        {
            "date": "February 27, 2025 at 11:45:46 a.m. GMT",
            "authority": "https://gitlab.eclipse.org/eclipsefdn/emo-team/iplab/-/issues/19596",
            "scancode-version": "31.2.1",
            "licenses-discovered": [
                "Apache-2.0"
            ],
            "copyrights": [
                "Copyright 2018 The Android Open Source Project",
                "Copyright 2019 The Android Open Source Project",
                "Copyright 2021 The Android Open Source Project"
            ],
            "file-count": 7,
            "sha256": "5cf43d3c8f67295f0f8330d9442ab0d871bef16d12f47817ecb517c373bbd980",
            "source": "https://dl.google.com/android/maven2/androidx/lifecycle/lifecycle-viewmodel-savedstate/2.5.1/lifecycle-viewmodel-savedstate-2.5.1-sources.jar",
            "status": "approved"
        }
    ]
}