{
    "id": "maven/mavencentral/org.apache.xmlgraphics/batik-constants/1.18",
    "license": "Apache-2.0",
    "authority": "https://gitlab.eclipse.org/eclipsefdn/emo-team/iplab/-/issues/16575",
    "source": "https://repo1.maven.org/maven2/org/apache/xmlgraphics/batik-constants/1.18/batik-constants-1.18-sources.jar",
    "status": "approved",
    "scans": [
        {
            "date": "October 9, 2024, 2:45:22 p.m. GMT",
            "authority": "https://gitlab.eclipse.org/eclipsefdn/emo-team/iplab/-/issues/16575",
            "scancode-version": "31.2.1",
            "licenses-discovered": [
                "Apache-2.0"
            ],
            "copyrights": [
            ],
            "file-count": 4,
            "sha256": "d91b8dc42b55a270846176b01bf3915a22ae34c5291903a50697ec11b226f017",
            "source": "https://repo1.maven.org/maven2/org/apache/xmlgraphics/batik-constants/1.18/batik-constants-1.18-sources.jar",
            "status": "approved"
        }
    ]
}