{
    "id": "npm/npmjs/-/node-domexception/1.0.0",
    "license": "MIT AND ISC",
    "authority": "https://gitlab.eclipse.org/eclipsefdn/emo-team/iplab/-/issues/11984",
    "source": "https://registry.yarnpkg.com/node-domexception/-/node-domexception-1.0.0.tgz",
    "status": "approved",
    "scans": [
        {
            "date": "December 13, 2023 at 4:17:47 p.m. GMT",
            "authority": "https://gitlab.eclipse.org/eclipsefdn/emo-team/iplab/-/issues/11984",
            "scancode-version": "31.2.1",
            "licenses-discovered": [
                "MIT",
                "ISC"
            ],
            "copyrights": [
                "Copyright (c) 2021 Jimmy Warting"
            ],
            "file-count": 42,
            "sha256": "eba234134890897807b85c2bc67cd32d0242eb9be1d1c62513797fdaab60c971",
            "source": "https://registry.yarnpkg.com/node-domexception/-/node-domexception-1.0.0.tgz",
            "status": "approved"
        }
    ]
}