{
    "id": "maven/mavencentral/org.springframework.boot/spring-boot-starter-webflux/3.1.2",
    "license": "Apache-2.0",
    "authority": "https://gitlab.eclipse.org/eclipsefdn/emo-team/iplab/-/issues/9739",
    "source": "https://repo.maven.apache.org/maven2/org/springframework/boot/spring-boot-starter-webflux/3.1.2/spring-boot-starter-webflux-3.1.2-sources.jar",
    "status": "approved",
    "scans": [
        {
            "date": "July 24, 2023 at 3:14:02 p.m. GMT",
            "authority": "https://gitlab.eclipse.org/eclipsefdn/emo-team/iplab/-/issues/9739",
            "scancode-version": "31.2.1",
            "licenses-discovered": [
                "Apache-2.0"
            ],
            "copyrights": [
            ],
            "file-count": 2,
            "sha256": "17d0cccdae0f32ab479ee0a22e5f117977fd43d4f2d8bd8ad45a791a8541e7a2",
            "source": "https://repo.maven.apache.org/maven2/org/springframework/boot/spring-boot-starter-webflux/3.1.2/spring-boot-starter-webflux-3.1.2-sources.jar",
            "status": "approved"
        }
    ]
}