{
    "id": "maven/mavencentral/com.yahoo.elide/elide-spring-boot-autoconfigure/7.1.2",
    "license": "Apache-2.0",
    "authority": "https://gitlab.eclipse.org/eclipsefdn/emo-team/iplab/-/issues/17482",
    "source": "https://repo1.maven.org/maven2/com/yahoo/elide/elide-spring-boot-autoconfigure/7.1.2/elide-spring-boot-autoconfigure-7.1.2-sources.jar",
    "status": "approved",
    "scans": [
        {
            "date": "November 26, 2024 at 10:36:55 p.m. GMT",
            "authority": "https://gitlab.eclipse.org/eclipsefdn/emo-team/iplab/-/issues/17482",
            "scancode-version": "31.2.1",
            "licenses-discovered": [
                "Apache-2.0"
            ],
            "copyrights": [
                "Copyright 2019, Yahoo Inc.",
                "Copyright 2019, the original author or authors",
                "Copyright 2020, Yahoo Inc.",
                "Copyright 2021, Yahoo Inc.",
                "Copyright 2022, Yahoo Inc.",
                "Copyright 2023, the original author or authors",
                "Copyright 2024, the original author or authors"
            ],
            "file-count": 47,
            "sha256": "b4d4a1e8863a399596dd2bdab42f416418e35cce7b766ea7cb70b56024c3624d",
            "source": "https://repo1.maven.org/maven2/com/yahoo/elide/elide-spring-boot-autoconfigure/7.1.2/elide-spring-boot-autoconfigure-7.1.2-sources.jar",
            "status": "approved"
        }
    ]
}