{
    "id": "maven/mavencentral/org.activiti/activiti-bpmn-model/8.0.0",
    "license": "Apache-2.0",
    "authority": "https://gitlab.eclipse.org/eclipsefdn/emo-team/iplab/-/issues/12479",
    "source": "https://maven.alfresco.com/nexus/service/local/repositories/activiti-releases/content//org/activiti/activiti-bpmn-model/8.0.0/activiti-bpmn-model-8.0.0-sources.jar",
    "status": "approved",
    "scans": [
        {
            "date": "January 2, 2024 at 8:28:03 p.m. GMT",
            "authority": "https://gitlab.eclipse.org/eclipsefdn/emo-team/iplab/-/issues/12479",
            "scancode-version": "31.2.1",
            "licenses-discovered": [
                "Apache-2.0"
            ],
            "copyrights": [
                "Copyright 2010-2020 Alfresco Software, Ltd."
            ],
            "file-count": 102,
            "sha256": "f14319ed583cdf195a35ee36b00833b284780a193b95b91aeb3bf398ff86f10a",
            "source": "https://maven.alfresco.com/nexus/service/local/repositories/activiti-releases/content//org/activiti/activiti-bpmn-model/8.0.0/activiti-bpmn-model-8.0.0-sources.jar",
            "status": "approved"
        }
    ]
}