{
    "id": "npm/npmjs/-/postcss-double-position-gradients/6.0.0",
    "license": "MIT-0",
    "authority": "https://gitlab.eclipse.org/eclipsefdn/emo-team/iplab/-/issues/18984",
    "source": "https://registry.yarnpkg.com/postcss-double-position-gradients/-/postcss-double-position-gradients-6.0.0.tgz",
    "status": "approved",
    "scans": [
        {
            "date": "January 19, 2025 at 8:09:08 p.m. GMT",
            "authority": "https://gitlab.eclipse.org/eclipsefdn/emo-team/iplab/-/issues/18984",
            "scancode-version": "31.2.1",
            "licenses-discovered": [
                "MIT-0"
            ],
            "copyrights": [
                "Copyright (c) CSSTools Contributors"
            ],
            "file-count": 6,
            "sha256": "75ea5329441579acd90bdad1653ed8470130f4dbae89b18a95befda043e7b36e",
            "source": "https://registry.yarnpkg.com/postcss-double-position-gradients/-/postcss-double-position-gradients-6.0.0.tgz",
            "status": "approved"
        }
    ]
}