{
    "id": "maven/mavencentral/org.glassfish.hk2.external/asm-all-repackaged/2.5.0-b03",
    "license": "BSD-3-Clause",
    "licenses-discovered": [
        "BSD-3-Clause"
    ],
    "file-count": 138,
    "scancode-version": "30.1.0",
    "authority": "https://gitlab.eclipse.org/eclipsefdn/emo-team/iplab/-/issues/2353",
    "source": "https://search.maven.org/remotecontent?filepath=org/glassfish/hk2/external/asm-all-repackaged/2.5.0-b03/asm-all-repackaged-2.5.0-b03-sources.jar",
    "status": "approved"
}