{
    "id": "maven/mavencentral/org.graalvm.truffle/truffle-api/22.0.0.2",
    "license": "UPL-1.0",
    "authority": "https://gitlab.eclipse.org/eclipsefdn/emo-team/iplab/-/issues/5274",
    "source": "https://search.maven.org/remotecontent?filepath=org/graalvm/truffle/truffle-api/22.0.0.2/truffle-api-22.0.0.2-sources.jar",
    "status": "approved",
    "scans": [
        {
            "date": "December 1, 2022 at 10:26:14 a.m. GMT",
            "authority": "https://gitlab.eclipse.org/eclipsefdn/emo-team/iplab/-/issues/5274",
            "scancode-version": "31.2.1",
            "licenses-discovered": [
                "UPL-1.0"
            ],
            "copyrights": [
                "Copyright (c) 2012, 2018, Oracle and/or its affiliates",
                "Copyright (c) 2012, 2019, Oracle and/or its affiliates",
                "Copyright (c) 2012, 2020, Oracle and/or its affiliates",
                "Copyright (c) 2012, 2021, Oracle and/or its affiliates",
                "Copyright (c) 2013, 2018, Oracle and/or its affiliates",
                "Copyright (c) 2013, 2019, Oracle and/or its affiliates",
                "Copyright (c) 2013, 2020, Oracle and/or its affiliates",
                "Copyright (c) 2013, 2021, Oracle and/or its affiliates",
                "Copyright (c) 2014, 2018, Oracle and/or its affiliates",
                "Copyright (c) 2014, 2019, Oracle and/or its affiliates",
                "Copyright (c) 2014, 2020, Oracle and/or its affiliates",
                "Copyright (c) 2014, 2021, Oracle and/or its affiliates",
                "Copyright (c) 2014, 2022, Oracle and/or its affiliates",
                "Copyright (c) 2015, 2018, Oracle and/or its affiliates",
                "Copyright (c) 2015, 2019, Oracle and/or its affiliates",
                "Copyright (c) 2015, 2020, Oracle and/or its affiliates",
                "Copyright (c) 2015, 2021, Oracle and/or its affiliates",
                "Copyright (c) 2016, 2018, Oracle and/or its affiliates",
                "Copyright (c) 2016, 2019, Oracle and/or its affiliates",
                "Copyright (c) 2016, 2020, Oracle and/or its affiliates",
                "Copyright (c) 2016, 2021, Oracle and/or its affiliates",
                "Copyright (c) 2017, 2018, Oracle and/or its affiliates",
                "Copyright (c) 2017, 2019, Oracle and/or its affiliates",
                "Copyright (c) 2017, 2020, Oracle and/or its affiliates",
                "Copyright (c) 2017, 2021, Oracle and/or its affiliates",
                "Copyright (c) 2017, 2022, Oracle and/or its affiliates",
                "Copyright (c) 2018, 2019, Oracle and/or its affiliates",
                "Copyright (c) 2018, 2020, Oracle and/or its affiliates",
                "Copyright (c) 2018, 2021, Oracle and/or its affiliates",
                "Copyright (c) 2018, Oracle and/or its affiliates",
                "Copyright (c) 2019, 2020, Oracle and/or its affiliates",
                "Copyright (c) 2019, 2021, Oracle and/or its affiliates",
                "Copyright (c) 2019, Oracle and/or its affiliates",
                "Copyright (c) 2020, 2020, Oracle and/or its affiliates",
                "Copyright (c) 2020, 2021, Oracle and/or its affiliates",
                "Copyright (c) 2020, Oracle and/or its affiliates",
                "Copyright (c) 2021, 2021, Oracle and/or its affiliates",
                "Copyright (c) 2021, Oracle and/or its affiliates"
            ],
            "file-count": 535,
            "sha256": "5c1d3bd6e337eea670e6844f1a13191c1d48fa5717859abe5a460b1442765bb6",
            "source": "https://search.maven.org/remotecontent?filepath=org/graalvm/truffle/truffle-api/22.0.0.2/truffle-api-22.0.0.2-sources.jar",
            "status": "approved"
        }
    ]
}