{
    "id": "maven/mavencentral/org.apache.camel/camel-core-engine/3.21.0",
    "license": "Apache-2.0",
    "authority": "https://gitlab.eclipse.org/eclipsefdn/emo-team/iplab/-/issues/10319",
    "source": "https://repo.maven.apache.org/maven2/org/apache/camel/camel-core-engine/3.21.0/camel-core-engine-3.21.0-sources.jar",
    "status": "approved",
    "scans": [
        {
            "date": "September 6, 2023 at 10:53:40 a.m. GMT",
            "authority": "https://gitlab.eclipse.org/eclipsefdn/emo-team/iplab/-/issues/10319",
            "scancode-version": "31.2.1",
            "licenses-discovered": [
                "Apache-2.0"
            ],
            "copyrights": [
            ],
            "file-count": 16,
            "sha256": "de2b39d8977935d94bd2b2a69713c46e88ca8260ce20a8b6ca14a50ae60ffe30",
            "source": "https://repo.maven.apache.org/maven2/org/apache/camel/camel-core-engine/3.21.0/camel-core-engine-3.21.0-sources.jar",
            "status": "approved"
        }
    ]
}