{
    "id": "maven/mavencentral/org.jboss.weld/weld-api/5.0.SP3",
    "license": "Apache-2.0",
    "authority": "https://gitlab.eclipse.org/eclipsefdn/emo-team/iplab/-/issues/5300",
    "source": "https://search.maven.org/remotecontent?filepath=org/jboss/weld/weld-api/5.0.SP3/weld-api-5.0.SP3-sources.jar",
    "status": "approved",
    "scans": [
        {
            "date": "December 1, 2022 at 11:21:48 p.m. GMT",
            "authority": "https://gitlab.eclipse.org/eclipsefdn/emo-team/iplab/-/issues/5300",
            "scancode-version": "31.2.1",
            "licenses-discovered": [
                "Apache-2.0",
                "Apache-2.0 AND CDDL-1.0 AND EPL-2.0 AND (GPL-2.0-only WITH Classpath-exception-2.0)"
            ],
            "copyrights": [
                "Copyright 2008, Red Hat Middleware LLC, and individual contributors by the authors",
                "Copyright 2008, Red Hat, Inc., and individual contributors by the authors",
                "Copyright 2014, Red Hat, Inc., and individual contributors by the authors",
                "Copyright 2015, Red Hat, Inc., and individual contributors by the authors",
                "Copyright 2016, Red Hat, Inc.",
                "Copyright 2016, Red Hat, Inc., and individual contributors by the authors",
                "Copyright 2017, Red Hat, Inc., and individual contributors by the authors",
                "Copyright 2018, Red Hat, Inc., and individual contributors by the authors"
            ],
            "file-count": 44,
            "sha256": "0172aafff03520e73b7e1a87ae5bbe3c69c5a8ac8e8d826506c2cf35069608bd",
            "source": "https://search.maven.org/remotecontent?filepath=org/jboss/weld/weld-api/5.0.SP3/weld-api-5.0.SP3-sources.jar",
            "status": "restricted"
        }
    ]
}
