{
    "id": "maven/mavencentral/org.apache.hadoop/hadoop-hdfs/3.4.0",
    "license": "Apache-2.0 AND (Apache-2.0 AND BSD-2-Clause AND BSD-3-Clause AND MIT)",
    "authority": "https://gitlab.eclipse.org/eclipsefdn/emo-team/iplab/-/issues/14122",
    "source": "https://repo1.maven.org/maven2/org/apache/hadoop/hadoop-hdfs/3.4.0/hadoop-hdfs-3.4.0-sources.jar",
    "status": "approved",
    "scans": [
        {
            "date": "March 26, 2024 at 1:51:48 p.m. GMT",
            "authority": "https://gitlab.eclipse.org/eclipsefdn/emo-team/iplab/-/issues/14122",
            "scancode-version": "31.2.1",
            "licenses-discovered": [
                "Apache-2.0",
                "Apache-2.0 AND BSD-2-Clause AND BSD-3-Clause AND MIT"
            ],
            "copyrights": [
                "Copyright (c) 2007 The Guava Authors",
                "Copyright (c) 2009-2017 Dave Gamble and cJSON contributors"
            ],
            "file-count": 726,
            "sha256": "3675b088a5fdc18023a51b2ff32eb3eb1294bdfb80a84d22ced0cca81785210d",
            "source": "https://repo1.maven.org/maven2/org/apache/hadoop/hadoop-hdfs/3.4.0/hadoop-hdfs-3.4.0-sources.jar",
            "status": "approved"
        }
    ]
}