{
    "id": "maven/mavencentral/org.apache.camel/camel-dataset/3.22.2",
    "license": "Apache-2.0",
    "authority": "https://gitlab.eclipse.org/eclipsefdn/emo-team/iplab/-/issues/17372",
    "source": "https://repo1.maven.org/maven2/org/apache/camel/camel-dataset/3.22.2/camel-dataset-3.22.2-sources.jar",
    "status": "approved",
    "scans": [
        {
            "date": "November 20, 2024, 11:16:36 a.m. GMT",
            "authority": "https://gitlab.eclipse.org/eclipsefdn/emo-team/iplab/-/issues/17372",
            "scancode-version": "31.2.1",
            "licenses-discovered": [
                "Apache-2.0"
            ],
            "copyrights": [
            ],
            "file-count": 32,
            "sha256": "b4cc84f5a46c63dc82cc0f4d875baed496d11cc0bf23f8ebe94cd82f82d1e41e",
            "source": "https://repo1.maven.org/maven2/org/apache/camel/camel-dataset/3.22.2/camel-dataset-3.22.2-sources.jar",
            "status": "approved"
        }
    ]
}