{
    "id": "maven/mavencentral/org.flowable/flowable-engine-common/6.8.0",
    "license": "Apache-2.0",
    "authority": "https://gitlab.eclipse.org/eclipsefdn/emo-team/iplab/-/issues/6447",
    "source": "https://search.maven.org/remotecontent?filepath=org/flowable/flowable-engine-common/6.8.0/flowable-engine-common-6.8.0-sources.jar",
    "status": "approved",
    "scans": [
        {
            "date": "January 23, 2023 at 8:17:02 p.m. GMT",
            "authority": "https://gitlab.eclipse.org/eclipsefdn/emo-team/iplab/-/issues/6447",
            "scancode-version": "31.2.1",
            "licenses-discovered": [
                "Apache-2.0"
            ],
            "copyrights": [
                "Copyright (c) 1997, 2019 Oracle and/or its affiliates and others",
                "Copyright 2004 The Apache Software Foundation",
                "Copyright 2006-2009 Odysseus Software GmbH",
                "Copyright 2018 Flowable",
                "copyright Terracotta, Inc., unless otherwise indicated"
            ],
            "file-count": 399,
            "sha256": "44af2a49b6283985b4ddc01b369ba770319a58ae8df5781fc226b39faeef9e21",
            "source": "https://search.maven.org/remotecontent?filepath=org/flowable/flowable-engine-common/6.8.0/flowable-engine-common-6.8.0-sources.jar",
            "status": "approved"
        }
    ]
}