{
    "id": "git/github/valyala/tcplisten/ceec8f93295a",
    "license": "MIT",
    "licenses-discovered": [
        "MIT"
    ],
    "copyrights": [
        "Copyright (c) Aliaksandr Valialkin"
    ],
    "file-count": 10,
    "scancode-version": "30.1.0",
    "authority": "https://gitlab.eclipse.org/eclipsefdn/emo-team/iplab/-/issues/3637",
    "source": "https://github.com/valyala/tcplisten/archive/ceec8f93295a.zip",
    "status": "approved"
}