{
    "id": "git/github/spf13/pflag/v1.0.3",
    "license": "BSD-3-Clause",
    "licenses-discovered": [
        "BSD-3-Clause"
    ],
    "file-count": 56,
    "scancode-version": "30.1.0",
    "authority": "https://gitlab.eclipse.org/eclipsefdn/emo-team/iplab/-/issues/2614",
    "source": "https://github.com/spf13/pflag/archive/refs/tags/v1.0.3.zip",
    "status": "approved"
}