{
    "id": "npm/npmjs/@typescript-eslint/scope-manager/6.14.0",
    "license": "BSD-2-Clause AND (BSD-2-Clause AND ISC AND MIT) AND MIT",
    "authority": "https://gitlab.eclipse.org/eclipsefdn/emo-team/iplab/-/issues/11975",
    "source": "https://github.com/typescript-eslint/typescript-eslint/archive/refs/tags/v6.14.0.zip",
    "status": "approved",
    "scans": [
        {
            "date": "December 13, 2023 at 6:15:58 p.m. GMT",
            "authority": "https://gitlab.eclipse.org/eclipsefdn/emo-team/iplab/-/issues/11975",
            "scancode-version": "31.2.1",
            "licenses-discovered": [
                "BSD-2-Clause",
                "BSD-2-Clause AND ISC AND MIT",
                "MIT"
            ],
            "copyrights": [
                "Copyright (c) 2016 unional",
                "Copyright (c) 2019 typescript-eslint and other contributors",
                "Copyright (c) 2021 typescript-eslint and other contributors",
                "Copyright (c) 2023 typescript-eslint and other contributors",
                "Copyright JS Foundation and other contributors, https://js.foundation",
                "Copyright Joyent, Inc. and other Node contributors"
            ],
            "file-count": 7606,
            "sha256": "0acbedc4f6dda4845047e4a3fd40464d5ac1032eb7dfe66e9495b559773a8d28",
            "source": "https://github.com/typescript-eslint/typescript-eslint/archive/refs/tags/v6.14.0.zip",
            "status": "approved"
        }
    ]
}