{
    "id": "npm/npmjs/-/terser/5.19.0",
    "license": "BSD-2-Clause AND BSD-3-Clause AND BSD-2-Clause",
    "authority": "https://gitlab.eclipse.org/eclipsefdn/emo-team/iplab/-/issues/9355",
    "source": "https://registry.yarnpkg.com/terser/-/terser-5.19.0.tgz",
    "status": "approved",
    "scans": [
        {
            "date": "July 11, 2023 at 5:03:44 p.m. GMT",
            "authority": "https://gitlab.eclipse.org/eclipsefdn/emo-team/iplab/-/issues/9355",
            "scancode-version": "31.2.1",
            "licenses-discovered": [
                "BSD-2-Clause AND BSD-3-Clause",
                "BSD-2-Clause"
            ],
            "copyrights": [
                "Copyright 2012 (c) Mihai Bazon <mihai.bazon@gmail.com>",
                "Copyright 2012-2018 (c) Mihai Bazon <mihai.bazon@gmail.com>"
            ],
            "file-count": 40,
            "sha256": "e0c933696f245e8716d0a45881b80018da78ebe8758f09b89373522080a34544",
            "source": "https://registry.yarnpkg.com/terser/-/terser-5.19.0.tgz",
            "status": "approved"
        }
    ]
}