{
    "id": "pypi/pypi/-/python-augeas/1.1.0",
    "license": "LGPL-2.1-only AND LGPL-2.0-or-later AND LGPL-2.1-or-later AND Sendmail AND GPL-2.0-or-later AND GPL-1.0-or-later",
    "authority": "https://gitlab.eclipse.org/eclipsefdn/emo-team/iplab/-/issues/4810",
    "status": "restricted",
    "scans": [
        {
            "date": "November 10, 2022 at 7:30:53 p.m. GMT",
            "authority": "https://gitlab.eclipse.org/eclipsefdn/emo-team/iplab/-/issues/4810",
            "scancode-version": "31.2.1",
            "licenses-discovered": [
                "LGPL-2.1-only",
                "LGPL-2.0-or-later",
                "LGPL-2.1-or-later",
                "Sendmail",
                "GPL-2.0-or-later",
                "GPL-1.0-or-later"
            ],
            "copyrights": [
                "Copyright (c) 1991, 1999 Free Software Foundation, Inc.",
                "Copyright (c) 1998 - 2001 Frodo Looijaard <frodol@dds.nl>",
                "Copyright (c) 2001-2003 Sendmail, Inc. and its suppliers",
                "Copyright (c) 2008 Jeff Schroeder <jeffschroeder@computer.org>",
                "Copyright (c) 2008 Nathaniel McCallum",
                "Copyright (c) 2009 Red Hat, Inc.",
                "Copyright 2007 Red Hat, Inc.",
                "copyrighted by the Free Software Foundation"
            ],
            "file-count": 135,
            "sha256": "5194a49e86b40ffc57055f73d833f87e39dce6fce934683e7d0d5bbb8eff3b8c",
            "source": "https://files.pythonhosted.org/packages/af/cc/5064a3c25721cd863e6982b87f10fdd91d8bcc62b6f7f36f5231f20d6376/python-augeas-1.1.0.tar.gz",
            "status": "restricted"
        }
    ]
}