{
    "id": "nuget/nuget/-/QRCoder/1.4.1",
    "license": "MIT",
    "authority": "https://gitlab.eclipse.org/eclipsefdn/emo-team/iplab/-/issues/14807",
    "source": "https://github.com/codebude/QRCoder/archive/refs/tags/v1.4.2.zip",
    "status": "approved",
    "scans": [
        {
            "date": "May 26, 2024 at 4:59:53 p.m. GMT",
            "authority": "https://gitlab.eclipse.org/eclipsefdn/emo-team/iplab/-/issues/14807",
            "scancode-version": "31.2.1",
            "licenses-discovered": [
                "MIT"
            ],
            "copyrights": [
                "Copyright (c) 2013-2018 Raffael Herrmann",
                "Copyright (c) www.code-bude.net / Raffael Herrmann",
                "Copyright (c) www.code-bude.net 2016"
            ],
            "file-count": 81,
            "sha256": "8e950c8e0b57e02a389989f5c25422a7d01650b75ef4916eab2a8aa2d7248e8b",
            "source": "https://github.com/codebude/QRCoder/archive/refs/tags/v1.4.2.zip",
            "status": "approved"
        }
    ]
}