{
    "id": "maven/mavencentral/com.vladsch.flexmark/flexmark-ext-autolink/0.64.8",
    "license": "BSD-2-Clause AND CC-BY-SA-4.0",
    "authority": "https://gitlab.eclipse.org/eclipsefdn/emo-team/iplab/-/issues/11337",
    "source": "https://repo.maven.apache.org/maven2/com/vladsch/flexmark/flexmark-ext-autolink/0.64.8/flexmark-ext-autolink-0.64.8-sources.jar",
    "status": "approved",
    "scans": [
        {
            "date": "October 26, 2023 at 7:00:47 p.m. GMT",
            "authority": "https://gitlab.eclipse.org/eclipsefdn/emo-team/iplab/-/issues/11337",
            "scancode-version": "31.2.1",
            "licenses-discovered": [
            ],
            "copyrights": [
            ],
            "file-count": 7,
            "sha256": "44fd15f2753b803a82f9b02b9e88eacb7aa7a2ea9e6a6dd48f906aa93e1a30c7",
            "source": "https://repo.maven.apache.org/maven2/com/vladsch/flexmark/flexmark-ext-autolink/0.64.8/flexmark-ext-autolink-0.64.8-sources.jar",
            "status": "restricted"
        }
    ]
}
