{
    "id": "go/golang/github.com%2Fspf13/cobra/v0.0.2-0.20171109065643-2da4a54c5cee",
    "license": "Apache-2.0",
    "authority": "https://gitlab.eclipse.org/eclipsefdn/emo-team/iplab/-/issues/12516",
    "source": "https://proxy.golang.org/github.com%2Fspf13/cobra/@v/v0.0.2-0.20171109065643-2da4a54c5cee.zip",
    "status": "approved",
    "scans": [
        {
            "date": "December 26, 2023 at 6:42:06 a.m. GMT",
            "authority": "https://gitlab.eclipse.org/eclipsefdn/emo-team/iplab/-/issues/12516",
            "scancode-version": "31.2.1",
            "licenses-discovered": [
                "Apache-2.0",
                "AGPL-3.0-or-later AND BSD-2-Clause AND BSD-3-Clause AND GPL-2.0-only AND GPL-3.0-only AND LGPL-2.0-or-later AND MIT",
                "AGPL-3.0-only AND AGPL-3.0-or-later",
                "Apache-2.0 AND BSD-2-Clause AND BSD-2-Clause-Views",
                "Apache-2.0 AND BSD-3-Clause",
                "Apache-2.0 AND GPL-2.0-only AND LGPL-2.1-or-later",
                "Apache-2.0 AND GPL-3.0-only",
                "LGPL-2.1-or-later AND LGPL-3.0-only AND LGPL-3.0-or-later",
                "Apache-2.0 AND MIT",
                "Apache-2.0 AND LicenseRef-scancode-unknown"
            ],
            "copyrights": [
                "Copyright (c) 1989, 1991 Free Software Foundation, Inc.",
                "Copyright (c) 2007 Free Software Foundation, Inc. <http://fsf.org/>",
                "Copyright (c) 2013 Steve Francia <spf@spf13.com>",
                "Copyright (c) 2015 Steve Francia <spf@spf13.com>",
                "Copyright (c) 2017 NAME HERE",
                "Copyright 2015 Red Hat Inc.",
                "Copyright 2016 French Ben",
                "copyrighted by the Free Software Foundation"
            ],
            "file-count": 56,
            "sha256": "c211744b7881a79365d341912737f1a62b8869343044a017f7c5ceb14b6e668a",
            "source": "https://proxy.golang.org/github.com%2Fspf13/cobra/@v/v0.0.2-0.20171109065643-2da4a54c5cee.zip",
            "status": "restricted"
        }
    ]
}
