{
    "id": "go/golang/github.com%2Faws%2Faws-sdk-go-v2%2Fservice%2Finternal/s3shared/v1.3.0",
    "license": "Apache-2.0",
    "authority": "https://gitlab.eclipse.org/eclipsefdn/emo-team/iplab/-/issues/12352",
    "source": "https://proxy.golang.org/github.com%2Faws%2Faws-sdk-go-v2%2Fservice%2Finternal/s3shared/@v/v1.3.0.zip",
    "status": "approved",
    "scans": [
        {
            "date": "December 20, 2023 at 2:15:55 p.m. GMT",
            "authority": "https://gitlab.eclipse.org/eclipsefdn/emo-team/iplab/-/issues/12352",
            "scancode-version": "31.2.1",
            "licenses-discovered": [
                "Apache-2.0"
            ],
            "copyrights": [
            ],
            "file-count": 23,
            "sha256": "a4d7d038d73dec86bbe6c86fc41a220a3630fca4318eaeaeca57bc9dc06d1d4e",
            "source": "https://proxy.golang.org/github.com%2Faws%2Faws-sdk-go-v2%2Fservice%2Finternal/s3shared/@v/v1.3.0.zip",
            "status": "approved"
        }
    ]
}