{
    "id": "nuget/nuget/-/EFCore.NamingConventions/9.0.0",
    "license": "Apache-2.0",
    "authority": "https://gitlab.eclipse.org/eclipsefdn/emo-team/iplab/-/issues/17617",
    "source": "https://github.com/efcore/EFCore.NamingConventions/archive/refs/tags/v9.0.0.zip",
    "status": "approved",
    "scans": [
        {
            "date": "December 3, 2024 at 12:28:19 p.m. GMT",
            "authority": "https://gitlab.eclipse.org/eclipsefdn/emo-team/iplab/-/issues/17617",
            "scancode-version": "31.2.1",
            "licenses-discovered": [
                "Apache-2.0"
            ],
            "copyrights": [
                "(c) Shay Rojansky Entity Framework Core",
                "Copyright (c) .NET Foundation",
                "Shay Rojansky Copyright 2023"
            ],
            "file-count": 33,
            "sha256": "af3f84307f600d47cc1f9363b4217649897cdfb3f9c57cc27cfc4738e8be7e06",
            "source": "https://github.com/efcore/EFCore.NamingConventions/archive/refs/tags/v9.0.0.zip",
            "status": "approved"
        }
    ]
}