{
    "id": "npm/npmjs/-/source-map/0.7.3",
    "license": "BSD-3-Clause",
    "licenses-discovered": [
        "BSD-3-Clause",
        "BSD-3-Clause AND LicenseRef-scancode-unknown-license-reference"
    ],
    "file-count": 19,
    "scancode-version": "30.1.0",
    "authority": "https://gitlab.eclipse.org/eclipsefdn/emo-team/iplab/-/issues/2416",
    "source": "https://registry.npmjs.org/source-map/-/source-map-0.7.3.tgz",
    "status": "approved"
}
