{
    "id": "npm/npmjs/-/electron-to-chromium/1.5.28",
    "license": "ISC",
    "authority": "https://gitlab.eclipse.org/eclipsefdn/emo-team/iplab/-/issues/16296",
    "source": "https://github.com/Kilian/electron-to-chromium/archive/refs/tags/v1.5.28.zip",
    "status": "approved",
    "scans": [
        {
            "date": "September 25, 2024, 8:10:31 p.m. GMT",
            "authority": "https://gitlab.eclipse.org/eclipsefdn/emo-team/iplab/-/issues/16296",
            "scancode-version": "31.2.1",
            "licenses-discovered": [
                "ISC",
                "ISC AND JSON"
            ],
            "copyrights": [
                "Copyright 2018 Kilian Valkhof"
            ],
            "file-count": 19,
            "sha256": "627759c9c7b0636df7672e6b52a8101349a2b7a07692205965f8c1639b12fee1",
            "source": "https://github.com/Kilian/electron-to-chromium/archive/refs/tags/v1.5.28.zip",
            "status": "restricted"
        }
    ]
}