{
    "id": "go/golang/github.com%2Fsaintfish/chardet/v0.0.0-20230101081208-5e3ef4b5456d",
    "license": "ICU AND MIT AND CC-BY-SA-3.0 AND LicenseRef-Terms-of-use",
    "authority": "https://gitlab.eclipse.org/eclipsefdn/emo-team/iplab/-/issues/11433",
    "source": "https://proxy.golang.org/github.com%2Fsaintfish/chardet/@v/v0.0.0-20230101081208-5e3ef4b5456d.zip",
    "status": "approved",
    "scans": [
        {
            "date": "November 3, 2023 at 3:05:15 p.m. GMT",
            "authority": "https://gitlab.eclipse.org/eclipsefdn/emo-team/iplab/-/issues/11433",
            "scancode-version": "31.2.1",
            "licenses-discovered": [
                "ICU",
                "ICU AND MIT",
                "LicenseRef-scancode-unknown"
            ],
            "copyrights": [
                "(c) !a http://rd.rakuten.co.jp/s/?R2",
                "(c) $?C$?i!j*Qa3/41DSSAao*R+-!P 1B|a|bthPU!H src http://act.chinatimes.com/aimg/travelrich07/kusotour_hptr_110221.gif",
                "(c) $?degeoX' src http://www.chinatimes.com/content-images/11050105/C018160A.jpg",
                "(c) 1/2E,PAu c*IAaAo?deg(r) CAPo,du\"'AI deg!uae!' src http://image.nate.com/img/cms/content_pool/2012/08/0816_iss4_05.jpg",
                "(c) 1996-2012, Amazon.com, Inc.",
                "(c) 2000-2012 Gemius SA",
                "(c) 2012 Baidu /duty/' E1OAdegUPECdeg+-OPA http://www.miibeian.gov.cn",
                "(c) E\"u(r)'$?SS U!A3uPC'CoX$?U3u (c) PY Z",
                "(c) EE http://www.rakuten.co.jp/category/sweets/",
                "(c) ICPO$?030173oA src http://www.baidu.com/cache/global/img/gs.gif",
                "(c) R*SS (c) A",
                "(c) http://rd.rakuten.co.jp/s/?R2",
                "(c) i!|A'Iy'iPn http://www.rakuten.co.jp/category/daily/",
                "(c) o\"k (c) E",
                "(c) o, (c) MY",
                "(c) o3o,$?$?$?N1quo,$?$?dege1quo,\"E!w1quo,(r)E3o (c) PY",
                "(c) u' src http://www.chinatimes.com/content-images/110504/C018161Y.jpg",
                "(c) y src http://act.chinatimes.com/aimg/travelrich07/artisan_hptr_071119.gif",
                "Copyright (c) 1995-2012 International Business Machines Corporation and others",
                "Copyright (c) 1997-2012 Rakuten, Inc.",
                "Copyright (c) 1999-2012",
                "Copyright (c) 2012 chardet Authors",
                "Copyright (c) http://www.skcomms.co.kr",
                "Copyright Omniture, Inc."
            ],
            "file-count": 26,
            "sha256": "dcce23e5f3e31bca9fbb5da5f704b55e4bd3c447ecccbc3ba508c5d4ba0e9d74",
            "source": "https://proxy.golang.org/github.com%2Fsaintfish/chardet/@v/v0.0.0-20230101081208-5e3ef4b5456d.zip",
            "status": "restricted"
        }
    ]
}
