{
    "id": "maven/mavencentral/io.cloudevents/cloudevents-core/2.5.0",
    "license": "Apache-2.0",
    "authority": "https://gitlab.eclipse.org/eclipsefdn/emo-team/iplab/-/issues/9328",
    "source": "https://repo.maven.apache.org/maven2/io/cloudevents/cloudevents-core/2.5.0/cloudevents-core-2.5.0-sources.jar",
    "status": "approved",
    "scans": [
        {
            "date": "July 11, 2023 at 6:50:16 a.m. GMT",
            "authority": "https://gitlab.eclipse.org/eclipsefdn/emo-team/iplab/-/issues/9328",
            "scancode-version": "31.2.1",
            "licenses-discovered": [
                "Apache-2.0"
            ],
            "copyrights": [
                "Copyright 2018-Present The CloudEvents Authors"
            ],
            "file-count": 36,
            "sha256": "0dd399ff78ccc57f01b02d61d43c16dba86bbe0d34fcf06b2e5d50a173e5a8c8",
            "source": "https://repo.maven.apache.org/maven2/io/cloudevents/cloudevents-core/2.5.0/cloudevents-core-2.5.0-sources.jar",
            "status": "approved"
        }
    ]
}