{
    "id": "maven/mavencentral/com.azure.resourcemanager/azure-resourcemanager-eventhubs/2.44.0",
    "license": "MIT",
    "authority": "https://gitlab.eclipse.org/eclipsefdn/emo-team/iplab/-/issues/16944",
    "source": "https://repo1.maven.org/maven2/com/azure/resourcemanager/azure-resourcemanager-eventhubs/2.44.0/azure-resourcemanager-eventhubs-2.44.0-sources.jar",
    "status": "approved",
    "scans": [
        {
            "date": "October 29, 2024, 5:29:45 a.m. GMT",
            "authority": "https://gitlab.eclipse.org/eclipsefdn/emo-team/iplab/-/issues/16944",
            "scancode-version": "31.2.1",
            "licenses-discovered": [
                "MIT"
            ],
            "copyrights": [
                "Copyright (c) Microsoft Corporation"
            ],
            "file-count": 185,
            "sha256": "870c37415a986b3d5e4f81c6c81c16b95369175098e8e835206a35ef76c469fb",
            "source": "https://repo1.maven.org/maven2/com/azure/resourcemanager/azure-resourcemanager-eventhubs/2.44.0/azure-resourcemanager-eventhubs-2.44.0-sources.jar",
            "status": "approved"
        }
    ]
}