{
    "id": "maven/mavencentral/com.fasterxml.jackson.datatype/jackson-datatype-jsr310/2.15.0",
    "license": "Apache-2.0",
    "authority": "https://gitlab.eclipse.org/eclipsefdn/emo-team/iplab/-/issues/7930",
    "source": "https://search.maven.org/remotecontent?filepath=com/fasterxml/jackson/datatype/jackson-datatype-jsr310/2.15.0/jackson-datatype-jsr310-2.15.0-sources.jar",
    "status": "approved",
    "scans": [
        {
            "date": "April 25, 2023 at 3:09:55 p.m. GMT",
            "authority": "https://gitlab.eclipse.org/eclipsefdn/emo-team/iplab/-/issues/7930",
            "scancode-version": "31.2.1",
            "licenses-discovered": [
            ],
            "copyrights": [
            ],
            "file-count": 1,
            "sha256": "880c929020d4b79bf1995656d21d9a6859aab3a9460f941eb0b1a6e5502ee4cc",
            "source": "https://search.maven.org/remotecontent?filepath=com/fasterxml/jackson/datatype/jackson-datatype-jsr310/2.15.0/jackson-datatype-jsr310-2.15.0-sources.jar",
            "status": "restricted"
        },
        {
            "date": "May 11, 2023 at 8:39:26 p.m. GMT",
            "authority": "https://gitlab.eclipse.org/eclipsefdn/emo-team/iplab/-/issues/7930",
            "scancode-version": "31.2.1",
            "licenses-discovered": [
                "Apache-2.0"
            ],
            "copyrights": [
                "Copyright 2013 FasterXML.com"
            ],
            "file-count": 57,
            "sha256": "afffb4785b5b8722bedefe02e16ac9add0a7d0319b2e8fcfffc3e5c1690e817d",
            "source": "https://search.maven.org/remotecontent?filepath=com/fasterxml/jackson/datatype/jackson-datatype-jsr310/2.15.0/jackson-datatype-jsr310-2.15.0-sources.jar",
            "status": "approved"
        }
    ]
}