{
    "id": "go/golang/github.com%2FMasterminds/sprig/v2.22.0",
    "license": "MIT",
    "authority": "https://gitlab.eclipse.org/eclipsefdn/emo-team/iplab/-/issues/12254",
    "source": "https://github.com/Masterminds/sprig/archive/refs/tags/v2.22.0.zip",
    "status": "approved",
    "scans": [
        {
            "date": "December 21, 2023 at 6:17:56 a.m. GMT",
            "authority": "https://gitlab.eclipse.org/eclipsefdn/emo-team/iplab/-/issues/12254",
            "scancode-version": "31.2.1",
            "licenses-discovered": [
                "MIT",
                "LicenseRef-scancode-proprietary-license"
            ],
            "copyrights": [
                "Copyright (c) 2013 Masterminds"
            ],
            "file-count": 57,
            "sha256": "2b98a62c67eb38e85673b7d02b17d504c7d48293a87c25b0c892c155cbeae8df",
            "source": "https://github.com/Masterminds/sprig/archive/refs/tags/v2.22.0.zip",
            "status": "restricted"
        }
    ]
}
