{
    "id": "maven/mavencentral/software.amazon.awssdk/json-utils/2.21.5",
    "license": "Apache-2.0",
    "authority": "https://gitlab.eclipse.org/eclipsefdn/emo-team/iplab/-/issues/11119",
    "source": "https://repo.maven.apache.org/maven2/software/amazon/awssdk/json-utils/2.21.5/json-utils-2.21.5-sources.jar",
    "status": "approved",
    "scans": [
        {
            "date": "October 24, 2023 at 11:22:52 a.m. GMT",
            "authority": "https://gitlab.eclipse.org/eclipsefdn/emo-team/iplab/-/issues/11119",
            "scancode-version": "31.2.1",
            "licenses-discovered": [
                "Apache-2.0"
            ],
            "copyrights": [
                "Copyright Amazon.com, Inc. or its affiliates"
            ],
            "file-count": 15,
            "sha256": "dd41d18359b81255cd4d6413669ce90029eb47197b2a556820f87ca508752bc5",
            "source": "https://repo.maven.apache.org/maven2/software/amazon/awssdk/json-utils/2.21.5/json-utils-2.21.5-sources.jar",
            "status": "approved"
        }
    ]
}