{
    "license": "MIT",
    "file-count": 15,
    "authority": "https://gitlab.eclipse.org/eclipsefdn/emo-team/iplab/-/issues/1128",
    "scancode-version": "21.3.31",
    "licenses-discovered": [
        "MIT"
    ],
    "id": "npm/npmjs/-/des.js/1.0.0",
    "source": "https://github.com/indutny/des.js/archive/v1.0.0.zip",
    "status": "approved"
}