{
    "id": "nuget/nuget/-/Serilog.Sinks.File/6.0.0",
    "license": "Apache-2.0",
    "authority": "https://gitlab.eclipse.org/eclipsefdn/emo-team/iplab/-/issues/19183",
    "source": "https://github.com/serilog/serilog-sinks-file/archive/refs/tags/v6.0.0.zip",
    "status": "approved",
    "scans": [
        {
            "date": "January 24, 2025 at 8:13:26 a.m. GMT",
            "authority": "https://gitlab.eclipse.org/eclipsefdn/emo-team/iplab/-/issues/19183",
            "scancode-version": "31.2.1",
            "licenses-discovered": [
                "Apache-2.0"
            ],
            "copyrights": [
                "Copyright (c) 2016 Serilog",
                "Copyright 2013-2016 Serilog",
                "Copyright 2013-2017 Serilog",
                "Copyright 2013-2019 Serilog",
                "Copyright 2016-2019 Serilog",
                "Copyright 2017 Serilog",
                "Copyright 2019 Serilog"
            ],
            "file-count": 64,
            "sha256": "efe35b07627d22d3660a19a7a376b1a32d03b03d76666db26d755c2cf60d3cd2",
            "source": "https://github.com/serilog/serilog-sinks-file/archive/refs/tags/v6.0.0.zip",
            "status": "approved"
        }
    ]
}