{
    "id": "npm/npmjs/-/ts-migrate-server/0.1.33",
    "license": "MIT",
    "authority": "https://gitlab.eclipse.org/eclipsefdn/emo-team/iplab/-/issues/9861",
    "source": "https://registry.yarnpkg.com/ts-migrate-server/-/ts-migrate-server-0.1.33.tgz",
    "status": "approved",
    "scans": [
        {
            "date": "August 8, 2023 at 9:19:08 a.m. GMT",
            "authority": "https://gitlab.eclipse.org/eclipsefdn/emo-team/iplab/-/issues/9861",
            "scancode-version": "31.2.1",
            "licenses-discovered": [
                "MIT"
            ],
            "copyrights": [
                "Copyright (c) 2020 Airbnb"
            ],
            "file-count": 42,
            "sha256": "334c1bfb439e722d77d93ec18c2fd3a2c9adb98d3c04d850db2d579cb59b6189",
            "source": "https://registry.yarnpkg.com/ts-migrate-server/-/ts-migrate-server-0.1.33.tgz",
            "status": "approved"
        }
    ]
}