{
    "id": "npm/npmjs/-/html-webpack-plugin/5.6.0",
    "license": "MIT",
    "authority": "https://gitlab.eclipse.org/eclipsefdn/emo-team/iplab/-/issues/12378",
    "source": "https://github.com/jantimon/html-webpack-plugin/archive/refs/tags/v5.6.0.zip",
    "status": "approved",
    "scans": [
        {
            "date": "December 21, 2023 at 5:46:53 a.m. GMT",
            "authority": "https://gitlab.eclipse.org/eclipsefdn/emo-team/iplab/-/issues/12378",
            "scancode-version": "31.2.1",
            "licenses-discovered": [
                "MIT"
            ],
            "copyrights": [
                "Copyright JS Foundation and other contributors"
            ],
            "file-count": 195,
            "sha256": "6e47d540106ba03fae1c930613be044fa6498d701dd01ebb518940a9551b4413",
            "source": "https://github.com/jantimon/html-webpack-plugin/archive/refs/tags/v5.6.0.zip",
            "status": "approved"
        }
    ]
}