{
    "id": "p2/orbit/p2.eclipse.plugin/org.eclipse.ecf.provider.filetransfer.httpclient5.win32.source/1.0.400.v20220109-1926",
    "license": "Apache-2.0 AND EPL-1.0 AND Apache-2.0 AND EPL-2.0",
    "licenses-discovered": [
        "Apache-2.0 AND EPL-1.0",
        "Apache-2.0",
        "EPL-2.0"
    ],
    "copyrights": [
        "Copyright (c) 2019 Yatta Solutions and others",
        "Copyright (c) 2021 Red Hat Inc. and others"
    ],
    "file-count": 6,
    "scancode-version": "31.2.1",
    "authority": "https://gitlab.eclipse.org/eclipsefdn/emo-team/iplab/-/issues/3976",
    "source": "https://search.maven.org/remotecontent?filepath=org/eclipse/ecf/org.eclipse.ecf.provider.filetransfer.httpclient5.win32/1.0.400/org.eclipse.ecf.provider.filetransfer.httpclient5.win32-1.0.400-sources.jar",
    "status": "approved"
}