{
    "id": "maven/mavencentral/com.tngtech.archunit/archunit/1.1.0",
    "license": "Apache-2.0",
    "authority": "https://gitlab.eclipse.org/eclipsefdn/emo-team/iplab/-/issues/15249",
    "source": "https://repo1.maven.org/maven2/com/tngtech/archunit/archunit/1.1.0/archunit-1.1.0-sources.jar",
    "status": "approved",
    "scans": [
        {
            "date": "October 11, 2023 at 11:27:55 a.m. GMT",
            "authority": "https://gitlab.eclipse.org/eclipsefdn/emo-team/iplab/-/issues/11048",
            "scancode-version": "31.2.1",
            "licenses-discovered": [
                "Apache-2.0"
            ],
            "copyrights": [
                "Copyright 2014-2023 TNG Technology Consulting GmbH",
                "Copyright 2023 TNG Technology Consulting GmbH"
            ],
            "file-count": 294,
            "sha256": "6b9a279892cd8a5f42027b5a30538ef0603bf7d11426ab7ac60d89b7979f2a04",
            "source": "https://repo.maven.apache.org/maven2/com/tngtech/archunit/archunit/1.1.0/archunit-1.1.0-sources.jar",
            "status": "approved"
        },
        {
            "date": "June 14, 2024 at 3:21:44 p.m. GMT",
            "authority": "https://gitlab.eclipse.org/eclipsefdn/emo-team/iplab/-/issues/15249",
            "scancode-version": "31.2.1",
            "licenses-discovered": [
                "Apache-2.0"
            ],
            "copyrights": [
                "Copyright 2014-2023 TNG Technology Consulting GmbH",
                "Copyright 2023 TNG Technology Consulting GmbH"
            ],
            "file-count": 294,
            "sha256": "6b9a279892cd8a5f42027b5a30538ef0603bf7d11426ab7ac60d89b7979f2a04",
            "source": "https://repo1.maven.org/maven2/com/tngtech/archunit/archunit/1.1.0/archunit-1.1.0-sources.jar",
            "status": "approved"
        }
    ]
}