{
    "id": "npm/npmjs/@webassemblyjs/utf8/1.11.5",
    "license": "MIT",
    "authority": "https://gitlab.eclipse.org/eclipsefdn/emo-team/iplab/-/issues/7966",
    "source": "https://registry.npmjs.org/@webassemblyjs/utf8/-/utf8-1.11.5.tgz",
    "status": "approved",
    "scans": [
        {
            "date": "April 26, 2023 at 12:59:32 p.m. GMT",
            "authority": "https://gitlab.eclipse.org/eclipsefdn/emo-team/iplab/-/issues/7966",
            "scancode-version": "31.2.1",
            "licenses-discovered": [
                "MIT"
            ],
            "copyrights": [
            ],
            "file-count": 8,
            "sha256": "3a1de5771584586d387ee097c073c7ed71e576c87a3f41a233a555e1a534f8b8",
            "source": "https://registry.npmjs.org/@webassemblyjs/utf8/-/utf8-1.11.5.tgz",
            "status": "approved"
        }
    ]
}