{
    "id": "crate/cratesio/-/curl-sys/0.4.63",
    "license": "MIT",
    "authority": "https://gitlab.eclipse.org/eclipsefdn/emo-team/iplab/-/issues/9784",
    "source": "https://github.com/alexcrichton/curl-rust/archive/refs/tags/curl-sys-0.4.63.zip",
    "status": "approved",
    "scans": [
        {
            "date": "July 28, 2023 at 8:58:05 p.m. GMT",
            "authority": "https://gitlab.eclipse.org/eclipsefdn/emo-team/iplab/-/issues/9784",
            "scancode-version": "31.2.1",
            "licenses-discovered": [
                "MIT",
                "curl"
            ],
            "copyrights": [
                "Copyright (c) 2014 Carl Lerche"
            ],
            "file-count": 46,
            "sha256": "789dd92480e0aea70a01741706e69cbbe99d91b322b52a4092e98097098b5021",
            "source": "https://github.com/alexcrichton/curl-rust/archive/refs/tags/curl-sys-0.4.63.zip",
            "status": "restricted"
        }
    ]
}
