{
    "id": "npm/npmjs/-/emoji-regex-xs/1.0.0",
    "license": "MIT",
    "authority": "https://gitlab.eclipse.org/eclipsefdn/emo-team/iplab/-/issues/17413",
    "source": "https://github.com/slevithan/emoji-regex-xs/archive/refs/tags/v1.0.0.zip",
    "status": "approved",
    "scans": [
        {
            "date": "November 22, 2024, 1:25:23 p.m. GMT",
            "authority": "https://gitlab.eclipse.org/eclipsefdn/emo-team/iplab/-/issues/17413",
            "scancode-version": "31.2.1",
            "licenses-discovered": [
                "MIT"
            ],
            "copyrights": [
                "Copyright (c) 2024 Steven Levithan"
            ],
            "file-count": 9,
            "sha256": "dc54642dcb79e48fc1be264406f5c08ee8c34969b6f24efd59c500c9aa1ce8be",
            "source": "https://github.com/slevithan/emoji-regex-xs/archive/refs/tags/v1.0.0.zip",
            "status": "approved"
        }
    ]
}