{
    "license": "BSD-3-Clause AND MIT",
    "file-count": 7,
    "authority": "https://gitlab.eclipse.org/eclipsefdn/emo-team/iplab/-/issues/1084",
    "scancode-version": "21.3.31",
    "licenses-discovered": [
        "MIT",
        "BSD-3-Clause"
    ],
    "id": "npm/npmjs/-/sanitize-html/1.20.1",
    "source": "https://registry.npmjs.org/sanitize-html/-/sanitize-html-1.20.1.tgz",
    "status": "approved"
}