{
    "id": "npm/npmjs/-/rxjs/7.6.0",
    "license": "Apache-2.0 AND (0BSD AND Apache-2.0) AND 0BSD",
    "authority": "https://gitlab.eclipse.org/eclipsefdn/emo-team/iplab/-/issues/5750",
    "source": "https://registry.npmjs.org/rxjs/-/rxjs-7.6.0.tgz",
    "status": "approved",
    "scans": [
        {
            "date": "December 14, 2022 at 2:02:34 a.m. GMT",
            "authority": "https://gitlab.eclipse.org/eclipsefdn/emo-team/iplab/-/issues/5750",
            "scancode-version": "31.2.1",
            "licenses-discovered": [
                "Apache-2.0",
                "0BSD AND Apache-2.0",
                "0BSD"
            ],
            "copyrights": [
                "(c) b.value",
                "Copyright (c) 2015-2018 Google, Inc., Netflix, Inc., Microsoft Corp. and contributors",
                "Copyright (c) Microsoft Corporation"
            ],
            "file-count": 2276,
            "sha256": "6beafa9444e0496de2addc02ba04c42d700b4f416671bb36794ef5709e387e28",
            "source": "https://registry.npmjs.org/rxjs/-/rxjs-7.6.0.tgz",
            "status": "approved"
        }
    ]
}