{
    "id": "npm/npmjs/-/react-dropzone/12.0.4",
    "license": "MIT",
    "licenses-discovered": [
        "MIT"
    ],
    "copyrights": [
        "Copyright (c) Param Aggarwal"
    ],
    "file-count": 61,
    "scancode-version": "30.1.0",
    "authority": "https://gitlab.eclipse.org/eclipsefdn/emo-team/iplab/-/issues/2981",
    "source": "https://github.com/react-dropzone/react-dropzone/archive/v12.0.4.zip",
    "status": "approved"
}