{
    "id": "npm/npmjs/-/pbf/3.2.1",
    "license": "MIT AND BSD-3-Clause",
    "authority": "https://gitlab.eclipse.org/eclipsefdn/emo-team/iplab/-/issues/8110",
    "source": "https://github.com/mapbox/pbf/archive/v3.2.1.zip",
    "status": "approved",
    "scans": [
        {
            "date": "May 3, 2023 at 7:39:13 a.m. GMT",
            "authority": "https://gitlab.eclipse.org/eclipsefdn/emo-team/iplab/-/issues/8110",
            "scancode-version": "31.2.1",
            "licenses-discovered": [
                "MIT",
                "BSD-3-Clause"
            ],
            "copyrights": [
                "Copyright (c) 2017, Mapbox"
            ],
            "file-count": 25,
            "sha256": "85d05636797a33080e84f1989db987acc7ccd60d50c3134ee6b7706b21a5acfc",
            "source": "https://github.com/mapbox/pbf/archive/v3.2.1.zip",
            "status": "approved"
        }
    ]
}