{
    "id": "maven/mavencentral/org.eclipse.dataspaceconnector/ids-core/0.0.1-20220922.4-20230220.143048-1",
    "license": "Apache-2.0",
    "authority": "https://gitlab.eclipse.org/eclipsefdn/emo-team/iplab/-/issues/7651",
    "source": "https://search.maven.org/remotecontent?filepath=org/eclipse/dataspaceconnector/ids-core/0.0.1-milestone-6/ids-core-0.0.1-milestone-6-sources.jar",
    "status": "approved",
    "scans": [
        {
            "date": "March 28, 2023 at 9:43:15 p.m. GMT",
            "authority": "https://gitlab.eclipse.org/eclipsefdn/emo-team/iplab/-/issues/7651",
            "scancode-version": "31.2.1",
            "licenses-discovered": [
                "Apache-2.0"
            ],
            "copyrights": [
                "Copyright (c) 2020, 2021 Fraunhofer Institute for Software and Systems Engineering",
                "Copyright (c) 2020, 2021 Microsoft Corporation",
                "Copyright (c) 2021 - 2022 Daimler TSS GmbH",
                "Copyright (c) 2021 Daimler TSS GmbH",
                "Copyright (c) 2021 Microsoft Corporation",
                "Copyright (c) 2022 Fraunhofer Institute for Software and Systems Engineering"
            ],
            "file-count": 16,
            "sha256": "3b40584e24cdbf00cc30834f042f81e145717c0299a42fd57f14cd6dacaaeb33",
            "source": "https://search.maven.org/remotecontent?filepath=org/eclipse/dataspaceconnector/ids-core/0.0.1-milestone-6/ids-core-0.0.1-milestone-6-sources.jar",
            "status": "approved"
        }
    ]
}