{
    "id": "pypi/pypi/-/paginate/0.5.6",
    "license": "MIT",
    "authority": "https://gitlab.eclipse.org/eclipsefdn/emo-team/iplab/-/issues/13071",
    "source": "https://files.pythonhosted.org/packages/68/58/e670a947136fdcece8ac5376b3df1369d29e4f6659b0c9b358605b115e9e/paginate-0.5.6.tar.gz",
    "status": "approved",
    "scans": [
        {
            "date": "February 1, 2024 at 9:11:22 p.m. GMT",
            "authority": "https://gitlab.eclipse.org/eclipsefdn/emo-team/iplab/-/issues/13071",
            "scancode-version": "31.2.1",
            "licenses-discovered": [
                "MIT"
            ],
            "copyrights": [
                "Copyright (c) 2007-2012 Christoph Haas <email@christoph-haas.de>",
                "Copyright 2007-2016 Christoph Haas and contributors credits Mike Orr"
            ],
            "file-count": 14,
            "sha256": "5e6007b6a9398177a7e1648d04fdd9f8c9766a1a945bceac82f1929e8c78af2d",
            "source": "https://files.pythonhosted.org/packages/68/58/e670a947136fdcece8ac5376b3df1369d29e4f6659b0c9b358605b115e9e/paginate-0.5.6.tar.gz",
            "status": "approved"
        }
    ]
}