{
    "id": "maven/mavencentral/org.geotools/gt-shapefile/30.2",
    "license": "LGPL-2.0-or-later AND LGPL-2.1-only",
    "authority": "https://gitlab.eclipse.org/eclipsefdn/emo-team/iplab/-/issues/13110",
    "source": "https://repo.osgeo.org/repository/geotools-releases/org/geotools/gt-shapefile/30.2/gt-shapefile-30.2-sources.jar",
    "status": "approved",
    "scans": [
        {
            "date": "February 2, 2024 at 8:35:31 p.m. GMT",
            "authority": "https://gitlab.eclipse.org/eclipsefdn/emo-team/iplab/-/issues/13110",
            "scancode-version": "31.2.1",
            "licenses-discovered": [
                "LGPL-2.0-or-later",
                "LGPL-2.1-only"
            ],
            "copyrights": [
                "(c) 2002-2008, Open Source Geospatial Foundation",
                "(c) 2002-2011, Open Source Geospatial Foundation",
                "(c) 2002-2015, Open Source Geospatial Foundation",
                "(c) 2002-2017, Open Source Geospatial Foundation",
                "(c) 2002-2021, Open Source Geospatial Foundation",
                "(c) 2003-2008, Open Source Geospatial Foundation",
                "(c) 2004-2008, Open Source Geospatial Foundation",
                "(c) 2005-2008, Open Source Geospatial Foundation",
                "(c) 2005-2015, Open Source Geospatial Foundation",
                "(c) 2007-2016, Open Source Geospatial Foundation",
                "(c) 2008, Open Source Geospatial Foundation",
                "(c) 2008-2015, Open Source Geospatial Foundation",
                "(c) 2014 - 2015, Open Source Geospatial Foundation",
                "(c) 2015, Open Source Geospatial Foundation",
                "(c) 2019, Open Source Geospatial Foundation",
                "(c) 2021, Open Source Geospatial Foundation"
            ],
            "file-count": 75,
            "sha256": "3e74eefbdb833b5c753d3776009c9009ee6af0a8270e17b7ca3454a0606d797c",
            "source": "https://repo.osgeo.org/repository/geotools-releases/org/geotools/gt-shapefile/30.2/gt-shapefile-30.2-sources.jar",
            "status": "approved"
        }
    ]
}