{
    "id": "maven/mavencentral/org.wildfly.security/wildfly-elytron-http-util/1.15.3.Final",
    "license": "Apache-2.0",
    "licenses-discovered": [
        "Apache-2.0"
    ],
    "file-count": 18,
    "scancode-version": "30.1.0",
    "authority": "https://gitlab.eclipse.org/eclipsefdn/emo-team/iplab/-/issues/2022",
    "source": "https://search.maven.org/remotecontent?filepath=org/wildfly/security/wildfly-elytron-http-util/1.15.3.Final/wildfly-elytron-http-util-1.15.3.Final-sources.jar",
    "status": "approved"
}