{
    "id": "npm/npmjs/-/micromark-util-character/2.1.1",
    "license": "MIT",
    "authority": "https://gitlab.eclipse.org/eclipsefdn/emo-team/iplab/-/issues/17409",
    "source": "https://registry.yarnpkg.com/micromark-util-character/-/micromark-util-character-2.1.1.tgz",
    "status": "approved",
    "scans": [
        {
            "date": "November 22, 2024, 1:21:33 p.m. GMT",
            "authority": "https://gitlab.eclipse.org/eclipsefdn/emo-team/iplab/-/issues/17409",
            "scancode-version": "31.2.1",
            "licenses-discovered": [
                "MIT"
            ],
            "copyrights": [
                "(c) Titus Wormer",
                "Copyright (c) Titus Wormer <tituswormer@gmail.com>"
            ],
            "file-count": 9,
            "sha256": "bacefea968d21cedf290ec319ec92e2bc20e4f7b02f62cb4ad1e7b07c5a45185",
            "source": "https://registry.yarnpkg.com/micromark-util-character/-/micromark-util-character-2.1.1.tgz",
            "status": "approved"
        }
    ]
}