{
    "id": "maven/mavencentral/org.apache.maven.plugin-tools/maven-plugin-annotations/3.12.0",
    "license": "Apache-2.0",
    "authority": "https://gitlab.eclipse.org/eclipsefdn/emo-team/iplab/-/issues/14209",
    "source": "https://repo1.maven.org/maven2/org/apache/maven/plugin-tools/maven-plugin-annotations/3.12.0/maven-plugin-annotations-3.12.0-sources.jar",
    "status": "approved",
    "scans": [
        {
            "date": "April 3, 2024 at 9:00:27 p.m. GMT",
            "authority": "https://gitlab.eclipse.org/eclipsefdn/emo-team/iplab/-/issues/14209",
            "scancode-version": "31.2.1",
            "licenses-discovered": [
                "Apache-2.0"
            ],
            "copyrights": [
            ],
            "file-count": 11,
            "sha256": "192c6d4a262073f1e6a986248e244f5260f9c521ecdce5be7be78dc442a7d619",
            "source": "https://repo1.maven.org/maven2/org/apache/maven/plugin-tools/maven-plugin-annotations/3.12.0/maven-plugin-annotations-3.12.0-sources.jar",
            "status": "approved"
        }
    ]
}