{
    "id": "maven/mavencentral/org.codehaus.plexus/plexus-io/3.4.1",
    "license": "Apache-2.0",
    "authority": "https://gitlab.eclipse.org/eclipsefdn/emo-team/iplab/-/issues/7307",
    "source": "https://search.maven.org/remotecontent?filepath=org/codehaus/plexus/plexus-io/3.4.1/plexus-io-3.4.1-sources.jar",
    "status": "approved",
    "scans": [
        {
            "date": "March 2, 2023 at 5:37:48 a.m. GMT",
            "authority": "https://gitlab.eclipse.org/eclipsefdn/emo-team/iplab/-/issues/7307",
            "scancode-version": "31.2.1",
            "licenses-discovered": [
                "Apache-2.0"
            ],
            "copyrights": [
                "Copyright 2007 The Codehaus Foundation",
                "Copyright 2014 The Codehaus Foundation"
            ],
            "file-count": 61,
            "sha256": "1494e7489ad9b15416236f12ab95cefb2d10638ebaa3a11bad8099ef4fa72cd5",
            "source": "https://search.maven.org/remotecontent?filepath=org/codehaus/plexus/plexus-io/3.4.1/plexus-io-3.4.1-sources.jar",
            "status": "approved"
        }
    ]
}