{
    "id": "p2/orbit/p2.eclipse-plugin/org.slf4j.bridge.jul/1.7.30",
    "license": "MIT",
    "licenses-discovered": [
        "MIT"
    ],
    "copyrights": [
        "Copyright (c) 2004-2011 QOS.ch"
    ],
    "file-count": 5,
    "scancode-version": "31.2.1",
    "authority": "https://gitlab.eclipse.org/eclipsefdn/emo-team/iplab/-/issues/3820",
    "source": "https://search.maven.org/remotecontent?filepath=org/slf4j/jul-to-slf4j/1.7.30/jul-to-slf4j-1.7.30-sources.jar",
    "status": "approved"
}