{
    "id": "maven/mavencentral/org.apache.maven.plugins/maven-enforcer-plugin/3.3.0",
    "license": "Apache-2.0",
    "authority": "https://gitlab.eclipse.org/eclipsefdn/emo-team/iplab/-/issues/9096",
    "source": "https://repo.maven.apache.org/maven2/org/apache/maven/plugins/maven-enforcer-plugin/3.3.0/maven-enforcer-plugin-3.3.0-sources.jar",
    "status": "approved",
    "scans": [
        {
            "date": "June 19, 2023 at 8:49:27 a.m. GMT",
            "authority": "https://gitlab.eclipse.org/eclipsefdn/emo-team/iplab/-/issues/9096",
            "scancode-version": "31.2.1",
            "licenses-discovered": [
                "Apache-2.0"
            ],
            "copyrights": [
            ],
            "file-count": 15,
            "sha256": "a6f6c58a9bfed251a67bf13ff89ad1306bb667def4b991e323b2a4b2d0849408",
            "source": "https://repo.maven.apache.org/maven2/org/apache/maven/plugins/maven-enforcer-plugin/3.3.0/maven-enforcer-plugin-3.3.0-sources.jar",
            "status": "approved"
        }
    ]
}