{
    "id": "npm/npmjs/@babel/plugin-transform-react-jsx-development/7.22.5",
    "license": "MIT",
    "authority": "https://gitlab.eclipse.org/eclipsefdn/emo-team/iplab/-/issues/9025",
    "source": "https://registry.npmjs.org/@babel/plugin-transform-react-jsx-development/-/plugin-transform-react-jsx-development-7.22.5.tgz",
    "status": "approved",
    "scans": [
        {
            "date": "June 15, 2023 at 4:59:21 p.m. GMT",
            "authority": "https://gitlab.eclipse.org/eclipsefdn/emo-team/iplab/-/issues/9025",
            "scancode-version": "31.2.1",
            "licenses-discovered": [
                "MIT"
            ],
            "copyrights": [
                "Copyright (c) 2014-present Sebastian McKenzie and other contributors"
            ],
            "file-count": 5,
            "sha256": "0ed9b22b2568b64e8c5ce7cb4e720b2335ee4d61ba960e3789fba433e3f9ce2a",
            "source": "https://registry.npmjs.org/@babel/plugin-transform-react-jsx-development/-/plugin-transform-react-jsx-development-7.22.5.tgz",
            "status": "approved"
        }
    ]
}