{
    "id": "maven/mavencentral/org.geotools/gt-xml/32.0",
    "license": "LGPL-2.0-or-later AND LGPL-2.1-only AND (Apache-2.0 AND LGPL-2.1-only)",
    "authority": "https://gitlab.eclipse.org/eclipsefdn/emo-team/iplab/-/issues/16226",
    "source": "https://repo.osgeo.org/repository/geotools-releases/org/geotools/gt-xml/32.0/gt-xml-32.0-sources.jar",
    "status": "approved",
    "scans": [
        {
            "date": "September 19, 2024, 3:19:22 p.m. GMT",
            "authority": "https://gitlab.eclipse.org/eclipsefdn/emo-team/iplab/-/issues/16226",
            "scancode-version": "31.2.1",
            "licenses-discovered": [
                "LGPL-2.0-or-later",
                "LGPL-2.1-only",
                "Apache-2.0 AND LGPL-2.1-only"
            ],
            "copyrights": [
                "(c) 2002-2008, Open Source Geospatial Foundation",
                "(c) 2002-2016, Open Source Geospatial Foundation",
                "(c) 2002-2019, Open Source Geospatial Foundation",
                "(c) 2003 - 2016, Open Source Geospatial Foundation",
                "(c) 2003-2008, Open Source Geospatial Foundation",
                "(c) 2003-2015, Open Source Geospatial Foundation",
                "(c) 2004 The Apache Software Foundation",
                "(c) 2004-2008, Open Source Geospatial Foundation",
                "(c) 2004-2015, Open Source Geospatial Foundation",
                "(c) 2004-2016, Open Source Geospatial Foundation",
                "(c) 2005-2008, Open Source Geospatial Foundation",
                "(c) 2005-2016, Open Source Geospatial Foundation",
                "(c) 2006-2008, Open Source Geospatial Foundation",
                "(c) 2010-2011, Open Source Geospatial Foundation",
                "(c) 2010-2012, Open Source Geospatial Foundation",
                "(c) 2011-2016 Open Source Geospatial Foundation",
                "(c) 2015 - 2016, Open Source Geospatial Foundation",
                "(c) 2018, Open Source Geospatial Foundation",
                "(c) 2019, Open Source Geospatial Foundation",
                "(c) 2022, Open Source Geospatial Foundation",
                "Copyright 2002 Vision for New York. 377 Broadway, 11th Floor, New York, New York, 10013",
                "Copyright 2003, 2004 The Apache Software Foundation",
                "Copyright 2003-2016 The Apache Software Foundation",
                "Copyright 2004 The Apache Software Foundation",
                "Copyright 2004-2016 The Apache Software Foundation"
            ],
            "file-count": 157,
            "sha256": "4d5cad91cce5bda5fb625bc9bc87491091e462e222325d9d399389d452a6488f",
            "source": "https://repo.osgeo.org/repository/geotools-releases/org/geotools/gt-xml/32.0/gt-xml-32.0-sources.jar",
            "status": "approved"
        }
    ]
}