{
    "id": "maven/mavencentral/com.azure.resourcemanager/azure-resourcemanager-containerinstance/2.44.0",
    "license": "MIT",
    "authority": "https://gitlab.eclipse.org/eclipsefdn/emo-team/iplab/-/issues/16941",
    "source": "https://repo1.maven.org/maven2/com/azure/resourcemanager/azure-resourcemanager-containerinstance/2.44.0/azure-resourcemanager-containerinstance-2.44.0-sources.jar",
    "status": "approved",
    "scans": [
        {
            "date": "October 29, 2024, 5:00:41 a.m. GMT",
            "authority": "https://gitlab.eclipse.org/eclipsefdn/emo-team/iplab/-/issues/16941",
            "scancode-version": "31.2.1",
            "licenses-discovered": [
                "MIT"
            ],
            "copyrights": [
                "Copyright (c) Microsoft Corporation"
            ],
            "file-count": 107,
            "sha256": "9ca9bf89d529662ae3b120603d6bbf257bdf95ff097bbc4d6796dfecd5f0c0c2",
            "source": "https://repo1.maven.org/maven2/com/azure/resourcemanager/azure-resourcemanager-containerinstance/2.44.0/azure-resourcemanager-containerinstance-2.44.0-sources.jar",
            "status": "approved"
        }
    ]
}