{
    "id": "p2/orbit/p2.eclipse-plugin/org.apache.felix.scr.source/2.2.4",
    "license": "Apache-2.0",
    "authority": "https://gitlab.eclipse.org/eclipsefdn/emo-team/iplab/-/issues/5344",
    "source": "https://search.maven.org/remotecontent?filepath=org/apache/felix/org.apache.felix.scr/2.2.4/org.apache.felix.scr-2.2.4-sources.jar",
    "status": "approved",
    "scans": [
        {
            "date": "December 3, 2022 at 4:07:51 p.m. GMT",
            "authority": "https://gitlab.eclipse.org/eclipsefdn/emo-team/iplab/-/issues/5344",
            "scancode-version": "31.2.1",
            "licenses-discovered": [
                "Apache-2.0"
            ],
            "copyrights": [
                "Copyright (c) OSGi Alliance (2000, 2012)"
            ],
            "file-count": 103,
            "sha256": "f74f9ef56c5c251512807c0325cf5fdbe8ab685ac5249fc7abfe5c84085eb609",
            "source": "https://search.maven.org/remotecontent?filepath=org/apache/felix/org.apache.felix.scr/2.2.4/org.apache.felix.scr-2.2.4-sources.jar",
            "status": "approved"
        }
    ]
}