{
    "id": "maven/mavencentral/com.github.tomakehurst/wiremock-jre8/2.33.2",
    "license": "MIT AND Apache-2.0",
    "licenses-discovered": [
        "MIT",
        "Apache-2.0"
    ],
    "copyrights": [
        "(c) Denis Pushkarev",
        "(c) OpenJS Foundation and other contributors",
        "Copyright (c) Thomas Akehurst"
    ],
    "file-count": 492,
    "scancode-version": "30.1.0",
    "authority": "https://gitlab.eclipse.org/eclipsefdn/emo-team/iplab/-/issues/3073",
    "source": "https://search.maven.org/remotecontent?filepath=com/github/tomakehurst/wiremock-jre8/2.33.2/wiremock-jre8-2.33.2-sources.jar",
    "status": "approved"
}