{
    "id": "maven/mavencentral/biz.aQute.bnd/biz.aQute.tester/7.1.0",
    "license": "Apache-2.0 OR EPL-2.0",
    "authority": "https://gitlab.eclipse.org/eclipsefdn/emo-team/iplab/-/issues/19481",
    "source": "https://repo1.maven.org/maven2/biz/aQute/bnd/biz.aQute.tester/7.1.0/biz.aQute.tester-7.1.0-sources.jar",
    "status": "approved",
    "scans": [
        {
            "date": "February 19, 2025 at 8:51:02 a.m. GMT",
            "authority": "https://gitlab.eclipse.org/eclipsefdn/emo-team/iplab/-/issues/19481",
            "scancode-version": "31.2.1",
            "licenses-discovered": [
            ],
            "copyrights": [
            ],
            "file-count": 17,
            "sha256": "39c49717dd22f9c5550821e33486d3f103c0da4629d14af939bcf74d8ed133e7",
            "source": "https://repo1.maven.org/maven2/biz/aQute/bnd/biz.aQute.tester/7.1.0/biz.aQute.tester-7.1.0-sources.jar",
            "status": "restricted"
        }
    ]
}