{
    "id": "p2/orbit/p2.eclipse.plugin/org.apache.lucene.analysis-common/9.4.2.v20221211-0752",
    "license": "Apache-2.0 AND BSD-2-Clause AND BSD-3-Clause AND CC-BY-SA-3.0 AND ICU  AND LicenseRef-scancode-unicode-mappings AND MIT AND Python-2.0",
    "authority": "https://gitlab.eclipse.org/eclipsefdn/emo-team/iplab/-/issues/5864",
    "source": "https://search.maven.org/remotecontent?filepath=org/apache/lucene/lucene-analysis-common/9.4.2/lucene-analysis-common-9.4.2-sources.jar",
    "status": "approved",
    "scans": [
        {
            "date": "December 15, 2022 at 10:31:40 a.m. GMT",
            "authority": "https://gitlab.eclipse.org/eclipsefdn/emo-team/iplab/-/issues/5864",
            "scancode-version": "31.2.1",
            "licenses-discovered": [
                "Apache-2.0",
                "Apache-2.0 AND BSD-2-Clause AND BSD-3-Clause AND CC-BY-SA-3.0 AND ICU AND LGPL-2.0-or-later AND LicenseRef-scancode-other-copyleft AND LicenseRef-scancode-unicode-mappings AND MIT AND Python-2.0",
                "Apache-2.0 AND BSD-3-Clause",
                "Apache-2.0 AND LPPL-1.3c",
                "BSD-3-Clause"
            ],
            "copyrights": [
                "Copyright (c) 1999-2010, International Business Machines Corporation and others",
                "Copyright (c) 2001, Dr Martin Porter",
                "Copyright (c) 2001-2009 Anders Moeller",
                "Copyright (c) 2002, Richard Boulton",
                "Copyright (c) 2003, Center for Intelligent Information Retrieval, University of Massachusetts, Amherst",
                "Copyright (c) 2004,2005, Richard Boulton",
                "Copyright (c) 2005, Jacques Savoy",
                "Copyright (c) 2006 Dawid Weiss",
                "Copyright (c) 2006,2007,2009,2010,2011,2014-2019, Olly Betts",
                "Copyright (c) 2007-2011 Dawid Weiss, Marcin Milkowski",
                "Copyright (c) 2010, Jean-Philippe Barrette-LaPierre, <jpb@rrette.com>",
                "Copyright (c) 2011 Zygmunt Saloni, Wlodzimierz Gruszczynski, Marcin Wolinski, Robert Wolosz",
                "Copyright (c) 2011-2016, Yann Collet",
                "Copyright (c) 2013, Yoshiki Shibukawa",
                "Copyright 2001-2004 Unicode, Inc.",
                "Copyright 2003, CIIR University of Massachusetts Amherst (http://ciir.cs.umass.edu)",
                "Copyright 2008, Luicid Imagination, Inc."
            ],
            "file-count": 536,
            "sha256": "5100475b95708bc8c89836037e072bbbd595e2380e6c961b6b74d3e2379afd8b",
            "source": "https://search.maven.org/remotecontent?filepath=org/apache/lucene/lucene-analysis-common/9.4.2/lucene-analysis-common-9.4.2-sources.jar",
            "status": "restricted"
        }
    ]
}
