{
    "id": "maven/mavencentral/com.thoughtworks.qdox/qdox/2.1.0",
    "license": "Apache-2.0",
    "authority": "https://gitlab.eclipse.org/eclipsefdn/emo-team/iplab/-/issues/17657",
    "source": "https://repo1.maven.org/maven2/com/thoughtworks/qdox/qdox/2.1.0/qdox-2.1.0-sources.jar",
    "status": "approved",
    "scans": [
        {
            "date": "December 4, 2024 at 12:04:29 p.m. GMT",
            "authority": "https://gitlab.eclipse.org/eclipsefdn/emo-team/iplab/-/issues/17657",
            "scancode-version": "31.2.1",
            "licenses-discovered": [
                "Apache-2.0"
            ],
            "copyrights": [
            ],
            "file-count": 207,
            "sha256": "5976e93e416bef84f73580fedad6c0c118a3234784082b2aae5cf17b735a874c",
            "source": "https://repo1.maven.org/maven2/com/thoughtworks/qdox/qdox/2.1.0/qdox-2.1.0-sources.jar",
            "status": "approved"
        }
    ]
}