{
    "id": "maven/mavencentral/org.apache.hadoop.thirdparty/hadoop-shaded-protobuf_3_7/1.1.1",
    "license": "Apache-2.0 AND BSD-3-Clause AND MIT",
    "authority": "https://gitlab.eclipse.org/eclipsefdn/emo-team/iplab/-/issues/13045",
    "source": "https://repo1.maven.org/maven2/org/apache/hadoop/thirdparty/hadoop-shaded-protobuf_3_7/1.1.1/hadoop-shaded-protobuf_3_7-1.1.1.jar",
    "status": "approved",
    "scans": [
        {
            "date": "February 1, 2024 at 6:52:36 p.m. GMT",
            "authority": "https://gitlab.eclipse.org/eclipsefdn/emo-team/iplab/-/issues/13045",
            "scancode-version": "31.2.1",
            "licenses-discovered": [
                "Apache-2.0 AND BSD-3-Clause AND MIT",
                "Apache-2.0",
                "LicenseRef-scancode-protobuf",
                "BSD-3-Clause"
            ],
            "copyrights": [
                "Copyright 2008 Google Inc.",
                "Copyright 2020"
            ],
            "file-count": 606,
            "sha256": "4b4f70f14576cabec34607a035b58aaefa6c042d693328d90de79db581966f8b",
            "source": "https://repo1.maven.org/maven2/org/apache/hadoop/thirdparty/hadoop-shaded-protobuf_3_7/1.1.1/hadoop-shaded-protobuf_3_7-1.1.1.jar",
            "status": "restricted"
        }
    ]
}
