{
    "id": "npm/npmjs/@inversifyjs/common/1.3.3",
    "license": "MIT",
    "authority": "https://gitlab.eclipse.org/eclipsefdn/emo-team/iplab/-/issues/17408",
    "source": "https://github.com/inversify/monorepo/archive/refs/tags/@inversifyjs/core@1.3.3.zip",
    "status": "approved",
    "scans": [
        {
            "date": "November 22, 2024, 1:20:52 p.m. GMT",
            "authority": "https://gitlab.eclipse.org/eclipsefdn/emo-team/iplab/-/issues/17408",
            "scancode-version": "31.2.1",
            "licenses-discovered": [
                "MIT"
            ],
            "copyrights": [
                "Copyright (c) 2024 inversify"
            ],
            "file-count": 178,
            "sha256": "4ac4004a6961a6d24202465f3ecdd8d0a86d99e325fdf9abc0fe3b5376365eb8",
            "source": "https://github.com/inversify/monorepo/archive/refs/tags/@inversifyjs/core@1.3.3.zip",
            "status": "approved"
        }
    ]
}