{
    "id": "maven/mavencentral/org.wildfly.security/wildfly-elytron-http/2.2.1.Final",
    "license": "Apache-2.0",
    "authority": "https://gitlab.eclipse.org/eclipsefdn/emo-team/iplab/-/issues/9514",
    "source": "https://repo.maven.apache.org/maven2/org/wildfly/security/wildfly-elytron-http/2.2.1.Final/wildfly-elytron-http-2.2.1.Final-sources.jar",
    "status": "approved",
    "scans": [
        {
            "date": "July 17, 2023 at 1:49:50 p.m. GMT",
            "authority": "https://gitlab.eclipse.org/eclipsefdn/emo-team/iplab/-/issues/9514",
            "scancode-version": "31.2.1",
            "licenses-discovered": [
                "Apache-2.0"
            ],
            "copyrights": [
                "Copyright 2014 Red Hat, Inc., and individual contributors",
                "Copyright 2015 Red Hat, Inc., and individual contributors",
                "Copyright 2016 Red Hat, Inc., and individual contributors",
                "Copyright 2018 Red Hat, Inc., and individual contributors",
                "Copyright 2021 Red Hat, Inc."
            ],
            "file-count": 24,
            "sha256": "26f343c5978c5bb0f33174acf3bc47c411bf35dbb31c2f2a81a1abfe65e83d19",
            "source": "https://repo.maven.apache.org/maven2/org/wildfly/security/wildfly-elytron-http/2.2.1.Final/wildfly-elytron-http-2.2.1.Final-sources.jar",
            "status": "approved"
        }
    ]
}