{
    "id": "maven/mavencentral/com.google.api.grpc/proto-google-common-protos/2.24.0",
    "license": "Apache-2.0",
    "authority": "https://gitlab.eclipse.org/eclipsefdn/emo-team/iplab/-/issues/10472",
    "source": "https://repo.maven.apache.org/maven2/com/google/api/grpc/proto-google-common-protos/2.24.0/proto-google-common-protos-2.24.0-sources.jar",
    "status": "approved",
    "scans": [
        {
            "date": "September 12, 2023 at 6:10:12 a.m. GMT",
            "authority": "https://gitlab.eclipse.org/eclipsefdn/emo-team/iplab/-/issues/10472",
            "scancode-version": "31.2.1",
            "licenses-discovered": [
                "Apache-2.0"
            ],
            "copyrights": [
                "Copyright 2015 Google LLC",
                "Copyright 2016 Google LLC",
                "Copyright 2019 Google LLC.",
                "Copyright 2020 Google LLC",
                "Copyright 2021 Google LLC",
                "Copyright 2021 Google LLC.",
                "Copyright 2022 Google LLC",
                "Copyright 2023 Google LLC"
            ],
            "file-count": 366,
            "sha256": "aba01c519b65c57df90532b6ec87aab7ddcb1aea6417a2e39d6359daa3137aa5",
            "source": "https://repo.maven.apache.org/maven2/com/google/api/grpc/proto-google-common-protos/2.24.0/proto-google-common-protos-2.24.0-sources.jar",
            "status": "approved"
        }
    ]
}