{
    "id": "go/golang/github.com%2Fgo-sql-driver/mysql/v1.5.0",
    "license": "MPL-2.0",
    "authority": "https://gitlab.eclipse.org/eclipsefdn/emo-team/iplab/-/issues/12512",
    "source": "https://proxy.golang.org/github.com%2Fgo-sql-driver/mysql/@v/v1.5.0.zip",
    "status": "approved",
    "scans": [
        {
            "date": "December 26, 2023 at 6:47:32 a.m. GMT",
            "authority": "https://gitlab.eclipse.org/eclipsefdn/emo-team/iplab/-/issues/12512",
            "scancode-version": "31.2.1",
            "licenses-discovered": [
                "LicenseRef-scancode-proprietary-license AND MPL-2.0",
                "MPL-2.0",
                "MPL-1.1 AND MPL-2.0"
            ],
            "copyrights": [
                "Copyright 2012 The Go-MySQL-Driver Authors",
                "Copyright 2013 The Go-MySQL-Driver Authors",
                "Copyright 2014 The Go-MySQL-Driver Authors",
                "Copyright 2016 The Go-MySQL-Driver Authors",
                "Copyright 2017 The Go-MySQL-Driver Authors",
                "Copyright 2018 The Go-MySQL-Driver Authors",
                "Copyright 2019 The Go-MySQL-Driver Authors"
            ],
            "file-count": 45,
            "sha256": "0096578da82b58a7103152d76b20d3a140adc30ca2e0769c5cd570b7d09e6566",
            "source": "https://proxy.golang.org/github.com%2Fgo-sql-driver/mysql/@v/v1.5.0.zip",
            "status": "restricted"
        }
    ]
}
