{
    "id": "go/golang/github.com%2Fgo-openapi/spec/v0.0.0-20160808142527-6aced65f8501",
    "license": "Apache-2.0 AND (Apache-2.0 AND CC-BY-4.0) AND MIT AND CC-BY-4.0",
    "authority": "https://gitlab.eclipse.org/eclipsefdn/emo-team/iplab/-/issues/12292",
    "source": "https://proxy.golang.org/github.com%2Fgo-openapi/spec/@v/v0.0.0-20160808142527-6aced65f8501.zip",
    "status": "approved",
    "scans": [
        {
            "date": "December 20, 2023 at 1:53:40 p.m. GMT",
            "authority": "https://gitlab.eclipse.org/eclipsefdn/emo-team/iplab/-/issues/12292",
            "scancode-version": "31.2.1",
            "licenses-discovered": [
                "Apache-2.0",
                "Apache-2.0 AND CC-BY-4.0",
                "MIT",
                "CC-BY-4.0"
            ],
            "copyrights": [
                "Copyright (c) 2004, 2006 The Linux Foundation and its contributors",
                "Copyright 2015 go-swagger"
            ],
            "file-count": 64,
            "sha256": "aee22fe82089ca14d83415dd5ba55cf6789045f80d56e35253891c0cabf7cce3",
            "source": "https://proxy.golang.org/github.com%2Fgo-openapi/spec/@v/v0.0.0-20160808142527-6aced65f8501.zip",
            "status": "approved"
        }
    ]
}