{
    "id": "npm/npmjs/-/normalize-package-data/3.0.3",
    "license": "BSD-2-Clause",
    "authority": "https://gitlab.eclipse.org/eclipsefdn/emo-team/iplab/-/issues/11614",
    "source": "https://github.com/npm/normalize-package-data/archive/refs/tags/v3.0.3.zip",
    "status": "approved",
    "scans": [
        {
            "date": "November 17, 2023 at 4:17:19 p.m. GMT",
            "authority": "https://gitlab.eclipse.org/eclipsefdn/emo-team/iplab/-/issues/11614",
            "scancode-version": "31.2.1",
            "licenses-discovered": [
                "BSD-2-Clause AND BSD-3-Clause",
                "BSD-2-Clause",
                "BSD-2-Clause AND JSON",
                "Apache-2.0 AND MIT",
                "MIT"
            ],
            "copyrights": [
                "Copyright (c) 2013 Meryn Stol",
                "Copyright (c) Meryn Stol 'Author"
            ],
            "file-count": 34,
            "sha256": "f36ae938040b7b2ddb351a4b511b00cf557c3da7639aa670658a98332e5309a1",
            "source": "https://github.com/npm/normalize-package-data/archive/refs/tags/v3.0.3.zip",
            "status": "restricted"
        }
    ]
}
