{
    "id": "crate/cratesio/-/zerofrom-derive/0.1.4",
    "license": "Apache-2.0 AND Unicode-3.0",
    "authority": "https://gitlab.eclipse.org/eclipsefdn/emo-team/iplab/-/issues/15438",
    "source": "https://crates.io/api/v1/crates/zerofrom-derive/0.1.4/download",
    "status": "approved",
    "scans": [
        {
            "date": "June 15, 2024 at 2:52:33 a.m. GMT",
            "authority": "https://gitlab.eclipse.org/eclipsefdn/emo-team/iplab/-/issues/15438",
            "scancode-version": "31.2.1",
            "licenses-discovered": [
                "LicenseRef-scancode-unknown-spdx"
            ],
            "copyrights": [
                "(c) 1995-2016 International Business Machines Corporation and others",
                "Copyright (c) 2020-2024 Unicode, Inc."
            ],
            "file-count": 9,
            "sha256": "0ea7b4a3637ea8669cedf0f1fd5c286a17f3de97b8dd5a70a6c167a1730e63a5",
            "source": "https://crates.io/api/v1/crates/zerofrom-derive/0.1.4/download",
            "status": "restricted"
        }
    ]
}