{
    "id": "nuget/nuget/-/xunit/2.5.0",
    "license": "Apache-2.0 AND MIT",
    "authority": "https://gitlab.eclipse.org/eclipsefdn/emo-team/iplab/-/issues/10072",
    "source": "https://github.com/xunit/xunit/archive/refs/tags/2.5.0.zip",
    "status": "approved",
    "scans": [
        {
            "date": "August 16, 2023 at 10:50:42 a.m. GMT",
            "authority": "https://gitlab.eclipse.org/eclipsefdn/emo-team/iplab/-/issues/10072",
            "scancode-version": "31.2.1",
            "licenses-discovered": [
                "Apache-2.0 AND MIT",
                "Apache-2.0 AND LicenseRef-scancode-free-unknown",
                "JSON",
                "Apache-2.0",
                "MIT"
            ],
            "copyrights": [
                "Copyright (c) .NET Foundation",
                "Copyright (c) .NET Foundation and Contributors",
                "Copyright (c) .NET Foundation and contributors",
                "Copyright (c) 2015 .NET Foundation"
            ],
            "file-count": 703,
            "sha256": "651b665eda06eb9354736aa793113c81238e7caf667ceb713f67c6010e717dbe",
            "source": "https://github.com/xunit/xunit/archive/refs/tags/2.5.0.zip",
            "status": "restricted"
        }
    ]
}
