{
    "id": "npm/npmjs/-/css-loader/6.9.0",
    "license": "MIT AND Apache-2.0",
    "authority": "https://gitlab.eclipse.org/eclipsefdn/emo-team/iplab/-/issues/12670",
    "source": "https://github.com/webpack-contrib/css-loader/archive/refs/tags/v6.9.0.zip",
    "status": "approved",
    "scans": [
        {
            "date": "January 10, 2024 at 7:38:29 a.m. GMT",
            "authority": "https://gitlab.eclipse.org/eclipsefdn/emo-team/iplab/-/issues/12670",
            "scancode-version": "31.2.1",
            "licenses-discovered": [
                "MIT",
                "Apache-2.0"
            ],
            "copyrights": [
                "Copyright 2011 Google Inc.",
                "Copyright JS Foundation and other contributors"
            ],
            "file-count": 522,
            "sha256": "5c0f86c8aa2ba3d4a6db28a8314a98513044bddf070fa2f87d859aee6cba5d41",
            "source": "https://github.com/webpack-contrib/css-loader/archive/refs/tags/v6.9.0.zip",
            "status": "approved"
        }
    ]
}