{
    "id": "nuget/nuget/-/Grapevine/4.2.2",
    "license": "Apache-2.0",
    "authority": "https://gitlab.eclipse.org/eclipsefdn/emo-team/iplab/-/issues/16001",
    "source": "https://github.com/scottoffen/grapevine-legacy/archive/refs/tags/4.2.2.zip",
    "status": "approved",
    "scans": [
        {
            "date": "August 23, 2024 at 3:09:27 p.m. GMT",
            "authority": "https://gitlab.eclipse.org/eclipsefdn/emo-team/iplab/-/issues/16001",
            "scancode-version": "31.2.1",
            "licenses-discovered": [
                "Apache-2.0"
            ],
            "copyrights": [
                "(c) 2014-2019 Scott Offen Scott Offen"
            ],
            "file-count": 97,
            "sha256": "a6c58468c910a1103076e49786541bee84603b2fb1d413cee5d62429983db181",
            "source": "https://github.com/scottoffen/grapevine-legacy/archive/refs/tags/4.2.2.zip",
            "status": "approved"
        }
    ]
}