{
    "id": "npm/npmjs/-/rgbcolor/1.0.1",
    "license": "MIT",
    "authority": "https://gitlab.eclipse.org/eclipsefdn/emo-team/iplab/-/issues/16602",
    "source": "https://registry.yarnpkg.com/rgbcolor/-/rgbcolor-1.0.1.tgz",
    "status": "approved",
    "scans": [
        {
            "date": "October 10, 2024, 8:29:23 a.m. GMT",
            "authority": "https://gitlab.eclipse.org/eclipsefdn/emo-team/iplab/-/issues/16602",
            "scancode-version": "31.2.1",
            "licenses-discovered": [
                "MIT"
            ],
            "copyrights": [
                "Copyright (c) 2016 Stoyan Stefanov, http://phpied.com"
            ],
            "file-count": 5,
            "sha256": "51be5b477cbe2b12d89be8d72772c609d005bb4d6b271f6031796ecf18f7ca03",
            "source": "https://registry.yarnpkg.com/rgbcolor/-/rgbcolor-1.0.1.tgz",
            "status": "approved"
        }
    ]
}