{
    "id": "npm/npmjs/-/z-schema/5.0.6",
    "license": "MIT AND (BSD-3-Clause AND CC-BY-4.0 AND MIT) AND CC-BY-4.0",
    "authority": "https://gitlab.eclipse.org/eclipsefdn/emo-team/iplab/-/issues/14015",
    "source": "https://github.com/zaggino/z-schema/archive/refs/tags/v5.0.6.zip",
    "status": "approved",
    "scans": [
        {
            "date": "March 22, 2024 at 4:31:13 p.m. GMT",
            "authority": "https://gitlab.eclipse.org/eclipsefdn/emo-team/iplab/-/issues/14015",
            "scancode-version": "31.2.1",
            "licenses-discovered": [
                "MIT",
                "BSD-3-Clause AND CC-BY-4.0 AND MIT",
                "CC-BY-4.0"
            ],
            "copyrights": [
                "Copyright (c) 2008-2014 Pivotal Labs",
                "Copyright (c) 2014 Martin Zagora and other contributors https://github.com/zaggino/z-schema/graphs/contributors",
                "Copyright JS Foundation and other contributors <https://js.foundation/>",
                "Copyright Jeremy Ashkenas, DocumentCloud and Investigative Reporters & Editors",
                "Copyright Joyent, Inc. and other Node contributors",
                "Copyright jQuery Foundation and other contributors <https://jquery.org/>"
            ],
            "file-count": 137,
            "sha256": "51d5a3dae91a25c56836db5d9a37eb7c536629f8eba9ef8ab3052a52a0a744e0",
            "source": "https://github.com/zaggino/z-schema/archive/refs/tags/v5.0.6.zip",
            "status": "approved"
        }
    ]
}