{
    "id": "nuget/nuget/-/xunit.analyzers/1.11.0",
    "license": "Apache-2.0 AND MIT",
    "authority": "https://gitlab.eclipse.org/eclipsefdn/emo-team/iplab/-/issues/14197",
    "source": "https://github.com/xunit/xunit.analyzers/archive/refs/tags/1.11.0.zip",
    "status": "approved",
    "scans": [
        {
            "date": "April 2, 2024 at 7:28:31 a.m. GMT",
            "authority": "https://gitlab.eclipse.org/eclipsefdn/emo-team/iplab/-/issues/14197",
            "scancode-version": "31.2.1",
            "licenses-discovered": [
                "Apache-2.0 AND MIT",
                "Apache-2.0 AND LicenseRef-scancode-free-unknown",
                "Apache-2.0",
                "MIT"
            ],
            "copyrights": [
                "Copyright (c) .NET Foundation",
                "Copyright (c) .NET Foundation and Contributors"
            ],
            "file-count": 315,
            "sha256": "7061c631e4183c72aac7064340c98df6827e8e2182067d2e5c5de664cf1daa35",
            "source": "https://github.com/xunit/xunit.analyzers/archive/refs/tags/1.11.0.zip",
            "status": "restricted"
        }
    ]
}
