{
    "id": "npm/npmjs/-/react-confetti/6.2.2",
    "license": "MIT",
    "authority": "https://gitlab.eclipse.org/eclipsefdn/emo-team/iplab/-/issues/19349",
    "source": "https://github.com/alampros/react-confetti/archive/refs/tags/v6.2.2.zip",
    "status": "approved",
    "scans": [
        {
            "date": "February 6, 2025 at 10:29:00 a.m. GMT",
            "authority": "https://gitlab.eclipse.org/eclipsefdn/emo-team/iplab/-/issues/19349",
            "scancode-version": "31.2.1",
            "licenses-discovered": [
                "MIT"
            ],
            "copyrights": [
                "Copyright (c) 2016 Aaron Lampros"
            ],
            "file-count": 26,
            "sha256": "1a6d834cd4521439867d213f88e517f5961f665d89b3c78b6539a4624aa2af0a",
            "source": "https://github.com/alampros/react-confetti/archive/refs/tags/v6.2.2.zip",
            "status": "approved"
        }
    ]
}