{
    "id": "pypi/pypi/-/grpcio-tools/1.64.1",
    "license": "Apache-2.0 AND BSD-3-Clause AND MIT",
    "authority": "https://gitlab.eclipse.org/eclipsefdn/emo-team/iplab/-/issues/15155",
    "source": "https://files.pythonhosted.org/packages/a8/21/6ec1c3849199c0a5e12f9640316a1cd2020fc29ecb1910e858d8b0e5d1b4/grpcio_tools-1.64.1.tar.gz",
    "status": "approved",
    "scans": [
        {
            "date": "June 11, 2024 at 3:46:11 p.m. GMT",
            "authority": "https://gitlab.eclipse.org/eclipsefdn/emo-team/iplab/-/issues/15155",
            "scancode-version": "31.2.1",
            "licenses-discovered": [
                "Apache-2.0",
                "BSD-3-Clause",
                "Apache-2.0 AND LicenseRef-scancode-generic-exception",
                "MIT"
            ],
            "copyrights": [
                "Copyright (c) 2009-2021, Google LLC",
                "Copyright (c) 2009-2023, Google LLC",
                "Copyright (c) 2019 Yibo Cai",
                "Copyright 2007 Google Inc.",
                "Copyright 2008 Google Inc.",
                "Copyright 2008 Google Inc. https://developers.google.com/protocol-buffers",
                "Copyright 2009 Google Inc.",
                "Copyright 2012 Google Inc.",
                "Copyright 2014 Google Inc.",
                "Copyright 2015 Google Inc.",
                "Copyright 2015 gRPC",
                "Copyright 2015-2016 gRPC",
                "Copyright 2016 Google Inc.",
                "Copyright 2016 gRPC",
                "Copyright 2017 Google Inc.",
                "Copyright 2017 The Abseil Authors",
                "Copyright 2017 gRPC",
                "Copyright 2018 The Abseil Authors",
                "Copyright 2018 gRPC",
                "Copyright 2019 The Abseil Authors",
                "Copyright 2019 gRPC",
                "Copyright 2020 The Abseil Authors",
                "Copyright 2020 The gRPC",
                "Copyright 2020 gRPC",
                "Copyright 2021 The Abseil Authors",
                "Copyright 2021 The gRPC",
                "Copyright 2021 gRPC",
                "Copyright 2022 Google Inc.",
                "Copyright 2022 Google LLC",
                "Copyright 2022 The Abseil Authors",
                "Copyright 2022 gRPC",
                "Copyright 2023 Google Inc.",
                "Copyright 2023 Google LLC",
                "Copyright 2023 Google LLC.",
                "Copyright 2023 The Abseil Authors",
                "Copyright 2023 The gRPC",
                "Copyright 2023 gRPC",
                "Copyright 2024 Google LLC.",
                "Copyright 2024 The Abseil Authors",
                "Copyright 2024 The gRPC",
                "Copyright 2024 gRPC",
                "IsLower (c) IsDigit (c)"
            ],
            "file-count": 2935,
            "sha256": "72b3550b91adb8354656ecf0f6d1d4611299044bae11fb1e7cc1d1bb66b8c1eb",
            "source": "https://files.pythonhosted.org/packages/a8/21/6ec1c3849199c0a5e12f9640316a1cd2020fc29ecb1910e858d8b0e5d1b4/grpcio_tools-1.64.1.tar.gz",
            "status": "restricted"
        }
    ]
}