{
    "id": "maven/mavencentral/androidx.emoji2/emoji2/1.4.0",
    "license": "Apache-2.0",
    "authority": "https://gitlab.eclipse.org/eclipsefdn/emo-team/iplab/-/issues/10478",
    "source": "https://dl.google.com/android/maven2/androidx/emoji2/emoji2/1.4.0/emoji2-1.4.0-sources.jar",
    "status": "approved",
    "scans": [
        {
            "date": "September 12, 2023 at 7:45:25 a.m. GMT",
            "authority": "https://gitlab.eclipse.org/eclipsefdn/emo-team/iplab/-/issues/10478",
            "scancode-version": "31.2.1",
            "licenses-discovered": [
                "Apache-2.0"
            ],
            "copyrights": [
                "Copyright 2021 The Android Open Source Project",
                "Copyright 2022 The Android Open Source Project"
            ],
            "file-count": 17,
            "sha256": "5db44eec9cee653ba403f0e88a02ce41ab6301a0b7dd7cb35fc32f9747f2228b",
            "source": "https://dl.google.com/android/maven2/androidx/emoji2/emoji2/1.4.0/emoji2-1.4.0-sources.jar",
            "status": "approved"
        }
    ]
}