{
    "id": "npm/npmjs/@vscode/vsce-sign-darwin-arm64/2.0.2",
    "license": "LicenseRef-scancode-ms-xamarin-uitest3.2.0",
    "authority": "https://gitlab.eclipse.org/eclipsefdn/emo-team/iplab/-/issues/15969",
    "source": "https://registry.yarnpkg.com/@vscode/vsce-sign-darwin-arm64/-/vsce-sign-darwin-arm64-2.0.2.tgz",
    "status": "restricted",
    "board_exception": [
        {
            "rule": "project_all_future",
            "project": "ecd.cdt-cloud"
        },
        {
            "rule": "project_all_future",
            "project": "ecd.theia"
        }
    ],
    "scans": [
        {
            "date": "August 22, 2024 at 12:12:04 a.m. GMT",
            "authority": "https://gitlab.eclipse.org/eclipsefdn/emo-team/iplab/-/issues/15969",
            "scancode-version": "31.2.1",
            "licenses-discovered": [
                "LicenseRef-scancode-ms-xamarin-uitest3.2.0"
            ],
            "copyrights": [
            ],
            "file-count": 3,
            "sha256": "aa3f59b13c163cdc14e7d78a793419892080da8ad7bfc62663cddc157ba81e92",
            "source": "https://registry.yarnpkg.com/@vscode/vsce-sign-darwin-arm64/-/vsce-sign-darwin-arm64-2.0.2.tgz",
            "status": "restricted"
        }
    ]
}