{
    "id": "maven/mavencentral/io.netty/netty-transport-classes-kqueue/4.1.84.Final",
    "license": "Apache-2.0",
    "licenses-discovered": [
        "Apache-2.0"
    ],
    "copyrights": [
        "Copyright 2016 The Netty Project",
        "Copyright 2021 The Netty Project"
    ],
    "file-count": 32,
    "scancode-version": "31.2.1",
    "authority": "https://gitlab.eclipse.org/eclipsefdn/emo-team/iplab/-/issues/4107",
    "source": "https://search.maven.org/remotecontent?filepath=io/netty/netty-transport-classes-kqueue/4.1.84.Final/netty-transport-classes-kqueue-4.1.84.Final-sources.jar",
    "status": "approved"
}