{
    "id": "npm/npmjs/-/cypress/13.15.2",
    "license": "MIT AND BSD-3-Clause AND Apache-2.0 AND MPL-2.0",
    "authority": "https://gitlab.eclipse.org/eclipsefdn/emo-team/iplab/-/issues/17385",
    "source": "https://github.com/cypress-io/cypress/archive/refs/tags/v13.15.2.zip",
    "status": "approved",
    "scans": [
        {
            "date": "November 21, 2024, 12:08:47 p.m. GMT",
            "authority": "https://gitlab.eclipse.org/eclipsefdn/emo-team/iplab/-/issues/17385",
            "scancode-version": "31.2.1",
            "licenses-discovered": [
                "MIT",
                "BSD-3-Clause",
                "Apache-2.0",
                "MPL-2.0",
                "EPL-1.0 AND NTP-0",
                "ISC",
                "JSON",
                "BSD-2-Clause AND MIT"
            ],
            "copyrights": [
                "Copyright (c) 2007 Ariel Flesler",
                "Copyright (c) 2014, Eugene Ware",
                "Copyright (c) 2016' Cypress.io Kitchen Sink",
                "Copyright (c) 2017 Cypress.io https://cypress.io",
                "Copyright (c) 2018, salesforce.com, inc.",
                "Copyright (c) 2020 Cypress.io https://cypress.io",
                "Copyright (c) 2021 Briebug, Inc.",
                "Copyright (c) 2021 Cypress.io",
                "Copyright (c) 2023 Cypress.io",
                "Copyright 2017 Google Inc.",
                "Copyright Google LLC",
                "Copyright JS Foundation and other contributors",
                "Copyright jQuery Foundation and other contributors",
                "copyright content Cypress.io"
            ],
            "file-count": 6939,
            "sha256": "25d6ce75efd4c0ae06a9554120d7bf7155d26cc933594551ba37b253f4c4a0c0",
            "source": "https://github.com/cypress-io/cypress/archive/refs/tags/v13.15.2.zip",
            "status": "restricted"
        }
    ]
}