{
    "id": "maven/mavencentral/org.jetbrains.kotlin/kotlin-stdlib-jdk8/1.8.22",
    "license": "Apache-2.0",
    "authority": "https://gitlab.eclipse.org/eclipsefdn/emo-team/iplab/-/issues/8875",
    "source": "https://repo.maven.apache.org/maven2/org/jetbrains/kotlin/kotlin-stdlib-jdk8/1.8.22/kotlin-stdlib-jdk8-1.8.22-sources.jar",
    "status": "approved",
    "scans": [
        {
            "date": "June 14, 2023 at 6:51:04 p.m. GMT",
            "authority": "https://gitlab.eclipse.org/eclipsefdn/emo-team/iplab/-/issues/8875",
            "scancode-version": "31.2.1",
            "licenses-discovered": [
            ],
            "copyrights": [
            ],
            "file-count": 2,
            "sha256": "40e9a80f6b953d12389623760d438e69914098d0c4d7053f70f90533ec041259",
            "source": "https://repo.maven.apache.org/maven2/org/jetbrains/kotlin/kotlin-stdlib-jdk8/1.8.22/kotlin-stdlib-jdk8-1.8.22-sources.jar",
            "status": "restricted"
        }
    ]
}
