{
    "id": "maven/mavencentral/com.azure.resourcemanager/azure-resourcemanager-monitor/2.28.0",
    "license": "MIT",
    "authority": "https://gitlab.eclipse.org/eclipsefdn/emo-team/iplab/-/issues/9679",
    "source": "https://repo.maven.apache.org/maven2/com/azure/resourcemanager/azure-resourcemanager-monitor/2.28.0/azure-resourcemanager-monitor-2.28.0-sources.jar",
    "status": "approved",
    "scans": [
        {
            "date": "July 20, 2023 at 11:20:28 a.m. GMT",
            "authority": "https://gitlab.eclipse.org/eclipsefdn/emo-team/iplab/-/issues/9679",
            "scancode-version": "31.2.1",
            "licenses-discovered": [
                "MIT"
            ],
            "copyrights": [
                "(c) 2008 VeriSign, Inc.",
                "Copyright (c) Microsoft Corporation"
            ],
            "file-count": 373,
            "sha256": "f88bc240cd81be85d9c96f216e75732799a29e0a05ca35617e63208d4b57b20a",
            "source": "https://repo.maven.apache.org/maven2/com/azure/resourcemanager/azure-resourcemanager-monitor/2.28.0/azure-resourcemanager-monitor-2.28.0-sources.jar",
            "status": "approved"
        }
    ]
}