{
    "id": "npm/npmjs/@rollup/plugin-commonjs/25.0.1",
    "license": "MIT",
    "authority": "https://gitlab.eclipse.org/eclipsefdn/emo-team/iplab/-/issues/9003",
    "source": "https://registry.npmjs.org/@rollup/plugin-commonjs/-/plugin-commonjs-25.0.1.tgz",
    "status": "approved",
    "scans": [
        {
            "date": "June 15, 2023 at 2:18:44 p.m. GMT",
            "authority": "https://gitlab.eclipse.org/eclipsefdn/emo-team/iplab/-/issues/9003",
            "scancode-version": "31.2.1",
            "licenses-discovered": [
                "MIT"
            ],
            "copyrights": [
                "Copyright (c) 2019 RollupJS"
            ],
            "file-count": 7,
            "sha256": "885655920d57e75d5795b7603e6f757c4ec18ee271fd9716a207bd10ece37245",
            "source": "https://registry.npmjs.org/@rollup/plugin-commonjs/-/plugin-commonjs-25.0.1.tgz",
            "status": "approved"
        }
    ]
}