{
    "id": "git/github/golang/text/v0.3.2",
    "license": "BSD-3-Clause",
    "licenses-discovered": [
        "Apache-2.0 AND BSD-3-Clause",
        "BSD-3-Clause",
        "BSD-3-Clause AND CC-BY-SA-1.0 AND CC-BY-SA-2.0 AND CC-BY-SA-3.0",
        "BSD-3-Clause AND CC-BY-SA-1.0 AND CC-BY-SA-2.0 AND CC-BY-SA-2.5 AND CC-BY-SA-3.0"
    ],
    "copyrights": [
        "(c) (c) A",
        "(c) (c) AAEE",
        "(c) AeHa (c)",
        "(c) Bv",
        "(c) EAiE (c)",
        "(c) EeAoq (c)",
        "(c) EmeEBu (c)",
        "(c) aA'AE (c) 1AE",
        "(c) lEEe (c) AE",
        "(c) oav!A (c) AY I",
        "(c) uSSg1/2a+-N (c) OY",
        "Copyright The Go Authors"
    ],
    "file-count": 510,
    "scancode-version": "30.1.0",
    "authority": "https://gitlab.eclipse.org/eclipsefdn/emo-team/iplab/-/issues/3704",
    "source": "https://github.com/golang/text/archive/refs/tags/v0.3.2.zip",
    "status": "approved"
}
