{
    "id": "npm/npmjs/-/eslint-import-resolver-node/0.3.9",
    "license": "MIT",
    "authority": "https://gitlab.eclipse.org/eclipsefdn/emo-team/iplab/-/issues/9923",
    "source": "https://registry.yarnpkg.com/eslint-import-resolver-node/-/eslint-import-resolver-node-0.3.9.tgz",
    "status": "approved",
    "scans": [
        {
            "date": "August 11, 2023 at 1:17:56 a.m. GMT",
            "authority": "https://gitlab.eclipse.org/eclipsefdn/emo-team/iplab/-/issues/9923",
            "scancode-version": "31.2.1",
            "licenses-discovered": [
                "MIT"
            ],
            "copyrights": [
                "Copyright (c) 2015 Ben Mosher"
            ],
            "file-count": 4,
            "sha256": "4dc92ec24667c9ab57bbeaa08b368aea22b742037fb19e935f85b52528a3e9f6",
            "source": "https://registry.yarnpkg.com/eslint-import-resolver-node/-/eslint-import-resolver-node-0.3.9.tgz",
            "status": "approved"
        }
    ]
}