{
    "id": "maven/mavencentral/io.smallrye.common/smallrye-common-classloader/2.9.0",
    "license": "Apache-2.0",
    "authority": "https://gitlab.eclipse.org/eclipsefdn/emo-team/iplab/-/issues/17839",
    "source": "https://repo1.maven.org/maven2/io/smallrye/common/smallrye-common-classloader/2.9.0/smallrye-common-classloader-2.9.0-sources.jar",
    "status": "approved",
    "scans": [
        {
            "date": "December 13, 2024 at 12:03:28 p.m. GMT",
            "authority": "https://gitlab.eclipse.org/eclipsefdn/emo-team/iplab/-/issues/17839",
            "scancode-version": "31.2.1",
            "licenses-discovered": [
            ],
            "copyrights": [
            ],
            "file-count": 7,
            "sha256": "4c06f3abf694e52d7ac4c23603c1a7771aeb174c4f1c47a50b05e1bfda82bc83",
            "source": "https://repo1.maven.org/maven2/io/smallrye/common/smallrye-common-classloader/2.9.0/smallrye-common-classloader-2.9.0-sources.jar",
            "status": "restricted"
        }
    ]
}