{
    "id": "crate/cratesio/-/sval/1.0.0",
    "license": "None",
    "licenses-discovered": [
    ],
    "copyrights": [
    ],
    "file-count": 1,
    "scancode-version": "31.2.1",
    "authority": "https://gitlab.eclipse.org/eclipsefdn/emo-team/iplab/-/issues/4241",
    "source": "https://crates.io/api/v1/crates/sval/1.0.0/download",
    "status": "restricted"
}