{
    "id": "maven/mavencentral/systems.uom/systems-common/2.0.1",
    "license": "BSD-3-Clause",
    "authority": "https://gitlab.eclipse.org/eclipsefdn/emo-team/iplab/-/issues/5516",
    "source": "https://search.maven.org/remotecontent?filepath=systems/uom/systems-common/2.0.1/systems-common-2.0.1-sources.jar",
    "status": "approved",
    "scans": [
        {
            "date": "December 9, 2022 at 4:04:54 a.m. GMT",
            "authority": "https://gitlab.eclipse.org/eclipsefdn/emo-team/iplab/-/issues/5516",
            "scancode-version": "31.2.1",
            "licenses-discovered": [
                "BSD-3-Clause"
            ],
            "copyrights": [
                "Copyright (c) 2005-2020, Jean-Marie Dautelle, Werner Keil and others"
            ],
            "file-count": 16,
            "sha256": "186680f059997a13a780bbe040b16cb9c77a180e177eed9d6495f9d73813c57f",
            "source": "https://search.maven.org/remotecontent?filepath=systems/uom/systems-common/2.0.1/systems-common-2.0.1-sources.jar",
            "status": "approved"
        }
    ]
}