{
    "id": "npm/npmjs/@nrwl/devkit/15.2.1",
    "license": "MIT",
    "authority": "https://gitlab.eclipse.org/eclipsefdn/emo-team/iplab/-/issues/5055",
    "source": "https://registry.npmjs.org/@nrwl/devkit/-/devkit-15.2.1.tgz",
    "status": "approved",
    "scans": [
        {
            "date": "November 23, 2022 at 1:24:39 p.m. GMT",
            "authority": "https://gitlab.eclipse.org/eclipsefdn/emo-team/iplab/-/issues/5055",
            "scancode-version": "31.2.1",
            "licenses-discovered": [
                "MIT"
            ],
            "copyrights": [
                "Copyright (c) 2017-2022 Narwhal Technologies Inc."
            ],
            "file-count": 97,
            "sha256": "63b7a433c452fb53e5fb229dccafdd9d3b6dafd294a8faa9f025890b3fdfebb4",
            "source": "https://registry.npmjs.org/@nrwl/devkit/-/devkit-15.2.1.tgz",
            "status": "approved"
        }
    ]
}