{
    "id": "maven/mavencentral/org.codelibs.elasticsearch.lib/grok/7.15.2",
    "license": "Elastic-2.0 OR SSPL-1.0",
    "authority": "https://gitlab.eclipse.org/eclipsefdn/emo-team/iplab/-/issues/6423",
    "source": "https://maven.codelibs.org/org/codelibs/elasticsearch/lib/grok/7.15.2/grok-7.15.2-sources.jar",
    "status": "approved",
    "scans": [
        {
            "date": "February 1, 2023 at 5:09:00 a.m. GMT",
            "authority": "https://gitlab.eclipse.org/eclipsefdn/emo-team/iplab/-/issues/6423",
            "scancode-version": "31.2.1",
            "licenses-discovered": [
                "Elastic-2.0 AND SSPL-1.0"
            ],
            "copyrights": [
                "Copyright Elasticsearch B.V."
            ],
            "file-count": 7,
            "sha256": "a0f651b6d270ca97297d006bf11b49769f40bb6b8f729a45deb5dd6149786708",
            "source": "https://maven.codelibs.org/org/codelibs/elasticsearch/lib/grok/7.15.2/grok-7.15.2-sources.jar",
            "status": "approved"
        }
    ]
}
