{
    "id": "maven/mavencentral/org.apache.camel/camel-spring-xml/3.21.0",
    "license": "Apache-2.0",
    "authority": "https://gitlab.eclipse.org/eclipsefdn/emo-team/iplab/-/issues/10297",
    "source": "https://repo.maven.apache.org/maven2/org/apache/camel/camel-spring-xml/3.21.0/camel-spring-xml-3.21.0-sources.jar",
    "status": "approved",
    "scans": [
        {
            "date": "September 6, 2023 at 11:14:46 a.m. GMT",
            "authority": "https://gitlab.eclipse.org/eclipsefdn/emo-team/iplab/-/issues/10297",
            "scancode-version": "31.2.1",
            "licenses-discovered": [
                "Apache-2.0"
            ],
            "copyrights": [
            ],
            "file-count": 56,
            "sha256": "1372bb736c851f4fa7277facaec5242d238cf7639993d04947449e10196fce40",
            "source": "https://repo.maven.apache.org/maven2/org/apache/camel/camel-spring-xml/3.21.0/camel-spring-xml-3.21.0-sources.jar",
            "status": "approved"
        }
    ]
}