{
    "id": "maven/mavencentral/org.keycloak/keycloak-spring-security-adapter/20.0.2",
    "license": "Apache-2.0",
    "authority": "https://gitlab.eclipse.org/eclipsefdn/emo-team/iplab/-/issues/6344",
    "source": "https://search.maven.org/remotecontent?filepath=org/keycloak/keycloak-spring-security-adapter/20.0.2/keycloak-spring-security-adapter-20.0.2-sources.jar",
    "status": "approved",
    "scans": [
        {
            "date": "January 12, 2023 at 5:29:34 p.m. GMT",
            "authority": "https://gitlab.eclipse.org/eclipsefdn/emo-team/iplab/-/issues/6344",
            "scancode-version": "31.2.1",
            "licenses-discovered": [
                "Apache-2.0"
            ],
            "copyrights": [
                "Copyright 2016 Red Hat, Inc. and/or its affiliates and other contributors",
                "Copyright 2016 Red Hat, Inc. and/or its affiliates ~ and other contributors",
                "Copyright 2017 Red Hat, Inc. and/or its affiliates and other contributors",
                "Copyright 2018 Red Hat, Inc. and/or its affiliates and other contributors"
            ],
            "file-count": 46,
            "sha256": "075f896dd2dd70a158a822d230ce889dfda8d8d7191f3c276be8f58e5f56ace3",
            "source": "https://search.maven.org/remotecontent?filepath=org/keycloak/keycloak-spring-security-adapter/20.0.2/keycloak-spring-security-adapter-20.0.2-sources.jar",
            "status": "approved"
        }
    ]
}