{
    "id": "maven/mavencentral/com.google.inject.extensions/guice-persist/4.2.2",
    "license": "Apache-2.0",
    "licenses-discovered": [
        "Apache-2.0"
    ],
    "copyrights": [
        "Copyright (c) 2010 Google Inc.",
        "Copyright (c) 2010 Google, Inc."
    ],
    "file-count": 19,
    "scancode-version": "31.2.1",
    "authority": "https://gitlab.eclipse.org/eclipsefdn/emo-team/iplab/-/issues/4381",
    "source": "https://search.maven.org/remotecontent?filepath=com/google/inject/extensions/guice-persist/4.2.2/guice-persist-4.2.2-sources.jar",
    "status": "approved"
}