{
    "id": "go/golang/github.com%2Fcontainernetworking/cni/v0.8.1",
    "license": "Apache-2.0",
    "authority": "https://gitlab.eclipse.org/eclipsefdn/emo-team/iplab/-/issues/12431",
    "source": "https://proxy.golang.org/github.com%2Fcontainernetworking/cni/@v/v0.8.1.zip",
    "status": "approved",
    "scans": [
        {
            "date": "December 21, 2023 at 10:10:40 a.m. GMT",
            "authority": "https://gitlab.eclipse.org/eclipsefdn/emo-team/iplab/-/issues/12431",
            "scancode-version": "31.2.1",
            "licenses-discovered": [
                "Apache-2.0"
            ],
            "copyrights": [
                "Copyright (c) 2004, 2006 The Linux Foundation and its contributors",
                "Copyright 2014-2016 CNI authors",
                "Copyright 2015 CNI authors",
                "Copyright 2016 CNI authors",
                "Copyright 2017 CNI authors",
                "Copyright 2018 CNI authors",
                "Copyright 2019 CNI authors"
            ],
            "file-count": 84,
            "sha256": "9cc37c3a71e267e0c78539203ed22ad2c03a711c70be3bd4727890d4e66b10b9",
            "source": "https://proxy.golang.org/github.com%2Fcontainernetworking/cni/@v/v0.8.1.zip",
            "status": "approved"
        }
    ]
}