{
    "id": "npm/npmjs/-/axios/1.7.2",
    "license": "MIT",
    "authority": "https://gitlab.eclipse.org/eclipsefdn/emo-team/iplab/-/issues/14871",
    "source": "https://github.com/axios/axios/archive/refs/tags/v1.7.2.zip",
    "status": "approved",
    "scans": [
        {
            "date": "May 22, 2024 at 2:43:59 p.m. GMT",
            "authority": "https://gitlab.eclipse.org/eclipsefdn/emo-team/iplab/-/issues/14871",
            "scancode-version": "31.2.1",
            "licenses-discovered": [
                "MIT"
            ],
            "copyrights": [
                "Copyright (c) 2014 Yehuda Katz, Tom Dale, Stefan Penner and contributors",
                "Copyright (c) 2014-present Matt Zabriskie & Collaborators",
                "Copyright (c) 2024 Matt Zabriskie and contributors",
                "Copyright (c) year lib.author and contributors"
            ],
            "file-count": 239,
            "sha256": "e7cf3c4bcf5e3b859980041df5d0dcee4dd9c2bb72f0720a0eab873e4e7788b4",
            "source": "https://github.com/axios/axios/archive/refs/tags/v1.7.2.zip",
            "status": "approved"
        }
    ]
}