{
    "id": "npm/npmjs/-/globals/13.22.0",
    "license": "MIT",
    "authority": "https://gitlab.eclipse.org/eclipsefdn/emo-team/iplab/-/issues/10835",
    "source": "https://github.com/sindresorhus/globals/archive/refs/tags/v13.22.0.zip",
    "status": "approved",
    "scans": [
        {
            "date": "October 2, 2023 at 7:52:07 p.m. GMT",
            "authority": "https://gitlab.eclipse.org/eclipsefdn/emo-team/iplab/-/issues/10835",
            "scancode-version": "31.2.1",
            "licenses-discovered": [
                "MIT"
            ],
            "copyrights": [
                "Copyright (c) Sindre Sorhus <sindresorhus@gmail.com> (https://sindresorhus.com)"
            ],
            "file-count": 15,
            "sha256": "b7e5fd88745575d62ee0330cff5db3270048ea1e5a9fd91a394fbb52a6c64ed7",
            "source": "https://github.com/sindresorhus/globals/archive/refs/tags/v13.22.0.zip",
            "status": "approved"
        }
    ]
}