{
    "id": "maven/mavencentral/com.azure.resourcemanager/azure-resourcemanager-redis/2.47.0",
    "license": "MIT",
    "authority": "https://gitlab.eclipse.org/eclipsefdn/emo-team/iplab/-/issues/19259",
    "source": "https://repo1.maven.org/maven2/com/azure/resourcemanager/azure-resourcemanager-redis/2.47.0/azure-resourcemanager-redis-2.47.0-sources.jar",
    "status": "approved",
    "scans": [
        {
            "date": "February 4, 2025 at 4:16:36 a.m. GMT",
            "authority": "https://gitlab.eclipse.org/eclipsefdn/emo-team/iplab/-/issues/19259",
            "scancode-version": "31.2.1",
            "licenses-discovered": [
                "MIT"
            ],
            "copyrights": [
                "Copyright (c) Microsoft Corporation"
            ],
            "file-count": 123,
            "sha256": "d57decd37c2b8d46bc856ffb87dcbd5b1cb5bf73aa1509177aa672e3ff0952de",
            "source": "https://repo1.maven.org/maven2/com/azure/resourcemanager/azure-resourcemanager-redis/2.47.0/azure-resourcemanager-redis-2.47.0-sources.jar",
            "status": "approved"
        }
    ]
}