{
    "id": "go/golang/github.com%2Fonsi%2Fginkgo/v2/v2.1.3",
    "license": "MIT AND BSD-3-Clause",
    "authority": "https://gitlab.eclipse.org/eclipsefdn/emo-team/iplab/-/issues/12501",
    "source": "https://proxy.golang.org/github.com%2Fonsi%2Fginkgo/v2/@v/v2.1.3.zip",
    "status": "approved",
    "scans": [
        {
            "date": "December 26, 2023 at 7:07:48 a.m. GMT",
            "authority": "https://gitlab.eclipse.org/eclipsefdn/emo-team/iplab/-/issues/12501",
            "scancode-version": "31.2.1",
            "licenses-discovered": [
                "MIT",
                "BSD-3-Clause"
            ],
            "copyrights": [
                "Copyright (c) 2013-2014 Onsi Fakhouri",
                "Copyright (c) 2016 Yasuhiro Matsumoto",
                "Copyright 2013 The Go Authors"
            ],
            "file-count": 401,
            "sha256": "406b8f0557d405ec7fa78761c3e8455c6c806e69990b77bf9c2da6f3a9f2377e",
            "source": "https://proxy.golang.org/github.com%2Fonsi%2Fginkgo/v2/@v/v2.1.3.zip",
            "status": "approved"
        }
    ]
}