{
    "id": "git/github/gorilla/websocket/v1.4.1",
    "license": "BSD-3-Clause AND BSD-2-Clause AND (BSD-3-Clause AND MIT)",
    "licenses-discovered": [
        "BSD-3-Clause",
        "BSD-2-Clause",
        "BSD-3-Clause AND MIT"
    ],
    "copyrights": [
        "Copyright (c) Bjoern Hoehrmann <bjoern@hoehrmann.de>",
        "Copyright The Gorilla WebSocket"
    ],
    "file-count": 54,
    "scancode-version": "30.1.0",
    "authority": "https://gitlab.eclipse.org/eclipsefdn/emo-team/iplab/-/issues/3643",
    "source": "https://github.com/gorilla/websocket/archive/refs/tags/v1.4.1.zip",
    "status": "approved"
}