{
    "id": "npm/npmjs/@adobe/css-tools/4.0.2",
    "license": "MIT",
    "authority": "https://gitlab.eclipse.org/eclipsefdn/emo-team/iplab/-/issues/6345",
    "source": "https://registry.npmjs.org/@adobe/css-tools/-/css-tools-4.0.2.tgz",
    "status": "approved",
    "scans": [
        {
            "date": "January 12, 2023 at 8:00:09 p.m. GMT",
            "authority": "https://gitlab.eclipse.org/eclipsefdn/emo-team/iplab/-/issues/6345",
            "scancode-version": "31.2.1",
            "licenses-discovered": [
                "MIT"
            ],
            "copyrights": [
                "Copyright (c) 2012 TJ Holowaychuk <tj@vision-media.ca>",
                "Copyright (c) 2022 Jean-Philippe Zolesio <holblin@gmail.com>"
            ],
            "file-count": 15,
            "sha256": "08f615ebf42099b7c00a09751bd86780a399f62ddf1a1cb01da41e99daab5d13",
            "source": "https://registry.npmjs.org/@adobe/css-tools/-/css-tools-4.0.2.tgz",
            "status": "approved"
        }
    ]
}