{
    "id": "npm/npmjs/-/nwsapi/2.2.4",
    "license": "MIT",
    "authority": "https://gitlab.eclipse.org/eclipsefdn/emo-team/iplab/-/issues/7909",
    "source": "https://registry.yarnpkg.com/nwsapi/-/nwsapi-2.2.4.tgz",
    "status": "approved",
    "scans": [
        {
            "date": "April 18, 2023 at 6:36:36 p.m. GMT",
            "authority": "https://gitlab.eclipse.org/eclipsefdn/emo-team/iplab/-/issues/7909",
            "scancode-version": "31.2.1",
            "licenses-discovered": [
                "MIT"
            ],
            "copyrights": [
                "Copyright (c) 2007-2017 Diego Perini",
                "Copyright (c) 2007-2019 Diego Perini",
                "Copyright (c) 2007-2019 Diego Perini (http://www.iport.it/)"
            ],
            "file-count": 7,
            "sha256": "6e88b48b1432131fc789cf018e4f920f38905218025e22d447af6b35955db8c2",
            "source": "https://registry.yarnpkg.com/nwsapi/-/nwsapi-2.2.4.tgz",
            "status": "approved"
        }
    ]
}