{
    "id": "p2/orbit/p2.eclipse.plugin/org.apache.httpcomponents.client5.httpclient5-win/5.2.1.v20230802-0847",
    "license": "Apache-2.0",
    "authority": "https://gitlab.eclipse.org/eclipsefdn/emo-team/iplab/-/issues/9838",
    "source": "https://repo.maven.apache.org/maven2/org/apache/httpcomponents/client5/httpclient5-win/5.2/httpclient5-win-5.2-sources.jar",
    "status": "approved",
    "scans": [
        {
            "date": "August 2, 2023 at 3:36:57 p.m. GMT",
            "authority": "https://gitlab.eclipse.org/eclipsefdn/emo-team/iplab/-/issues/9838",
            "scancode-version": "31.2.1",
            "licenses-discovered": [
                "Apache-2.0"
            ],
            "copyrights": [
            ],
            "file-count": 9,
            "sha256": "a2ca0d1e1a3f55dfa1a6ea2d28ed41c3aa871243ad4e82f2c9c167af34e98733",
            "source": "https://repo.maven.apache.org/maven2/org/apache/httpcomponents/client5/httpclient5-win/5.2/httpclient5-win-5.2-sources.jar",
            "status": "approved"
        }
    ]
}