{
    "id": "crate/cratesio/-/either/1.8.0",
    "license": "Apache-2.0 AND MIT AND Apache-2.0 AND MIT",
    "licenses-discovered": [
        "Apache-2.0 AND MIT",
        "Apache-2.0",
        "MIT"
    ],
    "copyrights": [
        "Copyright (c) 2015 Permission"
    ],
    "file-count": 11,
    "scancode-version": "31.2.1",
    "authority": "https://gitlab.eclipse.org/eclipsefdn/emo-team/iplab/-/issues/4245",
    "source": "https://crates.io/api/v1/crates/either/1.8.0/download",
    "status": "approved"
}