{
    "id": "maven/mavencentral/io.fabric8/openshift-client-api/6.6.0",
    "license": "Apache-2.0",
    "authority": "https://gitlab.eclipse.org/eclipsefdn/emo-team/iplab/-/issues/8342",
    "source": "https://search.maven.org/remotecontent?filepath=io/fabric8/openshift-client-api/6.6.0/openshift-client-api-6.6.0-sources.jar",
    "status": "approved",
    "scans": [
        {
            "date": "May 5, 2023 at 5:42:29 a.m. GMT",
            "authority": "https://gitlab.eclipse.org/eclipsefdn/emo-team/iplab/-/issues/8342",
            "scancode-version": "31.2.1",
            "licenses-discovered": [
                "Apache-2.0"
            ],
            "copyrights": [
                "Copyright (c) 2015 Red Hat, Inc."
            ],
            "file-count": 45,
            "sha256": "26a53cc1a3143e7dff99cd34854488bf93362d35d74f92b06e37a10429131b69",
            "source": "https://search.maven.org/remotecontent?filepath=io/fabric8/openshift-client-api/6.6.0/openshift-client-api-6.6.0-sources.jar",
            "status": "approved"
        }
    ]
}