{
    "id": "npm/npmjs/@angular/common/15.0.3",
    "license": "MIT",
    "authority": "https://gitlab.eclipse.org/eclipsefdn/emo-team/iplab/-/issues/5747",
    "source": "https://registry.npmjs.org/@angular/common/-/common-15.0.3.tgz",
    "status": "approved",
    "scans": [
        {
            "date": "December 14, 2022 at 2:29:36 a.m. GMT",
            "authority": "https://gitlab.eclipse.org/eclipsefdn/emo-team/iplab/-/issues/5747",
            "scancode-version": "31.2.1",
            "licenses-discovered": [
                "MIT"
            ],
            "copyrights": [
                "(c) 2010-2022 Google LLC. https://angular.io",
                "Copyright Google LLC"
            ],
            "file-count": 3014,
            "sha256": "d2fd3302fbe13fd5c70a7fae2de04df24712bd37986abeb8584e1e78f8ae26e8",
            "source": "https://registry.npmjs.org/@angular/common/-/common-15.0.3.tgz",
            "status": "approved"
        }
    ]
}