{
    "id": "p2/orbit/p2.eclipse.plugin/org.apache.xmlgraphics.fop-core/2.9.0.v20240704-1700",
    "license": "Apache-2.0 AND Zlib AND Apache-1.1",
    "authority": "https://gitlab.eclipse.org/eclipsefdn/emo-team/iplab/-/issues/15626",
    "source": "https://repo1.maven.org/maven2/org/apache/xmlgraphics/fop-core/2.9/fop-core-2.9-sources.jar",
    "status": "approved",
    "scans": [
        {
            "date": "July 11, 2024 at 2:50:29 p.m. GMT",
            "authority": "https://gitlab.eclipse.org/eclipsefdn/emo-team/iplab/-/issues/15626",
            "scancode-version": "31.2.1",
            "licenses-discovered": [
                "Apache-2.0",
                "Zlib",
                "Apache-1.1"
            ],
            "copyrights": [
                "(c) 2001 Westinghouse Electric Company",
                "Copyright (c) 2008 Kai-Uwe Behrmann",
                "Copyright (c) The Apache Software Foundation",
                "Copyright 2009 + The Apache Software Foundation"
            ],
            "file-count": 1731,
            "sha256": "2f08c087180becb30123188645462515e60628666862125cfbb67fc784cf6008",
            "source": "https://repo1.maven.org/maven2/org/apache/xmlgraphics/fop-core/2.9/fop-core-2.9-sources.jar",
            "status": "approved"
        }
    ]
}