{
    "id": "maven/mavencentral/com.google.api.grpc/grpc-google-cloud-datastore-admin-v1/2.19.1",
    "license": "Apache-2.0",
    "authority": "https://gitlab.eclipse.org/eclipsefdn/emo-team/iplab/-/issues/15796",
    "source": "https://repo1.maven.org/maven2/com/google/api/grpc/grpc-google-cloud-datastore-admin-v1/2.19.1/grpc-google-cloud-datastore-admin-v1-2.19.1-sources.jar",
    "status": "approved",
    "scans": [
        {
            "date": "July 24, 2024 at 3:09:23 p.m. GMT",
            "authority": "https://gitlab.eclipse.org/eclipsefdn/emo-team/iplab/-/issues/15796",
            "scancode-version": "31.2.1",
            "licenses-discovered": [
                "Apache-2.0"
            ],
            "copyrights": [
                "Copyright 2024 Google LLC"
            ],
            "file-count": 4,
            "sha256": "351ca58b980371b9f53961a4e54c8b880fa461899d3d8f441ad0190f5cebf5ec",
            "source": "https://repo1.maven.org/maven2/com/google/api/grpc/grpc-google-cloud-datastore-admin-v1/2.19.1/grpc-google-cloud-datastore-admin-v1-2.19.1-sources.jar",
            "status": "approved"
        }
    ]
}