{
    "id": "p2/orbit/p2.eclipse.plugin/org.commonmark-gfm-tables/0.21.0.v20230927-1332",
    "license": "BSD-2-Clause",
    "authority": "https://gitlab.eclipse.org/eclipsefdn/emo-team/iplab/-/issues/10695",
    "source": "https://download.eclipse.org/tools/orbit/simrel/orbit-aggregation/milestone/S202310110718/plugins/org.commonmark-gfm-tables.source_0.21.0.v20230927-1332.jar",
    "status": "approved",
    "scans": [
        {
            "date": "October 12, 2023 at 12:15:34 a.m. GMT",
            "authority": "https://gitlab.eclipse.org/eclipsefdn/emo-team/iplab/-/issues/10695",
            "scancode-version": "31.2.1",
            "licenses-discovered": [
                "BSD-2-Clause"
            ],
            "copyrights": [
                "(c) 2008 VeriSign, Inc.",
                "Copyright (c) 2015, Atlassian Pty Ltd"
            ],
            "file-count": 16,
            "sha256": "83886b212d71cedb2a17940e63eb111e8f773ffaee298c0e182127f845477d13",
            "source": "https://download.eclipse.org/tools/orbit/simrel/orbit-aggregation/milestone/S202310110718/plugins/org.commonmark-gfm-tables.source_0.21.0.v20230927-1332.jar",
            "status": "approved"
        }
    ]
}