{
    "id": "maven/mavencentral/org.typelevel/jawn-parser_2.13/1.3.2",
    "license": "MIT",
    "authority": "https://gitlab.eclipse.org/eclipsefdn/emo-team/iplab/-/issues/5514",
    "source": "https://search.maven.org/remotecontent?filepath=org/typelevel/jawn-parser_2.13/1.3.2/jawn-parser_2.13-1.3.2-sources.jar",
    "status": "approved",
    "scans": [
        {
            "date": "December 9, 2022 at 4:07:16 a.m. GMT",
            "authority": "https://gitlab.eclipse.org/eclipsefdn/emo-team/iplab/-/issues/5514",
            "scancode-version": "31.2.1",
            "licenses-discovered": [
            ],
            "copyrights": [
            ],
            "file-count": 17,
            "sha256": "f2b0bf10bc7c88d9aeb27e551bb38692910990d72ce65c58eb77801233ed3c23",
            "source": "https://search.maven.org/remotecontent?filepath=org/typelevel/jawn-parser_2.13/1.3.2/jawn-parser_2.13-1.3.2-sources.jar",
            "status": "restricted"
        }
    ]
}
