{
    "id": "p2/orbit/p2.eclipse-plugin/org.apache.commons.lang3/3.12.0",
    "license": "Apache-2.0",
    "licenses-discovered": [
        "Apache-2.0"
    ],
    "file-count": 219,
    "scancode-version": "30.1.0",
    "authority": "https://gitlab.eclipse.org/eclipsefdn/emo-team/iplab/-/issues/2077",
    "source": "https://search.maven.org/remotecontent?filepath=org/apache/commons/commons-lang3/3.12.0/commons-lang3-3.12.0-sources.jar",
    "status": "approved"
}