{
    "id": "npm/npmjs/-/yaml-language-server/1.16.0",
    "license": "MIT",
    "authority": "https://gitlab.eclipse.org/eclipsefdn/emo-team/iplab/-/issues/19363",
    "source": "https://github.com/redhat-developer/yaml-language-server/archive/refs/tags/1.16.0.zip",
    "status": "approved",
    "scans": [
        {
            "date": "February 7, 2025 at 2:58:55 p.m. GMT",
            "authority": "https://gitlab.eclipse.org/eclipsefdn/emo-team/iplab/-/issues/19363",
            "scancode-version": "31.2.1",
            "licenses-discovered": [
                "MIT"
            ],
            "copyrights": [
                "Copyright (c) 2004, 2006 The Linux Foundation and its contributors",
                "Copyright (c) 2017 Red Hat Inc. and others",
                "Copyright (c) Adam Voss",
                "Copyright (c) Microsoft Corporation",
                "Copyright (c) Red Hat",
                "Copyright (c) Red Hat, Inc."
            ],
            "file-count": 149,
            "sha256": "d9619e7b376da636bb07e5a9fb1c1bbd6cd69778c4587508b53e11d76e47078a",
            "source": "https://github.com/redhat-developer/yaml-language-server/archive/refs/tags/1.16.0.zip",
            "status": "approved"
        }
    ]
}