{
    "id": "npm/npmjs/@types/responselike/1.0.1",
    "license": "MIT",
    "authority": "https://gitlab.eclipse.org/eclipsefdn/emo-team/iplab/-/issues/11009",
    "source": "https://registry.yarnpkg.com/@types/responselike/-/responselike-1.0.1.tgz",
    "status": "approved",
    "scans": [
        {
            "date": "October 11, 2023 at 5:31:27 a.m. GMT",
            "authority": "https://gitlab.eclipse.org/eclipsefdn/emo-team/iplab/-/issues/11009",
            "scancode-version": "31.2.1",
            "licenses-discovered": [
                "MIT"
            ],
            "copyrights": [
                "Copyright (c) Microsoft Corporation"
            ],
            "file-count": 4,
            "sha256": "26110bcec55a40cde7197f79e2dadb914b534f34fb9d334766902712fc190d75",
            "source": "https://registry.yarnpkg.com/@types/responselike/-/responselike-1.0.1.tgz",
            "status": "approved"
        }
    ]
}