{
    "id": "maven/mavencentral/com.huaweicloud.sdk/huaweicloud-sdk-vpc/3.1.84",
    "license": "Apache-2.0",
    "authority": "https://gitlab.eclipse.org/eclipsefdn/emo-team/iplab/-/issues/13554",
    "source": "https://repo1.maven.org/maven2/com/huaweicloud/sdk/huaweicloud-sdk-vpc/3.1.84/huaweicloud-sdk-vpc-3.1.84-sources.jar",
    "status": "approved",
    "scans": [
        {
            "date": "March 6, 2024 at 10:46:50 a.m. GMT",
            "authority": "https://gitlab.eclipse.org/eclipsefdn/emo-team/iplab/-/issues/13554",
            "scancode-version": "31.2.1",
            "licenses-discovered": [
            ],
            "copyrights": [
            ],
            "file-count": 572,
            "sha256": "4f7b9e6c49b1f9ea24fa5851aea4a4679b6fd4f9bb21d2337136965a6395b603",
            "source": "https://repo1.maven.org/maven2/com/huaweicloud/sdk/huaweicloud-sdk-vpc/3.1.84/huaweicloud-sdk-vpc-3.1.84-sources.jar",
            "status": "restricted"
        }
    ]
}
