{
    "id": "maven/mavencentral/com.google.auth/google-auth-library-credentials/1.27.0",
    "license": "BSD-3-Clause",
    "authority": "https://gitlab.eclipse.org/eclipsefdn/emo-team/iplab/-/issues/16263",
    "source": "https://repo1.maven.org/maven2/com/google/auth/google-auth-library-credentials/1.27.0/google-auth-library-credentials-1.27.0-sources.jar",
    "status": "approved",
    "scans": [
        {
            "date": "September 23, 2024, 7:04:02 p.m. GMT",
            "authority": "https://gitlab.eclipse.org/eclipsefdn/emo-team/iplab/-/issues/16263",
            "scancode-version": "31.2.1",
            "licenses-discovered": [
                "BSD-3-Clause"
            ],
            "copyrights": [
                "Copyright 2015, Google Inc.",
                "Copyright 2016, Google Inc.",
                "Copyright 2022 Google LLC",
                "Copyright 2024, Google Inc."
            ],
            "file-count": 8,
            "sha256": "ee767a413b5c852575075e18f1ca745b15048fb3853e196d3cc545ebb9d06e23",
            "source": "https://repo1.maven.org/maven2/com/google/auth/google-auth-library-credentials/1.27.0/google-auth-library-credentials-1.27.0-sources.jar",
            "status": "approved"
        }
    ]
}