{
    "license": "CDDL-1.0 OR GPL-2.0-only WITH Classpath-exception-2.0",
    "file-count": 32,
    "authority": "https://gitlab.eclipse.org/eclipsefdn/emo-team/iplab/-/issues/1832",
    "scancode-version": "30.1.0",
    "licenses-discovered": [
    ],
    "id": "maven/mavencentral/org.glassfish.hk2.external/aopalliance-repackaged/2.4.0-b25",
    "source": "https://search.maven.org/remotecontent?filepath=org/glassfish/hk2/external/aopalliance-repackaged/2.4.0-b25/aopalliance-repackaged-2.4.0-b25-sources.jar",
    "status": "approved"
}
