{
    "id": "project/technology.lmos/eclipse-lmos/lmos-demo/21ec463d5779a1ddf1372fee8e1739b0d470376a",
    "license": "CC-BY-4.0 AND Apache-2.0 AND CC0-1.0",
    "authority": "https://gitlab.eclipse.org/eclipsefdn/emo-team/iplab/-/issues/17955",
    "source": "https://github.com/eclipse-lmos/lmos-demo/archive/21ec463d5779a1ddf1372fee8e1739b0d470376a.zip",
    "status": "approved",
    "scans": [
        {
            "date": "December 18, 2024 at 6:08:48 p.m. GMT",
            "authority": "https://gitlab.eclipse.org/eclipsefdn/emo-team/iplab/-/issues/17955",
            "scancode-version": "31.2.1",
            "licenses-discovered": [
                "CC-BY-4.0",
                "Apache-2.0",
                "Apache-2.0 AND CC0-1.0",
                "CC0-1.0"
            ],
            "copyrights": [
                "Copyright (c) 2024 Deutsche Telekom AG.",
                "Copyright 2022 Free Software Foundation Europe e.V. <https://fsfe.org>",
                "Copyright 2023 www.contributor-covenant.org",
                "Copyright 2024 Deutsche Telekom AG"
            ],
            "file-count": 29,
            "sha256": "9950fb07ad08ee9e780b6fb67342cf2c33d41f478b66241664e7c8f5bf42c235",
            "source": "https://github.com/eclipse-lmos/lmos-demo/archive/21ec463d5779a1ddf1372fee8e1739b0d470376a.zip",
            "status": "restricted"
        }
    ]
}