{
    "id": "npm/npmjs/-/node-gyp/9.0.0",
    "license": "MIT AND BSD-3-Clause",
    "licenses-discovered": [
        "MIT",
        "BSD-3-Clause"
    ],
    "file-count": 143,
    "scancode-version": "30.1.0",
    "authority": "https://gitlab.eclipse.org/eclipsefdn/emo-team/iplab/-/issues/2651",
    "source": "https://github.com/nodejs/node-gyp/archive/v9.0.0.zip",
    "status": "approved"
}