{
    "id": "npm/npmjs/-/util-deprecate/1.0.2",
    "license": "MIT",
    "authority": "https://gitlab.eclipse.org/eclipsefdn/emo-team/iplab/-/issues/5885",
    "source": "https://registry.yarnpkg.com/util-deprecate/-/util-deprecate-1.0.2.tgz",
    "status": "approved",
    "scans": [
        {
            "date": "December 17, 2022 at 12:43:00 a.m. GMT",
            "authority": "https://gitlab.eclipse.org/eclipsefdn/emo-team/iplab/-/issues/5885",
            "scancode-version": "31.2.1",
            "licenses-discovered": [
                "MIT"
            ],
            "copyrights": [
                "Copyright (c) 2014 Nathan Rajlich <nathan@tootallnate.net>"
            ],
            "file-count": 6,
            "sha256": "79a1de983c1b393180c47456d6b73caab278a00ea6e37d5c6675f2dcdec2a3e5",
            "source": "https://registry.yarnpkg.com/util-deprecate/-/util-deprecate-1.0.2.tgz",
            "status": "approved"
        }
    ]
}