{
    "id": "maven/mavencentral/io.vertx/vertx-bridge-common/4.3.4",
    "license": "Apache-2.0 AND EPL-1.0",
    "licenses-discovered": [
        "Apache-2.0 AND EPL-1.0"
    ],
    "copyrights": [
        "Copyright (c) 2011-2015 The original author or authors"
    ],
    "file-count": 9,
    "scancode-version": "31.2.1",
    "authority": "https://gitlab.eclipse.org/eclipsefdn/emo-team/iplab/-/issues/4380",
    "source": "https://search.maven.org/remotecontent?filepath=io/vertx/vertx-bridge-common/4.3.4/vertx-bridge-common-4.3.4-sources.jar",
    "status": "approved"
}