{
    "id": "p2/orbit/p2.eclipse-plugin/org.apache.batik.codec/1.16.0.v20221027-0840",
    "license": "Apache-2.0",
    "authority": "https://gitlab.eclipse.org/eclipsefdn/emo-team/iplab/-/issues/5360",
    "source": "https://repo1.maven.org/maven2/org/apache/xmlgraphics/batik-codec/1.16/batik-codec-1.16-sources.jar",
    "status": "approved",
    "scans": [
        {
            "date": "December 3, 2022 at 3:40:19 p.m. GMT",
            "authority": "https://gitlab.eclipse.org/eclipsefdn/emo-team/iplab/-/issues/5360",
            "scancode-version": "31.2.1",
            "licenses-discovered": [
                "Apache-2.0"
            ],
            "copyrights": [
            ],
            "file-count": 41,
            "sha256": "b4da35fa15cd9dd25285b95ac6db3b4b11caf8f0f17fbae0832acadf58b10d94",
            "source": "https://repo1.maven.org/maven2/org/apache/xmlgraphics/batik-codec/1.16/batik-codec-1.16-sources.jar",
            "status": "approved"
        }
    ]
}