{
    "id": "maven/mavencentral/org.osgi/org.osgi.service.provisioning/1.2.0",
    "license": "Apache-1.1 AND Apache-2.0",
    "authority": "https://gitlab.eclipse.org/eclipsefdn/emo-team/iplab/-/issues/17681",
    "source": "https://repo1.maven.org/maven2/org/osgi/org.osgi.service.provisioning/1.2.0/org.osgi.service.provisioning-1.2.0-sources.jar",
    "status": "approved",
    "scans": [
        {
            "date": "December 4, 2024 at 12:30:08 p.m. GMT",
            "authority": "https://gitlab.eclipse.org/eclipsefdn/emo-team/iplab/-/issues/17681",
            "scancode-version": "31.2.1",
            "licenses-discovered": [
                "Apache-1.1",
                "Apache-2.0"
            ],
            "copyrights": [
                "Copyright (c) OSGi Alliance (2000, 2015)",
                "Copyright (c) OSGi Alliance (2002, 2015)",
                "Copyright (c) OSGi Alliance (2010, 2012)"
            ],
            "file-count": 6,
            "sha256": "52b99522a0d678ef5cfd978d8c824d360d1704676f5a6e7c3d6056371883cc27",
            "source": "https://repo1.maven.org/maven2/org/osgi/org.osgi.service.provisioning/1.2.0/org.osgi.service.provisioning-1.2.0-sources.jar",
            "status": "approved"
        }
    ]
}