{
    "id": "npm/npmjs/@storybook/preview/7.0.21",
    "license": "MIT",
    "authority": "https://gitlab.eclipse.org/eclipsefdn/emo-team/iplab/-/issues/9026",
    "source": "https://registry.npmjs.org/@storybook/preview/-/preview-7.0.21.tgz",
    "status": "approved",
    "scans": [
        {
            "date": "June 15, 2023 at 4:58:57 p.m. GMT",
            "authority": "https://gitlab.eclipse.org/eclipsefdn/emo-team/iplab/-/issues/9026",
            "scancode-version": "31.2.1",
            "licenses-discovered": [
                "MIT"
            ],
            "copyrights": [
            ],
            "file-count": 8,
            "sha256": "4ed2add4caa048f918e5543840ded5dcdfb070ebd44b7126acbdf3efb9b13b98",
            "source": "https://registry.npmjs.org/@storybook/preview/-/preview-7.0.21.tgz",
            "status": "approved"
        }
    ]
}