{
    "id": "npm/npmjs/-/react-tooltip/4.4.3",
    "license": "MIT",
    "licenses-discovered": [
        "MIT"
    ],
    "copyrights": [
        "Copyright (c) 2015 Wang Zixiao",
        "copyright (c) 2014-2022 Denis Pushkarev"
    ],
    "file-count": 8,
    "scancode-version": "31.2.1",
    "authority": "https://gitlab.eclipse.org/eclipsefdn/emo-team/iplab/-/issues/4634",
    "source": "https://registry.npmjs.org/react-tooltip/-/react-tooltip-4.4.3.tgz",
    "status": "approved"
}