{
    "id": "maven/mavencentral/software.amazon.awssdk/netty-nio-client/2.28.17",
    "license": "Apache-2.0",
    "authority": "https://gitlab.eclipse.org/eclipsefdn/emo-team/iplab/-/issues/16538",
    "source": "https://repo1.maven.org/maven2/software/amazon/awssdk/netty-nio-client/2.28.17/netty-nio-client-2.28.17-sources.jar",
    "status": "approved",
    "scans": [
        {
            "date": "October 8, 2024, 11:36:17 p.m. GMT",
            "authority": "https://gitlab.eclipse.org/eclipsefdn/emo-team/iplab/-/issues/16538",
            "scancode-version": "31.2.1",
            "licenses-discovered": [
                "Apache-2.0"
            ],
            "copyrights": [
                "Copyright Amazon.com, Inc. or its affiliates"
            ],
            "file-count": 98,
            "sha256": "762992bd17136c32069b3fbf85a027cbe3e234824a97fd00953fafde22f6c01c",
            "source": "https://repo1.maven.org/maven2/software/amazon/awssdk/netty-nio-client/2.28.17/netty-nio-client-2.28.17-sources.jar",
            "status": "approved"
        }
    ]
}