{
    "id": "npm/npmjs/-/micromark-util-encode/2.0.1",
    "license": "MIT",
    "authority": "https://gitlab.eclipse.org/eclipsefdn/emo-team/iplab/-/issues/17395",
    "source": "https://github.com/micromark/micromark/archive/refs/tags/micromark-build@2.0.1.zip",
    "status": "approved",
    "scans": [
        {
            "date": "November 22, 2024, 1:02:51 p.m. GMT",
            "authority": "https://gitlab.eclipse.org/eclipsefdn/emo-team/iplab/-/issues/17395",
            "scancode-version": "31.2.1",
            "licenses-discovered": [
                "MIT"
            ],
            "copyrights": [
                "(c) (c) example.com/ C2 A9",
                "(c) . param TokenType",
                "(c) Titus Wormer",
                "(c) example.com",
                "Copyright (c) 2020 Titus Wormer <tituswormer@gmail.com>"
            ],
            "file-count": 209,
            "sha256": "8300fc04117910b927ebd7da28da55723f47345977210d0f63fd426be0454530",
            "source": "https://github.com/micromark/micromark/archive/refs/tags/micromark-build@2.0.1.zip",
            "status": "approved"
        }
    ]
}