{
    "id": "nuget/nuget/-/xunit.assert/2.8.1",
    "license": "Apache-2.0 AND MIT",
    "authority": "https://gitlab.eclipse.org/eclipsefdn/emo-team/iplab/-/issues/15176",
    "source": "https://github.com/xunit/xunit/archive/refs/tags/2.8.1.zip",
    "status": "approved",
    "scans": [
        {
            "date": "June 13, 2024 at 5:21:52 p.m. GMT",
            "authority": "https://gitlab.eclipse.org/eclipsefdn/emo-team/iplab/-/issues/15176",
            "scancode-version": "31.2.1",
            "licenses-discovered": [
                "Apache-2.0 AND MIT",
                "Apache-2.0 AND LicenseRef-scancode-free-unknown",
                "JSON",
                "Apache-2.0",
                "MIT"
            ],
            "copyrights": [
                "Copyright (c) .NET Foundation",
                "Copyright (c) .NET Foundation and Contributors",
                "Copyright (c) .NET Foundation and contributors",
                "Copyright (c) 2015 .NET Foundation"
            ],
            "file-count": 727,
            "sha256": "3334d07790922113d3f47463a05df20245d17095adef97a4cf0993f02bde1949",
            "source": "https://github.com/xunit/xunit/archive/refs/tags/2.8.1.zip",
            "status": "restricted"
        }
    ]
}