{
    "id": "crate/cratesio/-/tokio/1.43.0",
    "license": "MIT",
    "authority": "https://gitlab.eclipse.org/eclipsefdn/emo-team/iplab/-/issues/18533",
    "source": "https://crates.io/api/v1/crates/tokio/1.43.0/download",
    "status": "approved",
    "scans": [
        {
            "date": "January 9, 2025 at 12:21:33 p.m. GMT",
            "authority": "https://gitlab.eclipse.org/eclipsefdn/emo-team/iplab/-/issues/18533",
            "scancode-version": "31.2.1",
            "licenses-discovered": [
                "MIT"
            ],
            "copyrights": [
                "Copyright (c) Tokio Contributors"
            ],
            "file-count": 522,
            "sha256": "3d61fa4ffa3de412bfea335c6ecff681de2b609ba3c77ef3e00e521813a9ed9e",
            "source": "https://crates.io/api/v1/crates/tokio/1.43.0/download",
            "status": "approved"
        }
    ]
}