{
    "id": "maven/mavencentral/org.osgi/org.osgi.util.tracker/1.5.4",
    "license": "Apache-2.0",
    "authority": "https://gitlab.eclipse.org/eclipsefdn/emo-team/iplab/-/issues/16053",
    "source": "https://repo1.maven.org/maven2/org/osgi/org.osgi.util.tracker/1.5.4/org.osgi.util.tracker-1.5.4-sources.jar",
    "status": "approved",
    "scans": [
        {
            "date": "September 2, 2024 at 5:48:26 p.m. GMT",
            "authority": "https://gitlab.eclipse.org/eclipsefdn/emo-team/iplab/-/issues/16053",
            "scancode-version": "31.2.1",
            "licenses-discovered": [
                "Apache-2.0"
            ],
            "copyrights": [
            ],
            "file-count": 7,
            "sha256": "5677f6068fc06b1c092a8967613c6080eddba44048870cf4eb7ede8d61494bf0",
            "source": "https://repo1.maven.org/maven2/org/osgi/org.osgi.util.tracker/1.5.4/org.osgi.util.tracker-1.5.4-sources.jar",
            "status": "approved"
        }
    ]
}