{
    "id": "maven/mavencentral/software.amazon.awssdk/aws-core/2.30.33",
    "license": "Apache-2.0",
    "authority": "https://gitlab.eclipse.org/eclipsefdn/emo-team/iplab/-/issues/19912",
    "source": "https://repo1.maven.org/maven2/software/amazon/awssdk/aws-core/2.30.33/aws-core-2.30.33-sources.jar",
    "status": "approved",
    "scans": [
        {
            "date": "March 6, 2025 at 8:15:38 a.m. GMT",
            "authority": "https://gitlab.eclipse.org/eclipsefdn/emo-team/iplab/-/issues/19912",
            "scancode-version": "31.2.1",
            "licenses-discovered": [
                "Apache-2.0"
            ],
            "copyrights": [
                "Copyright 2020-2025 Amazon.com, Inc. or its affiliates",
                "Copyright Amazon.com, Inc. or its affiliates"
            ],
            "file-count": 76,
            "sha256": "fb78d378a76f3a238c665279d25d96c0c2aa629f1d1aa526944e48c05eec1cc2",
            "source": "https://repo1.maven.org/maven2/software/amazon/awssdk/aws-core/2.30.33/aws-core-2.30.33-sources.jar",
            "status": "approved"
        }
    ]
}