{
    "id": "npm/npmjs/@storybook/postinstall/7.0.21",
    "license": "MIT",
    "authority": "https://gitlab.eclipse.org/eclipsefdn/emo-team/iplab/-/issues/8943",
    "source": "https://registry.npmjs.org/@storybook/postinstall/-/postinstall-7.0.21.tgz",
    "status": "approved",
    "scans": [
        {
            "date": "June 15, 2023 at 3:12:11 p.m. GMT",
            "authority": "https://gitlab.eclipse.org/eclipsefdn/emo-team/iplab/-/issues/8943",
            "scancode-version": "31.2.1",
            "licenses-discovered": [
                "MIT"
            ],
            "copyrights": [
            ],
            "file-count": 12,
            "sha256": "40d04f222c3bb1198fda5db6c0ea6ef284cf39d29308144b79c6f5029d6e2068",
            "source": "https://registry.npmjs.org/@storybook/postinstall/-/postinstall-7.0.21.tgz",
            "status": "approved"
        }
    ]
}