{
    "id": "project/automotive.tractusx/-/knowledge-agents-aas-bridge/0.0",
    "license": "Apache-2.0",
    "authority": "https://gitlab.eclipse.org/eclipsefdn/emo-team/iplab/-/issues/11601",
    "source": "https://github.com/eclipse-tractusx/knowledge-agents-aas-bridge/pull/1.patch",
    "status": "approved",
    "scans": [
        {
            "date": "November 16, 2023 at 7:49:18 a.m. GMT",
            "authority": "https://gitlab.eclipse.org/eclipsefdn/emo-team/iplab/-/issues/11601",
            "scancode-version": "31.2.1",
            "licenses-discovered": [
            ],
            "copyrights": [
                "Copyright (c) 2021, 2023 Contributors",
                "Copyright (c) 2021,2022 Contributors",
                "Copyright (c) 2022 Mercedes-Benz Tech Innovation GmbH",
                "Copyright (c) 2022 Microsoft Corporation",
                "Copyright (c) 2022, 2023 Contributors",
                "Copyright (c) 2022,2023 Contributors",
                "Copyright (c) 2023 Bayerische Motoren Werke Aktiengesellschaft",
                "Copyright (c) 2023 Contributors",
                "Copyright (c) 2023 SAP SE",
                "Copyright (c) 2023 T-Systems International GmbH"
            ],
            "file-count": 1,
            "sha256": "735a5dea1882781a1b2688bf1921e6466a86497a5913781e93dd3efee76299c6",
            "source": "https://github.com/eclipse-tractusx/knowledge-agents-aas-bridge/pull/1.patch",
            "status": "restricted"
        }
    ]
}
