{
    "id": "maven/mavencentral/commons-math/commons-math/1.1",
    "license": "Apache-2.0",
    "licenses-discovered": [
        "Apache-2.0"
    ],
    "file-count": 286,
    "scancode-version": "30.1.0",
    "authority": "https://gitlab.eclipse.org/eclipsefdn/emo-team/iplab/-/issues/2559",
    "source": "https://archive.apache.org/dist/commons/math/source/commons-math-1.1-src.zip",
    "status": "approved"
}