{
    "id": "go/golang/google.golang.org/grpc/v1.59.0",
    "license": "Apache-2.0",
    "authority": "https://gitlab.eclipse.org/eclipsefdn/emo-team/iplab/-/issues/12192",
    "source": "https://proxy.golang.org/google.golang.org/grpc/@v/v1.59.0.zip",
    "status": "approved",
    "scans": [
        {
            "date": "December 21, 2023 at 6:40:56 p.m. GMT",
            "authority": "https://gitlab.eclipse.org/eclipsefdn/emo-team/iplab/-/issues/12192",
            "scancode-version": "31.2.1",
            "licenses-discovered": [
                "Apache-2.0"
            ],
            "copyrights": [
                "Copyright 2014 gRPC",
                "Copyright 2015 The gRPC",
                "Copyright 2015 gRPC",
                "Copyright 2015-2016 gRPC",
                "Copyright 2016 The gRPC",
                "Copyright 2016 gRPC",
                "Copyright 2017 gRPC",
                "Copyright 2018 The gRPC",
                "Copyright 2018 gRPC",
                "Copyright 2019 gRPC",
                "Copyright 2020 The gRPC",
                "Copyright 2020 gRPC",
                "Copyright 2021 gRPC",
                "Copyright 2022 gRPC",
                "Copyright 2023 gRPC"
            ],
            "file-count": 810,
            "sha256": "8d8be58b73bcbefd731939880edd32aa3a90c4b6937ce07d904075470fce3565",
            "source": "https://proxy.golang.org/google.golang.org/grpc/@v/v1.59.0.zip",
            "status": "approved"
        }
    ]
}