{
    "id": "maven/mavencentral/software.amazon.awssdk/checksums/2.21.5",
    "license": "Apache-2.0",
    "authority": "https://gitlab.eclipse.org/eclipsefdn/emo-team/iplab/-/issues/11134",
    "source": "https://repo.maven.apache.org/maven2/software/amazon/awssdk/checksums/2.21.5/checksums-2.21.5-sources.jar",
    "status": "approved",
    "scans": [
        {
            "date": "October 24, 2023 at 11:02:42 a.m. GMT",
            "authority": "https://gitlab.eclipse.org/eclipsefdn/emo-team/iplab/-/issues/11134",
            "scancode-version": "31.2.1",
            "licenses-discovered": [
                "Apache-2.0"
            ],
            "copyrights": [
                "Copyright Amazon.com, Inc. or its affiliates"
            ],
            "file-count": 5,
            "sha256": "03bb34adb9b69bbb2b5569b9a430176482b9dcc304e558be5f4d199c43d09405",
            "source": "https://repo.maven.apache.org/maven2/software/amazon/awssdk/checksums/2.21.5/checksums-2.21.5-sources.jar",
            "status": "approved"
        }
    ]
}