{
    "id": "npm/npmjs/-/sass/1.82.0",
    "license": "MIT",
    "authority": "https://gitlab.eclipse.org/eclipsefdn/emo-team/iplab/-/issues/17751",
    "source": "https://github.com/sass/dart-sass/archive/refs/tags/1.82.0.zip",
    "status": "approved",
    "scans": [
        {
            "date": "December 5, 2024 at 7:18:19 a.m. GMT",
            "authority": "https://gitlab.eclipse.org/eclipsefdn/emo-team/iplab/-/issues/17751",
            "scancode-version": "31.2.1",
            "licenses-discovered": [
                "MIT",
                "LicenseRef-scancode-proprietary-license AND MIT"
            ],
            "copyrights": [
                "Copyright (c) 2016, Google Inc.",
                "Copyright 2013 Andrey Sitnik <andrey@sitnik.ru>",
                "Copyright 2014 Google Inc.",
                "Copyright 2016 Google Inc.",
                "Copyright 2017 Google Inc.",
                "Copyright 2018 Google Inc.",
                "Copyright 2019 Google Inc.",
                "Copyright 2019 Google LLC.",
                "Copyright 2020 Google Inc.",
                "Copyright 2021 Google Inc.",
                "Copyright 2021 Google LLC.",
                "Copyright 2022 Google Inc.",
                "Copyright 2023 Google Inc.",
                "Copyright 2023 Google LLC.",
                "Copyright 2024 Google Inc.",
                "Copyright 2024 Google Inc. Forward",
                "Copyright 2024 Google LLC.",
                "Copyright DateTime.now .year Google, Inc."
            ],
            "file-count": 584,
            "sha256": "187d3026ead77cf77964555bf045e4c29c3ee817f2f18f8de6c3b4f16a541560",
            "source": "https://github.com/sass/dart-sass/archive/refs/tags/1.82.0.zip",
            "status": "restricted"
        }
    ]
}