{
    "id": "npm/npmjs/@typescript-eslint/utils/8.11.0",
    "license": "BSD-2-Clause AND MIT AND (BSD-2-Clause AND ISC AND MIT)",
    "authority": "https://gitlab.eclipse.org/eclipsefdn/emo-team/iplab/-/issues/16860",
    "source": "https://github.com/typescript-eslint/typescript-eslint/archive/refs/tags/v8.11.0.zip",
    "status": "approved",
    "scans": [
        {
            "date": "October 22, 2024, 10:33:47 a.m. GMT",
            "authority": "https://gitlab.eclipse.org/eclipsefdn/emo-team/iplab/-/issues/16860",
            "scancode-version": "31.2.1",
            "licenses-discovered": [
                "BSD-2-Clause",
                "MIT",
                "BSD-2-Clause AND ISC AND MIT"
            ],
            "copyrights": [
                "Copyright (c) 2016 unional",
                "Copyright (c) 2019 typescript-eslint and other contributors",
                "Copyright (c) 2021 typescript-eslint and other contributors",
                "Copyright (c) 2023 typescript-eslint and other contributors",
                "Copyright JS Foundation and other contributors, https://js.foundation",
                "Copyright Joyent, Inc. and other Node contributors",
                "Pp (c) Ac",
                "Tv (c) Gn"
            ],
            "file-count": 7756,
            "sha256": "859cce1b73adecae9a1948ec51f734f5b5fc34018fafe3887a26272bd1b42504",
            "source": "https://github.com/typescript-eslint/typescript-eslint/archive/refs/tags/v8.11.0.zip",
            "status": "approved"
        }
    ]
}