{
    "id": "pypi/pypi/-/shellingham/1.5.4",
    "license": "ISC AND BSD-3-Clause",
    "authority": "https://gitlab.eclipse.org/eclipsefdn/emo-team/iplab/-/issues/19381",
    "source": "https://files.pythonhosted.org/packages/58/15/8b3609fd3830ef7b27b655beb4b4e9c62313a4e8da8c676e142cc210d58e/shellingham-1.5.4.tar.gz",
    "status": "approved",
    "scans": [
        {
            "date": "February 11, 2025 at 9:20:31 p.m. GMT",
            "authority": "https://gitlab.eclipse.org/eclipsefdn/emo-team/iplab/-/issues/19381",
            "scancode-version": "31.2.1",
            "licenses-discovered": [
                "ISC",
                "BSD-3-Clause"
            ],
            "copyrights": [
                "Copyright (c) 2018, Tzu-ping Chung <uranusjr@gmail.com>"
            ],
            "file-count": 20,
            "sha256": "8dbca0739d487e5bd35ab3ca4b36e11c4078f3a234bfce294b0a0291363404de",
            "source": "https://files.pythonhosted.org/packages/58/15/8b3609fd3830ef7b27b655beb4b4e9c62313a4e8da8c676e142cc210d58e/shellingham-1.5.4.tar.gz",
            "status": "approved"
        }
    ]
}