{
    "id": "maven/mavencentral/com.azure.resourcemanager/azure-resourcemanager-sql/2.30.0",
    "license": "MIT",
    "authority": "https://gitlab.eclipse.org/eclipsefdn/emo-team/iplab/-/issues/10565",
    "source": "https://repo.maven.apache.org/maven2/com/azure/resourcemanager/azure-resourcemanager-sql/2.30.0/azure-resourcemanager-sql-2.30.0-sources.jar",
    "status": "approved",
    "scans": [
        {
            "date": "September 18, 2023 at 11:33:59 a.m. GMT",
            "authority": "https://gitlab.eclipse.org/eclipsefdn/emo-team/iplab/-/issues/10565",
            "scancode-version": "31.2.1",
            "licenses-discovered": [
                "MIT"
            ],
            "copyrights": [
                "(c) 2008 VeriSign, Inc.",
                "Copyright (c) Microsoft Corporation"
            ],
            "file-count": 956,
            "sha256": "79a537aec735729d9948a58b166992e309a2b1d6630338e36feccf69975383c8",
            "source": "https://repo.maven.apache.org/maven2/com/azure/resourcemanager/azure-resourcemanager-sql/2.30.0/azure-resourcemanager-sql-2.30.0-sources.jar",
            "status": "approved"
        }
    ]
}