{
    "id": "project/adoptium/adoptium.mc/jmc-build/0.0",
    "license": "Apache-2.0 AND BSD-3-Clause AND UPL-1.0",
    "licenses-discovered": [
        "Apache-2.0",
        "BSD-3-Clause",
        "UPL-1.0"
    ],
    "file-count": 11,
    "scancode-version": "30.1.0",
    "authority": "https://gitlab.eclipse.org/eclipsefdn/emo-team/iplab/-/issues/2685",
    "source": "https://github.com/adoptium/jmc-build/archive/refs/heads/master.zip",
    "status": "approved"
}