{
    "id": "npm/npmjs/@algolia/requester-node-http/5.18.0",
    "license": "MIT AND (BSD-2-Clause AND ISC AND MIT)",
    "authority": "https://gitlab.eclipse.org/eclipsefdn/emo-team/iplab/-/issues/18998",
    "source": "https://github.com/algolia/algoliasearch-client-javascript/archive/refs/tags/5.18.0.zip",
    "status": "approved",
    "scans": [
        {
            "date": "January 19, 2025 at 9:47:40 p.m. GMT",
            "authority": "https://gitlab.eclipse.org/eclipsefdn/emo-team/iplab/-/issues/18998",
            "scancode-version": "31.2.1",
            "licenses-discovered": [
                "MIT",
                "BSD-2-Clause AND ISC AND MIT"
            ],
            "copyrights": [
                "Copyright (c) 2013-Present Algolia"
            ],
            "file-count": 1079,
            "sha256": "8e25c8ddf64d6a841fed9c4242dab69046ffeef1438c60af3fd712ca6bf3df15",
            "source": "https://github.com/algolia/algoliasearch-client-javascript/archive/refs/tags/5.18.0.zip",
            "status": "approved"
        }
    ]
}