{
    "id": "maven/mavencentral/org.glassfish.shoal/shoal-gms-api/1.6.53",
    "license": "EPL-2.0 OR (GPL-2.0-only WITH Classpath-exception-2.0)",
    "licenses-discovered": [
        "EPL-2.0 AND (GPL-2.0-only WITH Classpath-exception-2.0)"
    ],
    "file-count": 57,
    "scancode-version": "30.1.0",
    "authority": "https://gitlab.eclipse.org/eclipsefdn/emo-team/iplab/-/issues/2568",
    "source": "https://search.maven.org/remotecontent?filepath=org/glassfish/shoal/shoal-gms-api/1.6.53/shoal-gms-api-1.6.53-sources.jar",
    "status": "approved"
}
