{
    "id": "npm/npmjs/@algolia/client-search/5.5.0",
    "license": "MIT AND (BSD-2-Clause AND ISC AND MIT)",
    "authority": "https://gitlab.eclipse.org/eclipsefdn/emo-team/iplab/-/issues/16178",
    "source": "https://github.com/algolia/algoliasearch-client-javascript/archive/refs/tags/5.5.0.zip",
    "status": "approved",
    "scans": [
        {
            "date": "September 18, 2024, 6:59:28 p.m. GMT",
            "authority": "https://gitlab.eclipse.org/eclipsefdn/emo-team/iplab/-/issues/16178",
            "scancode-version": "31.2.1",
            "licenses-discovered": [
                "MIT",
                "BSD-2-Clause AND ISC AND MIT"
            ],
            "copyrights": [
                "Copyright (c) 2013-Present Algolia"
            ],
            "file-count": 909,
            "sha256": "41ed33a8019ae796f16deeaad58b21e9782c6e81ee42b64d5f0e0cd9615c20f0",
            "source": "https://github.com/algolia/algoliasearch-client-javascript/archive/refs/tags/5.5.0.zip",
            "status": "approved"
        }
    ]
}