{
    "id": "maven/mavencentral/com.aayushatharva.brotli4j/native-linux-aarch64/1.16.0",
    "license": "Apache-2.0",
    "authority": "https://gitlab.eclipse.org/eclipsefdn/emo-team/iplab/-/issues/14468",
    "source": "https://repo1.maven.org/maven2/com/aayushatharva/brotli4j/native-linux-aarch64/1.16.0/native-linux-aarch64-1.16.0-sources.jar",
    "status": "approved",
    "scans": [
        {
            "date": "April 19, 2024 at 1:45:22 p.m. GMT",
            "authority": "https://gitlab.eclipse.org/eclipsefdn/emo-team/iplab/-/issues/14468",
            "scancode-version": "31.2.1",
            "licenses-discovered": [
                "Apache-2.0"
            ],
            "copyrights": [
                "Copyright (c) 2020-2023, Aayush Atharva"
            ],
            "file-count": 4,
            "sha256": "69021cf2b40d1379953393a48c418f89e8a9ba3691ac8a831c0711c1415887e4",
            "source": "https://repo1.maven.org/maven2/com/aayushatharva/brotli4j/native-linux-aarch64/1.16.0/native-linux-aarch64-1.16.0-sources.jar",
            "status": "approved"
        }
    ]
}