{
    "license": "Classpath-exception-2.0 AND GPL-2.0-only AND LicenseRef-scancode-oracle-openjdk-classpath-exception-2.0 AND MIT",
    "file-count": 966,
    "authority": "https://gitlab.eclipse.org/eclipsefdn/emo-team/iplab/-/issues/1497",
    "scancode-version": "30.1.0",
    "licenses-discovered": [
        "GPL-2.0-only",
        "LicenseRef-scancode-oracle-openjdk-classpath-exception-2.0",
        "MIT",
        "Classpath-exception-2.0"
    ],
    "id": "maven/mavencentral/org.openjdk.jcstress/jcstress-core/0.4",
    "source": "https://search.maven.org/remotecontent?filepath=org/openjdk/jcstress/jcstress-core/0.4/jcstress-core-0.4-sources.jar",
    "status": "restricted",
    "workswith": [
        "technology.collections"
    ]
}
