{
    "id": "npm/npmjs/-/ws/7.5.7",
    "license": "MIT",
    "licenses-discovered": [
        "MIT"
    ],
    "file-count": 17,
    "scancode-version": "30.1.0",
    "authority": "https://gitlab.eclipse.org/eclipsefdn/emo-team/iplab/-/issues/1940",
    "source": "https://registry.npmjs.org/ws/-/ws-7.5.7.tgz",
    "status": "approved"
}