{
    "id": "maven/mavencentral/org.infinispan/infinispan-commons/14.0.3.Final",
    "license": "xpp AND Apache-2.0",
    "authority": "https://gitlab.eclipse.org/eclipsefdn/emo-team/iplab/-/issues/5975",
    "source": "https://search.maven.org/remotecontent?filepath=org/infinispan/infinispan-commons/14.0.3.Final/infinispan-commons-14.0.3.Final-sources.jar",
    "status": "approved",
    "scans": [
        {
            "date": "December 22, 2022 at 4:57:18 p.m. GMT",
            "authority": "https://gitlab.eclipse.org/eclipsefdn/emo-team/iplab/-/issues/5975",
            "scancode-version": "31.2.1",
            "licenses-discovered": [
                "xpp",
                "Apache-2.0"
            ],
            "copyrights": [
                "Copyright (c) 2003 The Trustees of Indiana University",
                "Copyright (c) 2008 Google Inc.",
                "Copyright (c) 2011 Miami-Dade County"
            ],
            "file-count": 339,
            "sha256": "6ac8f7ac4b8d382af93cecb6bc712e419ef80d2b801a813c726589025668f264",
            "source": "https://search.maven.org/remotecontent?filepath=org/infinispan/infinispan-commons/14.0.3.Final/infinispan-commons-14.0.3.Final-sources.jar",
            "status": "restricted"
        }
    ]
}
