{
    "id": "maven/mavencentral/org.jetbrains.kotlin/kotlin-compiler/1.9.0",
    "license": "Apache-2.0 AND (NPL-1.1 OR GPL-2.0-or-later) AND NPL-1.1 AND BSD-3-Clause AND (Apache-2.0 AND BSD-3-Clause)",
    "authority": "https://gitlab.eclipse.org/eclipsefdn/emo-team/iplab/-/issues/11165",
    "source": "https://repo.maven.apache.org/maven2/org/jetbrains/kotlin/kotlin-compiler/1.9.0/kotlin-compiler-1.9.0-sources.jar",
    "status": "approved",
    "scans": [
        {
            "date": "October 25, 2023 at 10:35:49 a.m. GMT",
            "authority": "https://gitlab.eclipse.org/eclipsefdn/emo-team/iplab/-/issues/11165",
            "scancode-version": "31.2.1",
            "licenses-discovered": [
                "Apache-2.0",
                "GPL-1.0-or-later AND NPL-1.1",
                "NPL-1.1",
                "BSD-3-Clause",
                "Apache-2.0 AND BSD-3-Clause",
                "Apache-2.0 AND MIT"
            ],
            "copyrights": [
                "Copyright (c) 1997-1999 Netscape Communications Corporation",
                "Copyright (c) 1997-2000 Netscape Communications Corporation",
                "Copyright (c) 2000-2011 INRIA, France Telecom",
                "Copyright (c) 2011, the Dart project",
                "Copyright 2000-2017 JetBrains s.r.o. and Kotlin Programming Language contributors",
                "Copyright 2000-2018 JetBrains s.r.o. and Kotlin Programming Language contributors",
                "Copyright 2000-2019 JetBrains s.r.o. and Kotlin Programming Language contributors",
                "Copyright 2000-2020 JetBrains s.r.o.",
                "Copyright 2000-2021 JetBrains s.r.o. and contributors",
                "Copyright 2007 Google Inc.",
                "Copyright 2008 Google Inc.",
                "Copyright 2010-2014 JetBrains s.r.o.",
                "Copyright 2010-2015 JetBrains s.r.o.",
                "Copyright 2010-2016 JetBrains s.r.o.",
                "Copyright 2010-2017 JetBrains s.r.o.",
                "Copyright 2010-2018 JetBrains s.r.o.",
                "Copyright 2010-2018 JetBrains s.r.o. and Kotlin Programming Language contributors",
                "Copyright 2010-2019 JetBrains s.r.o.",
                "Copyright 2010-2019 JetBrains s.r.o. and Kotlin Programming Language contributors",
                "Copyright 2010-2020 JetBrains s.r.o.",
                "Copyright 2010-2020 JetBrains s.r.o. and Kotlin Programming Language contributors",
                "Copyright 2010-2021 JetBrains s.r.o.",
                "Copyright 2010-2021 JetBrains s.r.o. and Kotlin Programming Language contributors",
                "Copyright 2010-2022 JetBrains s.r.o. and Kotlin Programming Language contributors",
                "Copyright 2010-2023 JetBrains s.r.o. and Kotlin Programming Language contributors",
                "Copyright 2019 JetBrains s.r.o. and Kotlin Programming Language contributors",
                "Copyright 201L0-201L9 JetBrains s.r.o. and Kotlin Programming Language contributors",
                "LazyJavaStaticScope (c) Null"
            ],
            "file-count": 6109,
            "sha256": "c6193e2429f86118292782d508b5b50bfd698bdffee32edecf0f4d820b387263",
            "source": "https://repo.maven.apache.org/maven2/org/jetbrains/kotlin/kotlin-compiler/1.9.0/kotlin-compiler-1.9.0-sources.jar",
            "status": "restricted"
        }
    ]
}
