{
    "id": "maven/mavencentral/org.springframework.data/spring-data-rest-core/4.2.1",
    "license": "Apache-2.0",
    "authority": "https://gitlab.eclipse.org/eclipsefdn/emo-team/iplab/-/issues/12591",
    "source": "https://repo1.maven.org/maven2/org/springframework/data/spring-data-rest-core/4.2.1/spring-data-rest-core-4.2.1-sources.jar",
    "status": "approved",
    "scans": [
        {
            "date": "January 2, 2024 at 2:25:52 p.m. GMT",
            "authority": "https://gitlab.eclipse.org/eclipsefdn/emo-team/iplab/-/issues/12591",
            "scancode-version": "31.2.1",
            "licenses-discovered": [
                "Apache-2.0"
            ],
            "copyrights": [
                "Copyright 2012-2023 the original author or authors",
                "Copyright 2013-2023 the original author or authors",
                "Copyright 2014-2023 the original author or authors",
                "Copyright 2015-2023 the original author or authors",
                "Copyright 2018-2023 the original author or authors",
                "Copyright 2023 the original author or authors"
            ],
            "file-count": 96,
            "sha256": "d310962acda0b8bab79f9f1a23fd944a1562e46adc4901d8a275f37ecd8a54b9",
            "source": "https://repo1.maven.org/maven2/org/springframework/data/spring-data-rest-core/4.2.1/spring-data-rest-core-4.2.1-sources.jar",
            "status": "approved"
        }
    ]
}