{
    "id": "npm/npmjs/-/internal-slot/1.0.5",
    "license": "MIT",
    "authority": "https://gitlab.eclipse.org/eclipsefdn/emo-team/iplab/-/issues/7118",
    "source": "https://github.com/ljharb/internal-slot/archive/v1.0.5.zip",
    "status": "approved",
    "scans": [
        {
            "date": "February 14, 2023 at 3:23:31 p.m. GMT",
            "authority": "https://gitlab.eclipse.org/eclipsefdn/emo-team/iplab/-/issues/7118",
            "scancode-version": "31.2.1",
            "licenses-discovered": [
                "MIT"
            ],
            "copyrights": [
                "Copyright (c) 2019 Jordan Harband"
            ],
            "file-count": 15,
            "sha256": "47c8ce288bb8863609c524d84e3c18b63eaed2c5d0956bed00dd4806f8e068ae",
            "source": "https://github.com/ljharb/internal-slot/archive/v1.0.5.zip",
            "status": "approved"
        }
    ]
}