{
    "id": "pypi/pypi/-/rdflib/6.1.1",
    "license": "BSD-3-Clause AND MIT AND (LicenseRef-W3C-Test-Suite-License OR BSD-3-Clause) AND (GPL-2.0-only OR W3C OR LicenseRef-BSD OR MIT) AND PDDL-1.0 AND W3C AND LicenseRef-W3C-20230101",
    "authority": "https://gitlab.eclipse.org/eclipsefdn/emo-team/iplab/-/issues/4789",
    "source": "https://files.pythonhosted.org/packages/42/ff/00084798ba8d21f9e79044c4b8e56d0fca4bb7dd428ae693bcbfdbaa4a06/rdflib-6.1.1.tar.gz",
    "status": "approved",
    "scans": [
        {
            "date": "November 10, 2022 at 8:20:42 p.m. GMT",
            "authority": "https://gitlab.eclipse.org/eclipsefdn/emo-team/iplab/-/issues/4789",
            "scancode-version": "31.2.1",
            "licenses-discovered": [
                "BSD-3-Clause",
                "MIT",
                "LicenseRef-scancode-other-copyleft AND LicenseRef-scancode-proprietary-license",
                "LicenseRef-scancode-proprietary-license",
                "MIT AND W3C-19980720",
                "BSD-3-Clause AND GPL-2.0-only AND MIT AND W3C",
                "W3C"
            ],
            "copyrights": [
                "(c) doctest DEFAULT http://www.example.com/gr",
                "Copyright (c) 2002-2021, RDFLib Team",
                "Copyright (c) 2010 Charles Leifer, Eric Holscher, Bobby Grace",
                "Copyright (c) 2011 Bay Citizen & Texas Tribune",
                "Copyright (c) World Wide Web Consortium, (Massachusetts Institute of Technology, European Research Consortium for Informatics and Mathematics, Keio University) and others",
                "Copyright 2000-2007, World Wide",
                "Copyright 2001, Zolera Systems Inc.",
                "Copyright 2007, Sean B. Palmer",
                "Copyright 2007-2010 by the Sphinx team",
                "Copyright 2010, Gunnar A. Grimnes",
                "Copyright URIRef",
                "Copyright World Wide Web Consortium, (Massachusetts Institute of Technology, European Research Consortium for Informatics and Mathematics, Keio University)",
                "Copyright World Wide Web Consortium, (Massachusetts Institute of Technology, Institut National de Recherche en Informatique et en Automatique, Keio University)",
                "Copyright clause at <http://www.w3.org/Consortium/Legal/copyright-software.html>",
                "Web Consortium. Copyright 2001",
                "copyright 2009 - 2021, RDFLib Team",
                "copyright e (c)"
            ],
            "file-count": 7427,
            "sha256": "8dbfa0af2990b98471dacbc936d6494c997ede92fd8ed693fb84ee700ef6f754",
            "source": "https://files.pythonhosted.org/packages/42/ff/00084798ba8d21f9e79044c4b8e56d0fca4bb7dd428ae693bcbfdbaa4a06/rdflib-6.1.1.tar.gz",
            "status": "restricted"
        }
    ]
}