{
    "id": "maven/mavencentral/org.apache.cxf/cxf-core/3.5.3",
    "license": "Apache-2.0 AND LicenseRef-scancode-ws-addressing-spec AND LicenseRef-scancode-ms-ws-routing-spec AND W3C-19980720 AND W3C AND LicenseRef-scancode-ws-trust-specification",
    "authority": "https://gitlab.eclipse.org/eclipsefdn/emo-team/iplab/-/issues/5246",
    "source": "https://search.maven.org/remotecontent?filepath=org/apache/cxf/cxf-core/3.5.3/cxf-core-3.5.3-sources.jar",
    "status": "approved",
    "scans": [
        {
            "date": "November 29, 2022 at 4:58:26 p.m. GMT",
            "authority": "https://gitlab.eclipse.org/eclipsefdn/emo-team/iplab/-/issues/5246",
            "scancode-version": "31.2.1",
            "licenses-discovered": [
                "Apache-2.0",
                "LicenseRef-scancode-ws-addressing-spec",
                "LicenseRef-scancode-ms-ws-routing-spec",
                "W3C-19980720",
                "W3C",
                "LicenseRef-scancode-ws-trust-specification"
            ],
            "copyrights": [
                "(c) 2002-2005 BEA Systems, IBM, Microsoft Corporation, Inc, and TIBCO Software Inc",
                "Copyright (c) 2002-2004 BEA Systems Inc., International Business Machines Corporation, Microsoft Corporation, Inc, SAP AG, and Sun Microsystems, Inc",
                "Copyright (c) 2006 World Wide Web Consortium",
                "Copyright 2001 - 2005, International Business Machines Corporation and Microsoft Corporation",
                "Copyright 2001 - 2006, International Business Machines Corporation and Microsoft Corporation",
                "Copyright 2001 Martin Gudgin, Developmentor. http://www.develop.co.uk",
                "Copyright 2001 W3C (Massachusetts Institute of Technology, Institut National de Recherche en Informatique et en Automatique, Keio University)",
                "Copyright 2001-2005, International Business Machines Corporation and Microsoft Corporation",
                "Copyright 2003,2004 BEA Systems Inc. and IBM Corporation and Microsoft Corporation",
                "Copyright ?? 2005 World Wide Web Consortium"
            ],
            "file-count": 686,
            "sha256": "64a3f4d3f671abc680108f8ea9588d9f407c2f5578449d318e8c3d0f54a9f747",
            "source": "https://search.maven.org/remotecontent?filepath=org/apache/cxf/cxf-core/3.5.3/cxf-core-3.5.3-sources.jar",
            "status": "restricted"
        }
    ]
}
