{
    "license": "Apache-2.0",
    "file-count": 14347,
    "authority": "https://gitlab.eclipse.org/eclipsefdn/emo-team/iplab/-/issues/1565",
    "scancode-version": "30.1.0",
    "licenses-discovered": [
    ],
    "id": "maven/mavencentral/org.camunda.bpm.model/camunda-cmmn-model/7.15.0",
    "source": "",
    "status": "restricted"
}
