{
    "id": "npm/npmjs/@typescript-eslint/utils/8.3.0",
    "license": "BSD-2-Clause AND MIT AND (BSD-2-Clause AND ISC AND MIT)",
    "authority": "https://gitlab.eclipse.org/eclipsefdn/emo-team/iplab/-/issues/16011",
    "source": "https://github.com/typescript-eslint/typescript-eslint/archive/refs/tags/v8.3.0.zip",
    "status": "approved",
    "scans": [
        {
            "date": "August 27, 2024 at 8:10:18 a.m. GMT",
            "authority": "https://gitlab.eclipse.org/eclipsefdn/emo-team/iplab/-/issues/16011",
            "scancode-version": "31.2.1",
            "licenses-discovered": [
                "BSD-2-Clause",
                "MIT",
                "BSD-2-Clause AND ISC AND MIT"
            ],
            "copyrights": [
                "(c) Sindre Sorhus",
                "Copyright (c) 2016 unional",
                "Copyright (c) 2019 typescript-eslint and other contributors",
                "Copyright (c) 2021 typescript-eslint and other contributors",
                "Copyright (c) 2023 typescript-eslint and other contributors",
                "Copyright (c) Facebook, Inc. and its affiliates",
                "Copyright JS Foundation and other contributors, https://js.foundation",
                "Copyright Jeremy Ashkenas, DocumentCloud and Investigative Reporters & Editors",
                "Copyright Joyent, Inc. and other Node contributors",
                "Copyright OpenJS Foundation and other contributors <https://openjsf.org/>",
                "Pp (c) Ac",
                "Tv (c) Gn"
            ],
            "file-count": 7605,
            "sha256": "c12898eef62a0d1dec1ad0b16a21edc8e03f9578c51338c9a10deaf6acf1d2f8",
            "source": "https://github.com/typescript-eslint/typescript-eslint/archive/refs/tags/v8.3.0.zip",
            "status": "approved"
        }
    ]
}