{
    "id": "npm/npmjs/@catena-x/portal-shared-components/3.0.0",
    "license": "Apache-2.0 AND CC-BY-4.0 AND (BSD-3-Clause AND MIT) AND EPL-2.0 AND (EPL-2.0 AND (GPL-2.0-only WITH Classpath-exception-2.0)) AND BSD-3-Clause AND (Apache-2.0 AND CC0-1.0 AND EPL-2.0 AND (GPL-2.0-only WITH Classpath-exception-2.0)) AND (CDDL-1.0 AND EPL-2.0 AND (GPL-2.0-only WITH Classpath-exception-2.0)) AND (Apache-2.0 AND EPL-2.0 AND (GPL-2.0-only WITH Classpath-exception-2.0)) AND (Apache-2.0 AND LGPL-2.1-or-later AND MPL-1.1) AND MPL-2.0 AND OFL-1.1",
    "authority": "https://gitlab.eclipse.org/eclipsefdn/emo-team/iplab/-/issues/14240",
    "source": "https://github.com/eclipse-tractusx/portal-shared-components/archive/refs/tags/v3.0.0.zip",
    "status": "restricted",
    "scans": [
        {
            "date": "April 8, 2024 at 11:06:24 a.m. GMT",
            "authority": "https://gitlab.eclipse.org/eclipsefdn/emo-team/iplab/-/issues/14240",
            "scancode-version": "31.2.1",
            "licenses-discovered": [
                "Apache-2.0",
                "CC-BY-4.0",
                "BSD-3-Clause AND MIT",
                "EPL-2.0",
                "EPL-2.0 AND (GPL-2.0-only WITH Classpath-exception-2.0)",
                "BSD-3-Clause",
                "Apache-2.0 AND CC0-1.0 AND EPL-2.0 AND (GPL-2.0-only WITH Classpath-exception-2.0)",
                "CDDL-1.0 AND EPL-2.0 AND (GPL-2.0-only WITH Classpath-exception-2.0)",
                "Apache-2.0 AND EPL-2.0 AND (GPL-2.0-only WITH Classpath-exception-2.0)",
                "Apache-2.0 AND LGPL-2.1-or-later AND MPL-1.1",
                "MPL-2.0",
                "OFL-1.1"
            ],
            "copyrights": [
                "Copyright (c) 1989, 1991 Free Software Foundation, Inc.",
                "Copyright (c) 1996-2017, http://www.oracle.com' Oracle and/or its affiliates",
                "Copyright (c) 1997, 2018 Oracle and/or its affiliates",
                "Copyright (c) 1997, 2019 Oracle and/or its affiliates",
                "Copyright (c) 1997-2018 Oracle and/or its affiliates",
                "Copyright (c) 1999- Shigeru Chiba",
                "Copyright (c) 1999-2022 Shigeru Chiba",
                "Copyright (c) 2003, 2018 Oracle and/or its affiliates",
                "Copyright (c) 2007, Eclipse Foundation, Inc.",
                "Copyright (c) 2008, 2018 Oracle and/or its affiliates",
                "Copyright (c) 2008, Imran M Yousuf <imyousuf@smartitengineering.com>",
                "Copyright (c) 2009 The Guava Authors",
                "Copyright (c) 2009, 2018 Oracle and/or its affiliates",
                "Copyright (c) 2009, Google Inc.",
                "Copyright (c) 2009, Igor Fedorenko <igor@ifedorenko.com>",
                "Copyright (c) 2010, 2018 Oracle and/or its affiliates",
                "Copyright (c) 2010, 2023 Oracle and/or its affiliates",
                "Copyright (c) 2010, Matthias Sohn <matthias.sohn@sap.com> and others",
                "Copyright (c) 2011, 2019 Oracle and/or its affiliates",
                "Copyright (c) 2011, 2021 Oracle and/or its affiliates",
                "Copyright (c) 2011, 2023 Oracle and/or its affiliates",
                "Copyright (c) 2012, 2018 Oracle and/or its affiliates",
                "Copyright (c) 2012, 2020 Oracle and/or its affiliates",
                "Copyright (c) 2012, 2021 Oracle and/or its affiliates",
                "Copyright (c) 2012, 2023 Oracle and/or its affiliates",
                "Copyright (c) 2013, 2018 Oracle and/or its affiliates",
                "Copyright (c) 2013, 2021 Oracle and/or its affiliates",
                "Copyright (c) 2013, 2022 Oracle and/or its affiliates",
                "Copyright (c) 2013, 2023 Oracle and/or its affiliates",
                "Copyright (c) 2017",
                "Copyright (c) 2017, 2018 Oracle and/or its affiliates",
                "Copyright (c) 2017, 2023 Oracle and/or its affiliates",
                "Copyright (c) 2018 Payara Foundation and/or its affiliates",
                "Copyright (c) 2018, 2020 Oracle and/or its affiliates",
                "Copyright (c) 2018,2020 Eclipse Foundation",
                "Copyright (c) 2019 Eclipse Foundation",
                "Copyright (c) 2019 Eclipse Foundation and others",
                "Copyright (c) 2019, 2020 Eclipse Foundation",
                "Copyright (c) 2020, 2022 The Eclipse Foundation and others",
                "Copyright (c) 2020, Red Hat Inc.",
                "Copyright (c) 2021 The Eclipse Foundation and others",
                "Copyright (c) 2021, 2023 BMW Group AG",
                "Copyright (c) 2021, 2023 Contributors",
                "Copyright (c) 2021, 2023 Mercedes-Benz Group AG and BMW Group AG",
                "Copyright (c) 2021, 2024 Contributors",
                "Copyright (c) 2023 Contributors",
                "Copyright (c) 2023 Eclipse Foundation and others",
                "Copyright (c) 2024 Contributors",
                "Copyright 2004 The Apache Software Foundation",
                "Copyright 2011 Google Inc.",
                "Copyright 2015 The Error Prone",
                "Copyright 2019 Eclipse Foundation",
                "Copyright 2020 The LibreFranklin Project",
                "Copyright 2021-2024 Contributors",
                "Copyright 2023 Eclipse Foundation",
                "copyright Written by Doug Lea",
                "copyrighted by the Free Software Foundation"
            ],
            "file-count": 10547,
            "sha256": "5fb01203e8e71aa42a244f469414273efd46b773ec85a76223a4bcf47edec16a",
            "source": "https://github.com/eclipse-tractusx/portal-shared-components/archive/refs/tags/v3.0.0.zip",
            "status": "restricted"
        }
    ]
}