{
    "id": "maven/mavencentral/org.commonmark/commonmark-ext-image-attributes/0.24.0",
    "license": "BSD-2-Clause",
    "authority": "https://gitlab.eclipse.org/eclipsefdn/emo-team/iplab/-/issues/16842",
    "source": "https://repo1.maven.org/maven2/org/commonmark/commonmark-ext-image-attributes/0.24.0/commonmark-ext-image-attributes-0.24.0-sources.jar",
    "status": "approved",
    "scans": [
        {
            "date": "October 21, 2024, 3:56:21 p.m. GMT",
            "authority": "https://gitlab.eclipse.org/eclipsefdn/emo-team/iplab/-/issues/16833",
            "scancode-version": "31.2.1",
            "licenses-discovered": [
                "BSD-2-Clause"
            ],
            "copyrights": [
                "Copyright (c) 2015, Atlassian Pty Ltd"
            ],
            "file-count": 9,
            "sha256": "392d8c4efd22ef0b2f157f0b931df74c8c279aa1e2c61d68ff6005e05687dbe8",
            "source": "https://repo1.maven.org/maven2/org/commonmark/commonmark-ext-image-attributes/0.24.0/commonmark-ext-image-attributes-0.24.0-sources.jar",
            "status": "approved"
        },
        {
            "date": "October 21, 2024, 4:02:47 p.m. GMT",
            "authority": "https://gitlab.eclipse.org/eclipsefdn/emo-team/iplab/-/issues/16842",
            "scancode-version": "31.2.1",
            "licenses-discovered": [
                "BSD-2-Clause"
            ],
            "copyrights": [
                "Copyright (c) 2015, Atlassian Pty Ltd"
            ],
            "file-count": 9,
            "sha256": "392d8c4efd22ef0b2f157f0b931df74c8c279aa1e2c61d68ff6005e05687dbe8",
            "source": "https://repo1.maven.org/maven2/org/commonmark/commonmark-ext-image-attributes/0.24.0/commonmark-ext-image-attributes-0.24.0-sources.jar",
            "status": "approved"
        }
    ]
}