{
    "id": "maven/mavencentral/io.gatling/gatling-charts/3.10.5",
    "license": "Apache-2.0 AND MIT",
    "authority": "https://gitlab.eclipse.org/eclipsefdn/emo-team/iplab/-/issues/14469",
    "source": "https://repo1.maven.org/maven2/io/gatling/gatling-charts/3.10.5/gatling-charts-3.10.5-sources.jar",
    "status": "approved",
    "scans": [
        {
            "date": "April 19, 2024 at 1:46:32 p.m. GMT",
            "authority": "https://gitlab.eclipse.org/eclipsefdn/emo-team/iplab/-/issues/14469",
            "scancode-version": "31.2.1",
            "licenses-discovered": [
                "Apache-2.0",
                "MIT"
            ],
            "copyrights": [
                "(c) JS Foundation and other contributors",
                "Copyright 2011-2024 GatlingCorp (https://gatling.io)",
                "Copyright 2012 Twitter, Inc. http://www.apache.org/licenses/LICENSE-2.0.txt"
            ],
            "file-count": 81,
            "sha256": "9588073dcd61f4615fe34116fe303c83b93a1bda11a1e1def79e2e9b4c6224f4",
            "source": "https://repo1.maven.org/maven2/io/gatling/gatling-charts/3.10.5/gatling-charts-3.10.5-sources.jar",
            "status": "approved"
        }
    ]
}