{
    "id": "npm/npmjs/@babel/compat-data/7.20.1",
    "license": "MIT",
    "licenses-discovered": [
        "MIT"
    ],
    "copyrights": [
        "Copyright (c) 2014-present Sebastian McKenzie and other contributors"
    ],
    "file-count": 15,
    "scancode-version": "31.2.1",
    "authority": "https://gitlab.eclipse.org/eclipsefdn/emo-team/iplab/-/issues/4653",
    "source": "https://registry.npmjs.org/@babel/compat-data/-/compat-data-7.20.1.tgz",
    "status": "approved"
}