{
    "id": "npm/npmjs/-/vite-plugin-nightwatch/0.4.5",
    "license": "MIT",
    "authority": "https://gitlab.eclipse.org/eclipsefdn/emo-team/iplab/-/issues/8314",
    "source": "https://github.com/nightwatchjs/vite-plugin-nightwatch/archive/v0.4.5.zip",
    "status": "approved",
    "scans": [
        {
            "date": "May 4, 2023 at 5:25:36 p.m. GMT",
            "authority": "https://gitlab.eclipse.org/eclipsefdn/emo-team/iplab/-/issues/8314",
            "scancode-version": "31.2.1",
            "licenses-discovered": [
                "MIT"
            ],
            "copyrights": [
                "Copyright (c) 2022 Nightwatch.js"
            ],
            "file-count": 31,
            "sha256": "64d48d8d03bab5dbc469b1ee7b4374921f2652e753b02cd7e228071e44fcd22c",
            "source": "https://github.com/nightwatchjs/vite-plugin-nightwatch/archive/v0.4.5.zip",
            "status": "approved"
        }
    ]
}