{
    "id": "maven/mavencentral/org.codelibs.elasticsearch.module/transport-netty4/7.15.2",
    "license": "(Elastic-2.0 OR SSPL-1.0) AND (Apache-2.0 AND (Elastic-2.0 OR SSPL-1.0))",
    "authority": "https://gitlab.eclipse.org/eclipsefdn/emo-team/iplab/-/issues/6432",
    "source": "https://maven.codelibs.org/org/codelibs/elasticsearch/module/transport-netty4/7.15.2/transport-netty4-7.15.2-sources.jar",
    "status": "approved",
    "scans": [
        {
            "date": "February 1, 2023 at 5:05:30 a.m. GMT",
            "authority": "https://gitlab.eclipse.org/eclipsefdn/emo-team/iplab/-/issues/6432",
            "scancode-version": "31.2.1",
            "licenses-discovered": [
                "Elastic-2.0 AND SSPL-1.0",
                "Apache-2.0 AND Elastic-2.0 AND SSPL-1.0"
            ],
            "copyrights": [
                "Copyright 2012 The Netty Project",
                "Copyright Elasticsearch B.V."
            ],
            "file-count": 23,
            "sha256": "c049a132f516e3e043b87a3aaaceb616eb9877e35a9a2dea4257aaedd4ee6841",
            "source": "https://maven.codelibs.org/org/codelibs/elasticsearch/module/transport-netty4/7.15.2/transport-netty4-7.15.2-sources.jar",
            "status": "approved"
        }
    ]
}
