{
    "id": "maven/mavencentral/org.jboss.weld/weld-spi/6.0.Beta2",
    "license": "Apache-2.0",
    "authority": "https://gitlab.eclipse.org/eclipsefdn/emo-team/iplab/-/issues/15606",
    "source": "https://repo1.maven.org/maven2/org/jboss/weld/weld-spi/6.0.Beta2/weld-spi-6.0.Beta2-sources.jar",
    "status": "approved",
    "scans": [
        {
            "date": "July 3, 2024 at 6:13:34 p.m. GMT",
            "authority": "https://gitlab.eclipse.org/eclipsefdn/emo-team/iplab/-/issues/15606",
            "scancode-version": "31.2.1",
            "licenses-discovered": [
                "Apache-2.0 AND BSD-3-Clause AND CDDL-1.0 AND EPL-2.0 AND (GPL-2.0-only WITH Classpath-exception-2.0)",
                "Apache-2.0"
            ],
            "copyrights": [
                "Copyright 2008, Red Hat, Inc.",
                "Copyright 2010, Red Hat, Inc., and individual contributors by the authors",
                "Copyright 2012, Red Hat, Inc., and individual contributors by the authors",
                "Copyright 2013, Red Hat, Inc., and individual contributors by the authors",
                "Copyright 2014, Red Hat, Inc., and individual contributors by the authors",
                "Copyright 2015, Red Hat, Inc., and individual contributors by the authors",
                "Copyright 2016, Red Hat, Inc., and individual contributors by the authors",
                "Copyright 2019, Red Hat, Inc., and individual contributors by the authors"
            ],
            "file-count": 90,
            "sha256": "9196a7cc2365a27ef6f83f1b81639fec067453eaab12d8d15cc2c7b4e8379be1",
            "source": "https://repo1.maven.org/maven2/org/jboss/weld/weld-spi/6.0.Beta2/weld-spi-6.0.Beta2-sources.jar",
            "status": "restricted"
        }
    ]
}