{
    "id": "maven/mavencentral/org.apache.hbase/hbase-logging/2.4.13",
    "license": "Apache-2.0",
    "licenses-discovered": [
        "Apache-2.0"
    ],
    "copyrights": [
    ],
    "file-count": 8,
    "scancode-version": "31.2.1",
    "authority": "https://gitlab.eclipse.org/eclipsefdn/emo-team/iplab/-/issues/4447",
    "source": "https://search.maven.org/remotecontent?filepath=org/apache/hbase/hbase-logging/2.4.13/hbase-logging-2.4.13-sources.jar",
    "status": "approved"
}