{
    "id": "maven/mavencentral/org.apache.arrow/arrow-format/18.1.0",
    "license": "Apache-2.0",
    "authority": "https://gitlab.eclipse.org/eclipsefdn/emo-team/iplab/-/issues/17686",
    "source": "https://repo1.maven.org/maven2/org/apache/arrow/arrow-format/18.1.0/arrow-format-18.1.0-sources.jar",
    "status": "approved",
    "scans": [
        {
            "date": "December 4, 2024 at 2:25:06 p.m. GMT",
            "authority": "https://gitlab.eclipse.org/eclipsefdn/emo-team/iplab/-/issues/17686",
            "scancode-version": "31.2.1",
            "licenses-discovered": [
                "Apache-2.0"
            ],
            "copyrights": [
            ],
            "file-count": 64,
            "sha256": "d9dfee9b5fcaa5fba16d35f4c7d94183e8dca19de969a7f0f718726bb5026b4c",
            "source": "https://repo1.maven.org/maven2/org/apache/arrow/arrow-format/18.1.0/arrow-format-18.1.0-sources.jar",
            "status": "approved"
        }
    ]
}