{
    "id": "project/ecd.opensmartclide/eclipse-opensmartclide/smartclide/20986ed6732fdcc23267694212d5f2e4419ba55c",
    "license": "EPL-2.0 AND Apache-2.0 AND (EPL-2.0 OR GPL-2.0-only WITH Classpath-exception-2.0) AND MIT AND MPL-2.0",
    "authority": "https://gitlab.eclipse.org/eclipsefdn/emo-team/iplab/-/issues/6355",
    "source": "https://github.com/eclipse-opensmartclide/smartclide/archive/20986ed6732fdcc23267694212d5f2e4419ba55c.zip",
    "status": "approved",
    "scans": [
        {
            "date": "January 13, 2023 at 8:36:07 p.m. GMT",
            "authority": "https://gitlab.eclipse.org/eclipsefdn/emo-team/iplab/-/issues/6355",
            "scancode-version": "31.2.1",
            "licenses-discovered": [
                "EPL-2.0",
                "Apache-2.0",
                "EPL-2.0 AND (GPL-2.0-only WITH Classpath-exception-2.0)",
                "BSD-3-Clause",
                "MIT",
                "Apache-2.0 AND CC0-1.0 AND EPL-2.0 AND (GPL-2.0-only WITH Classpath-exception-2.0)",
                "EPL-2.0 OR GPL-2.0-only WITH Classpath-exception-2.0",
                "CDDL-1.0 AND EPL-2.0 AND (GPL-2.0-only WITH Classpath-exception-2.0)",
                "Apache-2.0 AND LGPL-2.1-or-later AND MPL-1.1",
                "MPL-2.0",
                "0BSD AND BSD-2-Clause-Views AND EPL-1.0"
            ],
            "copyrights": [
                "Copyright (c) 1989, 1991 Free Software Foundation, Inc.",
                "Copyright (c) 1996-2017, http://www.oracle.com' Oracle and/or its affiliates",
                "Copyright (c) 1997, 2018 Oracle and/or its affiliates",
                "Copyright (c) 1997, 2019 Oracle and/or its affiliates",
                "Copyright (c) 1997-2018 Oracle and/or its affiliates",
                "Copyright (c) 1999- Shigeru Chiba",
                "Copyright (c) 1999-2019 Shigeru Chiba",
                "Copyright (c) 2003, 2018 Oracle and/or its affiliates",
                "Copyright (c) 2008, 2018 Oracle and/or its affiliates",
                "Copyright (c) 2009 The Guava Authors",
                "Copyright (c) 2009, 2018 Oracle and/or its affiliates",
                "Copyright (c) 2010, 2018 Oracle and/or its affiliates",
                "Copyright (c) 2010, 2020 Oracle and/or its affiliates",
                "Copyright (c) 2011, 2018 Oracle and/or its affiliates",
                "Copyright (c) 2011, 2019 Oracle and/or its affiliates",
                "Copyright (c) 2011, 2021 Oracle and/or its affiliates",
                "Copyright (c) 2012, 2018 Oracle and/or its affiliates",
                "Copyright (c) 2012, 2019 Oracle and/or its affiliates",
                "Copyright (c) 2013, 2018 Oracle and/or its affiliates",
                "Copyright (c) 2013, 2021 Oracle and/or its affiliates",
                "Copyright (c) 2017, 2018 Oracle and/or its affiliates",
                "Copyright (c) 2017, 2019 Oracle and/or its affiliates",
                "Copyright (c) 2018 Oracle and/or its affiliates",
                "Copyright (c) 2018 Payara Foundation and/or its affiliates",
                "Copyright (c) 2018, 2020 Oracle and/or its affiliates",
                "Copyright (c) 2019 Eclipse Foundation",
                "Copyright (c) 2019 Eclipse Foundation and others",
                "Copyright (c) 2019, 2020 Eclipse Foundation",
                "Copyright (c) 2021 The Eclipse Foundation",
                "Copyright (c) 2021 The Eclipse Foundation and others",
                "Copyright 2004 The Apache Software Foundation",
                "Copyright 2004-present by the Checker Framework",
                "Copyright 2015 The Error Prone",
                "Copyright 2019 Eclipse Foundation",
                "copyright Written by Doug Lea",
                "copyrighted by the Free Software Foundation"
            ],
            "file-count": 8017,
            "sha256": "3bf2c7f1f606b5ed41113e91d7309628314921b2f223b6b3afd69f4865a26077",
            "source": "https://github.com/eclipse-opensmartclide/smartclide/archive/20986ed6732fdcc23267694212d5f2e4419ba55c.zip",
            "status": "restricted"
        }
    ]
}
