{
    "id": "maven/mavencentral/com.vaadin/flow-lit-template/24.6.5",
    "license": "Apache-2.0",
    "authority": "https://gitlab.eclipse.org/eclipsefdn/emo-team/iplab/-/issues/19761",
    "source": "https://repo1.maven.org/maven2/com/vaadin/flow-lit-template/24.6.5/flow-lit-template-24.6.5-sources.jar",
    "status": "approved",
    "scans": [
        {
            "date": "March 1, 2025 at 2:49:19 a.m. GMT",
            "authority": "https://gitlab.eclipse.org/eclipsefdn/emo-team/iplab/-/issues/19761",
            "scancode-version": "31.2.1",
            "licenses-discovered": [
                "Apache-2.0"
            ],
            "copyrights": [
                "Copyright 2000-2024 Vaadin Ltd."
            ],
            "file-count": 11,
            "sha256": "00bc116c650024dcf80802177abf867b6ffc2c267a6213576c204e3da65906f5",
            "source": "https://repo1.maven.org/maven2/com/vaadin/flow-lit-template/24.6.5/flow-lit-template-24.6.5-sources.jar",
            "status": "approved"
        }
    ]
}