{
    "id": "npm/npmjs/@typescript-eslint/experimental-utils/5.59.2",
    "license": "BSD-2-Clause AND MIT",
    "authority": "https://gitlab.eclipse.org/eclipsefdn/emo-team/iplab/-/issues/8405",
    "source": "https://github.com/typescript-eslint/typescript-eslint/archive/v5.59.2.zip",
    "status": "approved",
    "scans": [
        {
            "date": "May 9, 2023 at 5:24:45 p.m. GMT",
            "authority": "https://gitlab.eclipse.org/eclipsefdn/emo-team/iplab/-/issues/8405",
            "scancode-version": "31.2.1",
            "licenses-discovered": [
                "BSD-2-Clause",
                "MIT"
            ],
            "copyrights": [
                "Copyright (c) 2016 unional",
                "Copyright (c) 2019 typescript-eslint and other contributors",
                "Copyright (c) 2021 typescript-eslint and other contributors",
                "Copyright JS Foundation and other contributors, https://js.foundation",
                "Copyright Joyent, Inc. and other Node contributors"
            ],
            "file-count": 6939,
            "sha256": "5dd3a5bd156ab4f4b0f58eabd27c9f2514b97688540675dd7c8bb95d99a3522b",
            "source": "https://github.com/typescript-eslint/typescript-eslint/archive/v5.59.2.zip",
            "status": "approved"
        }
    ]
}