{
    "id": "project/automotive.velocitas/eclipse-velocitas/vehicle-model-cpp/23aed901db2e5c442522f94674bf48cfa714e8eb",
    "license": "Apache-2.0",
    "authority": "https://gitlab.eclipse.org/eclipsefdn/emo-team/iplab/-/issues/5235",
    "source": "https://github.com/eclipse-velocitas/vehicle-model-cpp/archive/23aed901db2e5c442522f94674bf48cfa714e8eb.zip",
    "status": "approved",
    "scans": [
        {
            "date": "November 29, 2022 at 2:21:08 a.m. GMT",
            "authority": "https://gitlab.eclipse.org/eclipsefdn/emo-team/iplab/-/issues/5235",
            "scancode-version": "31.2.1",
            "licenses-discovered": [
                "Apache-2.0"
            ],
            "copyrights": [
                "Copyright (c) 2022 Robert Bosch GmbH and Microsoft Corporation"
            ],
            "file-count": 112,
            "sha256": "2bcb9669a846ef9e6d17bc440db06544a75acd3065d587722daf43d559611fef",
            "source": "https://github.com/eclipse-velocitas/vehicle-model-cpp/archive/23aed901db2e5c442522f94674bf48cfa714e8eb.zip",
            "status": "restricted"
        }
    ]
}
