{
    "id": "npm/npmjs/-/robust-predicates/3.0.1",
    "license": "Unlicense",
    "licenses-discovered": [
        "Unlicense"
    ],
    "copyrights": [
    ],
    "file-count": 21,
    "scancode-version": "30.1.0",
    "authority": "https://gitlab.eclipse.org/eclipsefdn/emo-team/iplab/-/issues/3305",
    "source": "https://github.com/mourner/robust-predicates/archive/v3.0.1.zip",
    "status": "approved"
}