{
    "id": "maven/mavencentral/com.sun.woodstock.dependlibs/dataprovider/1.0",
    "license": "CDDL-1.0",
    "authority": "https://gitlab.eclipse.org/eclipsefdn/emo-team/iplab/-/issues/5281",
    "source": "https://search.maven.org/remotecontent?filepath=com/sun/woodstock/dependlibs/dataprovider/1.0/dataprovider-1.0.jar",
    "status": "approved",
    "scans": [
        {
            "date": "December 2, 2022 at 4:16:35 p.m. GMT",
            "authority": "https://gitlab.eclipse.org/eclipsefdn/emo-team/iplab/-/issues/5281",
            "scancode-version": "31.2.1",
            "licenses-discovered": [
            ],
            "copyrights": [
            ],
            "file-count": 73,
            "sha256": "6213669f5e45015b1689df16e5bd231078331876e5419111fc37343a8766637e",
            "source": "https://search.maven.org/remotecontent?filepath=com/sun/woodstock/dependlibs/dataprovider/1.0/dataprovider-1.0.jar",
            "status": "restricted"
        }
    ]
}
