{
    "license": "Apache-2.0",
    "file-count": 42,
    "authority": "https://gitlab.eclipse.org/eclipsefdn/emo-team/iplab/-/issues/1224",
    "scancode-version": "21.3.31",
    "licenses-discovered": [
        "Apache-2.0"
    ],
    "id": "maven/mavencentral/org.apache.aries.cdi/org.apache.aries.cdi.extra/1.1.4",
    "source": "https://search.maven.org/remotecontent?filepath=org/apache/aries/cdi/org.apache.aries.cdi.extra/1.1.4/org.apache.aries.cdi.extra-1.1.4-sources.jar",
    "status": "approved"
}