{
    "id": "maven/mavencentral/org.apache.derby/derbytools/10.15.2.0",
    "license": "Apache-2.0",
    "authority": "https://gitlab.eclipse.org/eclipsefdn/emo-team/iplab/-/issues/15592",
    "source": "https://repo1.maven.org/maven2/org/apache/derby/derbytools/10.15.2.0/derbytools-10.15.2.0.jar",
    "status": "approved",
    "scans": [
        {
            "date": "July 11, 2024 at 1:27:06 p.m. GMT",
            "authority": "https://gitlab.eclipse.org/eclipsefdn/emo-team/iplab/-/issues/15592",
            "scancode-version": "31.2.1",
            "licenses-discovered": [
                "Apache-2.0"
            ],
            "copyrights": [
                "Copyright 1997, 2020 The Apache Software Foundation"
            ],
            "file-count": 122,
            "sha256": "45d6dc34af9790f7f8fafb9b15d8525f3b429950fca4b4051e7e4f81f9170cd9",
            "source": "https://repo1.maven.org/maven2/org/apache/derby/derbytools/10.15.2.0/derbytools-10.15.2.0.jar",
            "status": "approved"
        }
    ]
}