{
    "id": "maven/mavencentral/org.rrd4j/rrd4j/3.5",
    "license": "Bitstream-Vera AND LicenseRef-Public-domain AND Apache-2.0",
    "authority": "https://gitlab.eclipse.org/eclipsefdn/emo-team/iplab/-/issues/14675",
    "source": "https://repo1.maven.org/maven2/org/rrd4j/rrd4j/3.5/rrd4j-3.5-sources.jar",
    "status": "approved",
    "scans": [
        {
            "date": "May 10, 2024 at 9:31:04 a.m. GMT",
            "authority": "https://gitlab.eclipse.org/eclipsefdn/emo-team/iplab/-/issues/14675",
            "scancode-version": "31.2.1",
            "licenses-discovered": [
                "Bitstream-Vera",
                "Apache-2.0",
                "Apache-2.0 AND LGPL-2.1-or-later"
            ],
            "copyrights": [
                "(c) 2001-2005 Sasa Markovic and Ciaran Treanor",
                "(c) 2003 by Bitstream, Inc.",
                "(c) year The OpenNMS Group, Inc.",
                "Copyright (c) 2001-2005 Sasa Markovic and Ciaran Treanor",
                "Copyright (c) 2003 by Bitstream, Inc.",
                "Copyright (c) 2011 The OpenNMS Group, Inc.",
                "Copyright (c) 2013 The OpenNMS Group, Inc",
                "Copyright (c) 2013 The OpenNMS Group, Inc.",
                "Copyright (c) 2013 The RRD4J Authors",
                "Copyright 2010 Tom Gibara",
                "Copyright 2011 The RRD4J Authors",
                "Copyright 2017 The RRD4J Authors"
            ],
            "file-count": 176,
            "sha256": "46283207038bf2eb1c8dd32dbb7e84f4ff5859b2489477b8e2736cf2f4f684da",
            "source": "https://repo1.maven.org/maven2/org/rrd4j/rrd4j/3.5/rrd4j-3.5-sources.jar",
            "status": "restricted"
        }
    ]
}