{
    "id": "maven/mavencentral/com.vaadin/vaadin-confirm-dialog-flow/24.3.7",
    "license": "Apache-2.0",
    "authority": "https://gitlab.eclipse.org/eclipsefdn/emo-team/iplab/-/issues/13775",
    "source": "https://repo1.maven.org/maven2/com/vaadin/vaadin-confirm-dialog-flow/24.3.7/vaadin-confirm-dialog-flow-24.3.7-sources.jar",
    "status": "approved",
    "scans": [
        {
            "date": "March 15, 2024 at 1:17:01 p.m. GMT",
            "authority": "https://gitlab.eclipse.org/eclipsefdn/emo-team/iplab/-/issues/13775",
            "scancode-version": "31.2.1",
            "licenses-discovered": [
                "Apache-2.0"
            ],
            "copyrights": [
                "Copyright 2000-2023 Vaadin Ltd."
            ],
            "file-count": 4,
            "sha256": "3151d66b76133915d45ac97e5c97578a0d81018c096266891d2b3b2e42c90209",
            "source": "https://repo1.maven.org/maven2/com/vaadin/vaadin-confirm-dialog-flow/24.3.7/vaadin-confirm-dialog-flow-24.3.7-sources.jar",
            "status": "approved"
        }
    ]
}