{
    "id": "npm/npmjs/-/rc-field-form/2.0.0",
    "license": "MIT",
    "authority": "https://gitlab.eclipse.org/eclipsefdn/emo-team/iplab/-/issues/14566",
    "source": "https://github.com/react-component/field-form/archive/refs/tags/v2.0.0.zip",
    "status": "approved",
    "scans": [
        {
            "date": "April 24, 2024 at 6:15:50 a.m. GMT",
            "authority": "https://gitlab.eclipse.org/eclipsefdn/emo-team/iplab/-/issues/14566",
            "scancode-version": "31.2.1",
            "licenses-discovered": [
                "MIT"
            ],
            "copyrights": [
                "Copyright (c) 2019-present react-component"
            ],
            "file-count": 104,
            "sha256": "4425919213c99207d2386ddfb97babae660518a34fd94c14451a7920c26f52f3",
            "source": "https://github.com/react-component/field-form/archive/refs/tags/v2.0.0.zip",
            "status": "approved"
        }
    ]
}