{
    "id": "maven/mavencentral/com.google.cloud/google-cloud-core/2.33.0",
    "license": "Apache-2.0",
    "authority": "https://gitlab.eclipse.org/eclipsefdn/emo-team/iplab/-/issues/13406",
    "source": "https://repo1.maven.org/maven2/com/google/cloud/google-cloud-core/2.33.0/google-cloud-core-2.33.0-sources.jar",
    "status": "approved",
    "scans": [
        {
            "date": "February 26, 2024 at 9:04:14 a.m. GMT",
            "authority": "https://gitlab.eclipse.org/eclipsefdn/emo-team/iplab/-/issues/13406",
            "scancode-version": "31.2.1",
            "licenses-discovered": [
                "Apache-2.0"
            ],
            "copyrights": [
                "Copyright 2015 Google LLC",
                "Copyright 2016 Google LLC",
                "Copyright 2017 Google LLC",
                "Copyright 2020 Google LLC",
                "Copyright 2023 Google LLC"
            ],
            "file-count": 50,
            "sha256": "2065da06ff8ea9a6ddba82e5f4c58be579732637485d9e713e316d4b1ddc04ee",
            "source": "https://repo1.maven.org/maven2/com/google/cloud/google-cloud-core/2.33.0/google-cloud-core-2.33.0-sources.jar",
            "status": "approved"
        }
    ]
}