{
    "id": "maven/mavencentral/io.smallrye.config/smallrye-config/3.10.2",
    "license": "Apache-2.0",
    "authority": "https://gitlab.eclipse.org/eclipsefdn/emo-team/iplab/-/issues/17902",
    "source": "https://repo1.maven.org/maven2/io/smallrye/config/smallrye-config/3.10.2/smallrye-config-3.10.2-sources.jar",
    "status": "approved",
    "scans": [
        {
            "date": "December 13, 2024 at 1:32:08 p.m. GMT",
            "authority": "https://gitlab.eclipse.org/eclipsefdn/emo-team/iplab/-/issues/17887",
            "scancode-version": "31.2.1",
            "licenses-discovered": [
                "Apache-2.0"
            ],
            "copyrights": [
                "(c) 2017 Red Hat inc.",
                "(c) 2018 Red Hat inc.",
                "Copyright 2017 Red Hat, Inc.",
                "Copyright 2018 Apache Software Foundation",
                "Copyright 2018 Red Hat, Inc.",
                "Copyright 2020 Red Hat, Inc."
            ],
            "file-count": 15,
            "sha256": "9ea66c3ceb027dfee17b2a6eac20e00aaa8c06991994a27c5c2e0d8e076ef6d0",
            "source": "https://repo1.maven.org/maven2/io/smallrye/config/smallrye-config/3.10.2/smallrye-config-3.10.2-sources.jar",
            "status": "approved"
        },
        {
            "date": "December 13, 2024 at 1:46:13 p.m. GMT",
            "authority": "https://gitlab.eclipse.org/eclipsefdn/emo-team/iplab/-/issues/17902",
            "scancode-version": "31.2.1",
            "licenses-discovered": [
                "Apache-2.0"
            ],
            "copyrights": [
                "(c) 2017 Red Hat inc.",
                "(c) 2018 Red Hat inc.",
                "Copyright 2017 Red Hat, Inc.",
                "Copyright 2018 Apache Software Foundation",
                "Copyright 2018 Red Hat, Inc.",
                "Copyright 2020 Red Hat, Inc."
            ],
            "file-count": 15,
            "sha256": "9ea66c3ceb027dfee17b2a6eac20e00aaa8c06991994a27c5c2e0d8e076ef6d0",
            "source": "https://repo1.maven.org/maven2/io/smallrye/config/smallrye-config/3.10.2/smallrye-config-3.10.2-sources.jar",
            "status": "approved"
        }
    ]
}