{
    "id": "npm/npmjs/-/core-js-compat/3.27.1",
    "license": "MIT AND BSD-3-Clause",
    "authority": "https://gitlab.eclipse.org/eclipsefdn/emo-team/iplab/-/issues/6014",
    "source": "https://github.com/zloirock/core-js/archive/v3.27.1.zip",
    "status": "approved",
    "scans": [
        {
            "date": "December 30, 2022 at 5:39:02 a.m. GMT",
            "authority": "https://gitlab.eclipse.org/eclipsefdn/emo-team/iplab/-/issues/6014",
            "scancode-version": "31.2.1",
            "licenses-discovered": [
                "MIT",
                "JSON",
                "BSD-3-Clause"
            ],
            "copyrights": [
                "(c) 2014-2022 Denis Pushkarev",
                "(c) web-platform-tests contributors",
                "(c) zbar', base about:blank', href http://example.com/foo",
                "Copyright (c) 2014-2022 Denis Pushkarev",
                "copyright (c) 2014-2022 Denis Pushkarev"
            ],
            "file-count": 3610,
            "sha256": "fb28877ed4c0dc4fc07cd0f2421d473606c0f804180e77f3fd2bf80b20ae29f6",
            "source": "https://github.com/zloirock/core-js/archive/v3.27.1.zip",
            "status": "restricted"
        }
    ]
}
