{
    "id": "npm/npmjs/@types/react/18.3.10",
    "license": "MIT",
    "authority": "https://gitlab.eclipse.org/eclipsefdn/emo-team/iplab/-/issues/16412",
    "source": "https://registry.npmjs.org/@types/react/-/react-18.3.10.tgz",
    "status": "approved",
    "scans": [
        {
            "date": "September 30, 2024, 1:05:52 p.m. GMT",
            "authority": "https://gitlab.eclipse.org/eclipsefdn/emo-team/iplab/-/issues/16412",
            "scancode-version": "31.2.1",
            "licenses-discovered": [
                "MIT"
            ],
            "copyrights": [
                "Copyright (c) Microsoft Corporation"
            ],
            "file-count": 15,
            "sha256": "0e53a4685a0be7f936669c76116f0a3a93c75806f53f64b3b1b458e2cba18730",
            "source": "https://registry.npmjs.org/@types/react/-/react-18.3.10.tgz",
            "status": "approved"
        }
    ]
}