{
    "id": "maven/mavencentral/org.wildfly.security/wildfly-elytron-credential/2.6.0.Final",
    "license": "Apache-2.0 AND (Apache-2.0 AND BSD-3-Clause)",
    "authority": "https://gitlab.eclipse.org/eclipsefdn/emo-team/iplab/-/issues/16642",
    "source": "https://repo1.maven.org/maven2/org/wildfly/security/wildfly-elytron-credential/2.6.0.Final/wildfly-elytron-credential-2.6.0.Final-sources.jar",
    "status": "approved",
    "scans": [
        {
            "date": "October 15, 2024, 2:46:18 a.m. GMT",
            "authority": "https://gitlab.eclipse.org/eclipsefdn/emo-team/iplab/-/issues/16642",
            "scancode-version": "31.2.1",
            "licenses-discovered": [
                "Apache-2.0",
                "Apache-2.0 AND BSD-3-Clause"
            ],
            "copyrights": [
                "Copyright 2013 Red Hat, Inc., and individual contributors",
                "Copyright 2014 Red Hat, Inc., and individual contributors",
                "Copyright 2015 Red Hat, Inc. and/or its affiliates",
                "Copyright 2015 Red Hat, Inc., and individual contributors",
                "Copyright 2016 Red Hat, Inc., and individual contributors",
                "Copyright 2017 Red Hat, Inc., and individual contributors",
                "Copyright 2018 Red Hat, Inc., and individual contributors",
                "Copyright 2019 Red Hat, Inc., and individual contributors",
                "Copyright 2020 Red Hat, Inc., and individual contributors"
            ],
            "file-count": 98,
            "sha256": "f29cc60c7ac4fb4cecdfad8722bfd777e07e43b2754eedf46f48cda9751c184e",
            "source": "https://repo1.maven.org/maven2/org/wildfly/security/wildfly-elytron-credential/2.6.0.Final/wildfly-elytron-credential-2.6.0.Final-sources.jar",
            "status": "approved"
        }
    ]
}