{
    "id": "nuget/nuget/-/Org.Eclipse.TractusX.Portal.Backend.Framework.DateTimeProvider/1.0.0",
    "license": "Apache-2.0 AND MIT AND CC-BY-4.0",
    "authority": "https://gitlab.eclipse.org/eclipsefdn/emo-team/iplab/-/issues/13214",
    "source": "https://github.com/eclipse-tractusx/portal-backend/archive/refs/tags/v1.0.0.zip",
    "status": "approved",
    "scans": [
        {
            "date": "February 13, 2024 at 9:04:08 a.m. GMT",
            "authority": "https://gitlab.eclipse.org/eclipsefdn/emo-team/iplab/-/issues/13214",
            "scancode-version": "31.2.1",
            "licenses-discovered": [
                "Apache-2.0",
                "MIT",
                "CC-BY-4.0"
            ],
            "copyrights": [
                "Copyright (c) 2019 Luk Vermeulen",
                "Copyright (c) 2021, 2023 BMW Group AG",
                "Copyright (c) 2021, 2023 Contributors",
                "Copyright (c) 2021, 2023 Microsoft and BMW Group AG",
                "Copyright (c) 2021,2022 BMW Group AG",
                "Copyright (c) 2021,2022 Contributors",
                "Copyright (c) 2021,2023 BMW Group AG",
                "Copyright (c) 2021,2023 Contributors",
                "Copyright (c) 2021,2023 Microsoft and BMW Group AG"
            ],
            "file-count": 1183,
            "sha256": "d01a4a5243c6aceb002a537639d5aee5b2e8dccdb251b6087722d23b313cbefe",
            "source": "https://github.com/eclipse-tractusx/portal-backend/archive/refs/tags/v1.0.0.zip",
            "status": "approved"
        }
    ]
}