{
    "id": "maven/mavencentral/org.springframework.integration/spring-integration-kafka/5.5.17",
    "license": "Apache-2.0",
    "authority": "https://gitlab.eclipse.org/eclipsefdn/emo-team/iplab/-/issues/7795",
    "source": "https://search.maven.org/remotecontent?filepath=org/springframework/integration/spring-integration-kafka/5.5.17/spring-integration-kafka-5.5.17-sources.jar",
    "status": "approved",
    "scans": [
        {
            "date": "April 5, 2023 at 6:05:53 a.m. GMT",
            "authority": "https://gitlab.eclipse.org/eclipsefdn/emo-team/iplab/-/issues/7795",
            "scancode-version": "31.2.1",
            "licenses-discovered": [
                "Apache-2.0"
            ],
            "copyrights": [
                "Copyright 2002-2020 the original author or authors",
                "Copyright 2013-2019 the original author or authors",
                "Copyright 2013-2021 the original author or authors",
                "Copyright 2015-2021 the original author or authors",
                "Copyright 2015-2022 the original author or authors",
                "Copyright 2016-2021 the original author or authors",
                "Copyright 2017-2019 the original author or authors",
                "Copyright 2018-2020 the original author or authors",
                "Copyright 2018-2021 the original author or authors",
                "Copyright 2019 the original author or authors",
                "Copyright 2019-2020 the original author or authors",
                "Copyright 2019-2022 the original author or authors",
                "Copyright 2020 the original author or authors",
                "Copyright 2020-2022 the original author or authors"
            ],
            "file-count": 45,
            "sha256": "85ef09a52dbaf6d1a6cb5a782ec6de4f3950e88f745a12d46a39a5d5686251fc",
            "source": "https://search.maven.org/remotecontent?filepath=org/springframework/integration/spring-integration-kafka/5.5.17/spring-integration-kafka-5.5.17-sources.jar",
            "status": "approved"
        }
    ]
}