{
    "id": "maven/mavencentral/io.fabric8/servicecatalog-client/6.13.5",
    "license": "Apache-2.0",
    "authority": "https://gitlab.eclipse.org/eclipsefdn/emo-team/iplab/-/issues/19378",
    "source": "https://repo1.maven.org/maven2/io/fabric8/servicecatalog-client/6.13.5/servicecatalog-client-6.13.5-sources.jar",
    "status": "approved",
    "scans": [
        {
            "date": "February 11, 2025 at 1:33:39 p.m. GMT",
            "authority": "https://gitlab.eclipse.org/eclipsefdn/emo-team/iplab/-/issues/19378",
            "scancode-version": "31.2.1",
            "licenses-discovered": [
                "Apache-2.0"
            ],
            "copyrights": [
                "Copyright (c) 2015 Red Hat, Inc.",
                "Copyright (c) 2018 Red Hat inc."
            ],
            "file-count": 20,
            "sha256": "95809793ffe4138a36014ca50e7e593d50c6c0fcfc412c550fdfa9b585d4d5ff",
            "source": "https://repo1.maven.org/maven2/io/fabric8/servicecatalog-client/6.13.5/servicecatalog-client-6.13.5-sources.jar",
            "status": "approved"
        }
    ]
}