{
    "id": "maven/mavencentral/org.activiti/activiti-spring/8.0.0",
    "license": "Apache-2.0",
    "authority": "https://gitlab.eclipse.org/eclipsefdn/emo-team/iplab/-/issues/12455",
    "source": "https://maven.alfresco.com/nexus/service/local/repositories/activiti-releases/content//org/activiti/activiti-spring/8.0.0/activiti-spring-8.0.0-sources.jar",
    "status": "approved",
    "scans": [
        {
            "date": "January 2, 2024 at 9:00:43 p.m. GMT",
            "authority": "https://gitlab.eclipse.org/eclipsefdn/emo-team/iplab/-/issues/12455",
            "scancode-version": "31.2.1",
            "licenses-discovered": [
                "Apache-2.0"
            ],
            "copyrights": [
                "Copyright 2010-2020 Alfresco Software, Ltd."
            ],
            "file-count": 25,
            "sha256": "8e9f018233ed7c84442017f0d3800bada6e3b7de04e351e03d639b0acf38a602",
            "source": "https://maven.alfresco.com/nexus/service/local/repositories/activiti-releases/content//org/activiti/activiti-spring/8.0.0/activiti-spring-8.0.0-sources.jar",
            "status": "approved"
        }
    ]
}