{
    "id": "maven/mavencentral/org.typelevel/cats-effect-std_2.13/3.5.0",
    "license": "Apache-2.0",
    "authority": "https://gitlab.eclipse.org/eclipsefdn/emo-team/iplab/-/issues/8630",
    "source": "https://repo.maven.apache.org/maven2/org/typelevel/cats-effect-std_2.13/3.5.0/cats-effect-std_2.13-3.5.0-sources.jar",
    "status": "approved",
    "scans": [
        {
            "date": "June 2, 2023 at 5:49:50 p.m. GMT",
            "authority": "https://gitlab.eclipse.org/eclipsefdn/emo-team/iplab/-/issues/8630",
            "scancode-version": "31.2.1",
            "licenses-discovered": [
                "Apache-2.0"
            ],
            "copyrights": [
                "Copyright 2020-2023 Typelevel"
            ],
            "file-count": 34,
            "sha256": "c8d6bd894797a9d6feb825c61de656fd3bfa781145aa34620d33e2c3484c2ebb",
            "source": "https://repo.maven.apache.org/maven2/org/typelevel/cats-effect-std_2.13/3.5.0/cats-effect-std_2.13-3.5.0-sources.jar",
            "status": "approved"
        }
    ]
}