{
    "id": "maven/mavencentral/io.quarkus/quarkus-resteasy-multipart/3.9.2",
    "license": "Apache-2.0",
    "authority": "https://gitlab.eclipse.org/eclipsefdn/emo-team/iplab/-/issues/16089",
    "source": "https://repo1.maven.org/maven2/io/quarkus/quarkus-resteasy-multipart/3.9.2/quarkus-resteasy-multipart-3.9.2-sources.jar",
    "status": "approved",
    "scans": [
        {
            "date": "September 10, 2024, 2:48:29 p.m. GMT",
            "authority": "https://gitlab.eclipse.org/eclipsefdn/emo-team/iplab/-/issues/16089",
            "scancode-version": "31.2.1",
            "licenses-discovered": [
            ],
            "copyrights": [
            ],
            "file-count": 11,
            "sha256": "7419521cf0aa1d54b0656f13452be82809a2b002711e4cb8923c776bf7169bd0",
            "source": "https://repo1.maven.org/maven2/io/quarkus/quarkus-resteasy-multipart/3.9.2/quarkus-resteasy-multipart-3.9.2-sources.jar",
            "status": "restricted"
        }
    ]
}