{
    "id": "maven/mavencentral/org.bytedeco/mkl-platform/2022.2-1.5.8",
    "license": "Apache-2.0 AND (Apache-2.0 OR GPL-2.0 WITH Classpath-exception-2.0)",
    "authority": "https://gitlab.eclipse.org/eclipsefdn/emo-team/iplab/-/issues/6807",
    "source": "https://search.maven.org/remotecontent?filepath=org/bytedeco/mkl-platform/2022.2-1.5.8/mkl-platform-2022.2-1.5.8-sources.jar",
    "status": "approved",
    "scans": [
        {
            "date": "January 27, 2023 at 9:42:05 p.m. GMT",
            "authority": "https://gitlab.eclipse.org/eclipsefdn/emo-team/iplab/-/issues/6807",
            "scancode-version": "31.2.1",
            "licenses-discovered": [
            ],
            "copyrights": [
            ],
            "file-count": 3,
            "sha256": "da62fc9c0382da819b29a6cae524f5d983525e0305aa3ca1d1161683c41db51d",
            "source": "https://search.maven.org/remotecontent?filepath=org/bytedeco/mkl-platform/2022.2-1.5.8/mkl-platform-2022.2-1.5.8-sources.jar",
            "status": "restricted"
        }
    ]
}
