{
    "id": "maven/mavencentral/io.swagger.core.v3/swagger-jaxrs2-jakarta/2.2.18",
    "license": "Apache-2.0",
    "authority": "https://gitlab.eclipse.org/eclipsefdn/emo-team/iplab/-/issues/11477",
    "source": "https://repo1.maven.org/maven2/io/swagger/core/v3/swagger-jaxrs2-jakarta/2.2.18/swagger-jaxrs2-jakarta-2.2.18-sources.jar",
    "status": "approved",
    "scans": [
        {
            "date": "November 9, 2023 at 8:04:56 a.m. GMT",
            "authority": "https://gitlab.eclipse.org/eclipsefdn/emo-team/iplab/-/issues/11477",
            "scancode-version": "31.2.1",
            "licenses-discovered": [
                "Apache-2.0"
            ],
            "copyrights": [
                "Copyright (c) 2015. SmartBear Software Inc."
            ],
            "file-count": 5,
            "sha256": "1070b5dd2439e19ca5a337637847adb7f86691459da881f22e23ac9463335a74",
            "source": "https://repo1.maven.org/maven2/io/swagger/core/v3/swagger-jaxrs2-jakarta/2.2.18/swagger-jaxrs2-jakarta-2.2.18-sources.jar",
            "status": "approved"
        }
    ]
}