{
    "id": "npm/npmjs/@angular/language-server/16.2.0",
    "license": "MIT",
    "authority": "https://gitlab.eclipse.org/eclipsefdn/emo-team/iplab/-/issues/11034",
    "source": "https://github.com/angular/vscode-ng-language-service/archive/refs/tags/v16.2.0.zip",
    "status": "approved",
    "scans": [
        {
            "date": "October 10, 2023 at 3:55:49 p.m. GMT",
            "authority": "https://gitlab.eclipse.org/eclipsefdn/emo-team/iplab/-/issues/11034",
            "scancode-version": "31.2.1",
            "licenses-discovered": [
                "MIT"
            ],
            "copyrights": [
                "Copyright (c) 2014-2016 Google, Inc. http://angular.io",
                "Copyright Google Inc",
                "Copyright Google Inc."
            ],
            "file-count": 175,
            "sha256": "5b3b252287d5b6fd8ba93006428ecab2da49eba5b8d86375ce50161375dcb9db",
            "source": "https://github.com/angular/vscode-ng-language-service/archive/refs/tags/v16.2.0.zip",
            "status": "approved"
        }
    ]
}