{
    "id": "maven/mavencentral/org.geotools.xsd/gt-xsd-fes/28.2",
    "license": "LGPL-2.1-only",
    "authority": "https://gitlab.eclipse.org/eclipsefdn/emo-team/iplab/-/issues/7189",
    "source": "https://repo.osgeo.org/repository/geotools-releases/org/geotools/xsd/gt-xsd-fes/28.2/gt-xsd-fes-28.2-sources.jar",
    "status": "approved",
    "scans": [
        {
            "date": "February 23, 2023 at 5:45:27 p.m. GMT",
            "authority": "https://gitlab.eclipse.org/eclipsefdn/emo-team/iplab/-/issues/7189",
            "scancode-version": "31.2.1",
            "licenses-discovered": [
                "LGPL-2.1-only"
            ],
            "copyrights": [
                "(c) 2002-2008, Open Source Geospatial Foundation",
                "(c) 2002-2011, Open Source Geospatial Foundation",
                "(c) 2002-2014, Open Source Geospatial Foundation",
                "(c) 2002-2015, Open Source Geospatial Foundation",
                "(c) 2002-2016, Open Source Geospatial Foundation",
                "(c) 2012, Open Source Geospatial Foundation",
                "(c) 2014, Open Source Geospatial Foundation",
                "(c) 2019, Open Source Geospatial Foundation",
                "Copyright (c) 2002, 2003, 2004 OpenGIS"
            ],
            "file-count": 82,
            "sha256": "e17985b2fc9fb27301eb1a7f67697b9aa5d9c83db5f338fa2ab83f93fb1482b6",
            "source": "https://repo.osgeo.org/repository/geotools-releases/org/geotools/xsd/gt-xsd-fes/28.2/gt-xsd-fes-28.2-sources.jar",
            "status": "approved"
        }
    ]
}