{
    "id": "maven/mavencentral/com.github.jnr/jnr-posix/3.1.15",
    "license": "EPL-2.0 OR GPL-2.0-only OR LGPL-2.1-only",
    "licenses-discovered": [
        "EPL-2.0 AND GPL-2.0-only AND LGPL-2.1-only"
    ],
    "file-count": 125,
    "scancode-version": "30.1.0",
    "authority": "https://gitlab.eclipse.org/eclipsefdn/emo-team/iplab/-/issues/2711",
    "source": "https://search.maven.org/remotecontent?filepath=com/github/jnr/jnr-posix/3.1.15/jnr-posix-3.1.15-sources.jar",
    "status": "approved"
}
