{
    "id": "npm/npmjs/@typescript-eslint/eslint-plugin/5.53.0",
    "license": "BSD-2-Clause AND MIT",
    "authority": "https://gitlab.eclipse.org/eclipsefdn/emo-team/iplab/-/issues/7421",
    "source": "https://github.com/typescript-eslint/typescript-eslint/archive/v5.53.0.zip",
    "status": "approved",
    "scans": [
        {
            "date": "March 21, 2023 at 2:30:21 p.m. GMT",
            "authority": "https://gitlab.eclipse.org/eclipsefdn/emo-team/iplab/-/issues/7421",
            "scancode-version": "31.2.1",
            "licenses-discovered": [
                "BSD-2-Clause",
                "MIT"
            ],
            "copyrights": [
                "Copyright (c) 2016 unional",
                "Copyright (c) 2019 typescript-eslint and other contributors",
                "Copyright (c) 2021 typescript-eslint and other contributors",
                "Copyright JS Foundation and other contributors, https://js.foundation",
                "Copyright Joyent, Inc. and other Node contributors"
            ],
            "file-count": 6715,
            "sha256": "9943bafb0e1d76b3a3429f9239a06335057087eb907be04fbaf465e63650ef07",
            "source": "https://github.com/typescript-eslint/typescript-eslint/archive/v5.53.0.zip",
            "status": "approved"
        }
    ]
}