{
    "id": "p2/orbit/p2.eclipse.plugin/org.apache.lucene.sandbox/9.7.0",
    "license": "Apache-2.0",
    "authority": "https://gitlab.eclipse.org/eclipsefdn/emo-team/iplab/-/issues/9228",
    "source": "https://repo.maven.apache.org/maven2/org/apache/lucene/lucene-sandbox/9.7.0/lucene-sandbox-9.7.0-sources.jar",
    "status": "approved",
    "scans": [
        {
            "date": "July 2, 2023 at 1:18:53 p.m. GMT",
            "authority": "https://gitlab.eclipse.org/eclipsefdn/emo-team/iplab/-/issues/9228",
            "scancode-version": "31.2.1",
            "licenses-discovered": [
                "Apache-2.0"
            ],
            "copyrights": [
            ],
            "file-count": 54,
            "sha256": "3d810f7d806754f0514e0c5a681cef89eac06ed630d667e6aaa5959e073b1906",
            "source": "https://repo.maven.apache.org/maven2/org/apache/lucene/lucene-sandbox/9.7.0/lucene-sandbox-9.7.0-sources.jar",
            "status": "approved"
        }
    ]
}