{
    "id": "git/github/golang/image/0694c2d4d067",
    "license": "BSD-3-Clause AND (BSD-3-Clause AND LicenseRef-scancode-proprietary-license)",
    "authority": "https://gitlab.eclipse.org/eclipsefdn/emo-team/iplab/-/issues/5434",
    "source": "https://github.com/golang/image/archive/0694c2d4d067.zip",
    "status": "restricted",
    "scans": [
        {
            "date": "December 8, 2022 at 7:45:08 p.m. GMT",
            "authority": "https://gitlab.eclipse.org/eclipsefdn/emo-team/iplab/-/issues/5434",
            "scancode-version": "31.2.1",
            "licenses-discovered": [
                "BSD-3-Clause",
                "BSD-3-Clause AND LicenseRef-scancode-proprietary-license"
            ],
            "copyrights": [
                "(c) 2016 Bigelow & Holmes Inc",
                "(c) 2016 by Bigelow & Holmes Inc",
                "Copyright (c) 2009 The Go Authors",
                "Copyright (c) 2016 Bigelow & Holmes Inc",
                "Copyright (c) 2016 by Bigelow & Holmes Inc",
                "Copyright 2011 The Go Authors",
                "Copyright 2012 The Go Authors",
                "Copyright 2013 The Go Authors",
                "Copyright 2014 The Go Authors",
                "Copyright 2015 The Go Authors",
                "Copyright 2016 The Go Authors",
                "Copyright 2017 The Go Authors",
                "Copyright 2018 The Go Authors",
                "Copyright 2019 The Go Authors",
                "NCopyright (c) 2016 by Bigelow & Holmes Inc",
                "OCopyright (c) 2016 by Bigelow & Holmes Inc",
                "copyright Raph Levien and Cyreal"
            ],
            "file-count": 224,
            "sha256": "e11b2b8a1972171a61f7b2e235a92f9ada0249592b14b26591b3fb671086cc28",
            "source": "https://github.com/golang/image/archive/0694c2d4d067.zip",
            "status": "restricted"
        }
    ]
}