{
    "id": "nuget/nuget/-/Namotion.Reflection/3.2.0",
    "license": "MIT",
    "authority": "https://gitlab.eclipse.org/eclipsefdn/emo-team/iplab/-/issues/17778",
    "source": "https://github.com/RicoSuter/Namotion.Reflection/archive/refs/heads/master.zip",
    "status": "approved",
    "scans": [
        {
            "date": "December 10, 2024 at 4:37:53 p.m. GMT",
            "authority": "https://gitlab.eclipse.org/eclipsefdn/emo-team/iplab/-/issues/17778",
            "scancode-version": "31.2.1",
            "licenses-discovered": [
                "MIT"
            ],
            "copyrights": [
                "Copyright (c) 2019 Rico Suter",
                "Copyright (c) Rico Suter"
            ],
            "file-count": 59,
            "sha256": "dc3960f218c78b452d508c0b56183396fe9141fbbbc23b1729e672f54db7f9fc",
            "source": "https://github.com/RicoSuter/Namotion.Reflection/archive/refs/heads/master.zip",
            "status": "approved"
        }
    ]
}