{
    "id": "maven/mavencentral/com.google.code.javaparser/javaparser/1.0.10",
    "license": "LGPL-3.0-or-later",
    "authority": "https://gitlab.eclipse.org/eclipsefdn/emo-team/iplab/-/issues/13474",
    "source": "https://repo1.maven.org/maven2/com/google/code/javaparser/javaparser/1.0.10/javaparser-1.0.10-sources.jar",
    "status": "approved",
    "scans": [
        {
            "date": "February 28, 2024 at 2:49:15 p.m. GMT",
            "authority": "https://gitlab.eclipse.org/eclipsefdn/emo-team/iplab/-/issues/13474",
            "scancode-version": "31.2.1",
            "licenses-discovered": [
                "LGPL-3.0-or-later"
            ],
            "copyrights": [
                "Copyright (c) 2007 Julio Vilmar Gesser",
                "Copyright (c) 2008 Julio Vilmar Gesser",
                "Copyright (c) 2010 Julio Vilmar Gesser"
            ],
            "file-count": 110,
            "sha256": "ad3761ef8ac1f8f202d67d769a5f7dbe4e66cde3879c0817f96fc4b94298a77e",
            "source": "https://repo1.maven.org/maven2/com/google/code/javaparser/javaparser/1.0.10/javaparser-1.0.10-sources.jar",
            "status": "approved"
        }
    ]
}