{
    "id": "maven/mavencentral/androidx.compose.material/material-icons-core/1.5.0",
    "license": "Apache-2.0",
    "authority": "https://gitlab.eclipse.org/eclipsefdn/emo-team/iplab/-/issues/10475",
    "source": "https://dl.google.com/android/maven2/androidx/compose/material/material-icons-core/1.5.0/material-icons-core-1.5.0-sources.jar",
    "status": "approved",
    "scans": [
        {
            "date": "September 12, 2023 at 8:30:41 a.m. GMT",
            "authority": "https://gitlab.eclipse.org/eclipsefdn/emo-team/iplab/-/issues/10475",
            "scancode-version": "31.2.1",
            "licenses-discovered": [
                "Apache-2.0"
            ],
            "copyrights": [
                "Copyright 2020 The Android Open Source Project",
                "Copyright 2023 The Android Open Source Project"
            ],
            "file-count": 248,
            "sha256": "48729ddeaa4270ce03e67a8a017ac6af4fb7ec988496ec87d1a5f9c5957aad4a",
            "source": "https://dl.google.com/android/maven2/androidx/compose/material/material-icons-core/1.5.0/material-icons-core-1.5.0-sources.jar",
            "status": "approved"
        }
    ]
}