{
    "id": "maven/mavencentral/org.geotools.ogc/net.opengis.fes/28.0",
    "license": "None",
    "authority": "https://gitlab.eclipse.org/eclipsefdn/emo-team/iplab/-/issues/6480",
    "source": "https://repo.osgeo.org/repository/geotools-releases/org/geotools/ogc/net.opengis.fes/28.0/net.opengis.fes-28.0-sources.jar",
    "status": "restricted",
    "scans": [
        {
            "date": "January 24, 2023 at 1:53:26 a.m. GMT",
            "authority": "https://gitlab.eclipse.org/eclipsefdn/emo-team/iplab/-/issues/6480",
            "scancode-version": "31.2.1",
            "licenses-discovered": [
            ],
            "copyrights": [
                "Copyright (c) 2001 OGC",
                "Copyright (c) 2006,2010 Open Geospatial Consortium, Inc.",
                "Copyright (c) 2010 Open Geospatial Consortium, Inc."
            ],
            "file-count": 130,
            "sha256": "9c0fcbc2f5e122b351c4f3f54cccd6c1746f39e186c110f172f0dee9f442b56e",
            "source": "https://repo.osgeo.org/repository/geotools-releases/org/geotools/ogc/net.opengis.fes/28.0/net.opengis.fes-28.0-sources.jar",
            "status": "restricted"
        }
    ]
}