{
    "id": "maven/mavencentral/com.vaadin/vaadin-custom-field-flow/24.6.5",
    "license": "Apache-2.0",
    "authority": "https://gitlab.eclipse.org/eclipsefdn/emo-team/iplab/-/issues/19783",
    "source": "https://repo1.maven.org/maven2/com/vaadin/vaadin-custom-field-flow/24.6.5/vaadin-custom-field-flow-24.6.5-sources.jar",
    "status": "approved",
    "scans": [
        {
            "date": "March 1, 2025 at 3:13:11 a.m. GMT",
            "authority": "https://gitlab.eclipse.org/eclipsefdn/emo-team/iplab/-/issues/19783",
            "scancode-version": "31.2.1",
            "licenses-discovered": [
                "Apache-2.0"
            ],
            "copyrights": [
                "Copyright 2000-2024 Vaadin Ltd."
            ],
            "file-count": 6,
            "sha256": "6bb85936861d6c61597540daa55b5976d110fcf76a649a0b9c70ca722c6cd401",
            "source": "https://repo1.maven.org/maven2/com/vaadin/vaadin-custom-field-flow/24.6.5/vaadin-custom-field-flow-24.6.5-sources.jar",
            "status": "approved"
        }
    ]
}