{
    "id": "maven/mavencentral/software.amazon.awssdk/third-party-jackson-core/2.25.1",
    "license": "Apache-2.0",
    "authority": "https://gitlab.eclipse.org/eclipsefdn/emo-team/iplab/-/issues/13703",
    "source": "https://repo1.maven.org/maven2/software/amazon/awssdk/third-party-jackson-core/2.25.1/third-party-jackson-core-2.25.1-sources.jar",
    "status": "approved",
    "scans": [
        {
            "date": "March 14, 2024 at 12:14:11 p.m. GMT",
            "authority": "https://gitlab.eclipse.org/eclipsefdn/emo-team/iplab/-/issues/13703",
            "scancode-version": "31.2.1",
            "licenses-discovered": [
                "Apache-2.0"
            ],
            "copyrights": [
                "Copyright Amazon.com, Inc. or its affiliates"
            ],
            "file-count": 4,
            "sha256": "2491cca49477dde901e6e0e6ff33abd0e0cd15e53476113c838e9a0b886ce630",
            "source": "https://repo1.maven.org/maven2/software/amazon/awssdk/third-party-jackson-core/2.25.1/third-party-jackson-core-2.25.1-sources.jar",
            "status": "approved"
        }
    ]
}