{
    "id": "maven/mavencentral/com.vaadin/vaadin-grid-flow/24.2.2",
    "license": "Apache-2.0",
    "authority": "https://gitlab.eclipse.org/eclipsefdn/emo-team/iplab/-/issues/12169",
    "source": "https://repo1.maven.org/maven2/com/vaadin/vaadin-grid-flow/24.2.2/vaadin-grid-flow-24.2.2-sources.jar",
    "status": "approved",
    "scans": [
        {
            "date": "December 18, 2023 at 9:07:45 a.m. GMT",
            "authority": "https://gitlab.eclipse.org/eclipsefdn/emo-team/iplab/-/issues/12169",
            "scancode-version": "31.2.1",
            "licenses-discovered": [
                "Apache-2.0"
            ],
            "copyrights": [
                "Copyright 2000-2023 Vaadin Ltd."
            ],
            "file-count": 64,
            "sha256": "8b1326ee8bdc92de8942a86a225f28c082e1d129df2d250702813451bbc88fef",
            "source": "https://repo1.maven.org/maven2/com/vaadin/vaadin-grid-flow/24.2.2/vaadin-grid-flow-24.2.2-sources.jar",
            "status": "approved"
        }
    ]
}