{
    "id": "maven/mavencentral/com.marcnuri.helm-java/linux-amd64/0.0.3",
    "license": "Apache-2.0",
    "authority": "https://gitlab.eclipse.org/eclipsefdn/emo-team/iplab/-/issues/13043",
    "source": "https://repo1.maven.org/maven2/com/marcnuri/helm-java/linux-amd64/0.0.3/linux-amd64-0.0.3-sources.jar",
    "status": "approved",
    "scans": [
        {
            "date": "February 1, 2024 at 12:29:35 p.m. GMT",
            "authority": "https://gitlab.eclipse.org/eclipsefdn/emo-team/iplab/-/issues/13043",
            "scancode-version": "31.2.1",
            "licenses-discovered": [
                "JSON"
            ],
            "copyrights": [
            ],
            "file-count": 7,
            "sha256": "cccf7ca7b97c802fb208823034e4b684668244b156418ab53116e1333bf64f37",
            "source": "https://repo1.maven.org/maven2/com/marcnuri/helm-java/linux-amd64/0.0.3/linux-amd64-0.0.3-sources.jar",
            "status": "restricted"
        }
    ]
}
