{
    "license": "CC0-1.0",
    "file-count": 45,
    "authority": "https://gitlab.eclipse.org/eclipsefdn/emo-team/iplab/-/issues/954",
    "scancode-version": "21.3.31",
    "licenses-discovered": [
        "CC0-1.0"
    ],
    "id": "npm/npmjs/stroncium/procfs/1.2.1",
    "source": "https://registry.yarnpkg.com/@stroncium/procfs/-/procfs-1.2.1.tgz",
    "status": "approved"
}