{
    "id": "maven/mavencentral/org.wildfly.security/wildfly-elytron-sasl-oauth2/2.6.0.Final",
    "license": "Apache-2.0",
    "authority": "https://gitlab.eclipse.org/eclipsefdn/emo-team/iplab/-/issues/16656",
    "source": "https://repo1.maven.org/maven2/org/wildfly/security/wildfly-elytron-sasl-oauth2/2.6.0.Final/wildfly-elytron-sasl-oauth2-2.6.0.Final-sources.jar",
    "status": "approved",
    "scans": [
        {
            "date": "October 15, 2024, 2:56:23 a.m. GMT",
            "authority": "https://gitlab.eclipse.org/eclipsefdn/emo-team/iplab/-/issues/16656",
            "scancode-version": "31.2.1",
            "licenses-discovered": [
                "Apache-2.0"
            ],
            "copyrights": [
                "Copyright 2016 Red Hat, Inc., and individual contributors",
                "Copyright 2018 Red Hat, Inc., and individual contributors"
            ],
            "file-count": 9,
            "sha256": "b90479a9076569fd30622cfd2d74e83c3a419319236f7fe1eb1754430f1fd2ea",
            "source": "https://repo1.maven.org/maven2/org/wildfly/security/wildfly-elytron-sasl-oauth2/2.6.0.Final/wildfly-elytron-sasl-oauth2-2.6.0.Final-sources.jar",
            "status": "approved"
        }
    ]
}