{
    "id": "npm/npmjs/-/postman-sandbox/4.0.6",
    "license": "Apache-2.0 AND MIT",
    "licenses-discovered": [
        "Apache-2.0",
        "MIT"
    ],
    "file-count": 100,
    "scancode-version": "30.1.0",
    "authority": "https://gitlab.eclipse.org/eclipsefdn/emo-team/iplab/-/issues/2652",
    "source": "https://github.com/postmanlabs/postman-sandbox/archive/v4.0.6.zip",
    "status": "approved"
}