{
    "id": "project/technology.lmos/eclipse-lmos/lmos-runtime/81bf7bc2c062b6de85002fd22ed1513a4e9adf55",
    "license": "CC0-1.0 AND Apache-2.0 AND CC-BY-4.0",
    "authority": "https://gitlab.eclipse.org/eclipsefdn/emo-team/iplab/-/issues/17958",
    "source": "https://github.com/eclipse-lmos/lmos-runtime/archive/81bf7bc2c062b6de85002fd22ed1513a4e9adf55.zip",
    "status": "approved",
    "scans": [
        {
            "date": "December 18, 2024 at 6:14:49 p.m. GMT",
            "authority": "https://gitlab.eclipse.org/eclipsefdn/emo-team/iplab/-/issues/17958",
            "scancode-version": "31.2.1",
            "licenses-discovered": [
                "CC0-1.0",
                "Apache-2.0",
                "CC-BY-4.0"
            ],
            "copyrights": [
                "Copyright (c) 2015-2021 the original",
                "Copyright (c) 2024 Deutsche Telekom AG.",
                "Copyright 2015 the original author or authors",
                "Copyright 2023 Deutsche Telekom AG",
                "Copyright 2023 www.contributor-covenant.org",
                "Copyright 2024 Deutsche Telekom AG"
            ],
            "file-count": 104,
            "sha256": "6966fcd29e8ad822ac647d4d0a864e9c54baf1cd77d2f69d7cf9336e5365d893",
            "source": "https://github.com/eclipse-lmos/lmos-runtime/archive/81bf7bc2c062b6de85002fd22ed1513a4e9adf55.zip",
            "status": "restricted"
        }
    ]
}