{
    "id": "maven/mavencentral/org.osgi/osgi.cmpn/7.0.0",
    "license": "Apache-2.0",
    "authority": "https://gitlab.eclipse.org/eclipsefdn/emo-team/iplab/-/issues/7911",
    "source": "https://search.maven.org/remotecontent?filepath=org/osgi/osgi.cmpn/7.0.0/osgi.cmpn-7.0.0-sources.jar",
    "status": "approved",
    "scans": [
        {
            "date": "April 19, 2023 at 1:47:38 p.m. GMT",
            "authority": "https://gitlab.eclipse.org/eclipsefdn/emo-team/iplab/-/issues/7911",
            "scancode-version": "31.2.1",
            "licenses-discovered": [
                "Apache-2.0"
            ],
            "copyrights": [
                "Copyright (c) OSGi Alliance (2000, 2013)",
                "Copyright (c) OSGi Alliance (2000, 2014)",
                "Copyright (c) OSGi Alliance (2000, 2015)",
                "Copyright (c) OSGi Alliance (2000, 2016)",
                "Copyright (c) OSGi Alliance (2000, 2017)",
                "Copyright (c) OSGi Alliance (2000, 2018)",
                "Copyright (c) OSGi Alliance (2001, 2013)",
                "Copyright (c) OSGi Alliance (2001, 2015)",
                "Copyright (c) OSGi Alliance (2001, 2016)",
                "Copyright (c) OSGi Alliance (2001, 2017)",
                "Copyright (c) OSGi Alliance (2001, 2018)",
                "Copyright (c) OSGi Alliance (2002, 2013)",
                "Copyright (c) OSGi Alliance (2002, 2015)",
                "Copyright (c) OSGi Alliance (2002, 2016)",
                "Copyright (c) OSGi Alliance (2002, 2017)",
                "Copyright (c) OSGi Alliance (2002, 2018)",
                "Copyright (c) OSGi Alliance (2004, 2013)",
                "Copyright (c) OSGi Alliance (2004, 2014)",
                "Copyright (c) OSGi Alliance (2004, 2015)",
                "Copyright (c) OSGi Alliance (2004, 2016)",
                "Copyright (c) OSGi Alliance (2004, 2017)",
                "Copyright (c) OSGi Alliance (2004, 2018)",
                "Copyright (c) OSGi Alliance (2005, 2012)",
                "Copyright (c) OSGi Alliance (2005, 2013)",
                "Copyright (c) OSGi Alliance (2005, 2014)",
                "Copyright (c) OSGi Alliance (2005, 2015)",
                "Copyright (c) OSGi Alliance (2005, 2016)",
                "Copyright (c) OSGi Alliance (2005, 2017)",
                "Copyright (c) OSGi Alliance (2005, 2018)",
                "Copyright (c) OSGi Alliance (2006, 2013)",
                "Copyright (c) OSGi Alliance (2006, 2014)",
                "Copyright (c) OSGi Alliance (2008, 2013)",
                "Copyright (c) OSGi Alliance (2008, 2015)",
                "Copyright (c) OSGi Alliance (2008, 2016)",
                "Copyright (c) OSGi Alliance (2009, 2013)",
                "Copyright (c) OSGi Alliance (2009, 2014)",
                "Copyright (c) OSGi Alliance (2009, 2015)",
                "Copyright (c) OSGi Alliance (2009, 2018)",
                "Copyright (c) OSGi Alliance (2010, 2013)",
                "Copyright (c) OSGi Alliance (2010, 2014)",
                "Copyright (c) OSGi Alliance (2010, 2015)",
                "Copyright (c) OSGi Alliance (2010, 2016)",
                "Copyright (c) OSGi Alliance (2010, 2017)",
                "Copyright (c) OSGi Alliance (2010, 2018)",
                "Copyright (c) OSGi Alliance (2011, 2013)",
                "Copyright (c) OSGi Alliance (2011, 2016)",
                "Copyright (c) OSGi Alliance (2011, 2017)",
                "Copyright (c) OSGi Alliance (2011, 2018)",
                "Copyright (c) OSGi Alliance (2012, 2013)",
                "Copyright (c) OSGi Alliance (2012, 2014)",
                "Copyright (c) OSGi Alliance (2012, 2016)",
                "Copyright (c) OSGi Alliance (2012, 2017)",
                "Copyright (c) OSGi Alliance (2012, 2018)",
                "Copyright (c) OSGi Alliance (2013)",
                "Copyright (c) OSGi Alliance (2013, 2014)",
                "Copyright (c) OSGi Alliance (2013, 2015)",
                "Copyright (c) OSGi Alliance (2013, 2016)",
                "Copyright (c) OSGi Alliance (2013, 2017)",
                "Copyright (c) OSGi Alliance (2013, 2018)",
                "Copyright (c) OSGi Alliance (2014)",
                "Copyright (c) OSGi Alliance (2014, 2015)",
                "Copyright (c) OSGi Alliance (2014, 2016)",
                "Copyright (c) OSGi Alliance (2014, 2017)",
                "Copyright (c) OSGi Alliance (2014, 2018)",
                "Copyright (c) OSGi Alliance (2015)",
                "Copyright (c) OSGi Alliance (2015, 2016)",
                "Copyright (c) OSGi Alliance (2015, 2017)",
                "Copyright (c) OSGi Alliance (2015, 2018)",
                "Copyright (c) OSGi Alliance (2016)",
                "Copyright (c) OSGi Alliance (2016, 2017)",
                "Copyright (c) OSGi Alliance (2016, 2018)",
                "Copyright (c) OSGi Alliance (2017)",
                "Copyright (c) OSGi Alliance (2017, 2018)",
                "Copyright (c) OSGi Alliance (2018)"
            ],
            "file-count": 487,
            "sha256": "040bfd0c9c3e390b83ab1a56470ea99a58774d779ae038a3b1bc1e22ac0a53b0",
            "source": "https://search.maven.org/remotecontent?filepath=org/osgi/osgi.cmpn/7.0.0/osgi.cmpn-7.0.0-sources.jar",
            "status": "approved"
        }
    ]
}