{
    "id": "crate/cratesio/-/litemap/0.7.3",
    "license": "Apache-2.0 AND Unicode-3.0",
    "authority": "https://gitlab.eclipse.org/eclipsefdn/emo-team/iplab/-/issues/15432",
    "source": "https://crates.io/api/v1/crates/litemap/0.7.3/download",
    "status": "approved",
    "scans": [
        {
            "date": "June 15, 2024 at 2:48:46 a.m. GMT",
            "authority": "https://gitlab.eclipse.org/eclipsefdn/emo-team/iplab/-/issues/15432",
            "scancode-version": "31.2.1",
            "licenses-discovered": [
                "LicenseRef-scancode-unknown-spdx"
            ],
            "copyrights": [
                "(c) 1995-2016 International Business Machines Corporation and others",
                "Copyright (c) 2020-2024 Unicode, Inc."
            ],
            "file-count": 23,
            "sha256": "643cb0b8d4fcc284004d5fd0d67ccf61dfffadb7f75e1e71bc420f4688a3a704",
            "source": "https://crates.io/api/v1/crates/litemap/0.7.3/download",
            "status": "restricted"
        }
    ]
}