{
    "id": "go/golang/github.com%2Fcoreos%2Fgo-systemd/v22/v22.5.0",
    "license": "Apache-2.0",
    "authority": "https://gitlab.eclipse.org/eclipsefdn/emo-team/iplab/-/issues/12010",
    "source": "https://proxy.golang.org/github.com%2Fcoreos%2Fgo-systemd/v22/@v/v22.5.0.zip",
    "status": "approved",
    "scans": [
        {
            "date": "December 14, 2023 at 12:07:35 p.m. GMT",
            "authority": "https://gitlab.eclipse.org/eclipsefdn/emo-team/iplab/-/issues/12010",
            "scancode-version": "31.2.1",
            "licenses-discovered": [
                "Apache-2.0"
            ],
            "copyrights": [
                "Copyright (c) 2004, 2006 The Linux Foundation and its contributors",
                "Copyright 2014 Docker, Inc.",
                "Copyright 2015 CoreOS Inc.",
                "Copyright 2015 CoreOS, Inc.",
                "Copyright 2015 RedHat, Inc.",
                "Copyright 2015, 2018 CoreOS, Inc.",
                "Copyright 2015-2018 CoreOS, Inc.",
                "Copyright 2016 CoreOS, Inc.",
                "Copyright 2018 CoreOS, Inc.",
                "Copyright 2019 CoreOS, Inc.",
                "Copyright 2020 CoreOS, Inc.",
                "Copyright 2022 CoreOS, Inc."
            ],
            "file-count": 89,
            "sha256": "4c44e3a6b84de4db393e341537c7124031fa98d5f98860ad31b32b4890f2234c",
            "source": "https://proxy.golang.org/github.com%2Fcoreos%2Fgo-systemd/v22/@v/v22.5.0.zip",
            "status": "approved"
        }
    ]
}