{
    "id": "pypi/pypi/-/patsy/0.5.6",
    "license": "BSD-2-Clause AND Python-2.0 AND MIT",
    "authority": "https://gitlab.eclipse.org/eclipsefdn/emo-team/iplab/-/issues/16875",
    "source": "https://files.pythonhosted.org/packages/c6/18/12e76e52d589c4a812a2f1fb2406b486c226b7ac263ac8ef4b5f4bb04058/patsy-0.5.6.tar.gz",
    "status": "approved",
    "scans": [
        {
            "date": "October 26, 2024, 5:22:26 p.m. GMT",
            "authority": "https://gitlab.eclipse.org/eclipsefdn/emo-team/iplab/-/issues/16875",
            "scancode-version": "31.2.1",
            "licenses-discovered": [
                "BSD-2-Clause AND Python-2.0",
                "BSD-2-Clause AND BSD-3-Clause",
                "BSD-2-Clause",
                "MIT",
                "Python-2.0"
            ],
            "copyrights": [
                "Copyright (c) 2001, 2002, 2003, 2004, 2005, 2006, 2007, 2008, 2009, 2010, 2011, 2012 Python Software Foundation",
                "Copyright (c) 2011 Nathaniel Smith <njs@pobox.com>",
                "Copyright (c) 2011-2012 Nathaniel Smith <njs@pobox.com>",
                "Copyright (c) 2011-2012, Patsy Developers",
                "Copyright (c) 2011-2013 Nathaniel Smith <njs@pobox.com>",
                "Copyright (c) 2011-2014 Nathaniel Smith <njs@pobox.com>",
                "Copyright (c) 2011-2015 Nathaniel Smith <njs@pobox.com>",
                "Copyright (c) 2012 Nathaniel Smith <njs@pobox.com>",
                "Copyright (c) 2012-2013 Nathaniel Smith <njs@pobox.com>",
                "Copyright (c) 2013 Nathaniel Smith <njs@pobox.com>",
                "Copyright (c) 2014 GDF Suez, http://www.gdfsuez.com",
                "Copyright 2007, 2008 Chris Wanstrath chris@ozmm.org",
                "copyright u'2011-2015, Nathaniel J. Smith"
            ],
            "file-count": 96,
            "sha256": "95c6d47a7222535f84bff7f63d7303f2e297747a598db89cf5c67f0c0c7d2cdb",
            "source": "https://files.pythonhosted.org/packages/c6/18/12e76e52d589c4a812a2f1fb2406b486c226b7ac263ac8ef4b5f4bb04058/patsy-0.5.6.tar.gz",
            "status": "restricted"
        }
    ]
}