{
    "id": "npm/npmjs/-/picocolors/1.0.1",
    "license": "ISC",
    "authority": "https://gitlab.eclipse.org/eclipsefdn/emo-team/iplab/-/issues/14718",
    "source": "https://github.com/alexeyraspopov/picocolors/archive/refs/tags/v1.0.1.zip",
    "status": "approved",
    "scans": [
        {
            "date": "May 14, 2024 at 6:54:15 p.m. GMT",
            "authority": "https://gitlab.eclipse.org/eclipsefdn/emo-team/iplab/-/issues/14718",
            "scancode-version": "31.2.1",
            "licenses-discovered": [
                "ISC"
            ],
            "copyrights": [
                "Copyright (c) 2021 Alexey Raspopov, Kostiantyn Denysov, Anton Verinov"
            ],
            "file-count": 18,
            "sha256": "d6e1fa85957e63cc347f18382f7eca327d4f82c2fdc7afb5462e79e13995cf9b",
            "source": "https://github.com/alexeyraspopov/picocolors/archive/refs/tags/v1.0.1.zip",
            "status": "approved"
        }
    ]
}