{
    "id": "project/dt.slm/eclipse-slm/slm-cc-base/eb3fc39dcea9de89bf54d165ed4c96274497a656",
    "license": "Apache-2.0 AND (MIT OR GPL-2.0-or-later) AND BSD-3-Clause)",
    "authority": "https://gitlab.eclipse.org/eclipsefdn/emo-team/iplab/-/issues/8531",
    "source": "https://github.com/eclipse-slm/slm-cc-base/archive/eb3fc39dcea9de89bf54d165ed4c96274497a656.zip",
    "status": "approved",
    "scans": [
        {
            "date": "May 23, 2023 at 9:50:27 p.m. GMT",
            "authority": "https://gitlab.eclipse.org/eclipsefdn/emo-team/iplab/-/issues/8531",
            "scancode-version": "31.2.1",
            "licenses-discovered": [
                "GPL-2.0-or-later",
                "BSD-3-Clause",
                "Apache-2.0 AND BSD-3-Clause AND GPL-2.0-or-later AND MIT"
            ],
            "copyrights": [
            ],
            "file-count": 22,
            "sha256": "e60b4f512afefd3d2c6fca7ffbcfda33777569283561390803e79005bee0e9f9",
            "source": "https://github.com/eclipse-slm/slm-cc-base/archive/eb3fc39dcea9de89bf54d165ed4c96274497a656.zip",
            "status": "restricted"
        }
    ]
}
