{
    "id": "maven/mavencentral/net.sourceforge.plantuml/plantuml-epl/1.2023.11",
    "license": "EPL-1.0 AND Apache-2.0 AND CC0-1.0 AND LicenseRef-Permission-Notice AND (Apache-2.0 OR BSD-3-Clause OR EPL-1.0 OR AGPL-3.0-or-later OR GPL-2.0-or-later OR LGPL-2.1-or-later OR MIT)",
    "authority": "https://gitlab.eclipse.org/eclipsefdn/emo-team/iplab/-/issues/10595",
    "source": "https://repo.maven.apache.org/maven2/net/sourceforge/plantuml/plantuml-epl/1.2023.11/plantuml-epl-1.2023.11-sources.jar",
    "status": "approved",
    "scans": [
        {
            "date": "September 20, 2023 at 11:27:09 a.m. GMT",
            "authority": "https://gitlab.eclipse.org/eclipsefdn/emo-team/iplab/-/issues/10595",
            "scancode-version": "31.2.1",
            "licenses-discovered": [
                "BSD-3-Clause AND EPL-1.0",
                "EPL-1.0",
                "EPL-1.0 AND MIT",
                "EPL-1.0 AND LicenseRef-scancode-mit-xfig",
                "CC0-1.0 AND EPL-1.0",
                "Apache-2.0 AND EPL-1.0",
                "Apache-2.0 AND BSD-3-Clause AND EPL-1.0 AND GPL-2.0-or-later AND LGPL-2.1-or-later AND MIT",
                "Apache-2.0 AND BSD-3-Clause AND EPL-1.0 AND LGPL-2.1-or-later AND LicenseRef-scancode-unknown AND MIT",
                "Apache-2.0"
            ],
            "copyrights": [
                "(c) Copyright 2009-2024, Arnaud Roques",
                "(c) David Lippman http://www.pierce.ctc.edu/dlippman",
                "(c) Peter Jipsen http://www.chapman.edu/~jipsen",
                "(c) by Brett Schwarz https://github.com/bschwarz/puml-themes",
                "(c) by Twitter at https://twemoji.twitter.com",
                "Copyright (c) 1994 Anthony Dekker",
                "Copyright (c) 2019 by Brett Schwarz",
                "Copyright (c) 2020 by Brett Schwarz",
                "Copyright (c) 2022 by Bharat Rajagopalan",
                "Copyright (c) Project",
                "David Beaumont, Copyright 2005"
            ],
            "file-count": 2815,
            "sha256": "bfdf63127d03ad41aa0866de8feefd12d7b2518cd1a3074981fc625d06875708",
            "source": "https://repo.maven.apache.org/maven2/net/sourceforge/plantuml/plantuml-epl/1.2023.11/plantuml-epl-1.2023.11-sources.jar",
            "status": "restricted"
        }
    ]
}
