{
    "id": "npm/npmjs/@nx/nx-darwin-x64/19.8.1",
    "license": "MIT",
    "authority": "https://gitlab.eclipse.org/eclipsefdn/emo-team/iplab/-/issues/16308",
    "source": "https://github.com/nrwl/nx/archive/refs/tags/19.8.1.zip",
    "status": "approved",
    "scans": [
        {
            "date": "September 26, 2024, 1:10:53 a.m. GMT",
            "authority": "https://gitlab.eclipse.org/eclipsefdn/emo-team/iplab/-/issues/16308",
            "scancode-version": "31.2.1",
            "licenses-discovered": [
                "MIT",
                "TMate",
                "Apache-2.0",
                "GPL-3.0-only AND JSON AND MIT",
                "JSON AND MIT",
                "MIT AND Unlicense",
                "ISC",
                "JSON",
                "Apache-2.0 AND BSD-3-Clause AND CDDL-1.0 AND CDDL-1.1 AND EPL-1.0 AND EPL-2.0 AND (GPL-2.0-only WITH Classpath-exception-2.0) AND MIT"
            ],
            "copyrights": [
                "(c) 2024 made with",
                "Copyright (c) 2014 The Android Open Source Project",
                "Copyright (c) 2015-2021 the original",
                "Copyright (c) 2017-2024 Narwhal Technologies Inc.",
                "Copyright (c) 2022 Mohammad Ataei",
                "Copyright 2015 the original author or authors",
                "Copyright Google Inc."
            ],
            "file-count": 7814,
            "sha256": "2aeb402d076662dbcdcbc5d950b8a20b4c939932cc04e4e0fc75cdfff78a858e",
            "source": "https://github.com/nrwl/nx/archive/refs/tags/19.8.1.zip",
            "status": "restricted"
        }
    ]
}