{
    "id": "maven/mavencentral/org.eclipse.dataspaceconnector/ids-api-multipart-dispatcher-v1/0.0.1-20220922.4-20230220.143048-1",
    "license": "Apache-2.0",
    "authority": "https://gitlab.eclipse.org/eclipsefdn/emo-team/iplab/-/issues/7645",
    "source": "https://search.maven.org/remotecontent?filepath=org/eclipse/dataspaceconnector/ids-api-multipart-dispatcher-v1/0.0.1-milestone-6/ids-api-multipart-dispatcher-v1-0.0.1-milestone-6-sources.jar",
    "status": "approved",
    "scans": [
        {
            "date": "March 28, 2023 at 9:46:15 p.m. GMT",
            "authority": "https://gitlab.eclipse.org/eclipsefdn/emo-team/iplab/-/issues/7645",
            "scancode-version": "31.2.1",
            "licenses-discovered": [
                "Apache-2.0"
            ],
            "copyrights": [
                "Copyright (c) 2020 - 2022 Fraunhofer Institute for Software and Systems Engineering",
                "Copyright (c) 2020, 2021 Fraunhofer Institute for Software and Systems Engineering",
                "Copyright (c) 2021 - 2022 Fraunhofer Institute for Software and Systems Engineering",
                "Copyright (c) 2021 Daimler TSS GmbH",
                "Copyright (c) 2021 Fraunhofer Institute for Software and Systems Engineering",
                "Copyright (c) 2022 Amadeus"
            ],
            "file-count": 15,
            "sha256": "ba053427cae4c866d67399e5483349544bd20fd61245616d80886c77bee5fce2",
            "source": "https://search.maven.org/remotecontent?filepath=org/eclipse/dataspaceconnector/ids-api-multipart-dispatcher-v1/0.0.1-milestone-6/ids-api-multipart-dispatcher-v1-0.0.1-milestone-6-sources.jar",
            "status": "approved"
        }
    ]
}