{
    "id": "npm/npmjs/@lerna/changed/6.4.0",
    "license": "MIT AND ISC",
    "authority": "https://gitlab.eclipse.org/eclipsefdn/emo-team/iplab/-/issues/6207",
    "source": "https://github.com/lerna/lerna/archive/v6.4.0.zip",
    "status": "approved",
    "scans": [
        {
            "date": "January 10, 2023 at 12:50:30 a.m. GMT",
            "authority": "https://gitlab.eclipse.org/eclipsefdn/emo-team/iplab/-/issues/6207",
            "scancode-version": "31.2.1",
            "licenses-discovered": [
                "MIT",
                "ISC",
                "ISC AND MIT"
            ],
            "copyrights": [
                "Copyright (c) 2015-present Lerna",
                "Copyright (c) 2018 Tester McPerson <test@example.com>"
            ],
            "file-count": 1503,
            "sha256": "9bbce9f8df04a9f63ce0ed150ac6ddfcafc2136388b8fb42be93b2a09576d768",
            "source": "https://github.com/lerna/lerna/archive/v6.4.0.zip",
            "status": "approved"
        }
    ]
}