{
    "id": "maven/mavencentral/software.amazon.awssdk/sts/2.20.91",
    "license": "Apache-2.0",
    "authority": "https://gitlab.eclipse.org/eclipsefdn/emo-team/iplab/-/issues/9269",
    "source": "https://repo.maven.apache.org/maven2/software/amazon/awssdk/sts/2.20.91/sts-2.20.91-sources.jar",
    "status": "approved",
    "scans": [
        {
            "date": "July 6, 2023 at 5:15:14 a.m. GMT",
            "authority": "https://gitlab.eclipse.org/eclipsefdn/emo-team/iplab/-/issues/9269",
            "scancode-version": "31.2.1",
            "licenses-discovered": [
                "Apache-2.0"
            ],
            "copyrights": [
                "Copyright Amazon.com, Inc. or its affiliates"
            ],
            "file-count": 137,
            "sha256": "089c0c57c7938ea9601e70975c5e1f2db6c9ff6b65f9e610f663fda62dba748d",
            "source": "https://repo.maven.apache.org/maven2/software/amazon/awssdk/sts/2.20.91/sts-2.20.91-sources.jar",
            "status": "approved"
        }
    ]
}