{
    "id": "maven/mavencentral/org.geotools.ogc/net.opengis.wfs/22.1",
    "license": "LGPL-2.1-only",
    "authority": "https://gitlab.eclipse.org/eclipsefdn/emo-team/iplab/-/issues/4911",
    "source": "https://repo.osgeo.org/repository/geotools-releases/org/geotools/ogc/net.opengis.wfs/22.1/net.opengis.wfs-22.1-sources.jar",
    "status": "approved",
    "scans": [
        {
            "date": "November 15, 2022 at 11:43:43 p.m. GMT",
            "authority": "https://gitlab.eclipse.org/eclipsefdn/emo-team/iplab/-/issues/4911",
            "scancode-version": "31.2.1",
            "licenses-discovered": [
            ],
            "copyrights": [
                "Copyright (c) 2001 OGC",
                "Copyright (c) 2006,2010 Open Geospatial Consortium, Inc.",
                "Copyright (c) 2010 Open Geospatial Consortium",
                "Copyright (c) 2010 Open Geospatial Consortium, Inc."
            ],
            "file-count": 319,
            "sha256": "9ae417c4fa00c5a5f50a8a5233ac1f3c1bda70924b05f9db1b394db267de8636",
            "source": "https://repo.osgeo.org/repository/geotools-releases/org/geotools/ogc/net.opengis.wfs/22.1/net.opengis.wfs-22.1-sources.jar",
            "status": "restricted"
        },
        {
            "date": "November 16, 2022 at 1:19:52 a.m. GMT",
            "authority": "https://gitlab.eclipse.org/eclipsefdn/emo-team/iplab/-/issues/4911",
            "scancode-version": "31.2.1",
            "licenses-discovered": [
            ],
            "copyrights": [
                "Copyright (c) 2001 OGC",
                "Copyright (c) 2006,2010 Open Geospatial Consortium, Inc.",
                "Copyright (c) 2010 Open Geospatial Consortium",
                "Copyright (c) 2010 Open Geospatial Consortium, Inc."
            ],
            "file-count": 319,
            "sha256": "9ae417c4fa00c5a5f50a8a5233ac1f3c1bda70924b05f9db1b394db267de8636",
            "source": "https://repo.osgeo.org/repository/geotools-releases/org/geotools/ogc/net.opengis.wfs/22.1/net.opengis.wfs-22.1-sources.jar",
            "status": "restricted"
        }
    ]
}
