{
    "id": "npm/npmjs/-/braces/3.0.3",
    "license": "MIT",
    "authority": "https://gitlab.eclipse.org/eclipsefdn/emo-team/iplab/-/issues/14866",
    "source": "https://github.com/micromatch/braces/archive/refs/tags/3.0.3.zip",
    "status": "approved",
    "scans": [
        {
            "date": "May 21, 2024 at 3:17:06 p.m. GMT",
            "authority": "https://gitlab.eclipse.org/eclipsefdn/emo-team/iplab/-/issues/14866",
            "scancode-version": "31.2.1",
            "licenses-discovered": [
                "MIT"
            ],
            "copyrights": [
                "Copyright (c) 2014-present, Jon Schlinkert",
                "Copyright (c) 2019, Jon Schlinkert (https://github.com/jonschlinkert)"
            ],
            "file-count": 32,
            "sha256": "0584771a05a0a2fac489a505d0ecea1ff739114c236b1c5f788b3e4c9f6d7338",
            "source": "https://github.com/micromatch/braces/archive/refs/tags/3.0.3.zip",
            "status": "approved"
        }
    ]
}