{
    "license": "MIT",
    "file-count": 26,
    "authority": "https://gitlab.eclipse.org/eclipsefdn/emo-team/iplab/-/issues/1394",
    "scancode-version": "30.1.0",
    "licenses-discovered": [
        "MIT"
    ],
    "id": "pypi/pypi/-/normality/2.2.2",
    "source": "https://files.pythonhosted.org/packages/6d/fa/ab5530a7882ee8e1378ab3d21c76a0f72dbfbb9a5a108203be3e1ba1cbc4/normality-2.2.2.tar.gz",
    "status": "approved"
}