{
    "id": "npm/npmjs/-/chai/4.3.7",
    "license": "MIT AND Apache-2.0",
    "licenses-discovered": [
        "MIT",
        "Apache-2.0"
    ],
    "copyrights": [
        "Copyright (c) 2011 Jake Luer <jake@alogicalparadox.com>",
        "Copyright (c) 2011-2014 Jake Luer <jake@alogicalparadox.com>",
        "Copyright (c) 2011-2016 Jake Luer <jake@alogicalparadox.com>",
        "Copyright (c) 2012-2014 Jake Luer <jake@alogicalparadox.com>",
        "Copyright (c) 2012-2015 Sakthipriyan Vairamani <thechargingvolcano@gmail.com>",
        "Copyright (c) 2012-2016 Jake Luer <jake@alogicalparadox.com>",
        "Copyright (c) 2013 Jake Luer <jake@alogicalparadox.com>",
        "Copyright (c) 2013 Jake Luer <jake@qualiancy.com>",
        "Copyright (c) 2013 jake luer <jake@alogicalparadox.com>",
        "Copyright (c) 2017 Chai.js Assertion Library"
    ],
    "file-count": 50,
    "scancode-version": "31.2.1",
    "authority": "https://gitlab.eclipse.org/eclipsefdn/emo-team/iplab/-/issues/4585",
    "source": "https://registry.npmjs.org/chai/-/chai-4.3.7.tgz",
    "status": "approved"
}