{
    "id": "maven/mavencentral/org.springframework.security/spring-security-oauth2-core/6.0.2",
    "license": "Apache-2.0",
    "authority": "https://gitlab.eclipse.org/eclipsefdn/emo-team/iplab/-/issues/7324",
    "source": "https://search.maven.org/remotecontent?filepath=org/springframework/security/spring-security-oauth2-core/6.0.2/spring-security-oauth2-core-6.0.2-sources.jar",
    "status": "approved",
    "scans": [
        {
            "date": "March 7, 2023 at 12:49:26 p.m. GMT",
            "authority": "https://gitlab.eclipse.org/eclipsefdn/emo-team/iplab/-/issues/7324",
            "scancode-version": "31.2.1",
            "licenses-discovered": [
                "Apache-2.0"
            ],
            "copyrights": [
                "Copyright 2002-2017 the original author or authors",
                "Copyright 2002-2018 the original author or authors",
                "Copyright 2002-2019 the original author or authors",
                "Copyright 2002-2020 the original author or authors",
                "Copyright 2002-2021 the original author or authors",
                "Copyright 2002-2022 the original author or authors"
            ],
            "file-count": 64,
            "sha256": "80ea92a0e6dbe802b26919bf0ff7de00c591a2afadceed5579d7405290b659d8",
            "source": "https://search.maven.org/remotecontent?filepath=org/springframework/security/spring-security-oauth2-core/6.0.2/spring-security-oauth2-core-6.0.2-sources.jar",
            "status": "approved"
        }
    ]
}