{
    "id": "npm/npmjs/-/vscode-messenger-common/0.5.1",
    "license": "MIT",
    "authority": "https://gitlab.eclipse.org/eclipsefdn/emo-team/iplab/-/issues/19197",
    "source": "https://github.com/TypeFox/vscode-messenger/archive/refs/tags/v0.5.1.zip",
    "status": "approved",
    "scans": [
        {
            "date": "January 24, 2025 at 10:44:45 p.m. GMT",
            "authority": "https://gitlab.eclipse.org/eclipsefdn/emo-team/iplab/-/issues/19197",
            "scancode-version": "31.2.1",
            "licenses-discovered": [
                "MIT"
            ],
            "copyrights": [
                "Copyright 2022 TypeFox GmbH",
                "Copyright 2023 TypeFox GmbH",
                "Copyright 2024 TypeFox GmbH"
            ],
            "file-count": 74,
            "sha256": "0f4364dba02faa38000a0ba733f630eb9fe9a55fc105d6d4785f3bcab4e694cd",
            "source": "https://github.com/TypeFox/vscode-messenger/archive/refs/tags/v0.5.1.zip",
            "status": "approved"
        }
    ]
}