{
    "id": "npm/npmjs/-/readdirp/4.1.1",
    "license": "MIT",
    "authority": "https://gitlab.eclipse.org/eclipsefdn/emo-team/iplab/-/issues/18591",
    "source": "https://github.com/paulmillr/readdirp/archive/refs/tags/4.1.1.zip",
    "status": "approved",
    "scans": [
        {
            "date": "January 13, 2025 at 3:04:56 p.m. GMT",
            "authority": "https://gitlab.eclipse.org/eclipsefdn/emo-team/iplab/-/issues/18591",
            "scancode-version": "31.2.1",
            "licenses-discovered": [
                "MIT",
                "JSON AND MIT"
            ],
            "copyrights": [
                "(c) 2012-2019 Thorsten Lorenz, Paul Miller (https://paulmillr.com)",
                "Copyright (c) 2012-2019 Thorsten Lorenz, Paul Miller (https://paulmillr.com)",
                "Copyright (c) 2012-2019 Thorsten Lorenz, Paul Miller <https://paulmillr.com>"
            ],
            "file-count": 16,
            "sha256": "92b3e075193355242b00404cd29c57e26a9a269c6972f5b71b54d20196171ec2",
            "source": "https://github.com/paulmillr/readdirp/archive/refs/tags/4.1.1.zip",
            "status": "restricted"
        }
    ]
}