{
    "id": "maven/mavencentral/de.vandermeer/skb-interfaces/0.0.1",
    "license": "Apache-2.0",
    "authority": "https://gitlab.eclipse.org/eclipsefdn/emo-team/iplab/-/issues/5314",
    "source": "https://search.maven.org/remotecontent?filepath=de/vandermeer/skb-interfaces/0.0.1/skb-interfaces-0.0.1-sources.jar",
    "status": "approved",
    "scans": [
        {
            "date": "December 2, 2022 at 2:32:14 p.m. GMT",
            "authority": "https://gitlab.eclipse.org/eclipsefdn/emo-team/iplab/-/issues/5314",
            "scancode-version": "31.2.1",
            "licenses-discovered": [
                "Apache-2.0"
            ],
            "copyrights": [
                "Copyright 2014 Sven van der Meer <vdmeer.sven@mykolab.com>",
                "Copyright 2016 Sven van der Meer <vdmeer.sven@mykolab.com>",
                "Copyright 2017 Sven van der Meer <vdmeer.sven@mykolab.com>"
            ],
            "file-count": 193,
            "sha256": "f7820c478a299c372a0196177a8508513ac843e5b09245086382d1fc1cf3a127",
            "source": "https://search.maven.org/remotecontent?filepath=de/vandermeer/skb-interfaces/0.0.1/skb-interfaces-0.0.1-sources.jar",
            "status": "approved"
        }
    ]
}