{
    "id": "npm/npmjs/-/registry-auth-token/3.3.2",
    "license": "MIT",
    "licenses-discovered": [
        "MIT"
    ],
    "copyrights": [
        "Copyright (c) 2016 Espen Hovlandsdal"
    ],
    "file-count": 9,
    "scancode-version": "31.2.1",
    "authority": "https://gitlab.eclipse.org/eclipsefdn/emo-team/iplab/-/issues/4696",
    "source": "https://registry.npmjs.org/registry-auth-token/-/registry-auth-token-3.3.2.tgz",
    "status": "approved"
}