{
    "id": "maven/mavencentral/it.unibz.inf.ontop/ontop-model/5.2.0",
    "license": "Apache-2.0",
    "authority": "https://gitlab.eclipse.org/eclipsefdn/emo-team/iplab/-/issues/16806",
    "source": "https://repo1.maven.org/maven2/it/unibz/inf/ontop/ontop-model/5.2.0/ontop-model-5.2.0-sources.jar",
    "status": "approved",
    "scans": [
        {
            "date": "October 18, 2024, 10:24:40 a.m. GMT",
            "authority": "https://gitlab.eclipse.org/eclipsefdn/emo-team/iplab/-/issues/16806",
            "scancode-version": "31.2.1",
            "licenses-discovered": [
                "Apache-2.0",
                "OGC-1.0"
            ],
            "copyrights": [
                "Copyright (c) 2009 - 2014 Free University of Bozen-Bolzano"
            ],
            "file-count": 705,
            "sha256": "e43f988251da03d0160a609d26a3d3fef07300c329613962bc934d71d89a7bcb",
            "source": "https://repo1.maven.org/maven2/it/unibz/inf/ontop/ontop-model/5.2.0/ontop-model-5.2.0-sources.jar",
            "status": "restricted"
        }
    ]
}