{
    "id": "npm/npmjs/-/read-package-json-fast/3.0.2",
    "license": "ISC",
    "authority": "https://gitlab.eclipse.org/eclipsefdn/emo-team/iplab/-/issues/5752",
    "source": "https://registry.npmjs.org/read-package-json-fast/-/read-package-json-fast-3.0.2.tgz",
    "status": "approved",
    "scans": [
        {
            "date": "December 14, 2022 at 1:57:24 a.m. GMT",
            "authority": "https://gitlab.eclipse.org/eclipsefdn/emo-team/iplab/-/issues/5752",
            "scancode-version": "31.2.1",
            "licenses-discovered": [
                "ISC"
            ],
            "copyrights": [
                "Copyright (c) npm, Inc. and Contributors"
            ],
            "file-count": 4,
            "sha256": "0d8f2d060e1fe19d445eaaaabdda4a7f388b9a0dd3c69db3022a064591ec5095",
            "source": "https://registry.npmjs.org/read-package-json-fast/-/read-package-json-fast-3.0.2.tgz",
            "status": "approved"
        }
    ]
}