{
    "id": "npm/npmjs/@commitlint/rules/17.2.0",
    "license": "MIT",
    "authority": "https://gitlab.eclipse.org/eclipsefdn/emo-team/iplab/-/issues/4859",
    "source": "https://registry.npmjs.org/@commitlint/rules/-/rules-17.2.0.tgz",
    "status": "approved",
    "scans": [
        {
            "date": "November 15, 2022 at 7:53:18 a.m. GMT",
            "authority": "https://gitlab.eclipse.org/eclipsefdn/emo-team/iplab/-/issues/4859",
            "scancode-version": "31.2.1",
            "licenses-discovered": [
                "MIT"
            ],
            "copyrights": [
                "Copyright (c) 2016 - present Mario Nebl"
            ],
            "file-count": 146,
            "sha256": "ab4581ffbc55315b63f3c678ed2ed41d554f3be062f25db16583a1f8a0c3fb60",
            "source": "https://registry.npmjs.org/@commitlint/rules/-/rules-17.2.0.tgz",
            "status": "approved"
        }
    ]
}