{
    "license": "Apache-2.0 AND MIT",
    "file-count": 3608,
    "authority": "https://gitlab.eclipse.org/eclipsefdn/emo-team/iplab/-/issues/1013",
    "scancode-version": "21.3.31",
    "licenses-discovered": [
        "Apache-2.0",
        "MIT"
    ],
    "id": "npm/npmjs/-/rxjs/6.5.5",
    "source": "https://registry.npmjs.org/rxjs/-/rxjs-6.5.5.tgz",
    "status": "approved"
}