{
    "id": "maven/mavencentral/jakarta.transaction/jakarta.transaction-api/2.0.1",
    "license": "EPL-2.0 OR GPL-2.0-only WITH Classpath-exception-2.0",
    "authority": "https://gitlab.eclipse.org/eclipsefdn/emo-team/iplab/-/issues/7697",
    "source": "https://search.maven.org/remotecontent?filepath=jakarta/transaction/jakarta.transaction-api/2.0.1/jakarta.transaction-api-2.0.1-sources.jar",
    "status": "approved",
    "scans": [
        {
            "date": "March 29, 2023 at 9:33:00 a.m. GMT",
            "authority": "https://gitlab.eclipse.org/eclipsefdn/emo-team/iplab/-/issues/7697",
            "scancode-version": "31.2.1",
            "licenses-discovered": [
                "CDDL-1.0 AND EPL-2.0 AND (GPL-2.0-only WITH Classpath-exception-2.0)",
                "EPL-2.0 AND (GPL-2.0-only WITH Classpath-exception-2.0)",
                "EPL-2.0 AND (GPL-2.0-only WITH Classpath-exception-2.0) AND LicenseRef-scancode-generic-export-compliance"
            ],
            "copyrights": [
                "Copyright (c) 1989, 1991 Free Software Foundation, Inc.",
                "Copyright (c) 1997, 2020 Oracle and/or its affiliates",
                "Copyright (c) 2010, 2020 Oracle and/or its affiliates",
                "Copyright (c) 2012, 2020 Oracle and/or its affiliates",
                "Copyright (c) 2013, 2020 Oracle and/or its affiliates",
                "Copyright (c) 2018, 2020 Eclipse Foundation",
                "copyrighted by the Free Software Foundation"
            ],
            "file-count": 24,
            "sha256": "fef60299cebc6f83d6ac0d7feb025ba23a0b85cc5908769869cd741f4e482614",
            "source": "https://search.maven.org/remotecontent?filepath=jakarta/transaction/jakarta.transaction-api/2.0.1/jakarta.transaction-api-2.0.1-sources.jar",
            "status": "restricted"
        }
    ]
}
