{
    "id": "maven/mavencentral/org.apache.camel/camel-util/3.21.0",
    "license": "Apache-2.0",
    "authority": "https://gitlab.eclipse.org/eclipsefdn/emo-team/iplab/-/issues/10275",
    "source": "https://repo.maven.apache.org/maven2/org/apache/camel/camel-util/3.21.0/camel-util-3.21.0-sources.jar",
    "status": "approved",
    "scans": [
        {
            "date": "September 6, 2023 at 11:36:20 a.m. GMT",
            "authority": "https://gitlab.eclipse.org/eclipsefdn/emo-team/iplab/-/issues/10275",
            "scancode-version": "31.2.1",
            "licenses-discovered": [
                "Apache-2.0"
            ],
            "copyrights": [
            ],
            "file-count": 78,
            "sha256": "4da82628f07cadf3982e25e8f61a238dc99f2d0234e8b6d5d7a30c11cf02efd4",
            "source": "https://repo.maven.apache.org/maven2/org/apache/camel/camel-util/3.21.0/camel-util-3.21.0-sources.jar",
            "status": "approved"
        }
    ]
}