{
    "id": "maven/mavencentral/org.apache.activemq/activemq-jdbc-store/5.18.2",
    "license": "Apache-2.0",
    "authority": "https://gitlab.eclipse.org/eclipsefdn/emo-team/iplab/-/issues/11284",
    "source": "https://repo.maven.apache.org/maven2/org/apache/activemq/activemq-jdbc-store/5.18.2/activemq-jdbc-store-5.18.2-sources.jar",
    "status": "approved",
    "scans": [
        {
            "date": "October 27, 2023 at 4:11:11 a.m. GMT",
            "authority": "https://gitlab.eclipse.org/eclipsefdn/emo-team/iplab/-/issues/11284",
            "scancode-version": "31.2.1",
            "licenses-discovered": [
                "Apache-2.0"
            ],
            "copyrights": [
            ],
            "file-count": 70,
            "sha256": "3d067769da75864b39ab6da2bc0714e62278025e3ea7df9d850560670a9556fc",
            "source": "https://repo.maven.apache.org/maven2/org/apache/activemq/activemq-jdbc-store/5.18.2/activemq-jdbc-store-5.18.2-sources.jar",
            "status": "approved"
        }
    ]
}