{
    "id": "maven/mavencentral/org.springframework.boot/spring-boot-starter-data-jpa/3.4.0",
    "license": "Apache-2.0",
    "authority": "https://gitlab.eclipse.org/eclipsefdn/emo-team/iplab/-/issues/17552",
    "source": "https://repo1.maven.org/maven2/org/springframework/boot/spring-boot-starter-data-jpa/3.4.0/spring-boot-starter-data-jpa-3.4.0-sources.jar",
    "status": "approved",
    "scans": [
        {
            "date": "November 29, 2024 at 4:35:14 a.m. GMT",
            "authority": "https://gitlab.eclipse.org/eclipsefdn/emo-team/iplab/-/issues/17552",
            "scancode-version": "31.2.1",
            "licenses-discovered": [
                "Apache-2.0"
            ],
            "copyrights": [
            ],
            "file-count": 2,
            "sha256": "4cd8a0432236102d655430101c7f639d33e123dc05ac96fa9bcfb56e512d017f",
            "source": "https://repo1.maven.org/maven2/org/springframework/boot/spring-boot-starter-data-jpa/3.4.0/spring-boot-starter-data-jpa-3.4.0-sources.jar",
            "status": "approved"
        }
    ]
}