{
    "id": "pypi/pypi/-/simpleline/1.9.0",
    "license": "GPL-2.0-or-later AND LGPL-2.0-or-later AND LGPL-3.0-only AND LGPL-3.0-or-later AND LGPL-3.0-only AND LGPL-3.0-or-later AND LicenseRef-scancode-free-unknown",
    "authority": "https://gitlab.eclipse.org/eclipsefdn/emo-team/iplab/-/issues/4806",
    "status": "restricted",
    "scans": [
        {
            "date": "November 10, 2022 at 7:44:08 p.m. GMT",
            "authority": "https://gitlab.eclipse.org/eclipsefdn/emo-team/iplab/-/issues/4806",
            "scancode-version": "31.2.1",
            "licenses-discovered": [
                "GPL-2.0-or-later AND LGPL-2.0-or-later AND LGPL-3.0-only AND LGPL-3.0-or-later",
                "LGPL-3.0-only",
                "LGPL-3.0-or-later",
                "LicenseRef-scancode-free-unknown"
            ],
            "copyrights": [
                "Copyright (c) 2007 Free Software Foundation, Inc. <https://fsf.org/>",
                "Copyright (c) 2020 Red Hat, Inc.",
                "copyright 2017, Jiri Konecny"
            ],
            "file-count": 99,
            "sha256": "7645e29a83df27a46defa1dc1e7e84f6adf91645e03cdd06b4384079bc89aef1",
            "source": "https://files.pythonhosted.org/packages/da/17/5a2bf4a30bc700df609b303b50c5b2a8a6a34d9776fe34979684f3c3b206/simpleline-1.9.0.tar.gz",
            "status": "restricted"
        }
    ]
}