{
    "id": "maven/mavencentral/com.vladsch.flexmark/flexmark-html2md-converter/0.64.8",
    "license": "BSD-2-Clause AND CC-BY-SA-4.0",
    "authority": "https://gitlab.eclipse.org/eclipsefdn/emo-team/iplab/-/issues/11293",
    "source": "https://repo.maven.apache.org/maven2/com/vladsch/flexmark/flexmark-html2md-converter/0.64.8/flexmark-html2md-converter-0.64.8-sources.jar",
    "status": "approved",
    "scans": [
        {
            "date": "October 27, 2023 at 3:57:10 a.m. GMT",
            "authority": "https://gitlab.eclipse.org/eclipsefdn/emo-team/iplab/-/issues/11293",
            "scancode-version": "31.2.1",
            "licenses-discovered": [
            ],
            "copyrights": [
            ],
            "file-count": 30,
            "sha256": "d304ddcd53b73434a5b5b4e8ca88954466e6df757ef37b0ab64512db54ca19a0",
            "source": "https://repo.maven.apache.org/maven2/com/vladsch/flexmark/flexmark-html2md-converter/0.64.8/flexmark-html2md-converter-0.64.8-sources.jar",
            "status": "restricted"
        }
    ]
}
