{
    "id": "git/github/RobWin/kotlin-wot/9e41fe4867e35efd9ff190881fd244a4b8a15b84",
    "license": "CC-BY-4.0 AND Apache-2.0",
    "authority": "https://gitlab.eclipse.org/eclipsefdn/emo-team/iplab/-/issues/19829",
    "source": "https://github.com/RobWin/kotlin-wot/archive/9e41fe4867e35efd9ff190881fd244a4b8a15b84.zip",
    "status": "restricted",
    "scans": [
        {
            "date": "March 1, 2025 at 7:36:31 a.m. GMT",
            "authority": "https://gitlab.eclipse.org/eclipsefdn/emo-team/iplab/-/issues/19829",
            "scancode-version": "31.2.1",
            "licenses-discovered": [
                "CC-BY-4.0",
                "Apache-2.0"
            ],
            "copyrights": [
                "Copyright (c) 2015-2021 the original",
                "Copyright 2015 the original author or authors",
                "Copyright 2023 www.contributor-covenant.org",
                "Copyright 2024 Deutsche Telekom AG",
                "Copyright 2024 Robert Winkler",
                "Copyright Robert Winkler"
            ],
            "file-count": 235,
            "sha256": "d3d4738583dea9fcf8dd2080ff94bb8acbd984e3594f285436c6ab018cab26ca",
            "source": "https://github.com/RobWin/kotlin-wot/archive/9e41fe4867e35efd9ff190881fd244a4b8a15b84.zip",
            "status": "restricted"
        }
    ]
}