{
    "id": "npm/npmjs/-/ajv/6.7.0",
    "license": "MIT",
    "licenses-discovered": [
        "MIT"
    ],
    "copyrights": [
        "Copyright (c) Evgeny Poberezkin"
    ],
    "file-count": 196,
    "scancode-version": "30.1.0",
    "authority": "https://gitlab.eclipse.org/eclipsefdn/emo-team/iplab/-/issues/2885",
    "source": "https://github.com/epoberezkin/ajv/archive/v6.7.0.zip",
    "status": "approved"
}