{
    "id": "go/golang/github.com%2Fgoogle/pprof/v0.0.0-20181206194817-3ea8567a2e57",
    "license": "Apache-2.0 AND BSD-3-Clause",
    "authority": "https://gitlab.eclipse.org/eclipsefdn/emo-team/iplab/-/issues/5792",
    "source": "https://proxy.golang.org/github.com%2Fgoogle/pprof/@v/v0.0.0-20181206194817-3ea8567a2e57.zip",
    "status": "approved",
    "scans": [
        {
            "date": "December 14, 2022 at 4:15:50 a.m. GMT",
            "authority": "https://gitlab.eclipse.org/eclipsefdn/emo-team/iplab/-/issues/5792",
            "scancode-version": "31.2.1",
            "licenses-discovered": [
                "Apache-2.0",
                "Apache-2.0 AND curl",
                "BSD-3-Clause"
            ],
            "copyrights": [
                "Copyright (c) 2013 Justin Palmer",
                "Copyright 2009-2017 Andrea Leofreddi <a.leofreddi@vleo.net>",
                "Copyright 2010-2017 Mike Bostock",
                "Copyright 2014 Google Inc.",
                "Copyright 2016 Google Inc.",
                "Copyright 2017 Google Inc.",
                "Copyright 2018 Google Inc."
            ],
            "file-count": 199,
            "sha256": "65b76add160a2ceaa6ca33d87a73c2a6b7495c30c12bfcb759593ba8495f29ed",
            "source": "https://proxy.golang.org/github.com%2Fgoogle/pprof/@v/v0.0.0-20181206194817-3ea8567a2e57.zip",
            "status": "restricted"
        }
    ]
}
