{
    "id": "maven/mavencentral/com.azure.resourcemanager/azure-resourcemanager-dns/2.30.0",
    "license": "MIT",
    "authority": "https://gitlab.eclipse.org/eclipsefdn/emo-team/iplab/-/issues/10556",
    "source": "https://repo.maven.apache.org/maven2/com/azure/resourcemanager/azure-resourcemanager-dns/2.30.0/azure-resourcemanager-dns-2.30.0-sources.jar",
    "status": "approved",
    "scans": [
        {
            "date": "September 18, 2023 at 6:14:13 a.m. GMT",
            "authority": "https://gitlab.eclipse.org/eclipsefdn/emo-team/iplab/-/issues/10556",
            "scancode-version": "31.2.1",
            "licenses-discovered": [
                "MIT"
            ],
            "copyrights": [
                "(c) 2008 VeriSign, Inc.",
                "Copyright (c) Microsoft Corporation"
            ],
            "file-count": 91,
            "sha256": "2dd46bf613e57e808ed629130dd5a0257e2ce63246c8e321875cc795fbf6361c",
            "source": "https://repo.maven.apache.org/maven2/com/azure/resourcemanager/azure-resourcemanager-dns/2.30.0/azure-resourcemanager-dns-2.30.0-sources.jar",
            "status": "approved"
        }
    ]
}