{
    "id": "maven/mavencentral/org.junit.vintage/junit-vintage-engine/5.9.0",
    "license": "EPL-2.0",
    "licenses-discovered": [
        "EPL-2.0"
    ],
    "copyrights": [
        "Copyright the original author or authors"
    ],
    "file-count": 36,
    "scancode-version": "30.1.0",
    "authority": "https://gitlab.eclipse.org/eclipsefdn/emo-team/iplab/-/issues/3129",
    "source": "https://search.maven.org/remotecontent?filepath=org/junit/vintage/junit-vintage-engine/5.9.0/junit-vintage-engine-5.9.0-sources.jar",
    "status": "approved"
}