{
    "id": "nuget/nuget/-/Swashbuckle.AspNetCore.SwaggerGen/6.7.3",
    "license": "MIT AND Apache-2.0",
    "authority": "https://gitlab.eclipse.org/eclipsefdn/emo-team/iplab/-/issues/16242",
    "source": "https://github.com/domaindrivendev/Swashbuckle.AspNetCore/archive/refs/tags/v6.7.3.zip",
    "status": "approved",
    "scans": [
        {
            "date": "September 20, 2024, 12:06:09 p.m. GMT",
            "authority": "https://gitlab.eclipse.org/eclipsefdn/emo-team/iplab/-/issues/16242",
            "scancode-version": "31.2.1",
            "licenses-discovered": [
                "MIT",
                "Apache-2.0"
            ],
            "copyrights": [
                "Copyright (c) 2016 Richard Morris",
                "Copyright (c) 2016-$( System.DateTime ::Now.ToString(yyyy)) Richard Morris"
            ],
            "file-count": 555,
            "sha256": "6699479c7d048e1a77ee77d9979881ebf246d55bdff179ed44bd4818c6220042",
            "source": "https://github.com/domaindrivendev/Swashbuckle.AspNetCore/archive/refs/tags/v6.7.3.zip",
            "status": "approved"
        }
    ]
}