{
    "id": "maven/mavencentral/org.bytedeco/openblas/0.3.21-1.5.8",
    "license": "BSD-3-Clause AND (Apache-2.0 OR GPL-2.0-or-later WITH Classpath-exception-2.0)",
    "authority": "https://gitlab.eclipse.org/eclipsefdn/emo-team/iplab/-/issues/6836",
    "source": "https://search.maven.org/remotecontent?filepath=org/bytedeco/openblas/0.3.21-1.5.8/openblas-0.3.21-1.5.8-sources.jar",
    "status": "approved",
    "scans": [
        {
            "date": "January 27, 2023 at 9:00:36 p.m. GMT",
            "authority": "https://gitlab.eclipse.org/eclipsefdn/emo-team/iplab/-/issues/6836",
            "scancode-version": "31.2.1",
            "licenses-discovered": [
                "BSD-3-Clause",
                "Apache-2.0 AND (GPL-2.0-or-later WITH Classpath-exception-2.0)"
            ],
            "copyrights": [
                "Copyright (c) 2010, Intel Corp.",
                "Copyright (c) 2014, Intel Corp.",
                "Copyright (c) 2016-2022 Samuel Audet"
            ],
            "file-count": 7,
            "sha256": "48759b0ed50b3ffa8747d52f5a87f3e7d21cc5806a94158ef1fe11668df04937",
            "source": "https://search.maven.org/remotecontent?filepath=org/bytedeco/openblas/0.3.21-1.5.8/openblas-0.3.21-1.5.8-sources.jar",
            "status": "restricted"
        }
    ]
}
