{
    "id": "maven/mavencentral/org.apache.sshd/sshd-common/2.8.0",
    "license": "Apache-2.0 AND ISC",
    "licenses-discovered": [
        "Apache-2.0",
        "ISC"
    ],
    "file-count": 385,
    "scancode-version": "30.1.0",
    "authority": "https://gitlab.eclipse.org/eclipsefdn/emo-team/iplab/-/issues/2349",
    "source": "https://search.maven.org/remotecontent?filepath=org/apache/sshd/sshd-common/2.8.0/sshd-common-2.8.0-sources.jar",
    "status": "approved"
}