{
    "id": "npm/npmjs/@storybook/csf-plugin/8.2.10",
    "license": "GPL-1.0-or-later AND MIT AND (BSD-2-Clause AND ISC AND MIT) AND OFL-1.1 AND ISC",
    "authority": "https://gitlab.eclipse.org/eclipsefdn/emo-team/iplab/-/issues/17136",
    "source": "https://github.com/storybookjs/storybook/archive/refs/tags/v8.2.10.zip",
    "status": "restricted",
    "scans": [
        {
            "date": "November 7, 2024, 10:40:14 p.m. GMT",
            "authority": "https://gitlab.eclipse.org/eclipsefdn/emo-team/iplab/-/issues/17136",
            "scancode-version": "31.2.1",
            "licenses-discovered": [
                "GPL-1.0-or-later",
                "MIT",
                "BSD-2-Clause AND ISC AND MIT",
                "OFL-1.1",
                "ISC"
            ],
            "copyrights": [
                "(c) 2017-present Renaud Tertrais",
                "(c) Unknown J2 V",
                "(c) Unknown Ks",
                "(c) Unknown Wu",
                "(c) Unknown Xs",
                "Copyright (c) 2016 Oxyno-zeta (Havrileck Alexandre)",
                "Copyright (c) 2017 The swc Project",
                "Copyright (c) 2024 Storybook",
                "Copyright 2011-2020 Tilde Inc. and contributors",
                "Copyright 2020 The Rubik Filtered Project",
                "Gt qt (c) Component",
                "Portions Copyright 2006-2011 Strobe Inc.",
                "Portions Copyright 2008-2011 Apple Inc."
            ],
            "file-count": 4797,
            "sha256": "eedc3107fcd1599043fa5a45e15d3cb6c595f641770ded7aa209f2a33b5e35f5",
            "source": "https://github.com/storybookjs/storybook/archive/refs/tags/v8.2.10.zip",
            "status": "restricted"
        }
    ]
}