{
    "id": "maven/mavencentral/com.vaadin/vaadin-custom-field-flow/14.8.9",
    "license": "Apache-2.0",
    "authority": "https://gitlab.eclipse.org/eclipsefdn/emo-team/iplab/-/issues/11227",
    "source": "https://repo.maven.apache.org/maven2/com/vaadin/vaadin-custom-field-flow/14.8.9/vaadin-custom-field-flow-14.8.9-sources.jar",
    "status": "approved",
    "scans": [
        {
            "date": "October 25, 2023 at 9:14:17 p.m. GMT",
            "authority": "https://gitlab.eclipse.org/eclipsefdn/emo-team/iplab/-/issues/11227",
            "scancode-version": "31.2.1",
            "licenses-discovered": [
                "Apache-2.0"
            ],
            "copyrights": [
                "Copyright (c) 2017 - 2018 Vaadin Ltd"
            ],
            "file-count": 4,
            "sha256": "4833a8fb49b20c1a58961f1e19b4a7972315fba1367563a97deba85254f20df7",
            "source": "https://repo.maven.apache.org/maven2/com/vaadin/vaadin-custom-field-flow/14.8.9/vaadin-custom-field-flow-14.8.9-sources.jar",
            "status": "approved"
        }
    ]
}