{
    "id": "maven/mavencentral/org.apache.activemq/artemis-quorum-ri/2.19.0",
    "license": "Apache-2.0",
    "licenses-discovered": [
        "Apache-2.0"
    ],
    "copyrights": [
        "Copyright The Apache Software Foundation"
    ],
    "file-count": 10,
    "scancode-version": "30.1.0",
    "authority": "https://gitlab.eclipse.org/eclipsefdn/emo-team/iplab/-/issues/3510",
    "source": "https://search.maven.org/remotecontent?filepath=org/apache/activemq/artemis-quorum-ri/2.19.0/artemis-quorum-ri-2.19.0-sources.jar",
    "status": "approved"
}