{
    "id": "npm/npmjs/@esbuild/linux-s390x/0.24.2",
    "license": "Apache-2.0 AND MIT AND BSD-3-Clause AND (BSD-2-Clause AND BSD-3-Clause)",
    "authority": "https://gitlab.eclipse.org/eclipsefdn/emo-team/iplab/-/issues/18314",
    "source": "https://github.com/evanw/esbuild/archive/refs/tags/v0.24.2.zip",
    "status": "approved",
    "scans": [
        {
            "date": "January 7, 2025 at 11:38:27 a.m. GMT",
            "authority": "https://gitlab.eclipse.org/eclipsefdn/emo-team/iplab/-/issues/18314",
            "scancode-version": "31.2.1",
            "licenses-discovered": [
                "Apache-2.0",
                "MIT",
                "BSD-3-Clause",
                "BSD-2-Clause AND BSD-3-Clause"
            ],
            "copyrights": [
                "(c) Evil Software Corp",
                "(c) Good Software",
                "(c) Good Software Corp",
                "(c) expectPrintedTarget t, 2019",
                "Copyright (c) 2009 The Go Authors",
                "Copyright (c) 2016 Caleb Spare",
                "Copyright (c) 2020 Evan Wallace",
                "Copyright (c) Microsoft Corporation",
                "Copyright 2012-2019 (c) Mihai Bazon <mihai.bazon@gmail.com>"
            ],
            "file-count": 324,
            "sha256": "e107b2a01915be5b886fffd02f2069e1dd7c9d002ac98ab622f66664b9809fbc",
            "source": "https://github.com/evanw/esbuild/archive/refs/tags/v0.24.2.zip",
            "status": "approved"
        }
    ]
}