{
    "id": "maven/mavencentral/org.lmdbjava/lmdbjava/0.9.0",
    "license": "Apache-2.0 AND (Apache-2.0 AND BSD-3-Clause AND EPL-1.0 AND LGPL-3.0-only AND MIT)",
    "authority": "https://gitlab.eclipse.org/eclipsefdn/emo-team/iplab/-/issues/19540",
    "source": "https://repo1.maven.org/maven2/org/lmdbjava/lmdbjava/0.9.0/lmdbjava-0.9.0-sources.jar",
    "status": "approved",
    "scans": [
        {
            "date": "February 25, 2025 at 8:12:10 a.m. GMT",
            "authority": "https://gitlab.eclipse.org/eclipsefdn/emo-team/iplab/-/issues/19540",
            "scancode-version": "31.2.1",
            "licenses-discovered": [
                "Apache-2.0",
                "Apache-2.0 AND BSD-3-Clause AND EPL-1.0 AND LGPL-3.0-only AND MIT"
            ],
            "copyrights": [
                "Copyright (c) 2016 - 2023 The LmdbJava Open Source Project"
            ],
            "file-count": 44,
            "sha256": "a42e9b7fd8933c1f0c88b6ef8674cb1507987364d2c6af781db14efbcab86ad9",
            "source": "https://repo1.maven.org/maven2/org/lmdbjava/lmdbjava/0.9.0/lmdbjava-0.9.0-sources.jar",
            "status": "approved"
        }
    ]
}