{
    "id": "npm/npmjs/-/nx/20.1.4",
    "license": "MIT",
    "authority": "https://gitlab.eclipse.org/eclipsefdn/emo-team/iplab/-/issues/17739",
    "source": "https://github.com/nrwl/nx/archive/refs/tags/20.1.4.zip",
    "status": "approved",
    "scans": [
        {
            "date": "December 5, 2024 at 6:57:44 a.m. GMT",
            "authority": "https://gitlab.eclipse.org/eclipsefdn/emo-team/iplab/-/issues/17739",
            "scancode-version": "31.2.1",
            "licenses-discovered": [
                "MIT",
                "TMate",
                "ISC",
                "LicenseRef-scancode-commercial-license AND MIT",
                "LicenseRef-scancode-commercial-license",
                "Apache-2.0",
                "GPL-3.0-only AND JSON AND MIT",
                "JSON AND MIT",
                "LicenseRef-scancode-commercial-license AND LicenseRef-scancode-proprietary-license",
                "MIT AND Unlicense",
                "JSON"
            ],
            "copyrights": [
                "(c) 2024 made with",
                "Copyright (c) 2014 The Android Open Source Project",
                "Copyright (c) 2015-2021 the original",
                "Copyright (c) 2017-2024 Narwhal Technologies Inc.",
                "Copyright (c) 2022 Mohammad Ataei",
                "Copyright 2015 the original author or authors",
                "Copyright Apple Inc., 2024",
                "Copyright Google Inc."
            ],
            "file-count": 8032,
            "sha256": "c0ce0c32aeb1eb557ea470db1ff6ce0eb8da68d1def96baea87f18147528d212",
            "source": "https://github.com/nrwl/nx/archive/refs/tags/20.1.4.zip",
            "status": "restricted"
        }
    ]
}