{
    "id": "maven/mavencentral/org.apache.cxf/cxf-rt-security/3.5.4",
    "license": "Apache-2.0",
    "licenses-discovered": [
        "Apache-2.0"
    ],
    "copyrights": [
    ],
    "file-count": 19,
    "scancode-version": "31.2.1",
    "authority": "https://gitlab.eclipse.org/eclipsefdn/emo-team/iplab/-/issues/4392",
    "source": "https://search.maven.org/remotecontent?filepath=org/apache/cxf/cxf-rt-security/3.5.4/cxf-rt-security-3.5.4-sources.jar",
    "status": "approved"
}