{
    "id": "npm/npmjs/-/ts-api-utils/1.4.0",
    "license": "MIT",
    "authority": "https://gitlab.eclipse.org/eclipsefdn/emo-team/iplab/-/issues/17411",
    "source": "https://github.com/JoshuaKGoldberg/ts-api-utils/archive/refs/tags/v1.4.0.zip",
    "status": "approved",
    "scans": [
        {
            "date": "November 22, 2024, 1:23:50 p.m. GMT",
            "authority": "https://gitlab.eclipse.org/eclipsefdn/emo-team/iplab/-/issues/17411",
            "scancode-version": "31.2.1",
            "licenses-discovered": [
                "MIT",
                "JSON AND MIT"
            ],
            "copyrights": [
            ],
            "file-count": 114,
            "sha256": "eb4646739f4d5d455a2471f467a11c2b8e0343726b7d237202be62f4fa4dd5b5",
            "source": "https://github.com/JoshuaKGoldberg/ts-api-utils/archive/refs/tags/v1.4.0.zip",
            "status": "restricted"
        }
    ]
}