{
    "id": "maven/mavencentral/software.amazon.awssdk/protocol-core/2.24.1",
    "license": "Apache-2.0",
    "authority": "https://gitlab.eclipse.org/eclipsefdn/emo-team/iplab/-/issues/13241",
    "source": "https://repo1.maven.org/maven2/software/amazon/awssdk/protocol-core/2.24.1/protocol-core-2.24.1-sources.jar",
    "status": "approved",
    "scans": [
        {
            "date": "February 14, 2024 at 3:08:18 p.m. GMT",
            "authority": "https://gitlab.eclipse.org/eclipsefdn/emo-team/iplab/-/issues/13241",
            "scancode-version": "31.2.1",
            "licenses-discovered": [
                "Apache-2.0"
            ],
            "copyrights": [
                "Copyright Amazon.com, Inc. or its affiliates"
            ],
            "file-count": 16,
            "sha256": "99bdfe4cd85996ec0fb54b59f934b5f7dd72f2931fbf476177515e41df527cbf",
            "source": "https://repo1.maven.org/maven2/software/amazon/awssdk/protocol-core/2.24.1/protocol-core-2.24.1-sources.jar",
            "status": "approved"
        }
    ]
}