{
    "id": "git/github/cncf/udpa/5459f2c99403",
    "license": "Apache-2.0",
    "authority": "https://gitlab.eclipse.org/eclipsefdn/emo-team/iplab/-/issues/5153",
    "source": "https://github.com/cncf/udpa/archive/5459f2c99403.zip",
    "status": "approved",
    "scans": [
        {
            "date": "November 24, 2022 at 9:04:00 p.m. GMT",
            "authority": "https://gitlab.eclipse.org/eclipsefdn/emo-team/iplab/-/issues/5153",
            "scancode-version": "31.2.1",
            "licenses-discovered": [
                "Apache-2.0"
            ],
            "copyrights": [
            ],
            "file-count": 72,
            "sha256": "78693cc4299f579f05bd1f8a978a8f2709458d33613488b7fe9f03b9f2b60f9f",
            "source": "https://github.com/cncf/udpa/archive/5459f2c99403.zip",
            "status": "approved"
        }
    ]
}