{
    "id": "maven/mavencentral/org.opensaml/opensaml-core/4.3.2",
    "license": "Apache-2.0",
    "authority": "https://gitlab.eclipse.org/eclipsefdn/emo-team/iplab/-/issues/17469",
    "source": "https://build.shibboleth.net/maven/releases/org/opensaml/opensaml-core/4.3.2/opensaml-core-4.3.2-sources.jar",
    "status": "approved",
    "scans": [
        {
            "date": "November 27, 2024 at 3:03:45 a.m. GMT",
            "authority": "https://gitlab.eclipse.org/eclipsefdn/emo-team/iplab/-/issues/17469",
            "scancode-version": "31.2.1",
            "licenses-discovered": [
                "Apache-2.0"
            ],
            "copyrights": [
            ],
            "file-count": 143,
            "sha256": "081fa4839871f95e75ff0f4dd9f0f87eda633395b65c574369d8c0b31f33d4d6",
            "source": "https://build.shibboleth.net/maven/releases/org/opensaml/opensaml-core/4.3.2/opensaml-core-4.3.2-sources.jar",
            "status": "approved"
        }
    ]
}