{
    "id": "maven/mavencentral/org.apache.logging.log4j/log4j-to-slf4j/2.13.3",
    "license": "Apache-2.0",
    "licenses-discovered": [
        "Apache-2.0"
    ],
    "copyrights": [
        "Copyright The Apache Software Foundation"
    ],
    "file-count": 11,
    "scancode-version": "30.1.0",
    "authority": "https://gitlab.eclipse.org/eclipsefdn/emo-team/iplab/-/issues/3041",
    "source": "https://search.maven.org/remotecontent?filepath=org/apache/logging/log4j/log4j-to-slf4j/2.13.3/log4j-to-slf4j-2.13.3-sources.jar",
    "status": "approved"
}