{
    "id": "crate/cratesio/-/clap_derive/4.5.18",
    "license": "Apache-2.0 AND MIT AND Apache-2.0 AND MIT AND (Apache-2.0 AND MIT AND MIT-0)",
    "authority": "https://gitlab.eclipse.org/eclipsefdn/emo-team/iplab/-/issues/17224",
    "source": "https://crates.io/api/v1/crates/clap_derive/4.5.18/download",
    "status": "approved",
    "scans": [
        {
            "date": "November 14, 2024, 7:53:54 a.m. GMT",
            "authority": "https://gitlab.eclipse.org/eclipsefdn/emo-team/iplab/-/issues/17224",
            "scancode-version": "31.2.1",
            "licenses-discovered": [
                "Apache-2.0 AND MIT",
                "Apache-2.0",
                "MIT",
                "Apache-2.0 AND MIT AND MIT-0"
            ],
            "copyrights": [
                "Copyright (c) 2015-2022 Kevin B. Knapp and Clap Contributors",
                "Copyright 2018 Guillaume Pinot"
            ],
            "file-count": 22,
            "sha256": "4ac6a0c7b1a9e9a5186361f67dfa1b88213572f427fb9ab038efb2bd8c582dab",
            "source": "https://crates.io/api/v1/crates/clap_derive/4.5.18/download",
            "status": "approved"
        }
    ]
}