{
    "id": "maven/mavencentral/org.wildfly.security/wildfly-elytron-http-digest/2.2.1.Final",
    "license": "Apache-2.0",
    "authority": "https://gitlab.eclipse.org/eclipsefdn/emo-team/iplab/-/issues/9418",
    "source": "https://repo.maven.apache.org/maven2/org/wildfly/security/wildfly-elytron-http-digest/2.2.1.Final/wildfly-elytron-http-digest-2.2.1.Final-sources.jar",
    "status": "approved",
    "scans": [
        {
            "date": "July 14, 2023 at 1:58:37 p.m. GMT",
            "authority": "https://gitlab.eclipse.org/eclipsefdn/emo-team/iplab/-/issues/9418",
            "scancode-version": "31.2.1",
            "licenses-discovered": [
                "Apache-2.0"
            ],
            "copyrights": [
                "Copyright 2015 Red Hat, Inc., and individual contributors",
                "Copyright 2016 Red Hat, Inc., and individual contributors",
                "Copyright 2018 Red Hat, Inc., and individual contributors"
            ],
            "file-count": 8,
            "sha256": "a8851b1a91111007dd7507202c95e8e961bc399e32102ba88e4ab404ce756361",
            "source": "https://repo.maven.apache.org/maven2/org/wildfly/security/wildfly-elytron-http-digest/2.2.1.Final/wildfly-elytron-http-digest-2.2.1.Final-sources.jar",
            "status": "approved"
        }
    ]
}