{
    "id": "maven/mavencentral/org.springframework/spring-webflux/6.0.4",
    "license": "Apache-2.0",
    "authority": "https://gitlab.eclipse.org/eclipsefdn/emo-team/iplab/-/issues/6964",
    "source": "https://search.maven.org/remotecontent?filepath=org/springframework/spring-webflux/6.0.4/spring-webflux-6.0.4-sources.jar",
    "status": "approved",
    "scans": [
        {
            "date": "February 3, 2023 at 7:48:43 p.m. GMT",
            "authority": "https://gitlab.eclipse.org/eclipsefdn/emo-team/iplab/-/issues/6964",
            "scancode-version": "31.2.1",
            "licenses-discovered": [
                "Apache-2.0"
            ],
            "copyrights": [
                "Copyright 2002-2016 the original author or authors",
                "Copyright 2002-2017 the original author or authors",
                "Copyright 2002-2018 the original author or authors",
                "Copyright 2002-2019 the original author or authors",
                "Copyright 2002-2020 the original author or authors",
                "Copyright 2002-2021 the original author or authors",
                "Copyright 2002-2022 the original author or authors"
            ],
            "file-count": 268,
            "sha256": "c65065ab9b7f42aa800a7bb16605e0279f24a42aacc863fba38fc83bf294d50c",
            "source": "https://search.maven.org/remotecontent?filepath=org/springframework/spring-webflux/6.0.4/spring-webflux-6.0.4-sources.jar",
            "status": "approved"
        }
    ]
}