{
    "license": "LGPL-3.0-only and MIT",
    "file-count": 139,
    "authority": "https://gitlab.eclipse.org/eclipsefdn/emo-team/iplab/-/issues/1718",
    "scancode-version": "30.1.0",
    "licenses-discovered": [
        "LGPL-2.1-or-later",
        "LGPL-2.0-or-later",
        "LGPL-3.0-only",
        "MIT",
        "GPL-2.0-only",
        "CC-BY-3.0"
    ],
    "id": "pypi/pypi/-/SNAKES/0.9.29",
    "source": "https://github.com/fpom/snakes/archive/e99fe3d964c2e17da18ddee9b852d36fdb536da1.zip",
    "status": "restricted",
    "board_exception": [
        {
            "rule": "project_all_future",
            "project": "technology.comma"
        }
    ]

}
