{
    "license": "Apache-2.0",
    "file-count": 872,
    "authority": "https://gitlab.eclipse.org/eclipsefdn/emo-team/iplab/-/issues/1179",
    "scancode-version": "30.1.0",
    "licenses-discovered": [
        "Apache-2.0",
        "BSD-2-Clause",
        "BSD-3-Clause",
        "EPL-1.0",
        "GPL-2.0-only",
        "GPL-3.0-only",
        "LGPL-2.1-only",
        "BSD-2-Clause-Views",
        "CDDL-1.0",
        "CPL-1.0",
        "EPL-2.0",
        "LicenseRef-scancode-free-unknown",
        "GPL-2.0-or-later",
        "LGPL-2.1-or-later",
        "MIT",
        "MPL-2.0",
        "LicenseRef-scancode-josl-1.0"
    ],
    "id": "p2/orbit/p2.eclipse-plugin/biz.aQute.bndlib/5.3.0",
    "source": "https://search.maven.org/remotecontent?filepath=biz/aQute/bnd/biz.aQute.bndlib/5.3.0/biz.aQute.bndlib-5.3.0-sources.jar",
    "status": "approved"
}
