{
    "id": "maven/mavencentral/org.apache.commons/commons-compress/1.25.0",
    "license": "Apache-2.0",
    "authority": "https://gitlab.eclipse.org/eclipsefdn/emo-team/iplab/-/issues/11600",
    "source": "https://repo1.maven.org/maven2/org/apache/commons/commons-compress/1.25.0/commons-compress-1.25.0-sources.jar",
    "status": "approved",
    "scans": [
        {
            "date": "November 16, 2023 at 7:05:25 a.m. GMT",
            "authority": "https://gitlab.eclipse.org/eclipsefdn/emo-team/iplab/-/issues/11600",
            "scancode-version": "31.2.1",
            "licenses-discovered": [
                "Apache-2.0",
                "Apache-2.0 AND BSD-3-Clause",
                "Apache-2.0 AND LicenseRef-scancode-proprietary-license"
            ],
            "copyrights": [
                "Copyright (c) 2004-2006 Intel Corporation"
            ],
            "file-count": 403,
            "sha256": "89f0a2631b900a856e5b4a2d4a516b3585b4e66e492b792f566d0651f2487204",
            "source": "https://repo1.maven.org/maven2/org/apache/commons/commons-compress/1.25.0/commons-compress-1.25.0-sources.jar",
            "status": "restricted"
        }
    ]
}
