{
    "id": "crate/cratesio/-/ignore-files/2.1.0",
    "license": "Apache-2.0",
    "authority": "https://gitlab.eclipse.org/eclipsefdn/emo-team/iplab/-/issues/17807",
    "source": "https://crates.io/api/v1/crates/ignore-files/2.1.0/download",
    "status": "approved",
    "scans": [
        {
            "date": "December 10, 2024 at 10:02:14 p.m. GMT",
            "authority": "https://gitlab.eclipse.org/eclipsefdn/emo-team/iplab/-/issues/17807",
            "scancode-version": "31.2.1",
            "licenses-discovered": [
                "Apache-2.0"
            ],
            "copyrights": [
            ],
            "file-count": 15,
            "sha256": "31f10b19535b2719cf9c105bf2037c83070755a01f83b8f45f032aba983a533b",
            "source": "https://crates.io/api/v1/crates/ignore-files/2.1.0/download",
            "status": "approved"
        }
    ]
}