{
    "id": "maven/mavencentral/com.azure/azure-core-http-netty/1.13.2",
    "license": "MIT AND Apache-2.0",
    "authority": "https://gitlab.eclipse.org/eclipsefdn/emo-team/iplab/-/issues/7948",
    "source": "https://search.maven.org/remotecontent?filepath=com/azure/azure-core-http-netty/1.13.2/azure-core-http-netty-1.13.2-sources.jar",
    "status": "approved",
    "scans": [
        {
            "date": "April 25, 2023 at 2:20:46 p.m. GMT",
            "authority": "https://gitlab.eclipse.org/eclipsefdn/emo-team/iplab/-/issues/7948",
            "scancode-version": "31.2.1",
            "licenses-discovered": [
                "MIT",
                "Apache-2.0"
            ],
            "copyrights": [
                "(c) 2008 VeriSign, Inc.",
                "Copyright (c) Microsoft Corporation",
                "Copyright 2014 The Netty Project",
                "Portions Copyright (c) Microsoft Corporation"
            ],
            "file-count": 28,
            "sha256": "4d1f613d4ee523d631ca6e6cda37e21990d03e1c7bd0bb50aad80b81cc87062a",
            "source": "https://search.maven.org/remotecontent?filepath=com/azure/azure-core-http-netty/1.13.2/azure-core-http-netty-1.13.2-sources.jar",
            "status": "approved"
        }
    ]
}