{
    "id": "maven/mavencentral/org.jetbrains/annotations/25.0.0",
    "license": "Apache-2.0",
    "authority": "https://gitlab.eclipse.org/eclipsefdn/emo-team/iplab/-/issues/16624",
    "source": "https://repo1.maven.org/maven2/org/jetbrains/annotations/25.0.0/annotations-25.0.0-sources.jar",
    "status": "approved",
    "scans": [
        {
            "date": "October 11, 2024, 5:52:34 a.m. GMT",
            "authority": "https://gitlab.eclipse.org/eclipsefdn/emo-team/iplab/-/issues/16624",
            "scancode-version": "31.2.1",
            "licenses-discovered": [
                "Apache-2.0"
            ],
            "copyrights": [
                "Copyright 2000-2021 JetBrains s.r.o."
            ],
            "file-count": 53,
            "sha256": "92185b610128c59d99adbd6c27e5efd893422582b2f887cdd0415d25b1246d1d",
            "source": "https://repo1.maven.org/maven2/org/jetbrains/annotations/25.0.0/annotations-25.0.0-sources.jar",
            "status": "approved"
        }
    ]
}