{
    "id": "crate/cratesio/-/zenoh-link-ws/1.0.0",
    "license": "Apache-2.0 AND EPL-2.0 AND (EPL-2.0 OR Apache-2.0)",
    "authority": "https://gitlab.eclipse.org/eclipsefdn/emo-team/iplab/-/issues/16978",
    "source": "https://crates.io/api/v1/crates/zenoh-link-ws/1.0.0/download",
    "status": "approved",
    "scans": [
        {
            "date": "October 31, 2024, 4:24:52 p.m. GMT",
            "authority": "https://gitlab.eclipse.org/eclipsefdn/emo-team/iplab/-/issues/16978",
            "scancode-version": "31.2.1",
            "licenses-discovered": [
                "Apache-2.0 AND EPL-2.0",
                "EPL-2.0 OR Apache-2.0"
            ],
            "copyrights": [
                "Copyright (c) 2023 ZettaScale Technology"
            ],
            "file-count": 6,
            "sha256": "7bef08ccbe6c84772770c6f0ff88ef6820b33142e2638dbadd7e1be0a2f98bcf",
            "source": "https://crates.io/api/v1/crates/zenoh-link-ws/1.0.0/download",
            "status": "approved"
        }
    ]
}