{
    "id": "project/ecd.opensmartclide/eclipse-opensmartclide/smartclide-Backend-REST-Client/09326dbea147af9ab7fefabaec9fc0bd1cf66b6c",
    "license": "EPL-2.0",
    "authority": "https://gitlab.eclipse.org/eclipsefdn/emo-team/iplab/-/issues/6358",
    "source": "https://github.com/eclipse-opensmartclide/smartclide-Backend-REST-Client/archive/09326dbea147af9ab7fefabaec9fc0bd1cf66b6c.zip",
    "status": "approved",
    "scans": [
        {
            "date": "January 13, 2023 at 8:16:56 p.m. GMT",
            "authority": "https://gitlab.eclipse.org/eclipsefdn/emo-team/iplab/-/issues/6358",
            "scancode-version": "31.2.1",
            "licenses-discovered": [
                "EPL-2.0"
            ],
            "copyrights": [
            ],
            "file-count": 2,
            "sha256": "9675b39b248457b51a14b6f2481da7ae982d7bff02763008bafaa94926a9b731",
            "source": "https://github.com/eclipse-opensmartclide/smartclide-Backend-REST-Client/archive/09326dbea147af9ab7fefabaec9fc0bd1cf66b6c.zip",
            "status": "restricted"
        }
    ]
}
