{
    "id": "crate/cratesio/-/windows_aarch64_gnullvm/0.52.3",
    "license": "Apache-2.0 AND MIT AND Apache-2.0 AND MIT",
    "authority": "https://gitlab.eclipse.org/eclipsefdn/emo-team/iplab/-/issues/13487",
    "source": "https://crates.io/api/v1/crates/windows_aarch64_gnullvm/0.52.3/download",
    "status": "approved",
    "scans": [
        {
            "date": "February 29, 2024 at 7:55:30 a.m. GMT",
            "authority": "https://gitlab.eclipse.org/eclipsefdn/emo-team/iplab/-/issues/13487",
            "scancode-version": "31.2.1",
            "licenses-discovered": [
                "Apache-2.0 AND MIT",
                "Apache-2.0",
                "MIT"
            ],
            "copyrights": [
                "Copyright (c) Microsoft Corporation"
            ],
            "file-count": 21543,
            "sha256": "68e5dcfb9413f53afd9c8f86e56a7b4d86d9a2fa26090ea2dc9e40fba56c6ec6",
            "source": "https://crates.io/api/v1/crates/windows_aarch64_gnullvm/0.52.3/download",
            "status": "approved"
        }
    ]
}