{
    "id": "git/github/microsoft/vscode-node-debug/v1.44.19",
    "license": "MIT AND (BSD-3-Clause AND MIT)",
    "licenses-discovered": [
        "MIT",
        "BSD-3-Clause AND MIT"
    ],
    "copyrights": [
        "Copyright (c) 2009-2011, Mozilla Foundation and contributors",
        "Copyright (c) 2011-2015, The Dojo Foundation",
        "Copyright (c) Microsoft Corporation"
    ],
    "file-count": 80,
    "scancode-version": "31.2.1",
    "authority": "https://gitlab.eclipse.org/eclipsefdn/emo-team/iplab/-/issues/4124",
    "source": "https://github.com/microsoft/vscode-node-debug/archive/refs/tags/v1.44.19.zip",
    "status": "approved"
}