{
    "id": "npm/npmjs/@vscode/debugprotocol/1.58.0",
    "license": "MIT",
    "licenses-discovered": [
        "MIT"
    ],
    "copyrights": [
        "Copyright (c) Microsoft Corporation"
    ],
    "file-count": 5,
    "scancode-version": "31.2.1",
    "authority": "https://gitlab.eclipse.org/eclipsefdn/emo-team/iplab/-/issues/4663",
    "source": "https://registry.npmjs.org/@vscode/debugprotocol/-/debugprotocol-1.58.0.tgz",
    "status": "approved"
}