{
    "id": "maven/mavencentral/org.activiti/activiti-spring-security-policies/8.0.0",
    "license": "Apache-2.0",
    "authority": "https://gitlab.eclipse.org/eclipsefdn/emo-team/iplab/-/issues/12454",
    "source": "https://maven.alfresco.com/nexus/service/local/repositories/activiti-releases/content//org/activiti/activiti-spring-security-policies/8.0.0/activiti-spring-security-policies-8.0.0-sources.jar",
    "status": "approved",
    "scans": [
        {
            "date": "January 2, 2024 at 9:02:29 p.m. GMT",
            "authority": "https://gitlab.eclipse.org/eclipsefdn/emo-team/iplab/-/issues/12454",
            "scancode-version": "31.2.1",
            "licenses-discovered": [
                "Apache-2.0"
            ],
            "copyrights": [
                "Copyright 2010-2020 Alfresco Software, Ltd."
            ],
            "file-count": 16,
            "sha256": "9822d1a8ab1a60d1ad9db43807b83f4bd6cf3547c7ce3fe0d6197c792f7cff1e",
            "source": "https://maven.alfresco.com/nexus/service/local/repositories/activiti-releases/content//org/activiti/activiti-spring-security-policies/8.0.0/activiti-spring-security-policies-8.0.0-sources.jar",
            "status": "approved"
        }
    ]
}