{
    "id": "maven/mavencentral/org.scalameta/junit-interface/0.7.29",
    "license": "Apache-2.0",
    "authority": "https://gitlab.eclipse.org/eclipsefdn/emo-team/iplab/-/issues/8864",
    "source": "https://repo.maven.apache.org/maven2/org/scalameta/junit-interface/0.7.29/junit-interface-0.7.29-sources.jar",
    "status": "approved",
    "scans": [
        {
            "date": "June 14, 2023 at 7:17:16 p.m. GMT",
            "authority": "https://gitlab.eclipse.org/eclipsefdn/emo-team/iplab/-/issues/8864",
            "scancode-version": "31.2.1",
            "licenses-discovered": [
            ],
            "copyrights": [
            ],
            "file-count": 29,
            "sha256": "8a500de3d742879ef44e766554e682ae492f73d5d5ef4726117e068ce4f67b90",
            "source": "https://repo.maven.apache.org/maven2/org/scalameta/junit-interface/0.7.29/junit-interface-0.7.29-sources.jar",
            "status": "restricted"
        }
    ]
}
