{
    "id": "go/golang/github.com%2Fgo-playground/universal-translator/v0.18.1",
    "license": "MIT",
    "authority": "https://gitlab.eclipse.org/eclipsefdn/emo-team/iplab/-/issues/11996",
    "source": "https://proxy.golang.org/github.com%2Fgo-playground/universal-translator/@v/v0.18.1.zip",
    "status": "approved",
    "scans": [
        {
            "date": "December 14, 2023 at 6:44:31 p.m. GMT",
            "authority": "https://gitlab.eclipse.org/eclipsefdn/emo-team/iplab/-/issues/11996",
            "scancode-version": "31.2.1",
            "licenses-discovered": [
                "MIT"
            ],
            "copyrights": [
                "Copyright (c) 2016 Go Playground"
            ],
            "file-count": 35,
            "sha256": "77fc966f2d045c208ddeaa8343924f83688841b6f4c2ae005dc9ea5550c7d171",
            "source": "https://proxy.golang.org/github.com%2Fgo-playground/universal-translator/@v/v0.18.1.zip",
            "status": "approved"
        }
    ]
}