{
    "license": "MIT AND MIT-0",
    "file-count": 11,
    "authority": "https://gitlab.eclipse.org/eclipsefdn/emo-team/iplab/-/issues/1108",
    "scancode-version": "21.3.31",
    "licenses-discovered": [
        "MIT-0",
        "MIT"
    ],
    "id": "npm/npmjs/-/nodemailer-fetch/1.3.0",
    "source": "https://github.com/nodemailer/nodemailer-fetch/archive/v1.3.0.zip",
    "status": "approved"
}