{
    "id": "maven/mavencentral/org.webjars.bowergithub.vaadin/vaadin-custom-field/1.3.1",
    "license": "Apache-2.0",
    "authority": "https://gitlab.eclipse.org/eclipsefdn/emo-team/iplab/-/issues/11220",
    "source": "https://repo.maven.apache.org/maven2/org/webjars/bowergithub/vaadin/vaadin-custom-field/1.3.1/vaadin-custom-field-1.3.1-sources.jar",
    "status": "approved",
    "scans": [
        {
            "date": "October 25, 2023 at 9:23:27 p.m. GMT",
            "authority": "https://gitlab.eclipse.org/eclipsefdn/emo-team/iplab/-/issues/11220",
            "scancode-version": "31.2.1",
            "licenses-discovered": [
            ],
            "copyrights": [
            ],
            "file-count": 0,
            "sha256": "8739c76e681f900923b900c9df0ef75cf421d39cabb54650c4b9ad19b6a76d85",
            "source": "https://repo.maven.apache.org/maven2/org/webjars/bowergithub/vaadin/vaadin-custom-field/1.3.1/vaadin-custom-field-1.3.1-sources.jar",
            "status": "restricted"
        }
    ]
}
