{
    "id": "maven/mavencentral/org.apache.lucene/lucene-core/9.9.1",
    "license": "Apache-2.0 AND LicenseRef-Permission-Notice AND LicenseRef-Python AND BSD-3-Clause AND MIT AND ICU AND (GPL-2.0-only OR LGPL-2.1-only OR MPL-1.1 OR CC-BY-4.0 OR Apache-2.0) AND BSD-2-Clause AND (Apache-2.0 AND ICU AND LicenseRef-Permission-Notice",
    "authority": "https://gitlab.eclipse.org/eclipsefdn/emo-team/iplab/-/issues/12104",
    "source": "https://repo1.maven.org/maven2/org/apache/lucene/lucene-core/9.9.1/lucene-core-9.9.1-sources.jar",
    "status": "approved",
    "scans": [
        {
            "date": "December 17, 2023 at 9:38:47 a.m. GMT",
            "authority": "https://gitlab.eclipse.org/eclipsefdn/emo-team/iplab/-/issues/12104",
            "scancode-version": "31.2.1",
            "licenses-discovered": [
                "Apache-2.0",
                "Apache-2.0 AND BSD-3-Clause AND NCSA",
                "Apache-2.0 AND ISC",
                "Apache-2.0 AND LicenseRef-scancode-sunpro",
                "Apache-2.0 AND ICU AND LicenseRef-scancode-unicode-mappings",
                "BSD-3-Clause",
                "Apache-2.0 AND MIT",
                "BSD-2-Clause"
            ],
            "copyrights": [
                "Copyright (c) 1970-2003, Wm. Randolph Franklin",
                "Copyright (c) 1993 by Sun Microsystems, Inc.",
                "Copyright (c) 1999-2010, International Business Machines Corporation and others",
                "Copyright (c) 2001-2009 Anders Moeller",
                "Copyright (c) 2011-2016, Yann Collet",
                "Copyright (c) 2016, Mapbox",
                "Copyright 2001-2004 Unicode, Inc."
            ],
            "file-count": 1076,
            "sha256": "fbd312aec46230e0fc0ff31e0ab562dabad07080087b8465ede0f7e6f13c24bc",
            "source": "https://repo1.maven.org/maven2/org/apache/lucene/lucene-core/9.9.1/lucene-core-9.9.1-sources.jar",
            "status": "restricted"
        }
    ]
}
