{
    "id": "go/golang/golang.org%2Fx/xerrors/v0.0.0-20200804184101-5ec99f83aff1",
    "license": "BSD-3-Clause",
    "licenses-discovered": [
        "BSD-3-Clause",
        "LicenseRef-scancode-google-patent-license-golang"
    ],
    "copyrights": [
        "Copyright The Go Authors"
    ],
    "file-count": 22,
    "scancode-version": "30.1.0",
    "authority": "https://gitlab.eclipse.org/eclipsefdn/emo-team/iplab/-/issues/3443",
    "source": "https://github.com/golang/xerrors/archive/5ec99f83aff198f5fbd629d6c8d8eb38a04218ca.zip",
    "status": "approved"
}
