{
    "id": "nuget/nuget/-/ReportPortal.XUnit/2.5.0",
    "license": "Apache-2.0",
    "authority": "https://gitlab.eclipse.org/eclipsefdn/emo-team/iplab/-/issues/10588",
    "source": "https://github.com/reportportal/agent-net-xunit/archive/refs/tags/2.5.0.zip",
    "status": "approved",
    "scans": [
        {
            "date": "September 19, 2023 at 9:40:24 a.m. GMT",
            "authority": "https://gitlab.eclipse.org/eclipsefdn/emo-team/iplab/-/issues/10588",
            "scancode-version": "31.2.1",
            "licenses-discovered": [
                "Apache-2.0"
            ],
            "copyrights": [
            ],
            "file-count": 26,
            "sha256": "fe1ab10d67e7005108844a6f7d44bb9f974901873ce3c7d33f92241b9de3ec9e",
            "source": "https://github.com/reportportal/agent-net-xunit/archive/refs/tags/2.5.0.zip",
            "status": "approved"
        }
    ]
}