{
    "id": "npm/npmjs/-/jest-diff/27.5.1",
    "license": "0BSD AND Apache-2.0 AND BSD-2-Clause AND MIT",
    "licenses-discovered": [
        "MIT",
        "0BSD",
        "BSD-2-Clause",
        "Apache-2.0"
    ],
    "file-count": 2683,
    "scancode-version": "30.1.0",
    "authority": "https://gitlab.eclipse.org/eclipsefdn/emo-team/iplab/-/issues/1951",
    "source": "https://github.com/facebook/jest/archive/v27.5.1.zip",
    "status": "approved"
}