{
    "id": "maven/mavencentral/org.apache.camel/camel-timer/3.22.2",
    "license": "Apache-2.0",
    "authority": "https://gitlab.eclipse.org/eclipsefdn/emo-team/iplab/-/issues/14954",
    "source": "https://repo1.maven.org/maven2/org/apache/camel/camel-timer/3.22.2/camel-timer-3.22.2-sources.jar",
    "status": "approved",
    "scans": [
        {
            "date": "May 29, 2024 at 10:35:25 a.m. GMT",
            "authority": "https://gitlab.eclipse.org/eclipsefdn/emo-team/iplab/-/issues/14954",
            "scancode-version": "31.2.1",
            "licenses-discovered": [
                "Apache-2.0"
            ],
            "copyrights": [
            ],
            "file-count": 17,
            "sha256": "f62f35b23a32121e7b24828664d1f5d8a0042a0729fa08d324b22dbbc0329643",
            "source": "https://repo1.maven.org/maven2/org/apache/camel/camel-timer/3.22.2/camel-timer-3.22.2-sources.jar",
            "status": "approved"
        }
    ]
}