{
    "id": "git/github/faker-js/faker/96195673448e9b56ea330a1d02ff63374a11ca8b",
    "license": "MIT AND BSD-3-Clause AND Beerware",
    "authority": "https://gitlab.eclipse.org/eclipsefdn/emo-team/iplab/-/issues/11620",
    "source": "https://github.com/faker-js/faker/archive/96195673448e9b56ea330a1d02ff63374a11ca8b.zip",
    "status": "approved",
    "scans": [
        {
            "date": "November 20, 2023 at 3:35:47 p.m. GMT",
            "authority": "https://gitlab.eclipse.org/eclipsefdn/emo-team/iplab/-/issues/11620",
            "scancode-version": "31.2.1",
            "licenses-discovered": [
                "MIT",
                "BSD-3-Clause",
                "Beerware AND MIT"
            ],
            "copyrights": [
                "Copyright (c) 1997 - 2002, Makoto Matsumoto and Takuji Nishimura",
                "Copyright (c) 2006 Y. Okada",
                "Copyright (c) 2007-2010 Benjamin Curtis http://search.cpan.org/~jasonk/Data-Faker-0.07",
                "Copyright (c) 2011-2013 Bermi Ferrer <bermi@bermilabs.com>",
                "Copyright (c) 2012-2014 Jeffrey Mealo",
                "Copyright (c) 2020 Marak Squires http://github.com/marak/faker.js",
                "Copyright (c) 2022-2023",
                "Copyright (c) 2022-2023 Faker",
                "Copyright (c) 2022-present Faker",
                "Copyright 2004-2005 by Jason Kohles",
                "copyright Marak Squires",
                "copyrighted (https://en.wikipedia.org/wiki/Copyright_in_compilation)"
            ],
            "file-count": 2974,
            "sha256": "14e0952fc57bdce34a820342be8b52ea7bd3da77a28103b21f3af7e38080a8fb",
            "source": "https://github.com/faker-js/faker/archive/96195673448e9b56ea330a1d02ff63374a11ca8b.zip",
            "status": "restricted"
        }
    ]
}
