{
    "id": "maven/mavencentral/com.github.java-json-tools/msg-simple/1.2",
    "license": "Apache-2.0 OR LGPL-3.0-or-later",
    "licenses-discovered": [
        "Apache-2.0 AND LGPL-2.1-or-later AND LGPL-3.0-only",
        "Apache-2.0 AND GPL-1.0-or-later AND LGPL-3.0-only",
        "Apache-2.0",
        "LGPL-3.0-only"
    ],
    "file-count": 24,
    "scancode-version": "30.1.0",
    "authority": "https://gitlab.eclipse.org/eclipsefdn/emo-team/iplab/-/issues/15239",
    "source": "https://repo1.maven.org/maven2/com/github/java-json-tools/msg-simple/1.2/msg-simple-1.2-sources.jar",
    "status": "approved",
    "scans": [
        {
            "date": "June 14, 2024 at 11:12:03 a.m. GMT",
            "authority": "https://gitlab.eclipse.org/eclipsefdn/emo-team/iplab/-/issues/15239",
            "scancode-version": "31.2.1",
            "licenses-discovered": [
                "Apache-2.0 AND LGPL-2.1-or-later AND LGPL-3.0-only",
                "Apache-2.0 AND GPL-1.0-or-later AND LGPL-3.0-only",
                "Apache-2.0",
                "LGPL-3.0-only"
            ],
            "copyrights": [
                "Copyright (c) 2007 Free Software Foundation, Inc. <http://fsf.org/>",
                "Copyright (c) 2014, Francis Galiegue (fgaliegue@gmail.com)"
            ],
            "file-count": 24,
            "sha256": "eeb0ecd504611cec75f261a6d282bb8b80214e473ef235481c8067b6b121f1cd",
            "source": "https://repo1.maven.org/maven2/com/github/java-json-tools/msg-simple/1.2/msg-simple-1.2-sources.jar",
            "status": "restricted"
        }
    ]
}