{
    "id": "npm/npmjs/-/node-pty/1.1.0-beta27",
    "license": "MIT AND (ISC AND MIT)",
    "authority": "https://gitlab.eclipse.org/eclipsefdn/emo-team/iplab/-/issues/18016",
    "source": "https://registry.npmjs.org/node-pty/-/node-pty-1.1.0-beta27.tgz",
    "status": "approved",
    "scans": [
        {
            "date": "December 31, 2024 at 10:24:47 a.m. GMT",
            "authority": "https://gitlab.eclipse.org/eclipsefdn/emo-team/iplab/-/issues/18016",
            "scancode-version": "31.2.1",
            "licenses-discovered": [
                "MIT",
                "ISC AND MIT"
            ],
            "copyrights": [
                "Copyright (c) 2009 Joshua Elsasser <josh@elsasser.org>",
                "Copyright (c) 2009 Microsoft Corporation",
                "Copyright (c) 2009 Nicholas Marriott <nicm@users.sourceforge.net>",
                "Copyright (c) 2009 Todd Carson <toc@daybefore.net>",
                "Copyright (c) 2011-2012 Ryan Prichard",
                "Copyright (c) 2011-2015 Ryan Prichard",
                "Copyright (c) 2011-2016 Ryan Prichard",
                "Copyright (c) 2012-2015, Christopher Jeffrey",
                "Copyright (c) 2012-2015, Christopher Jeffrey (https://github.com/chjj/)",
                "Copyright (c) 2012-2015, Christopher Jeffrey, Peter Sunde",
                "Copyright (c) 2013-2015, Christopher Jeffrey, Peter Sunde",
                "Copyright (c) 2015 Ryan Prichard",
                "Copyright (c) 2016 Ryan Prichard",
                "Copyright (c) 2016, Daniel Imms",
                "Copyright (c) 2016, Daniel Imms (http://www.growingwiththeweb.com)",
                "Copyright (c) 2017, Daniel Imms",
                "Copyright (c) 2018 - present Microsoft Corporation",
                "Copyright (c) 2018, Microsoft Corporation",
                "Copyright (c) 2019, Microsoft Corporation",
                "Copyright (c) 2020, Microsoft Corporation",
                "Copyright (c) Microsoft Corporation"
            ],
            "file-count": 255,
            "sha256": "3f135d8e4046421b5207b68f8bb2f426ec3274857c1f9aea7e87af92b5717259",
            "source": "https://registry.npmjs.org/node-pty/-/node-pty-1.1.0-beta27.tgz",
            "status": "approved"
        }
    ]
}