{
    "id": "maven/mavencentral/org.springframework.boot/spring-boot-starter-actuator/2.5.12",
    "license": "Apache-2.0",
    "licenses-discovered": [
        "Apache-2.0"
    ],
    "file-count": 2,
    "scancode-version": "30.1.0",
    "authority": "https://gitlab.eclipse.org/eclipsefdn/emo-team/iplab/-/issues/2170",
    "source": "https://search.maven.org/remotecontent?filepath=org/springframework/boot/spring-boot-starter-actuator/2.5.12/spring-boot-starter-actuator-2.5.12-sources.jar",
    "status": "approved"
}