{
    "id": "git/github/golang/mock/v1.4.0",
    "license": "Apache-2.0",
    "authority": "https://gitlab.eclipse.org/eclipsefdn/emo-team/iplab/-/issues/5566",
    "source": "https://github.com/golang/mock/archive/refs/tags/v1.4.0.zip",
    "status": "approved",
    "scans": [
        {
            "date": "December 9, 2022 at 10:59:21 a.m. GMT",
            "authority": "https://gitlab.eclipse.org/eclipsefdn/emo-team/iplab/-/issues/5566",
            "scancode-version": "31.2.1",
            "licenses-discovered": [
                "Apache-2.0"
            ],
            "copyrights": [
                "Copyright 2010 Google Inc.",
                "Copyright 2011 Google Inc.",
                "Copyright 2012 Google Inc.",
                "Copyright 2019 Google LLC",
                "Copyright 2020 Google Inc."
            ],
            "file-count": 97,
            "sha256": "550e376cae9ee0e4a8bd47f3eec48187e3d314972c7cff2f4fa2ee665a28baab",
            "source": "https://github.com/golang/mock/archive/refs/tags/v1.4.0.zip",
            "status": "approved"
        }
    ]
}