{
    "license": "Apache-2.0",
    "file-count": 19,
    "authority": "https://gitlab.eclipse.org/eclipsefdn/emo-team/iplab/-/issues/1221",
    "scancode-version": "21.3.31",
    "licenses-discovered": [
        "Apache-2.0"
    ],
    "id": "maven/mavencentral/org.apache.aries.rsa/org.apache.aries.rsa.core/1.16.1",
    "source": "https://search.maven.org/remotecontent?filepath=org/apache/aries/rsa/org.apache.aries.rsa.core/1.16.1/org.apache.aries.rsa.core-1.16.1-sources.jar",
    "status": "approved"
}