{
    "id": "npm/npmjs/-/nopt/7.2.0",
    "license": "ISC",
    "authority": "https://gitlab.eclipse.org/eclipsefdn/emo-team/iplab/-/issues/9086",
    "source": "https://registry.yarnpkg.com/nopt/-/nopt-7.2.0.tgz",
    "status": "approved",
    "scans": [
        {
            "date": "June 15, 2023 at 6:33:31 p.m. GMT",
            "authority": "https://gitlab.eclipse.org/eclipsefdn/emo-team/iplab/-/issues/9086",
            "scancode-version": "31.2.1",
            "licenses-discovered": [
                "ISC"
            ],
            "copyrights": [
                "Copyright (c) Isaac Z. Schlueter and Contributors"
            ],
            "file-count": 8,
            "sha256": "bb53479b5329f2a66322c48f910ed6532c71bfe6f081b2b48fd2d62bfbe883a8",
            "source": "https://registry.yarnpkg.com/nopt/-/nopt-7.2.0.tgz",
            "status": "approved"
        }
    ]
}