{
    "id": "maven/mavencentral/org.activiti/activiti-api-task-runtime-impl/8.6.0",
    "license": "Apache-2.0",
    "authority": "https://gitlab.eclipse.org/eclipsefdn/emo-team/iplab/-/issues/15898",
    "source": "https://maven.alfresco.com/nexus/service/local/repositories/activiti-releases/content//org/activiti/activiti-api-task-runtime-impl/8.6.0/activiti-api-task-runtime-impl-8.6.0-sources.jar",
    "status": "approved",
    "scans": [
        {
            "date": "August 14, 2024 at 4:30:48 p.m. GMT",
            "authority": "https://gitlab.eclipse.org/eclipsefdn/emo-team/iplab/-/issues/15898",
            "scancode-version": "31.2.1",
            "licenses-discovered": [
                "Apache-2.0"
            ],
            "copyrights": [
                "Copyright 2010-2020 Alfresco Software, Ltd."
            ],
            "file-count": 47,
            "sha256": "3c93574b7fe2f33d77f003e399c6f40f4fc13c3abd523b30a3d4ace4cb673785",
            "source": "https://maven.alfresco.com/nexus/service/local/repositories/activiti-releases/content//org/activiti/activiti-api-task-runtime-impl/8.6.0/activiti-api-task-runtime-impl-8.6.0-sources.jar",
            "status": "approved"
        }
    ]
}