{
    "id": "p2/orbit/p2.eclipse.plugin/org.commonmark-yaml-front-matter/0.24.0.v20241021-1700",
    "license": "BSD-2-Clause",
    "authority": "https://gitlab.eclipse.org/eclipsefdn/emo-team/iplab/-/issues/16836",
    "source": "https://repo1.maven.org/maven2/org/commonmark/commonmark-ext-yaml-front-matter/0.24.0/commonmark-ext-yaml-front-matter-0.24.0-sources.jar",
    "status": "approved",
    "scans": [
        {
            "date": "October 21, 2024, 3:58:48 p.m. GMT",
            "authority": "https://gitlab.eclipse.org/eclipsefdn/emo-team/iplab/-/issues/16836",
            "scancode-version": "31.2.1",
            "licenses-discovered": [
                "BSD-2-Clause"
            ],
            "copyrights": [
                "Copyright (c) 2015, Atlassian Pty Ltd"
            ],
            "file-count": 10,
            "sha256": "5cee64663842f1e7128af9c3e62ef183ea2cf205436d27a08b7cb5be0b20edb6",
            "source": "https://repo1.maven.org/maven2/org/commonmark/commonmark-ext-yaml-front-matter/0.24.0/commonmark-ext-yaml-front-matter-0.24.0-sources.jar",
            "status": "approved"
        }
    ]
}