{
    "id": "maven/mavencentral/org.bndtools/bndtools.api/7.0.0",
    "license": "Apache-2.0 OR EPL-2.0",
    "authority": "https://gitlab.eclipse.org/eclipsefdn/emo-team/iplab/-/issues/13287",
    "source": "https://repo1.maven.org/maven2/org/bndtools/bndtools.api/7.0.0/bndtools.api-7.0.0-sources.jar",
    "status": "approved",
    "scans": [
        {
            "date": "February 18, 2024 at 6:50:20 a.m. GMT",
            "authority": "https://gitlab.eclipse.org/eclipsefdn/emo-team/iplab/-/issues/13287",
            "scancode-version": "31.2.1",
            "licenses-discovered": [
            ],
            "copyrights": [
            ],
            "file-count": 31,
            "sha256": "70fcfbdd34510a0e0aeff49819443cb219afc889b9c81581f512113f421d4b92",
            "source": "https://repo1.maven.org/maven2/org/bndtools/bndtools.api/7.0.0/bndtools.api-7.0.0-sources.jar",
            "status": "restricted"
        }
    ]
}
