{
    "id": "npm/npmjs/@volar/language-service/2.1.0",
    "license": "MIT",
    "authority": "https://gitlab.eclipse.org/eclipsefdn/emo-team/iplab/-/issues/13512",
    "source": "https://github.com/volarjs/volar.js/archive/refs/tags/v2.1.0.zip",
    "status": "approved",
    "scans": [
        {
            "date": "March 4, 2024 at 11:27:04 a.m. GMT",
            "authority": "https://gitlab.eclipse.org/eclipsefdn/emo-team/iplab/-/issues/13512",
            "scancode-version": "31.2.1",
            "licenses-discovered": [
                "MIT"
            ],
            "copyrights": [
                "Copyright (c) 2021-present Johnson Chu",
                "Copyright (c) 2023-present Johnson Chu"
            ],
            "file-count": 194,
            "sha256": "06b0e897f853f0328b616cb129c65775dc0c7ad0e1c39508360c2dcb434916df",
            "source": "https://github.com/volarjs/volar.js/archive/refs/tags/v2.1.0.zip",
            "status": "approved"
        }
    ]
}