{
    "id": "maven/mavencentral/com.vaadin/vaadin-radio-button-flow/24.2.2",
    "license": "Apache-2.0",
    "authority": "https://gitlab.eclipse.org/eclipsefdn/emo-team/iplab/-/issues/12168",
    "source": "https://repo1.maven.org/maven2/com/vaadin/vaadin-radio-button-flow/24.2.2/vaadin-radio-button-flow-24.2.2-sources.jar",
    "status": "approved",
    "scans": [
        {
            "date": "December 18, 2023 at 9:08:17 a.m. GMT",
            "authority": "https://gitlab.eclipse.org/eclipsefdn/emo-team/iplab/-/issues/12168",
            "scancode-version": "31.2.1",
            "licenses-discovered": [
                "Apache-2.0"
            ],
            "copyrights": [
                "Copyright 2000-2023 Vaadin Ltd."
            ],
            "file-count": 8,
            "sha256": "56f95f9f34a9edd15eaf7add503c1d521d6d59b1456cdc3e5210634e228e4045",
            "source": "https://repo1.maven.org/maven2/com/vaadin/vaadin-radio-button-flow/24.2.2/vaadin-radio-button-flow-24.2.2-sources.jar",
            "status": "approved"
        }
    ]
}