{
    "id": "maven/mavencentral/jline/jline/2.11",
    "license": "BSD-3-Clause",
    "authority": "https://gitlab.eclipse.org/eclipsefdn/emo-team/iplab/-/issues/19707",
    "source": "https://repo1.maven.org/maven2/jline/jline/2.11/jline-2.11-sources.jar",
    "status": "approved",
    "scans": [
        {
            "date": "March 1, 2025 at 12:30:45 a.m. GMT",
            "authority": "https://gitlab.eclipse.org/eclipsefdn/emo-team/iplab/-/issues/19707",
            "scancode-version": "31.2.1",
            "licenses-discovered": [
                "BSD-3-Clause"
            ],
            "copyrights": [
                "Copyright (c) 2002-2012, the original author or authors"
            ],
            "file-count": 46,
            "sha256": "2dd08549513250e737e3833a941e7211ee0cf83e12de80533cbe00594312f9f4",
            "source": "https://repo1.maven.org/maven2/jline/jline/2.11/jline-2.11-sources.jar",
            "status": "approved"
        }
    ]
}