{
    "id": "maven/mavencentral/org.seleniumhq.selenium/selenium-support/4.2.2",
    "license": "Apache-2.0",
    "authority": "https://gitlab.eclipse.org/eclipsefdn/emo-team/iplab/-/issues/6133",
    "source": "https://search.maven.org/remotecontent?filepath=org/seleniumhq/selenium/selenium-support/4.2.2/selenium-support-4.2.2-sources.jar",
    "status": "approved",
    "scans": [
        {
            "date": "January 5, 2023 at 8:03:29 p.m. GMT",
            "authority": "https://gitlab.eclipse.org/eclipsefdn/emo-team/iplab/-/issues/6133",
            "scancode-version": "31.2.1",
            "licenses-discovered": [
                "Apache-2.0"
            ],
            "copyrights": [
            ],
            "file-count": 53,
            "sha256": "2a16fd95032ce4eb417e289d66e8df7e395f152b78e6000c5328629b4ab610be",
            "source": "https://search.maven.org/remotecontent?filepath=org/seleniumhq/selenium/selenium-support/4.2.2/selenium-support-4.2.2-sources.jar",
            "status": "approved"
        }
    ]
}