{
    "id": "maven/mavencentral/com.fasterxml.jackson.module/jackson-module-jaxb-annotations/2.15.0",
    "license": "Apache-2.0",
    "authority": "https://gitlab.eclipse.org/eclipsefdn/emo-team/iplab/-/issues/9100",
    "source": "https://repo.maven.apache.org/maven2/com/fasterxml/jackson/module/jackson-module-jaxb-annotations/2.15.0/jackson-module-jaxb-annotations-2.15.0-sources.jar",
    "status": "approved",
    "scans": [
        {
            "date": "June 20, 2023 at 9:10:51 a.m. GMT",
            "authority": "https://gitlab.eclipse.org/eclipsefdn/emo-team/iplab/-/issues/9100",
            "scancode-version": "31.2.1",
            "licenses-discovered": [
                "Apache-2.0"
            ],
            "copyrights": [
            ],
            "file-count": 15,
            "sha256": "eda6c8601ae0770b0a41e8ac6b40b42858a35d4d6680a3cc5341e657b1958548",
            "source": "https://repo.maven.apache.org/maven2/com/fasterxml/jackson/module/jackson-module-jaxb-annotations/2.15.0/jackson-module-jaxb-annotations-2.15.0-sources.jar",
            "status": "approved"
        }
    ]
}