{
    "id": "nuget/nuget/-/AasCore.Aas3.Package/1.0.0",
    "license": "MIT AND CC BY-ND 3.0 DE",
    "authority": "https://gitlab.eclipse.org/eclipsefdn/emo-team/iplab/-/issues/16004",
    "source": "https://github.com/aas-core-works/aas-package3-csharp/archive/refs/tags/v1.0.0.zip",
    "status": "approved",
    "scans": [
        {
            "date": "August 23, 2024 at 3:14:33 p.m. GMT",
            "authority": "https://gitlab.eclipse.org/eclipsefdn/emo-team/iplab/-/issues/16004",
            "scancode-version": "31.2.1",
            "licenses-discovered": [
                "MIT",
                "CC-BY-3.0 AND LicenseRef-scancode-free-unknown"
            ],
            "copyrights": [
                "Copyright (c) 2021 Marko Ristin <marko@ristin.ch>",
                "Copyright (c) 2021 Marko Ristin, Nico Braunisch https://raw.githubusercontent.com/aas-core-works/aas-package3-csharp/main/LICENSE https://github.com/aas-core-works/aas-package3-csharp",
                "Copyright (c) 2021 Nico Braunisch <nico.braunisch@tu-dresden.de>",
                "Copyright (c) 2021 Robert Lehmann <robert.lehmann@tu-dresden.de>"
            ],
            "file-count": 174,
            "sha256": "c5ea5f5a3748e7f1f10f9df23c43304481e0629faeaf7aa572a9b30f46379899",
            "source": "https://github.com/aas-core-works/aas-package3-csharp/archive/refs/tags/v1.0.0.zip",
            "status": "restricted"
        }
    ]
}