{
    "id": "npm/npmjs/-/eslint-module-utils/2.8.0",
    "license": "MIT",
    "authority": "https://gitlab.eclipse.org/eclipsefdn/emo-team/iplab/-/issues/15235",
    "source": "https://github.com/import-js/eslint-plugin-import/archive/refs/tags/v2.8.0.zip",
    "status": "approved",
    "scans": [
        {
            "date": "May 5, 2023 at 7:58:51 a.m. GMT",
            "authority": "https://gitlab.eclipse.org/eclipsefdn/emo-team/iplab/-/issues/8209",
            "scancode-version": "31.2.1",
            "licenses-discovered": [
                "MIT"
            ],
            "copyrights": [
                "Copyright (c) 2015 Ben Mosher",
                "copyright 2016 Desmond Brand"
            ],
            "file-count": 310,
            "sha256": "6e6e95ff6b3d64a93cdd1c88eb8753a365162eee2385b13cdef63e883bbd5d08",
            "source": "https://github.com/import-js/eslint-plugin-import/archive/v2.8.0.zip",
            "status": "approved"
        },
        {
            "date": "June 14, 2024 at 11:05:25 a.m. GMT",
            "authority": "https://gitlab.eclipse.org/eclipsefdn/emo-team/iplab/-/issues/15235",
            "scancode-version": "31.2.1",
            "licenses-discovered": [
                "MIT"
            ],
            "copyrights": [
                "Copyright (c) 2015 Ben Mosher",
                "copyright 2016 Desmond Brand"
            ],
            "file-count": 310,
            "sha256": "6e6e95ff6b3d64a93cdd1c88eb8753a365162eee2385b13cdef63e883bbd5d08",
            "source": "https://github.com/import-js/eslint-plugin-import/archive/refs/tags/v2.8.0.zip",
            "status": "approved"
        }
    ]
}