{
    "id": "maven/mavencentral/org.hibernate/hibernate-envers/5.3.20.Final",
    "license": "LGPL-2.1-only AND LGPL-2.1-or-later",
    "licenses-discovered": [
        "LGPL-2.1-only",
        "LGPL-2.1-or-later"
    ],
    "file-count": 260,
    "scancode-version": "30.1.0",
    "authority": "https://gitlab.eclipse.org/eclipsefdn/emo-team/iplab/-/issues/2053",
    "source": "https://search.maven.org/remotecontent?filepath=org/hibernate/hibernate-envers/5.3.20.Final/hibernate-envers-5.3.20.Final-sources.jar",
    "status": "restricted",
     "board_exception": [
        {
            "rule": "all"
        }
    ]

}
