{
    "id": "maven/mavencentral/com.vaadin/vaadin-select-flow/24.2.2",
    "license": "Apache-2.0",
    "authority": "https://gitlab.eclipse.org/eclipsefdn/emo-team/iplab/-/issues/12139",
    "source": "https://repo1.maven.org/maven2/com/vaadin/vaadin-select-flow/24.2.2/vaadin-select-flow-24.2.2-sources.jar",
    "status": "approved",
    "scans": [
        {
            "date": "December 18, 2023 at 9:46:05 a.m. GMT",
            "authority": "https://gitlab.eclipse.org/eclipsefdn/emo-team/iplab/-/issues/12139",
            "scancode-version": "31.2.1",
            "licenses-discovered": [
                "Apache-2.0"
            ],
            "copyrights": [
                "Copyright 2000-2023 Vaadin Ltd."
            ],
            "file-count": 9,
            "sha256": "041a43e367b06d42cd0292d6615d460803d0758d0367550a6bb742d07c056d9e",
            "source": "https://repo1.maven.org/maven2/com/vaadin/vaadin-select-flow/24.2.2/vaadin-select-flow-24.2.2-sources.jar",
            "status": "approved"
        }
    ]
}