{
    "id": "maven/mavencentral/com.azure.resourcemanager/azure-resourcemanager-sql/2.39.0",
    "license": "MIT",
    "authority": "https://gitlab.eclipse.org/eclipsefdn/emo-team/iplab/-/issues/15099",
    "source": "https://repo1.maven.org/maven2/com/azure/resourcemanager/azure-resourcemanager-sql/2.39.0/azure-resourcemanager-sql-2.39.0-sources.jar",
    "status": "approved",
    "scans": [
        {
            "date": "June 6, 2024 at 11:48:37 a.m. GMT",
            "authority": "https://gitlab.eclipse.org/eclipsefdn/emo-team/iplab/-/issues/15099",
            "scancode-version": "31.2.1",
            "licenses-discovered": [
                "MIT"
            ],
            "copyrights": [
                "(c) 2008 VeriSign, Inc.",
                "Copyright (c) Microsoft Corporation"
            ],
            "file-count": 958,
            "sha256": "99f79623dd575fbb38c4b20fbccbf9f2a56769d477d8141977b72514e939f94b",
            "source": "https://repo1.maven.org/maven2/com/azure/resourcemanager/azure-resourcemanager-sql/2.39.0/azure-resourcemanager-sql-2.39.0-sources.jar",
            "status": "approved"
        }
    ]
}