{
    "id": "project/automotive.openxilenv/eclipse-openxilenv/openxilenv/291c2e8cab574ff0d2e61431b2d716793e60572f",
    "license": "Apache-2.0",
    "authority": "https://gitlab.eclipse.org/eclipsefdn/emo-team/iplab/-/issues/9986",
    "source": "https://github.com/eclipse-openxilenv/openxilenv/archive/291c2e8cab574ff0d2e61431b2d716793e60572f.zip",
    "status": "approved",
    "scans": [
        {
            "date": "January 9, 2025 at 9:37:20 p.m. GMT",
            "authority": "https://gitlab.eclipse.org/eclipsefdn/emo-team/iplab/-/issues/9986",
            "scancode-version": "31.2.1",
            "licenses-discovered": [
                "Apache-2.0",
                "Apache-2.0 AND LGPL-2.0-or-later AND LGPL-3.0-only",
                "MPL-2.0",
                "MIT",
                "GPL-3.0-only",
                "GPL-3.0-only AND LGPL-3.0-only"
            ],
            "copyrights": [
                "Copyright (c) 2006-2022 Arseny Kapoulkine",
                "Copyright (c) 2007 Free Software Foundation, Inc. <http://fsf.org/>",
                "Copyright (c) 2016 The Qt Company Ltd. Contact http://www.qt.io/licensing",
                "Copyright (c) The Qt Company Ltd. and other contributors",
                "Copyright 1997- s ZF Friedrichshafen AG",
                "Copyright 2023 ZF Friedrichshafen AG"
            ],
            "file-count": 1431,
            "sha256": "3005e94c0e9297c66d59562c22e608b6730c1ade6b2b5a878211eac95f855e39",
            "source": "https://github.com/eclipse-openxilenv/openxilenv/archive/291c2e8cab574ff0d2e61431b2d716793e60572f.zip",
            "status": "restricted"
        }
    ]
}