{
    "id": "maven/mavencentral/io.opentelemetry/opentelemetry-context/1.44.1",
    "license": "Apache-2.0",
    "authority": "https://gitlab.eclipse.org/eclipsefdn/emo-team/iplab/-/issues/19360",
    "source": "https://repo1.maven.org/maven2/io/opentelemetry/opentelemetry-context/1.44.1/opentelemetry-context-1.44.1-sources.jar",
    "status": "approved",
    "scans": [
        {
            "date": "February 6, 2025 at 12:39:46 p.m. GMT",
            "authority": "https://gitlab.eclipse.org/eclipsefdn/emo-team/iplab/-/issues/19360",
            "scancode-version": "31.2.1",
            "licenses-discovered": [
                "Apache-2.0"
            ],
            "copyrights": [
                "Copyright 2013-2020 The OpenZipkin Authors",
                "Copyright 2015 The gRPC",
                "Copyright 2020 LINE Corporation",
                "Copyright Rafael Winterhalter"
            ],
            "file-count": 30,
            "sha256": "50f136587f0d1bf317fbfdd9cf5f589a321d7fd366e3cbea1dc511e458115324",
            "source": "https://repo1.maven.org/maven2/io/opentelemetry/opentelemetry-context/1.44.1/opentelemetry-context-1.44.1-sources.jar",
            "status": "approved"
        }
    ]
}