{
    "id": "maven/mavencentral/commons-io/commons-io/2.14.0",
    "license": "Apache-2.0",
    "authority": "https://gitlab.eclipse.org/eclipsefdn/emo-team/iplab/-/issues/10768",
    "source": "https://repo.maven.apache.org/maven2/commons-io/commons-io/2.14.0/commons-io-2.14.0-sources.jar",
    "status": "approved",
    "scans": [
        {
            "date": "September 30, 2023 at 4:54:51 a.m. GMT",
            "authority": "https://gitlab.eclipse.org/eclipsefdn/emo-team/iplab/-/issues/10768",
            "scancode-version": "31.2.1",
            "licenses-discovered": [
                "Apache-2.0"
            ],
            "copyrights": [
            ],
            "file-count": 253,
            "sha256": "6f8318a3e9f1a27b4d0a16e2802077951a0299951504d53cc24068016f21ddff",
            "source": "https://repo.maven.apache.org/maven2/commons-io/commons-io/2.14.0/commons-io-2.14.0-sources.jar",
            "status": "approved"
        }
    ]
}