{
    "id": "npm/npmjs/@types/lodash/4.14.104",
    "license": "MIT",
    "licenses-discovered": [
        "MIT"
    ],
    "copyrights": [
        "Copyright (c) Microsoft Corporation"
    ],
    "file-count": 314,
    "scancode-version": "31.2.1",
    "authority": "https://gitlab.eclipse.org/eclipsefdn/emo-team/iplab/-/issues/4131",
    "source": "https://registry.npmjs.org/@types/lodash/-/lodash-4.14.104.tgz",
    "status": "approved"
}