{
    "id": "maven/mavencentral/io.fabric8/kubernetes-client/6.4.0",
    "license": "Apache-2.0 AND LicenseRef-Public-Domain",
    "authority": "https://gitlab.eclipse.org/eclipsefdn/emo-team/iplab/-/issues/6570",
    "source": "https://search.maven.org/remotecontent?filepath=io/fabric8/kubernetes-client/6.4.0/kubernetes-client-6.4.0-sources.jar",
    "status": "approved",
    "scans": [
        {
            "date": "January 24, 2023 at 9:37:54 a.m. GMT",
            "authority": "https://gitlab.eclipse.org/eclipsefdn/emo-team/iplab/-/issues/6570",
            "scancode-version": "31.2.1",
            "licenses-discovered": [
                "Apache-2.0",
                "Apache-2.0 AND LicenseRef-scancode-public-domain-disclaimer"
            ],
            "copyrights": [
                "Copyright (c) 2015 Red Hat, Inc."
            ],
            "file-count": 125,
            "sha256": "8c3b675631209ae954bdbf99b12729a04f3ec7ca58a730b6eb0a5e86d3951416",
            "source": "https://search.maven.org/remotecontent?filepath=io/fabric8/kubernetes-client/6.4.0/kubernetes-client-6.4.0-sources.jar",
            "status": "restricted"
        }
    ]
}
