{
    "id": "maven/mavencentral/org.springframework.boot/spring-boot-starter-security/3.3.5",
    "license": "Apache-2.0",
    "authority": "https://gitlab.eclipse.org/eclipsefdn/emo-team/iplab/-/issues/16894",
    "source": "https://repo1.maven.org/maven2/org/springframework/boot/spring-boot-starter-security/3.3.5/spring-boot-starter-security-3.3.5-sources.jar",
    "status": "approved",
    "scans": [
        {
            "date": "October 28, 2024, 6:37:09 a.m. GMT",
            "authority": "https://gitlab.eclipse.org/eclipsefdn/emo-team/iplab/-/issues/16894",
            "scancode-version": "31.2.1",
            "licenses-discovered": [
                "Apache-2.0"
            ],
            "copyrights": [
            ],
            "file-count": 2,
            "sha256": "8db280cf0dc3d2b10f14a787c01a1add88f79b918acc1c917cac75be66e8259e",
            "source": "https://repo1.maven.org/maven2/org/springframework/boot/spring-boot-starter-security/3.3.5/spring-boot-starter-security-3.3.5-sources.jar",
            "status": "approved"
        }
    ]
}