{
    "id": "maven/mavencentral/org.activiti/activiti-api-runtime-shared/8.6.0",
    "license": "Apache-2.0",
    "authority": "https://gitlab.eclipse.org/eclipsefdn/emo-team/iplab/-/issues/15910",
    "source": "https://maven.alfresco.com/nexus/service/local/repositories/activiti-releases/content//org/activiti/activiti-api-runtime-shared/8.6.0/activiti-api-runtime-shared-8.6.0-sources.jar",
    "status": "approved",
    "scans": [
        {
            "date": "August 14, 2024 at 5:19:55 p.m. GMT",
            "authority": "https://gitlab.eclipse.org/eclipsefdn/emo-team/iplab/-/issues/15910",
            "scancode-version": "31.2.1",
            "licenses-discovered": [
                "Apache-2.0"
            ],
            "copyrights": [
                "Copyright 2010-2020 Alfresco Software, Ltd."
            ],
            "file-count": 17,
            "sha256": "50d847635fa302fbd28733d75d1f4f8d0bd67041cc0800cd43446b4ab6ddd559",
            "source": "https://maven.alfresco.com/nexus/service/local/repositories/activiti-releases/content//org/activiti/activiti-api-runtime-shared/8.6.0/activiti-api-runtime-shared-8.6.0-sources.jar",
            "status": "approved"
        }
    ]
}