{
    "id": "maven/mavencentral/io.aeron/aeron-all/1.39.0",
    "license": "Apache-2.0",
    "authority": "https://gitlab.eclipse.org/eclipsefdn/emo-team/iplab/-/issues/6821",
    "source": "https://search.maven.org/remotecontent?filepath=io/aeron/aeron-all/1.39.0/aeron-all-1.39.0-sources.jar",
    "status": "approved",
    "scans": [
        {
            "date": "January 27, 2023 at 9:20:50 p.m. GMT",
            "authority": "https://gitlab.eclipse.org/eclipsefdn/emo-team/iplab/-/issues/6821",
            "scancode-version": "31.2.1",
            "licenses-discovered": [
                "CC-BY-4.0 AND CC-BY-ND-4.0",
                "Apache-2.0"
            ],
            "copyrights": [
                "(c) Copyright 2014-2016 FIX Protocol Limited",
                "Copyright 2014-2022 Real Logic Limited",
                "Copyright 2015 Kaazing Corporation"
            ],
            "file-count": 707,
            "sha256": "6a52a22b520d071a0e9f76c8019cabe00ddc4653c5ee9c48c3557058f8a7b1fb",
            "source": "https://search.maven.org/remotecontent?filepath=io/aeron/aeron-all/1.39.0/aeron-all-1.39.0-sources.jar",
            "status": "restricted"
        }
    ]
}
