{
    "id": "maven/mavencentral/io.cucumber/cucumber-core/7.21.0",
    "license": "MIT AND (Apache-2.0 AND MIT)",
    "authority": "https://gitlab.eclipse.org/eclipsefdn/emo-team/iplab/-/issues/19276",
    "source": "https://repo1.maven.org/maven2/io/cucumber/cucumber-core/7.21.0/cucumber-core-7.21.0-sources.jar",
    "status": "approved",
    "scans": [
        {
            "date": "February 4, 2025 at 8:06:45 a.m. GMT",
            "authority": "https://gitlab.eclipse.org/eclipsefdn/emo-team/iplab/-/issues/19276",
            "scancode-version": "31.2.1",
            "licenses-discovered": [
                "MIT",
                "Apache-2.0 AND MIT"
            ],
            "copyrights": [
                "(c) 2011-2018 by Harvest",
                "(c) 2014-2023 Denis Pushkarev",
                "(c) JS Foundation and other contributors",
                "Copyright (c) 2011-2018 Harvest http://getharvest.com",
                "copyright (c) 2011-2017 Almende B.V, http://almende.com",
                "copyright (c) 2017-2019 visjs contributors, https://github.com/visjs"
            ],
            "file-count": 207,
            "sha256": "9e67504b16fa39f356d6d5056af4c6b9604fe3902af35e26918759a6ad21008d",
            "source": "https://repo1.maven.org/maven2/io/cucumber/cucumber-core/7.21.0/cucumber-core-7.21.0-sources.jar",
            "status": "approved"
        }
    ]
}