{
    "id": "npm/npmjs/@types/sinonjs__fake-timers/8.1.3",
    "license": "MIT",
    "authority": "https://gitlab.eclipse.org/eclipsefdn/emo-team/iplab/-/issues/11000",
    "source": "https://registry.yarnpkg.com/@types/sinonjs__fake-timers/-/sinonjs__fake-timers-8.1.3.tgz",
    "status": "approved",
    "scans": [
        {
            "date": "October 11, 2023 at 6:52:45 a.m. GMT",
            "authority": "https://gitlab.eclipse.org/eclipsefdn/emo-team/iplab/-/issues/11000",
            "scancode-version": "31.2.1",
            "licenses-discovered": [
                "MIT"
            ],
            "copyrights": [
                "Copyright (c) Microsoft Corporation"
            ],
            "file-count": 4,
            "sha256": "62cade200c063d18fd34ea1f9736ec3dbaecc8557e0532cabcfce3090a968383",
            "source": "https://registry.yarnpkg.com/@types/sinonjs__fake-timers/-/sinonjs__fake-timers-8.1.3.tgz",
            "status": "approved"
        }
    ]
}