{
    "id": "npm/npmjs/@storybook/components/6.5.10",
    "license": "MIT AND (0BSD AND MIT) AND 0BSD AND (BSD-3-Clause AND MIT)",
    "licenses-discovered": [
        "MIT",
        "0BSD AND MIT",
        "0BSD",
        "BSD-3-Clause AND MIT"
    ],
    "copyrights": [
        "Copyright (c) Facebook, Inc.",
        "Copyright (c) Kadira Inc. <hello@kadira.io>",
        "Copyright (c) Microsoft Corporation",
        "Copyright (c) Robert Penner",
        "Copyright Google Inc.",
        "Copyright KingSora Rene Haas. https://github.com/KingSora"
    ],
    "file-count": 74,
    "scancode-version": "30.1.0",
    "authority": "https://gitlab.eclipse.org/eclipsefdn/emo-team/iplab/-/issues/3252",
    "source": "https://registry.npmjs.org/@storybook/components/-/components-6.5.10.tgz",
    "status": "approved"
}