{
    "id": "maven/mavencentral/org.samba.jcifs/jcifs/1.3.3",
    "license": "LGPL-2.1-or-later AND (BSD-2-Clause AND LicenseRef-scancode-other-permissive) AND LGPL-2.0-or-later AND (GPL-1.0-or-later AND LGPL-2.0-or-later AND LGPL-2.1-only) AND (GPL-1.0-or-later AND LGPL-2.1-only) AND GPL-2.0-or-later",
    "licenses-discovered": [
        "LGPL-2.1-or-later",
        "BSD-2-Clause AND LicenseRef-scancode-other-permissive",
        "LGPL-2.0-or-later",
        "GPL-1.0-or-later AND LGPL-2.0-or-later AND LGPL-2.1-only",
        "GPL-1.0-or-later AND LGPL-2.1-only",
        "GPL-2.0-or-later"
    ],
    "file-count": 951,
    "scancode-version": "30.1.0",
    "authority": "https://gitlab.eclipse.org/eclipsefdn/emo-team/iplab/-/issues/2539",
    "source": "https://search.maven.org/remotecontent?filepath=org/samba/jcifs/jcifs/1.3.3/jcifs-1.3.3-sources.jar",
    "status": "restricted"
}