{
    "id": "maven/mavencentral/org.apache.hadoop/hadoop-common/2.10.0",
    "license": "Apache-2.0",
    "licenses-discovered": [
        "Apache-2.0",
        "Apache-2.0 AND BSD-2-Clause AND BSD-2-Clause-Views AND BSD-3-Clause AND CC-BY-2.5 AND CDDL-1.0 AND CDDL-1.1 AND EPL-1.0 AND LicenseRef-scancode-protobuf AND MIT",
        "Apache-2.0 AND BSD-3-Clause",
        "Apache-2.0 AND LicenseRef-scancode-public-domain-disclaimer"
    ],
    "copyrights": [
        "Copyright (c) 1995-2000 by the Hypersonic SQL Group",
        "Copyright (c) 2001-2016, The HSQL Development Group",
        "Copyright (c) 2003-2017 Optimatika",
        "Copyright (c) 2004-2006 Intel Corporation",
        "Copyright (c) 2004-2006 Intel Corportation",
        "Copyright (c) 2005, European Commission project OneLab",
        "Copyright (c) 2007 The Guava Authors",
        "Copyright (c) 2008,2009,2010 Massachusetts Institute of Technology",
        "Copyright (c) 2008-2016, SpryMedia Ltd.",
        "Copyright (c) 2010 Aleksander Williams",
        "Copyright (c) 2011 FuseSource Corp.",
        "Copyright (c) 2011 The LevelDB Authors",
        "Copyright (c) 2011-2014, Yann Collet",
        "Copyright (c) 2011-2016 Tim Wood, Iskren Chernev",
        "Copyright (c) 2012 The FreeBSD Foundation",
        "Copyright (c) 2014 Ivan Bozhanov",
        "Copyright 2002 Niels Provos <provos@citi.umich.edu>",
        "Copyright 2008, Google Inc.",
        "Copyright 2011, Google Inc.",
        "Copyright 2014, Google Inc.",
        "Copyright 2015 Apache Software Foundation",
        "Copyright jQuery Foundation and other contributors, https://jquery.org",
        "copyrighted by Bloomberg Finance",
        "copyrighted by Red Hat Inc."
    ],
    "file-count": 1000,
    "scancode-version": "31.2.1",
    "authority": "https://gitlab.eclipse.org/eclipsefdn/emo-team/iplab/-/issues/4483",
    "source": "https://search.maven.org/remotecontent?filepath=org/apache/hadoop/hadoop-common/2.10.0/hadoop-common-2.10.0-sources.jar",
    "status": "approved"
}
