{
    "id": "npm/npmjs/@lerna/create/8.1.8",
    "license": "MIT AND (ISC AND MIT) AND ISC",
    "authority": "https://gitlab.eclipse.org/eclipsefdn/emo-team/iplab/-/issues/16284",
    "source": "https://github.com/lerna/lerna/archive/refs/tags/v8.1.8.zip",
    "status": "approved",
    "scans": [
        {
            "date": "September 26, 2024, 1:20:49 p.m. GMT",
            "authority": "https://gitlab.eclipse.org/eclipsefdn/emo-team/iplab/-/issues/16284",
            "scancode-version": "31.2.1",
            "licenses-discovered": [
                "MIT",
                "ISC AND MIT",
                "ISC"
            ],
            "copyrights": [
                "Copyright (c) 2015-present Lerna",
                "Copyright (c) 2018 Tester McPerson <test@example.com>"
            ],
            "file-count": 1810,
            "sha256": "405285abc3451ed50e36a0011b8286c82a243efd528423c43b8d9a89d2663517",
            "source": "https://github.com/lerna/lerna/archive/refs/tags/v8.1.8.zip",
            "status": "approved"
        }
    ]
}