{
    "id": "go/golang/google.golang.org/grpc/v1.8.0",
    "license": "Apache-2.0",
    "authority": "https://gitlab.eclipse.org/eclipsefdn/emo-team/iplab/-/issues/12412",
    "source": "https://proxy.golang.org/google.golang.org/grpc/@v/v1.8.0.zip",
    "status": "approved",
    "scans": [
        {
            "date": "December 21, 2023 at 11:24:54 a.m. GMT",
            "authority": "https://gitlab.eclipse.org/eclipsefdn/emo-team/iplab/-/issues/12412",
            "scancode-version": "31.2.1",
            "licenses-discovered": [
                "Apache-2.0"
            ],
            "copyrights": [
                "Copyright 2014 gRPC",
                "Copyright 2015 gRPC",
                "Copyright 2015-2016 gRPC",
                "Copyright 2016 gRPC",
                "Copyright 2017 gRPC"
            ],
            "file-count": 204,
            "sha256": "3ac89ee67dc3c87077fabd495321d991a3b1ada9fe8483c15e5a0e3d68b4e669",
            "source": "https://proxy.golang.org/google.golang.org/grpc/@v/v1.8.0.zip",
            "status": "approved"
        }
    ]
}