{
    "id": "npm/npmjs/@storybook/react/7.0.21",
    "license": "MIT",
    "authority": "https://gitlab.eclipse.org/eclipsefdn/emo-team/iplab/-/issues/8927",
    "source": "https://registry.npmjs.org/@storybook/react/-/react-7.0.21.tgz",
    "status": "approved",
    "scans": [
        {
            "date": "June 15, 2023 at 3:40:35 p.m. GMT",
            "authority": "https://gitlab.eclipse.org/eclipsefdn/emo-team/iplab/-/issues/8927",
            "scancode-version": "31.2.1",
            "licenses-discovered": [
                "MIT"
            ],
            "copyrights": [
            ],
            "file-count": 186,
            "sha256": "816335d373c6870f6b64092b75073f74132667e6a79f22d350dd8acdccb2a87f",
            "source": "https://registry.npmjs.org/@storybook/react/-/react-7.0.21.tgz",
            "status": "approved"
        }
    ]
}