{
    "id": "maven/mavencentral/org.apache.avro/avro-ipc/1.11.0",
    "license": "Apache-2.0 AND (BSD-3-Clause OR GPL-2.0-only OR MIT)",
    "licenses-discovered": [
        "Apache-2.0",
        "BSD-3-Clause AND GPL-2.0-only AND MIT",
        "MIT",
        "BSD-3-Clause"
    ],
    "copyrights": [
        "Copyright (c) Dmitry Baranovskiy (http://g.raphaeljs.com)",
        "Copyright (c) Jason Frame (jason@onehackoranother.com)",
        "Copyright (c) Stanford Visualization Group",
        "Copyright John Resig",
        "Copyright The Apache Software Foundation",
        "Copyright The Dojo Foundation"
    ],
    "file-count": 49,
    "scancode-version": "30.1.0",
    "authority": "https://gitlab.eclipse.org/eclipsefdn/emo-team/iplab/-/issues/3362",
    "source": "https://search.maven.org/remotecontent?filepath=org/apache/avro/avro-ipc/1.11.0/avro-ipc-1.11.0-sources.jar",
    "status": "approved"
}
