{
    "id": "crate/cratesio/-/rustls/0.21.12",
    "license": "Apache-2.0 AND ISC AND MIT",
    "authority": "https://gitlab.eclipse.org/eclipsefdn/emo-team/iplab/-/issues/14616",
    "source": "https://crates.io/api/v1/crates/rustls/0.21.12/download",
    "status": "approved",
    "scans": [
        {
            "date": "May 5, 2024 at 12:13:14 p.m. GMT",
            "authority": "https://gitlab.eclipse.org/eclipsefdn/emo-team/iplab/-/issues/14616",
            "scancode-version": "31.2.1",
            "licenses-discovered": [
                "Apache-2.0",
                "ISC",
                "MIT",
                "Apache-2.0 AND ISC AND MIT"
            ],
            "copyrights": [
                "(c) 2009 Entrust, Inc. - for",
                "(c) 2014 Entrust, Inc. - for",
                "Copyright (c) 2016 Joseph Birr-Pixton <jpixton@gmail.com>",
                "Copyright (c) 2016, Joseph Birr-Pixton <jpixton@gmail.com>"
            ],
            "file-count": 134,
            "sha256": "3f56a14d1f48b391359b22f731fd4bd7e43c97f3c50eee276f3aa09c94784d3e",
            "source": "https://crates.io/api/v1/crates/rustls/0.21.12/download",
            "status": "approved"
        }
    ]
}