{
    "id": "maven/mavencentral/org.apache.parquet/parquet-format-structures/1.13.1",
    "license": "Apache-2.0",
    "authority": "https://gitlab.eclipse.org/eclipsefdn/emo-team/iplab/-/issues/19692",
    "source": "https://repo1.maven.org/maven2/org/apache/parquet/parquet-format-structures/1.13.1/parquet-format-structures-1.13.1-sources.jar",
    "status": "approved",
    "scans": [
        {
            "date": "March 1, 2025 at 12:10:08 a.m. GMT",
            "authority": "https://gitlab.eclipse.org/eclipsefdn/emo-team/iplab/-/issues/19692",
            "scancode-version": "31.2.1",
            "licenses-discovered": [
                "Apache-2.0"
            ],
            "copyrights": [
            ],
            "file-count": 73,
            "sha256": "d6c733e33c2191d0a94d3f781303195168d9e9ffc7f055ee9059e27ccd9385b4",
            "source": "https://repo1.maven.org/maven2/org/apache/parquet/parquet-format-structures/1.13.1/parquet-format-structures-1.13.1-sources.jar",
            "status": "approved"
        }
    ]
}