{
    "id": "maven/mavencentral/org.springframework.security/spring-security-oauth2-resource-server/6.4.1",
    "license": "Apache-2.0",
    "authority": "https://gitlab.eclipse.org/eclipsefdn/emo-team/iplab/-/issues/17548",
    "source": "https://repo1.maven.org/maven2/org/springframework/security/spring-security-oauth2-resource-server/6.4.1/spring-security-oauth2-resource-server-6.4.1-sources.jar",
    "status": "approved",
    "scans": [
        {
            "date": "November 29, 2024 at 4:31:37 a.m. GMT",
            "authority": "https://gitlab.eclipse.org/eclipsefdn/emo-team/iplab/-/issues/17548",
            "scancode-version": "31.2.1",
            "licenses-discovered": [
                "Apache-2.0"
            ],
            "copyrights": [
                "Copyright 2002-2018 the original author or authors",
                "Copyright 2002-2019 the original author or authors",
                "Copyright 2002-2020 the original author or authors",
                "Copyright 2002-2021 the original author or authors",
                "Copyright 2002-2022 the original author or authors",
                "Copyright 2002-2023 the original author or authors",
                "Copyright 2002-2024 the original author or authors"
            ],
            "file-count": 52,
            "sha256": "eaeb35a4637b7fd40a2448ae676192a806795673d256653ea6dfc7b70dae8697",
            "source": "https://repo1.maven.org/maven2/org/springframework/security/spring-security-oauth2-resource-server/6.4.1/spring-security-oauth2-resource-server-6.4.1-sources.jar",
            "status": "approved"
        }
    ]
}