{
    "id": "maven/mavencentral/org.jboss.arquillian.junit5/arquillian-junit5-core/1.8.0.Final",
    "license": "Apache-2.0",
    "authority": "https://gitlab.eclipse.org/eclipsefdn/emo-team/iplab/-/issues/14280",
    "source": "https://repo1.maven.org/maven2/org/jboss/arquillian/junit5/arquillian-junit5-core/1.8.0.Final/arquillian-junit5-core-1.8.0.Final-sources.jar",
    "status": "approved",
    "scans": [
        {
            "date": "April 12, 2024 at 5:13:35 p.m. GMT",
            "authority": "https://gitlab.eclipse.org/eclipsefdn/emo-team/iplab/-/issues/14280",
            "scancode-version": "31.2.1",
            "licenses-discovered": [
            ],
            "copyrights": [
            ],
            "file-count": 11,
            "sha256": "d021f7decf0441a7afa39cab3d462806d8c501480308d9d11751576c9a91a94d",
            "source": "https://repo1.maven.org/maven2/org/jboss/arquillian/junit5/arquillian-junit5-core/1.8.0.Final/arquillian-junit5-core-1.8.0.Final-sources.jar",
            "status": "restricted"
        }
    ]
}
