{
    "id": "go/golang/github.com%2Fgorhill/cronexpr/v0.0.0-20180427100037-88b0669f7d75",
    "license": "Apache-2.0 OR GPL-3.0-only",
    "authority": "https://gitlab.eclipse.org/eclipsefdn/emo-team/iplab/-/issues/12256",
    "source": "https://proxy.golang.org/github.com%2Fgorhill/cronexpr/@v/v0.0.0-20180427100037-88b0669f7d75.zip",
    "status": "approved",
    "scans": [
        {
            "date": "December 21, 2023 at 6:14:44 a.m. GMT",
            "authority": "https://gitlab.eclipse.org/eclipsefdn/emo-team/iplab/-/issues/12256",
            "scancode-version": "31.2.1",
            "licenses-discovered": [
                "Apache-2.0",
                "Apache-2.0 AND GPL-1.0-or-later AND GPL-3.0-only",
                "GPL-1.0-or-later AND GPL-3.0-only",
                "GPL-3.0-only"
            ],
            "copyrights": [
                "Copyright (c) 2007 Free Software Foundation, Inc. http://fsf.org",
                "Copyright (c) 2013 Raymond Hill",
                "Copyright 2013 Raymond Hill"
            ],
            "file-count": 10,
            "sha256": "742d8957d3f9fe773150fb3164868a755b2af5b705b38c72c45ca5386715c617",
            "source": "https://proxy.golang.org/github.com%2Fgorhill/cronexpr/@v/v0.0.0-20180427100037-88b0669f7d75.zip",
            "status": "restricted"
        }
    ]
}
