{
    "id": "npm/npmjs/-/eslint-plugin-vue/9.18.1",
    "license": "MIT",
    "authority": "https://gitlab.eclipse.org/eclipsefdn/emo-team/iplab/-/issues/11440",
    "source": "https://github.com/vuejs/eslint-plugin-vue/archive/refs/tags/v9.18.1.zip",
    "status": "approved",
    "scans": [
        {
            "date": "November 6, 2023 at 9:22:45 a.m. GMT",
            "authority": "https://gitlab.eclipse.org/eclipsefdn/emo-team/iplab/-/issues/11440",
            "scancode-version": "31.2.1",
            "licenses-discovered": [
                "MIT"
            ],
            "copyrights": [
                "Copyright (c) 2014 Yannick Croissant",
                "Copyright (c) 2017 Toru Nagashima",
                "copyright 2016 Toru Nagashima",
                "copyright 2017 Toru Nagashima",
                "copyright 2017 Xie Ding E De Mao",
                "copyright 2018 Michal Sajnog",
                "copyright 2020 Flo Edelmann",
                "copyright 2021 Flo Edelmann",
                "copyright 2021 Yosuke Ota",
                "copyright 2022 Yosuke Ota",
                "copyright 2023 Perry Song"
            ],
            "file-count": 1488,
            "sha256": "5002f01213d7f1217df07dbc2bca2810368cce4d88b85027ac67e1dda1fe9b1e",
            "source": "https://github.com/vuejs/eslint-plugin-vue/archive/refs/tags/v9.18.1.zip",
            "status": "approved"
        }
    ]
}