{
    "id": "npm/npmjs/-/rxjs/7.5.5",
    "license": "Apache-2.0 AND (0BSD AND Apache-2.0) AND 0BSD",
    "licenses-discovered": [
        "Apache-2.0",
        "0BSD AND Apache-2.0",
        "0BSD"
    ],
    "copyrights": [
        "(c) b.value",
        "Copyright (c) Google, Inc., Netflix, Inc., Microsoft Corp. and contributors",
        "Copyright (c) Microsoft Corporation"
    ],
    "file-count": 2268,
    "scancode-version": "30.1.0",
    "authority": "https://gitlab.eclipse.org/eclipsefdn/emo-team/iplab/-/issues/3306",
    "source": "https://registry.yarnpkg.com/rxjs/-/rxjs-7.5.5.tgz",
    "status": "approved"
}