{
    "id": "maven/mavencentral/org.springframework.boot/spring-boot-autoconfigure/3.2.0",
    "license": "Apache-2.0",
    "authority": "https://gitlab.eclipse.org/eclipsefdn/emo-team/iplab/-/issues/11751",
    "source": "https://repo1.maven.org/maven2/org/springframework/boot/spring-boot-autoconfigure/3.2.0/spring-boot-autoconfigure-3.2.0-sources.jar",
    "status": "approved",
    "scans": [
        {
            "date": "November 29, 2023 at 8:16:06 p.m. GMT",
            "authority": "https://gitlab.eclipse.org/eclipsefdn/emo-team/iplab/-/issues/11751",
            "scancode-version": "31.2.1",
            "licenses-discovered": [
                "Apache-2.0"
            ],
            "copyrights": [
                "Copyright 2012-2019 the original author or authors",
                "Copyright 2012-2020 the original author or authors",
                "Copyright 2012-2021 the original author or authors",
                "Copyright 2012-2022 the original author or authors",
                "Copyright 2012-2023 the original author or authors",
                "Copyright 2020-2022 the original author or authors"
            ],
            "file-count": 801,
            "sha256": "e4bb5b313ff4961c00cca1b80a6b7c62fefbf53a24822ec25b4064c8ed7fc8a9",
            "source": "https://repo1.maven.org/maven2/org/springframework/boot/spring-boot-autoconfigure/3.2.0/spring-boot-autoconfigure-3.2.0-sources.jar",
            "status": "approved"
        }
    ]
}