{
    "id": "maven/mavencentral/org.geotools/gt-epsg-hsql/32.0",
    "license": "LGPL-2.1-only",
    "authority": "https://gitlab.eclipse.org/eclipsefdn/emo-team/iplab/-/issues/16496",
    "source": "https://repo.osgeo.org/repository/geotools-releases/org/geotools/gt-epsg-hsql/32.0/gt-epsg-hsql-32.0-sources.jar",
    "status": "approved",
    "scans": [
        {
            "date": "October 8, 2024, 10:19:25 p.m. GMT",
            "authority": "https://gitlab.eclipse.org/eclipsefdn/emo-team/iplab/-/issues/16496",
            "scancode-version": "31.2.1",
            "licenses-discovered": [
                "BSD-3-Clause",
                "LGPL-2.1-only",
                "LicenseRef-scancode-proprietary-license"
            ],
            "copyrights": [
                "(c) 2005-2008, Open Source Geospatial Foundation"
            ],
            "file-count": 22,
            "sha256": "332e0036e4a2fb8590af9c36b4e4dd63308db659a471469efcbaea36cea14743",
            "source": "https://repo.osgeo.org/repository/geotools-releases/org/geotools/gt-epsg-hsql/32.0/gt-epsg-hsql-32.0-sources.jar",
            "status": "restricted"
        }
    ]
}