{
    "id": "npm/npmjs/-/react-hook-form/7.45.0",
    "license": "MIT",
    "authority": "https://gitlab.eclipse.org/eclipsefdn/emo-team/iplab/-/issues/9156",
    "source": "https://registry.yarnpkg.com/react-hook-form/-/react-hook-form-7.45.0.tgz",
    "status": "approved",
    "scans": [
        {
            "date": "June 21, 2023 at 8:47:50 p.m. GMT",
            "authority": "https://gitlab.eclipse.org/eclipsefdn/emo-team/iplab/-/issues/9156",
            "scancode-version": "31.2.1",
            "licenses-discovered": [
                "MIT"
            ],
            "copyrights": [
                "Copyright (c) 2019-present Beier(Bill) Luo"
            ],
            "file-count": 300,
            "sha256": "c3c85cc27430eabd8ee614ebf8fb23084ec5844f55f95bdd2d4931c4b178dab5",
            "source": "https://registry.yarnpkg.com/react-hook-form/-/react-hook-form-7.45.0.tgz",
            "status": "approved"
        }
    ]
}