{
    "id": "p2/orbit/p2.eclipse-plugin/org.tmatesoft.svnkit.svnkit/1.8.11",
    "license": "Apache-2.0 AND LicenseRef-scancode-unknown-license-reference AND TMate",
    "licenses-discovered": [
        "LicenseRef-scancode-unknown-license-reference",
        "TMate",
        "Apache-2.0"
    ],
    "file-count": 1095,
    "scancode-version": "30.1.0",
    "authority": "https://gitlab.eclipse.org/eclipsefdn/emo-team/iplab/-/issues/2310",
    "source": "https://search.maven.org/remotecontent?filepath=org/tmatesoft/svnkit/svnkit/1.8.11/svnkit-1.8.11-sources.jar",
    "status": "restricted"
}