{
    "id": "pypi/pypi/-/urllib3/1.26.15",
    "license": "MIT AND LicenseRef-Python AND Apache-2.0",
    "authority": "https://gitlab.eclipse.org/eclipsefdn/emo-team/iplab/-/issues/7995",
    "source": "https://files.pythonhosted.org/packages/21/79/6372d8c0d0641b4072889f3ff84f279b738cd8595b64c8e0496d4e848122/urllib3-1.26.15.tar.gz",
    "status": "approved",
    "scans": [
        {
            "date": "April 27, 2023 at 2:04:08 p.m. GMT",
            "authority": "https://gitlab.eclipse.org/eclipsefdn/emo-team/iplab/-/issues/7995",
            "scancode-version": "31.2.1",
            "licenses-discovered": [
                "MIT",
                "Python-2.0",
                "Apache-2.0"
            ],
            "copyrights": [
                "Copyright (c) 2008-2020 Andrey Petrov and contributors",
                "Copyright (c) 2010-2020 Benjamin Peterson",
                "Copyright (c) 2012 Senko Rasic <senko.rasic@dobarkod.hr>",
                "Copyright (c) 2015-2016 Will Bond <will@wbond.net>",
                "Copyright 2015 Google Inc."
            ],
            "file-count": 135,
            "sha256": "8a388717b9476f934a21484e8c8e61875ab60644d29b9b39e11e4b9dc1c6b305",
            "source": "https://files.pythonhosted.org/packages/21/79/6372d8c0d0641b4072889f3ff84f279b738cd8595b64c8e0496d4e848122/urllib3-1.26.15.tar.gz",
            "status": "restricted"
        }
    ]
}
