{
    "id": "npm/npmjs/@typescript-eslint/visitor-keys/5.47.0",
    "license": "BSD-2-Clause AND MIT",
    "authority": "https://gitlab.eclipse.org/eclipsefdn/emo-team/iplab/-/issues/6000",
    "source": "https://github.com/typescript-eslint/typescript-eslint/archive/v5.47.0.zip",
    "status": "approved",
    "scans": [
        {
            "date": "December 22, 2022 at 11:21:05 p.m. GMT",
            "authority": "https://gitlab.eclipse.org/eclipsefdn/emo-team/iplab/-/issues/6000",
            "scancode-version": "31.2.1",
            "licenses-discovered": [
                "BSD-2-Clause",
                "MIT"
            ],
            "copyrights": [
                "Copyright (c) 2016 unional",
                "Copyright (c) 2019 typescript-eslint and other contributors",
                "Copyright (c) 2021 typescript-eslint and other contributors",
                "Copyright JS Foundation and other contributors, https://js.foundation",
                "Copyright Joyent, Inc. and other Node contributors"
            ],
            "file-count": 5151,
            "sha256": "c0f441d48b879a1a36c485803fa801a2fc1584d0d2f3c60009e9654124c81d7c",
            "source": "https://github.com/typescript-eslint/typescript-eslint/archive/v5.47.0.zip",
            "status": "approved"
        }
    ]
}