{
    "id": "maven/mavencentral/biz.aQute.bnd/biz.aQute.bnd.util/6.4.0",
    "license": "Apache-2.0",
    "authority": "https://gitlab.eclipse.org/eclipsefdn/emo-team/iplab/-/issues/5270",
    "source": "https://search.maven.org/remotecontent?filepath=biz/aQute/bnd/biz.aQute.bnd.util/6.4.0/biz.aQute.bnd.util-6.4.0-sources.jar",
    "status": "approved",
    "scans": [
        {
            "date": "December 1, 2022 at 5:27:04 a.m. GMT",
            "authority": "https://gitlab.eclipse.org/eclipsefdn/emo-team/iplab/-/issues/5270",
            "scancode-version": "31.2.1",
            "licenses-discovered": [
                "Apache-2.0"
            ],
            "copyrights": [
                "Copyright 2016 Rene Perschon <rperschon85@gmail.com>",
                "Copyright 2017 Rene Perschon <rperschon85@gmail.com>"
            ],
            "file-count": 132,
            "sha256": "042d9017a6131d2f8b9139eee8e344a028076ec921b30e1b8aa49791efecb414",
            "source": "https://search.maven.org/remotecontent?filepath=biz/aQute/bnd/biz.aQute.bnd.util/6.4.0/biz.aQute.bnd.util-6.4.0-sources.jar",
            "status": "approved"
        }
    ]
}