{
    "license": "BSD-3-Clause AND MIT",
    "file-count": 26,
    "authority": "https://gitlab.eclipse.org/eclipsefdn/emo-team/iplab/-/issues/1348",
    "scancode-version": "30.1.0",
    "licenses-discovered": [
        "MIT",
        "BSD-3-Clause",
        "LicenseRef-scancode-unknown-license-reference"
    ],
    "id": "npm/npmjs/@sinonjs/fake-timers/6.0.1",
    "source": "https://github.com/sinonjs/fake-timers/archive/v6.0.1.zip",
    "status": "approved"
}
