{
    "id": "npm/npmjs/@nrwl/nx-linux-arm64-gnu/15.9.3",
    "license": "MIT",
    "authority": "https://gitlab.eclipse.org/eclipsefdn/emo-team/iplab/-/issues/8208",
    "source": "https://registry.npmjs.org/@nrwl/nx-linux-arm64-gnu/-/nx-linux-arm64-gnu-15.9.3.tgz",
    "status": "approved",
    "scans": [
        {
            "date": "May 5, 2023 at 7:59:30 a.m. GMT",
            "authority": "https://gitlab.eclipse.org/eclipsefdn/emo-team/iplab/-/issues/8208",
            "scancode-version": "31.2.1",
            "licenses-discovered": [
                "MIT"
            ],
            "copyrights": [
                "Copyright (c) 2017-2023 Narwhal Technologies Inc."
            ],
            "file-count": 3,
            "sha256": "19c1512f16b3bfbf36c2d9d63347678f57ee09399a1c70b7bdab512b54628059",
            "source": "https://registry.npmjs.org/@nrwl/nx-linux-arm64-gnu/-/nx-linux-arm64-gnu-15.9.3.tgz",
            "status": "approved"
        }
    ]
}