{
    "id": "crate/cratesio/-/zenoh-link-quic/1.0.0",
    "license": "Apache-2.0 AND EPL-2.0 AND (EPL-2.0 OR Apache-2.0)",
    "authority": "https://gitlab.eclipse.org/eclipsefdn/emo-team/iplab/-/issues/16988",
    "source": "https://crates.io/api/v1/crates/zenoh-link-quic/1.0.0/download",
    "status": "approved",
    "scans": [
        {
            "date": "October 31, 2024, 4:33:37 p.m. GMT",
            "authority": "https://gitlab.eclipse.org/eclipsefdn/emo-team/iplab/-/issues/16988",
            "scancode-version": "31.2.1",
            "licenses-discovered": [
                "Apache-2.0 AND EPL-2.0",
                "EPL-2.0 OR Apache-2.0"
            ],
            "copyrights": [
                "Copyright (c) 2023 ZettaScale Technology",
                "Copyright (c) 2024 ZettaScale Technology"
            ],
            "file-count": 7,
            "sha256": "aa18ee6df76c8145e71e2b6a39fdba8a42be61b4c27f45012531b27ea9f3ca89",
            "source": "https://crates.io/api/v1/crates/zenoh-link-quic/1.0.0/download",
            "status": "approved"
        }
    ]
}