{
    "id": "npm/npmjs/@ndelangen/get-tarball/3.0.9",
    "license": "MIT",
    "authority": "https://gitlab.eclipse.org/eclipsefdn/emo-team/iplab/-/issues/8958",
    "source": "https://registry.npmjs.org/@ndelangen/get-tarball/-/get-tarball-3.0.9.tgz",
    "status": "approved",
    "scans": [
        {
            "date": "June 15, 2023 at 3:02:38 p.m. GMT",
            "authority": "https://gitlab.eclipse.org/eclipsefdn/emo-team/iplab/-/issues/8958",
            "scancode-version": "31.2.1",
            "licenses-discovered": [
                "MIT"
            ],
            "copyrights": [
                "Copyright (c) 2016 David Bjorklund"
            ],
            "file-count": 7,
            "sha256": "f993708e4303fe07dce10f06da5597a092b7f1377e85299f5b22a2a29ef9a2d9",
            "source": "https://registry.npmjs.org/@ndelangen/get-tarball/-/get-tarball-3.0.9.tgz",
            "status": "approved"
        }
    ]
}