{
    "id": "maven/mavencentral/com.vaadin/hilla-parser-jvm-plugin-transfertypes/24.6.5",
    "license": "Apache-2.0",
    "authority": "https://gitlab.eclipse.org/eclipsefdn/emo-team/iplab/-/issues/19789",
    "source": "https://repo1.maven.org/maven2/com/vaadin/hilla-parser-jvm-plugin-transfertypes/24.6.5/hilla-parser-jvm-plugin-transfertypes-24.6.5-sources.jar",
    "status": "approved",
    "scans": [
        {
            "date": "March 1, 2025 at 3:18:02 a.m. GMT",
            "authority": "https://gitlab.eclipse.org/eclipsefdn/emo-team/iplab/-/issues/19789",
            "scancode-version": "31.2.1",
            "licenses-discovered": [
                "Apache-2.0"
            ],
            "copyrights": [
            ],
            "file-count": 5,
            "sha256": "a01acf9db5fc6998fb4b7ea3eec1c6debc40374c23ccd5604c84070ac24dd30a",
            "source": "https://repo1.maven.org/maven2/com/vaadin/hilla-parser-jvm-plugin-transfertypes/24.6.5/hilla-parser-jvm-plugin-transfertypes-24.6.5-sources.jar",
            "status": "approved"
        }
    ]
}