{
    "id": "maven/mavencentral/org.apache.lucene/lucene-analysis-smartcn/10.1.0",
    "license": "Apache-2.0",
    "authority": "https://gitlab.eclipse.org/eclipsefdn/emo-team/iplab/-/issues/18000",
    "source": "https://repo1.maven.org/maven2/org/apache/lucene/lucene-analysis-smartcn/10.1.0/lucene-analysis-smartcn-10.1.0-sources.jar",
    "status": "approved",
    "scans": [
        {
            "date": "December 22, 2024 at 12:00:31 a.m. GMT",
            "authority": "https://gitlab.eclipse.org/eclipsefdn/emo-team/iplab/-/issues/18000",
            "scancode-version": "31.2.1",
            "licenses-discovered": [
                "Apache-2.0"
            ],
            "copyrights": [
            ],
            "file-count": 22,
            "sha256": "5c094534a8ce9d5d58a84d81d1f8e9b4598b8f50984ab1e4308b05787149b540",
            "source": "https://repo1.maven.org/maven2/org/apache/lucene/lucene-analysis-smartcn/10.1.0/lucene-analysis-smartcn-10.1.0-sources.jar",
            "status": "approved"
        }
    ]
}