{
    "id": "maven/mavencentral/io.smallrye.common/smallrye-common-os/2.9.0",
    "license": "Apache-2.0",
    "authority": "https://gitlab.eclipse.org/eclipsefdn/emo-team/iplab/-/issues/18543",
    "source": "https://repo1.maven.org/maven2/io/smallrye/common/smallrye-common-os/2.9.0/smallrye-common-os-2.9.0-sources.jar",
    "status": "approved",
    "scans": [
        {
            "date": "January 10, 2025 at 3:27:09 p.m. GMT",
            "authority": "https://gitlab.eclipse.org/eclipsefdn/emo-team/iplab/-/issues/18543",
            "scancode-version": "31.2.1",
            "licenses-discovered": [
                "Apache-2.0"
            ],
            "copyrights": [
                "Copyright 2017 Red Hat, Inc., and individual contributors",
                "Copyright 2018 Red Hat, Inc., and individual contributors"
            ],
            "file-count": 11,
            "sha256": "3bd1ae97bdb6eae75bcd7a7ba8b5295dc5b5cf2a014ad2360cc8b03b18ba14ba",
            "source": "https://repo1.maven.org/maven2/io/smallrye/common/smallrye-common-os/2.9.0/smallrye-common-os-2.9.0-sources.jar",
            "status": "approved"
        }
    ]
}