{
    "id": "npm/npmjs/@paloaltonetworks/postman-code-generators/1.1.12",
    "license": "Apache-2.0",
    "authority": "https://gitlab.eclipse.org/eclipsefdn/emo-team/iplab/-/issues/6636",
    "source": "https://registry.npmjs.org/@paloaltonetworks/postman-code-generators/-/postman-code-generators-1.1.12.tgz",
    "status": "approved",
    "scans": [
        {
            "date": "January 25, 2023 at 12:29:31 p.m. GMT",
            "authority": "https://gitlab.eclipse.org/eclipsefdn/emo-team/iplab/-/issues/6636",
            "scancode-version": "31.2.1",
            "licenses-discovered": [
                "Apache-2.0"
            ],
            "copyrights": [
                "Copyright 2017 Postdot Technologies Pvt. Ltd.",
                "Copyright Postman, Inc."
            ],
            "file-count": 143,
            "sha256": "e3ed3e72e671afb34e82c4d5ddf25b81c52feec366e833bdeae1af5a6cfdd711",
            "source": "https://registry.npmjs.org/@paloaltonetworks/postman-code-generators/-/postman-code-generators-1.1.12.tgz",
            "status": "approved"
        }
    ]
}