{
    "id": "p2/orbit/p2.eclipse.plugin/org.apache.lucene.sandbox/9.5.0.v20230518-0524",
    "license": "Apache-2.0",
    "authority": "https://gitlab.eclipse.org/eclipsefdn/emo-team/iplab/-/issues/8480",
    "source": "https://search.maven.org/remotecontent?filepath=org/apache/lucene/lucene-sandbox/9.5.0/lucene-sandbox-9.5.0-sources.jar",
    "status": "approved",
    "scans": [
        {
            "date": "May 18, 2023 at 6:10:01 p.m. GMT",
            "authority": "https://gitlab.eclipse.org/eclipsefdn/emo-team/iplab/-/issues/8480",
            "scancode-version": "31.2.1",
            "licenses-discovered": [
                "Apache-2.0",
                "Apache-2.0 AND BSD-2-Clause AND BSD-3-Clause AND CC-BY-SA-3.0 AND ICU AND LGPL-2.0-or-later AND LicenseRef-scancode-other-copyleft AND LicenseRef-scancode-unicode-mappings AND MIT AND Python-2.0"
            ],
            "copyrights": [
                "Copyright (c) 1999-2010, International Business Machines Corporation and others",
                "Copyright (c) 2001, Dr Martin Porter",
                "Copyright (c) 2001-2009 Anders Moeller",
                "Copyright (c) 2002, Richard Boulton",
                "Copyright (c) 2003, Center for Intelligent Information Retrieval, University of Massachusetts, Amherst",
                "Copyright (c) 2006 Dawid Weiss",
                "Copyright (c) 2007-2011 Dawid Weiss, Marcin Milkowski",
                "Copyright (c) 2010, Jean-Philippe Barrette-LaPierre, <jpb@rrette.com>",
                "Copyright (c) 2011 Zygmunt Saloni, Wlodzimierz Gruszczynski, Marcin Wolinski, Robert Wolosz",
                "Copyright (c) 2011-2016, Yann Collet",
                "Copyright 2001-2004 Unicode, Inc."
            ],
            "file-count": 56,
            "sha256": "3ee3e9459aedfa07a717d2815e13c45d843d3daed767229f3311279b6064f1a7",
            "source": "https://search.maven.org/remotecontent?filepath=org/apache/lucene/lucene-sandbox/9.5.0/lucene-sandbox-9.5.0-sources.jar",
            "status": "restricted"
        }
    ]
}
