{
    "id": "nuget/nuget/-/Serilog.Formatting.Compact/2.0.0",
    "license": "Apache-2.0",
    "authority": "https://gitlab.eclipse.org/eclipsefdn/emo-team/iplab/-/issues/13981",
    "source": "https://github.com/serilog/serilog-formatting-compact/archive/refs/tags/v2.0.0.zip",
    "status": "approved",
    "scans": [
        {
            "date": "March 21, 2024 at 5:04:05 p.m. GMT",
            "authority": "https://gitlab.eclipse.org/eclipsefdn/emo-team/iplab/-/issues/13981",
            "scancode-version": "31.2.1",
            "licenses-discovered": [
                "Apache-2.0"
            ],
            "copyrights": [
                "Copyright 2016 Serilog"
            ],
            "file-count": 30,
            "sha256": "c8bf8c91422ef2abdf438b6daa773a5b322957f92a4f1f78c93ce5733cb18073",
            "source": "https://github.com/serilog/serilog-formatting-compact/archive/refs/tags/v2.0.0.zip",
            "status": "approved"
        }
    ]
}