{
    "id": "maven/mavencentral/com.azure.resourcemanager/azure-resourcemanager-storage/2.39.0",
    "license": "MIT",
    "authority": "https://gitlab.eclipse.org/eclipsefdn/emo-team/iplab/-/issues/15088",
    "source": "https://repo1.maven.org/maven2/com/azure/resourcemanager/azure-resourcemanager-storage/2.39.0/azure-resourcemanager-storage-2.39.0-sources.jar",
    "status": "approved",
    "scans": [
        {
            "date": "June 6, 2024 at 10:40:00 a.m. GMT",
            "authority": "https://gitlab.eclipse.org/eclipsefdn/emo-team/iplab/-/issues/15088",
            "scancode-version": "31.2.1",
            "licenses-discovered": [
                "MIT"
            ],
            "copyrights": [
                "(c) 2008 VeriSign, Inc.",
                "Container (c) Access",
                "Copyright (c) Microsoft Corporation"
            ],
            "file-count": 353,
            "sha256": "c56411585d482c6aebaa588ffed407fd859a4640b0ed0e24b0c62ef2093b65dd",
            "source": "https://repo1.maven.org/maven2/com/azure/resourcemanager/azure-resourcemanager-storage/2.39.0/azure-resourcemanager-storage-2.39.0-sources.jar",
            "status": "approved"
        }
    ]
}