{
    "id": "maven/mavencentral/org.springframework/spring-web/6.0.2",
    "license": "Apache-2.0",
    "authority": "https://gitlab.eclipse.org/eclipsefdn/emo-team/iplab/-/issues/5942",
    "source": "https://search.maven.org/remotecontent?filepath=org/springframework/spring-web/6.0.2/spring-web-6.0.2-sources.jar",
    "status": "approved",
    "scans": [
        {
            "date": "December 21, 2022 at 4:36:04 p.m. GMT",
            "authority": "https://gitlab.eclipse.org/eclipsefdn/emo-team/iplab/-/issues/5942",
            "scancode-version": "31.2.1",
            "licenses-discovered": [
                "Apache-2.0"
            ],
            "copyrights": [
                "Copyright 2002-2005 the original author or authors",
                "Copyright 2002-2007 the original author or authors",
                "Copyright 2002-2009 the original author or authors",
                "Copyright 2002-2010 the original author or authors",
                "Copyright 2002-2012 the original author or authors",
                "Copyright 2002-2013 the original author or authors",
                "Copyright 2002-2014 the original author or authors",
                "Copyright 2002-2015 the original author or authors",
                "Copyright 2002-2016 the original author or authors",
                "Copyright 2002-2017 the original author or authors",
                "Copyright 2002-2018 the original author or authors",
                "Copyright 2002-2019 the original author or authors",
                "Copyright 2002-2020 the original author or authors",
                "Copyright 2002-2021 the original author or authors",
                "Copyright 2002-2022 the original author or authors"
            ],
            "file-count": 693,
            "sha256": "b5d5e3ad49e01134fd5f3e1977c2fed9b6f0678eb243db3d02239aaca24138cb",
            "source": "https://search.maven.org/remotecontent?filepath=org/springframework/spring-web/6.0.2/spring-web-6.0.2-sources.jar",
            "status": "approved"
        }
    ]
}