{
    "id": "npm/npmjs/-/deep-freeze/0.0.1",
    "license": "LicenseRef-Public-domain",
    "authority": "https://gitlab.eclipse.org/eclipsefdn/emo-team/iplab/-/issues/11971",
    "source": "https://registry.yarnpkg.com/deep-freeze/-/deep-freeze-0.0.1.tgz",
    "status": "approved",
    "scans": [
        {
            "date": "December 13, 2023 at 6:42:33 p.m. GMT",
            "authority": "https://gitlab.eclipse.org/eclipsefdn/emo-team/iplab/-/issues/11971",
            "scancode-version": "31.2.1",
            "licenses-discovered": [
            ],
            "copyrights": [
            ],
            "file-count": 7,
            "sha256": "8114a49a3e2bc05b612b45248faa07e82efd7da58bb1234fea488c02ebc2bb3d",
            "source": "https://registry.yarnpkg.com/deep-freeze/-/deep-freeze-0.0.1.tgz",
            "status": "restricted"
        }
    ]
}
