{
    "id": "maven/mavencentral/jakarta.xml.rpc/jakarta.xml.rpc-api/1.1.4",
    "license": "(EPL-2.0 OR GPL-2.0-only WITH Classpath-exception-2.0) AND CDDL-1.0",
    "authority": "https://gitlab.eclipse.org/eclipsefdn/emo-team/iplab/-/issues/9822",
    "source": "https://repo.maven.apache.org/maven2/jakarta/xml/rpc/jakarta.xml.rpc-api/1.1.4/jakarta.xml.rpc-api-1.1.4-sources.jar",
    "status": "approved",
    "scans": [
        {
            "date": "July 30, 2023 at 9:53:28 a.m. GMT",
            "authority": "https://gitlab.eclipse.org/eclipsefdn/emo-team/iplab/-/issues/9822",
            "scancode-version": "31.2.1",
            "licenses-discovered": [
                "CDDL-1.0 AND EPL-2.0 AND (GPL-2.0-only WITH Classpath-exception-2.0)",
                "EPL-2.0 AND (GPL-2.0-only WITH Classpath-exception-2.0)"
            ],
            "copyrights": [
                "Copyright (c) 2003, 2018 Oracle and/or its affiliates",
                "Copyright (c) 2012, 2019 Oracle and/or its affiliates",
                "Copyright (c) 2018 Oracle and/or its affiliates",
                "Copyright (c) 2019 Eclipse Foundation"
            ],
            "file-count": 59,
            "sha256": "8b9a1b88fc03e0b44890a361c66cfbd81029e4656f04db817498e9028589d4f8",
            "source": "https://repo.maven.apache.org/maven2/jakarta/xml/rpc/jakarta.xml.rpc-api/1.1.4/jakarta.xml.rpc-api-1.1.4-sources.jar",
            "status": "restricted"
        }
    ]
}
