{
    "id": "npm/npmjs/@catena-x/portal-shared-components/3.1.0",
    "license": "Apache-2.0 AND CC-BY-4.0 AND OFL-1.1",
    "authority": "https://gitlab.eclipse.org/eclipsefdn/emo-team/iplab/-/issues/15945",
    "source": "https://github.com/eclipse-tractusx/portal-shared-components/archive/refs/tags/v3.1.0.zip",
    "status": "approved",
    "scans": [
        {
            "date": "August 14, 2024 at 5:59:29 p.m. GMT",
            "authority": "https://gitlab.eclipse.org/eclipsefdn/emo-team/iplab/-/issues/15945",
            "scancode-version": "31.2.1",
            "licenses-discovered": [
                "Apache-2.0",
                "CC-BY-4.0",
                "CC-BY-4.0 AND Apache-2.0",
                "OFL-1.1"
            ],
            "copyrights": [
                "Copyright (c) 2023 BMW Group AG",
                "Copyright (c) 2023 Contributors",
                "Copyright (c) 2023 Mercedes-Benz Group AG and BMW Group AG",
                "Copyright (c) 2024 BMW Group AG",
                "Copyright (c) 2024 Contributors",
                "Copyright (c) 2024 Mercedes-Benz Group AG and BMW Group AG",
                "Copyright 2020 The LibreFranklin Project"
            ],
            "file-count": 352,
            "sha256": "c8600c703324b3e7ff721fed4b650b358d7f2f1b9d618c8826c5a0706038bfd0",
            "source": "https://github.com/eclipse-tractusx/portal-shared-components/archive/refs/tags/v3.1.0.zip",
            "status": "approved"
        }
    ]
}