{
    "id": "npm/npmjs/@angular-devkit/build-angular/15.2.8",
    "license": "MIT",
    "authority": "https://gitlab.eclipse.org/eclipsefdn/emo-team/iplab/-/issues/8432",
    "source": "https://registry.npmjs.org/@angular-devkit/build-angular/-/build-angular-15.2.8.tgz",
    "status": "approved",
    "scans": [
        {
            "date": "May 10, 2023 at 4:07:32 a.m. GMT",
            "authority": "https://gitlab.eclipse.org/eclipsefdn/emo-team/iplab/-/issues/8432",
            "scancode-version": "31.2.1",
            "licenses-discovered": [
                "MIT",
                "JSON AND MIT"
            ],
            "copyrights": [
                "Copyright (c) 2017 Google, Inc.",
                "Copyright Google LLC"
            ],
            "file-count": 291,
            "sha256": "78f68ac49021ac793f0f4f606351b967b1e5865af2e741f0b902485bc02be653",
            "source": "https://registry.npmjs.org/@angular-devkit/build-angular/-/build-angular-15.2.8.tgz",
            "status": "restricted"
        }
    ]
}
