{
    "id": "npm/npmjs/@inquirer/search/3.0.4",
    "license": "MIT",
    "authority": "https://gitlab.eclipse.org/eclipsefdn/emo-team/iplab/-/issues/18900",
    "source": "https://github.com/SBoudrias/Inquirer.js/archive/refs/tags/v3.0.4.zip",
    "status": "approved",
    "scans": [
        {
            "date": "January 18, 2025 at 3:42:26 p.m. GMT",
            "authority": "https://gitlab.eclipse.org/eclipsefdn/emo-team/iplab/-/issues/18900",
            "scancode-version": "31.2.1",
            "licenses-discovered": [
                "MIT"
            ],
            "copyrights": [
                "Copyright (c) 2012 Simon Boudrias",
                "Copyright (c) 2016 Simon Boudrias (twitter vaxilart (https://twitter.com/Vaxilart))"
            ],
            "file-count": 69,
            "sha256": "0c1b816b5c195a75642acfdc86d169f61ce058f8c06bb5516bc711f133b90ccf",
            "source": "https://github.com/SBoudrias/Inquirer.js/archive/refs/tags/v3.0.4.zip",
            "status": "approved"
        }
    ]
}