{
    "id": "npm/npmjs/@commitlint/lint/17.4.2",
    "license": "MIT",
    "authority": "https://gitlab.eclipse.org/eclipsefdn/emo-team/iplab/-/issues/7075",
    "source": "https://github.com/conventional-changelog/commitlint/archive/v17.4.2.zip",
    "status": "approved",
    "scans": [
        {
            "date": "February 9, 2023 at 5:56:06 p.m. GMT",
            "authority": "https://gitlab.eclipse.org/eclipsefdn/emo-team/iplab/-/issues/7075",
            "scancode-version": "31.2.1",
            "licenses-discovered": [
                "MIT"
            ],
            "copyrights": [
                "Copyright (c) 2016 - present Mario Nebl",
                "Copyright (c) 2022 - present Dan Onoshko",
                "Copyright (c) 2022 - present Florian Guitton"
            ],
            "file-count": 581,
            "sha256": "efbebdd67badb1dbccb7d8a8441ea003197d5c41d6d18f648a1564f919a46368",
            "source": "https://github.com/conventional-changelog/commitlint/archive/v17.4.2.zip",
            "status": "approved"
        }
    ]
}