{
    "id": "go/golang/google.golang.org/grpc/v1.20.1",
    "license": "Apache-2.0",
    "authority": "https://gitlab.eclipse.org/eclipsefdn/emo-team/iplab/-/issues/6056",
    "source": "https://proxy.golang.org/google.golang.org/grpc/@v/v1.20.1.zip",
    "status": "approved",
    "scans": [
        {
            "date": "January 6, 2023 at 5:47:34 p.m. GMT",
            "authority": "https://gitlab.eclipse.org/eclipsefdn/emo-team/iplab/-/issues/6056",
            "scancode-version": "31.2.1",
            "licenses-discovered": [
                "Apache-2.0"
            ],
            "copyrights": [
                "Copyright 2014 gRPC",
                "Copyright 2015 gRPC",
                "Copyright 2015-2016 gRPC",
                "Copyright 2016 gRPC",
                "Copyright 2017 gRPC",
                "Copyright 2018 gRPC",
                "Copyright 2019 gRPC"
            ],
            "file-count": 387,
            "sha256": "7b27109c7a970b5e750a07bc5474f07e6daaffb05c614ab323265b597eb161b2",
            "source": "https://proxy.golang.org/google.golang.org/grpc/@v/v1.20.1.zip",
            "status": "approved"
        }
    ]
}