{
    "id": "git/github/actions/checkout/v3",
    "license": "Apache-2.0 AND BSD-2-Clause AND BSD-3-Clause AND CC0-1.0 AND MIT AND Apache-2.0 AND ISC AND BSD-3-Clause AND (Apache-2.0 AND BSD-3-Clause AND CC0-1.0 AND ISC AND MIT) AND BSD-2-Clause AND (BSD-3-Clause AND MIT)",
    "authority": "https://gitlab.eclipse.org/eclipsefdn/emo-team/iplab/-/issues/7992",
    "source": "https://github.com/actions/checkout/archive/refs/tags/v3.zip",
    "status": "approved",
    "scans": [
        {
            "date": "April 27, 2023 at 2:07:46 p.m. GMT",
            "authority": "https://gitlab.eclipse.org/eclipsefdn/emo-team/iplab/-/issues/7992",
            "scancode-version": "31.2.1",
            "licenses-discovered": [
                "Apache-2.0 AND BSD-2-Clause AND BSD-3-Clause AND CC0-1.0",
                "MIT",
                "Apache-2.0",
                "ISC",
                "BSD-3-Clause",
                "Apache-2.0 AND BSD-3-Clause AND CC0-1.0 AND ISC AND MIT",
                "BSD-2-Clause",
                "BSD-3-Clause AND MIT"
            ],
            "copyrights": [
                "(c) extraPathPercentEncodeSet.has",
                "Copyright (c) 2009-2015 Jeremy Ashkenas, DocumentCloud and Investigative Reporters & Editors",
                "Copyright (c) 2009-2015, Kevin Decker <kpdecker@gmail.com>",
                "Copyright (c) 2009-2021 Jeremy Ashkenas, Julian Gonggrijp, and DocumentCloud and Investigative Reporters & Editors",
                "Copyright (c) 2010-2016 Robert Kieffer and other contributors",
                "Copyright (c) 2010-2020 Robert Kieffer and other contributors",
                "Copyright (c) 2011 TJ Holowaychuk <tj@vision-media.ca>",
                "Copyright (c) 2011-2017 JS Foundation and contributors, https://js.foundation",
                "Copyright (c) 2012 Joshua M. Clulow <josh@sysmgr.org>",
                "Copyright (c) 2012 Koichi Kobayashi",
                "Copyright (c) 2012, Artur Adib <arturadib@gmail.com>",
                "Copyright (c) 2012-2014 Kit Cambridge. http://kitcambridge.be",
                "Copyright (c) 2012-2014, Bram Stein",
                "Copyright (c) 2013 James Halliday",
                "Copyright (c) 2013 Julian Gruber <julian@juliangruber.com>",
                "Copyright (c) 2013 Raynos",
                "Copyright (c) 2013 Thiago de Arruda",
                "Copyright (c) 2014 TJ Holowaychuk <tj@vision-media.ca>",
                "Copyright (c) 2014 Tyler Kellen",
                "Copyright (c) 2014, Domenic Denicola",
                "Copyright (c) 2014, Nathan LaFreniere and other contributors (https://github.com/ljharb/qs/graphs/contributors)",
                "Copyright (c) 2014-2017, Jon Schlinkert",
                "Copyright (c) 2015 Tyler Kellen",
                "Copyright (c) 2015 Zhiye Li",
                "Copyright (c) 2015-2016 Sebastian Mayr",
                "Copyright (c) 2016 David Frank",
                "Copyright (c) 2016 Jordan Harband",
                "Copyright (c) 2016 Zeit, Inc.",
                "Copyright (c) 2018 GitHub, Inc. and contributors",
                "Copyright (c) 2018 Octokit",
                "Copyright (c) 2018, Gregor Martynus (https://github.com/gr2m)",
                "Copyright (c) 2019 Jordan Harband",
                "Copyright (c) 2019 Octokit",
                "Copyright (c) 2019, Jon Schlinkert (https://github.com/jonschlinkert)",
                "Copyright (c) 2020 Jordan Harband",
                "Copyright (c) GitHub, Inc.",
                "Copyright (c) Gregor Martynus and contributors",
                "Copyright (c) Isaac Z. Schlueter",
                "Copyright (c) Isaac Z. Schlueter Autho",
                "Copyright (c) Isaac Z. Schlueter and Contributors",
                "Copyright (c) Microsoft",
                "Copyright (c) Microsoft Corporation",
                "Copyright (c) Sindre Sorhus <sindresorhus@gmail.com> (sindresorhus.com)",
                "Copyright 2010 James Halliday (mail@substack.net)",
                "Copyright 2012-2015 The Dojo Foundation <http://dojofoundation.org/>",
                "Copyright 2018 Gregor Martynus and other contributors",
                "Copyright 2019 GitHub",
                "Copyright 2020 Gregor Martynus",
                "Copyright Joyent, Inc. and other Node contributors",
                "Copyright Mathias Bynens <https://mathiasbynens.be/>",
                "Copyright jQuery Foundation and other contributors <https://jquery.org/>",
                "copyright 2009-2015 Jeremy Ashkenas, DocumentCloud and Investigative Reporters & Editors <http://underscorejs.org/>",
                "copyright Jeremy Ashkenas, DocumentCloud and Investigative Reporters & Editors <http://underscorejs.org/>"
            ],
            "file-count": 99,
            "sha256": "410e5881906cd88b9c5f9473457887f949aefc57d9f1493f8799e0df38ec3813",
            "source": "https://github.com/actions/checkout/archive/refs/tags/v3.zip",
            "status": "approved"
        }
    ]
}