{
    "id": "npm/npmjs/-/typedoc/0.25.13",
    "license": "Apache-2.0 AND MIT",
    "authority": "https://gitlab.eclipse.org/eclipsefdn/emo-team/iplab/-/issues/17822",
    "source": "https://github.com/TypeStrong/typedoc/archive/refs/tags/v0.25.13.zip",
    "status": "approved",
    "scans": [
        {
            "date": "December 11, 2024 at 2:08:19 p.m. GMT",
            "authority": "https://gitlab.eclipse.org/eclipsefdn/emo-team/iplab/-/issues/17822",
            "scancode-version": "31.2.1",
            "licenses-discovered": [
                "Apache-2.0",
                "MIT"
            ],
            "copyrights": [
                "(c) 2010-2015 Jeremy Ashkenas, DocumentCloud and Investigative Reporters & Editors Backbone"
            ],
            "file-count": 556,
            "sha256": "bc8c5fd869fa92cf2cf50ff9cd55f4fdee9e8e048d52e8e05b12c92d3bf18bc7",
            "source": "https://github.com/TypeStrong/typedoc/archive/refs/tags/v0.25.13.zip",
            "status": "approved"
        }
    ]
}