{
    "license": "",
    "file-count": 0,
    "authority": "https://gitlab.eclipse.org/eclipsefdn/emo-team/iplab/-/issues/973",
    "scancode-version": "21.3.31",
    "licenses-discovered": [
    ],
    "id": "maven/mavencentral/org.webjars.npm/mxgraph/3.9.8",
    "source": "https://search.maven.org/remotecontent?filepath=org/webjars/npm/mxgraph/3.9.8/mxgraph-3.9.8-sources.jar",
    "status": "restricted"
}