{
    "id": "go/golang/github.com/hashicorp%2Fterraform-plugin-framework/v1.4.2",
    "license": "MPL-2.0 AND (MPL-1.1 AND MPL-2.0)",
    "authority": "https://gitlab.eclipse.org/eclipsefdn/emo-team/iplab/-/issues/14439",
    "source": "https://proxy.golang.org/github.com/hashicorp%2Fterraform-plugin-framework/@v/v1.4.2.zip",
    "status": "approved",
    "scans": [
        {
            "date": "April 18, 2024 at 9:15:11 p.m. GMT",
            "authority": "https://gitlab.eclipse.org/eclipsefdn/emo-team/iplab/-/issues/14439",
            "scancode-version": "31.2.1",
            "licenses-discovered": [
                "MPL-2.0",
                "MPL-1.1 AND MPL-2.0"
            ],
            "copyrights": [
                "Copyright (c) 2021 HashiCorp, Inc.",
                "Copyright (c) HashiCorp, Inc."
            ],
            "file-count": 1174,
            "sha256": "23d43562da821876e8839b9b28c721a339277833e5d625bd9e914e100bd5e472",
            "source": "https://proxy.golang.org/github.com/hashicorp%2Fterraform-plugin-framework/@v/v1.4.2.zip",
            "status": "approved"
        }
    ]
}