{
    "id": "go/golang/github.com%2Ffsnotify/fsnotify/v1.4.7",
    "license": "BSD-3-Clause",
    "authority": "https://gitlab.eclipse.org/eclipsefdn/emo-team/iplab/-/issues/6116",
    "source": "https://proxy.golang.org/github.com%2Ffsnotify/fsnotify/@v/v1.4.7.zip",
    "status": "approved",
    "scans": [
        {
            "date": "January 5, 2023 at 9:45:58 p.m. GMT",
            "authority": "https://gitlab.eclipse.org/eclipsefdn/emo-team/iplab/-/issues/6116",
            "scancode-version": "31.2.1",
            "licenses-discovered": [
                "BSD-3-Clause"
            ],
            "copyrights": [
                "Copyright (c) 2012 The Go Authors",
                "Copyright (c) 2012 fsnotify Authors",
                "Copyright 2010 The Go Authors",
                "Copyright 2011 The Go Authors",
                "Copyright 2012 The Go Authors",
                "Copyright 2013 The Go Authors",
                "Copyright 2015 The Go Authors",
                "Copyright 2016 The Go Authors"
            ],
            "file-count": 22,
            "sha256": "1d09ad8f3dc41cb6e0288023b47272c1c9393ca411e48f4b5009bca6662dc3ad",
            "source": "https://proxy.golang.org/github.com%2Ffsnotify/fsnotify/@v/v1.4.7.zip",
            "status": "approved"
        }
    ]
}