{
    "id": "maven/mavencentral/io.fabric8/kubernetes-model-extensions/6.6.0",
    "license": "Apache-2.0",
    "authority": "https://gitlab.eclipse.org/eclipsefdn/emo-team/iplab/-/issues/8369",
    "source": "https://search.maven.org/remotecontent?filepath=io/fabric8/kubernetes-model-extensions/6.6.0/kubernetes-model-extensions-6.6.0-sources.jar",
    "status": "approved",
    "scans": [
        {
            "date": "May 5, 2023 at 5:01:25 a.m. GMT",
            "authority": "https://gitlab.eclipse.org/eclipsefdn/emo-team/iplab/-/issues/8369",
            "scancode-version": "31.2.1",
            "licenses-discovered": [
                "Apache-2.0"
            ],
            "copyrights": [
                "Copyright (c) 2015 Red Hat, Inc."
            ],
            "file-count": 177,
            "sha256": "f2b3267679f65b413ec58fbd762e077295ede72267b29a82103923ebd441ec96",
            "source": "https://search.maven.org/remotecontent?filepath=io/fabric8/kubernetes-model-extensions/6.6.0/kubernetes-model-extensions-6.6.0-sources.jar",
            "status": "approved"
        }
    ]
}