{
    "id": "maven/mavencentral/org.junit.platform/junit-platform-launcher/1.10.2",
    "license": "EPL-2.0",
    "authority": "https://gitlab.eclipse.org/eclipsefdn/emo-team/iplab/-/issues/15216",
    "source": "https://repo1.maven.org/maven2/org/junit/platform/junit-platform-launcher/1.10.2/junit-platform-launcher-1.10.2-sources.jar",
    "status": "approved",
    "scans": [
        {
            "date": "June 14, 2024 at 10:36:35 a.m. GMT",
            "authority": "https://gitlab.eclipse.org/eclipsefdn/emo-team/iplab/-/issues/15216",
            "scancode-version": "31.2.1",
            "licenses-discovered": [
                "EPL-2.0"
            ],
            "copyrights": [
                "Copyright 2015-2021 the original author or authors",
                "Copyright 2015-2023 the original author or authors"
            ],
            "file-count": 85,
            "sha256": "d3c84fbec86b224e0d2bd49e9335978bdeb6aead9f17cbee4f0e2e8885c7ab89",
            "source": "https://repo1.maven.org/maven2/org/junit/platform/junit-platform-launcher/1.10.2/junit-platform-launcher-1.10.2-sources.jar",
            "status": "approved"
        }
    ]
}