{
    "id": "maven/mavencentral/software.amazon.awssdk/secretsmanager/2.20.91",
    "license": "Apache-2.0",
    "authority": "https://gitlab.eclipse.org/eclipsefdn/emo-team/iplab/-/issues/9688",
    "source": "https://repo.maven.apache.org/maven2/software/amazon/awssdk/secretsmanager/2.20.91/secretsmanager-2.20.91-sources.jar",
    "status": "approved",
    "scans": [
        {
            "date": "July 20, 2023 at 10:43:02 a.m. GMT",
            "authority": "https://gitlab.eclipse.org/eclipsefdn/emo-team/iplab/-/issues/9688",
            "scancode-version": "31.2.1",
            "licenses-discovered": [
                "Apache-2.0"
            ],
            "copyrights": [
                "Copyright Amazon.com, Inc. or its affiliates"
            ],
            "file-count": 191,
            "sha256": "0a11ccf4b4801414d64475b180858a3b123af4f389c256e02ab377b2c52264e8",
            "source": "https://repo.maven.apache.org/maven2/software/amazon/awssdk/secretsmanager/2.20.91/secretsmanager-2.20.91-sources.jar",
            "status": "approved"
        }
    ]
}