{
    "id": "git/github/ugorji/go/v1.1.7",
    "license": "MIT",
    "licenses-discovered": [
        "MIT"
    ],
    "copyrights": [
        "Copyright (c) Ugorji Nwoke"
    ],
    "file-count": 92,
    "scancode-version": "30.1.0",
    "authority": "https://gitlab.eclipse.org/eclipsefdn/emo-team/iplab/-/issues/3620",
    "source": "https://github.com/ugorji/go/archive/refs/tags/v1.1.7.zip",
    "status": "approved"
}