{
    "id": "maven/mavencentral/net.bytebuddy/byte-buddy-agent/1.16.0",
    "license": "Apache-2.0",
    "authority": "https://gitlab.eclipse.org/eclipsefdn/emo-team/iplab/-/issues/18887",
    "source": "https://repo1.maven.org/maven2/net/bytebuddy/byte-buddy-agent/1.16.0/byte-buddy-agent-1.16.0-sources.jar",
    "status": "approved",
    "scans": [
        {
            "date": "January 18, 2025 at 7:00:08 a.m. GMT",
            "authority": "https://gitlab.eclipse.org/eclipsefdn/emo-team/iplab/-/issues/18887",
            "scancode-version": "31.2.1",
            "licenses-discovered": [
                "Apache-2.0"
            ],
            "copyrights": [
                "Copyright 2014 - Present Rafael Winterhalter"
            ],
            "file-count": 16,
            "sha256": "1ca691805f6d42f9c11dca95a3005c0965fb829b26178ee1559343ade38aec00",
            "source": "https://repo1.maven.org/maven2/net/bytebuddy/byte-buddy-agent/1.16.0/byte-buddy-agent-1.16.0-sources.jar",
            "status": "approved"
        }
    ]
}