{
    "id": "maven/mavencentral/io.fabric8/servicecatalog-model/6.11.0",
    "license": "Apache-2.0",
    "authority": "https://gitlab.eclipse.org/eclipsefdn/emo-team/iplab/-/issues/14146",
    "source": "https://repo1.maven.org/maven2/io/fabric8/servicecatalog-model/6.11.0/servicecatalog-model-6.11.0-sources.jar",
    "status": "approved",
    "scans": [
        {
            "date": "March 26, 2024 at 3:00:01 p.m. GMT",
            "authority": "https://gitlab.eclipse.org/eclipsefdn/emo-team/iplab/-/issues/14146",
            "scancode-version": "31.2.1",
            "licenses-discovered": [
                "Apache-2.0"
            ],
            "copyrights": [
                "Copyright (c) 2015 Red Hat, Inc."
            ],
            "file-count": 174,
            "sha256": "673f83a9f2a68bdc9561739f2e29ffff9df4dcdfefa47663ef274530aeb017fd",
            "source": "https://repo1.maven.org/maven2/io/fabric8/servicecatalog-model/6.11.0/servicecatalog-model-6.11.0-sources.jar",
            "status": "approved"
        }
    ]
}