{
    "id": "maven/mavencentral/org.apache.accumulo/accumulo-hadoop-mapreduce/2.0.1",
    "license": "Apache-2.0",
    "authority": "https://gitlab.eclipse.org/eclipsefdn/emo-team/iplab/-/issues/6522",
    "source": "https://search.maven.org/remotecontent?filepath=org/apache/accumulo/accumulo-hadoop-mapreduce/2.0.1/accumulo-hadoop-mapreduce-2.0.1-sources.jar",
    "status": "approved",
    "scans": [
        {
            "date": "January 26, 2023 at 4:51:46 a.m. GMT",
            "authority": "https://gitlab.eclipse.org/eclipsefdn/emo-team/iplab/-/issues/6522",
            "scancode-version": "31.2.1",
            "licenses-discovered": [
                "Apache-2.0"
            ],
            "copyrights": [
            ],
            "file-count": 35,
            "sha256": "58322dc4f4619c401f75171af52efc91d97625766133a08ce7c0de3daabbedd4",
            "source": "https://search.maven.org/remotecontent?filepath=org/apache/accumulo/accumulo-hadoop-mapreduce/2.0.1/accumulo-hadoop-mapreduce-2.0.1-sources.jar",
            "status": "approved"
        }
    ]
}