{
    "id": "pypi/pypi/-/pytest/8.1.1",
    "license": "MIT",
    "authority": "https://gitlab.eclipse.org/eclipsefdn/emo-team/iplab/-/issues/19365",
    "source": "https://files.pythonhosted.org/packages/30/b7/7d44bbc04c531dcc753056920e0988032e5871ac674b5a84cb979de6e7af/pytest-8.1.1.tar.gz",
    "status": "approved",
    "scans": [
        {
            "date": "February 8, 2025 at 7:58:09 p.m. GMT",
            "authority": "https://gitlab.eclipse.org/eclipsefdn/emo-team/iplab/-/issues/19365",
            "scancode-version": "31.2.1",
            "licenses-discovered": [
                "MIT",
                "JSON AND MIT"
            ],
            "copyrights": [
                "Copyright (c) 2004 Holger Krekel and others",
                "Copyright (c) 2014, Gregory Boissinot",
                "Copyright Holger Krekel and others, 2004",
                "copyright 2015, holger krekel and pytest-dev team"
            ],
            "file-count": 593,
            "sha256": "ac978141a75948948817d360297b7aae0fcb9d6ff6bc9ec6d514b85d5a65c044",
            "source": "https://files.pythonhosted.org/packages/30/b7/7d44bbc04c531dcc753056920e0988032e5871ac674b5a84cb979de6e7af/pytest-8.1.1.tar.gz",
            "status": "restricted"
        }
    ]
}