{
    "id": "npm/npmjs/@octokit/types/12.4.0",
    "license": "MIT AND (CC0-1.0 AND MIT)",
    "authority": "https://gitlab.eclipse.org/eclipsefdn/emo-team/iplab/-/issues/11950",
    "source": "https://github.com/octokit/types.ts/archive/refs/tags/v12.4.0.zip",
    "status": "approved",
    "scans": [
        {
            "date": "December 13, 2023 at 9:28:17 p.m. GMT",
            "authority": "https://gitlab.eclipse.org/eclipsefdn/emo-team/iplab/-/issues/11950",
            "scancode-version": "31.2.1",
            "licenses-discovered": [
                "MIT",
                "CC0-1.0 AND MIT"
            ],
            "copyrights": [
                "Copyright (c) 2019 Octokit"
            ],
            "file-count": 52,
            "sha256": "f1723857ac055c3d71ed7afddaa6fe95eaef9c8cc9d072e3b799e62a6e7367e7",
            "source": "https://github.com/octokit/types.ts/archive/refs/tags/v12.4.0.zip",
            "status": "approved"
        }
    ]
}