{
    "id": "npm/npmjs/@mui/private-theming/5.11.2",
    "license": "MIT AND OFL-1.1 AND CC-BY-3.0",
    "authority": "https://gitlab.eclipse.org/eclipsefdn/emo-team/iplab/-/issues/6629",
    "source": "https://github.com/mui/material-ui/archive/v5.11.2.zip",
    "status": "approved",
    "scans": [
        {
            "date": "January 25, 2023 at 3:03:49 p.m. GMT",
            "authority": "https://gitlab.eclipse.org/eclipsefdn/emo-team/iplab/-/issues/6629",
            "scancode-version": "31.2.1",
            "licenses-discovered": [
                "MIT",
                "AFL-3.0 AND AGPL-1.0-only AND AGPL-3.0-only AND AGPL-3.0-or-later AND APSL-1.0 AND APSL-1.1 AND Apache-1.1 AND Apache-2.0 AND BSD-2-Clause AND BSD-2-Clause-Patent AND BSD-2-Clause-Views AND BSD-3-Clause AND BSD-3-Clause-No-Nuclear-Warranty AND BSD-4-Clause AND BSD-4-Clause-UC AND CC-BY-SA-2.0 AND CC-BY-SA-4.0 AND CC0-1.0 AND CDDL-1.0 AND CDDL-1.1 AND CECILL-2.0 AND CECILL-2.1 AND CPOL-1.02 AND EFL-2.0 AND EPL-1.0 AND Frameworx-1.0 AND (GPL-2.0-only WITH Classpath-exception-2.0) AND HPND AND HaskellReport AND IBM-pibs AND ISC AND Interbase-1.0 AND LZMA-exception AND LicenseRef-scancode-d-fsl-1.0-en AND LicenseRef-scancode-free-unknown AND LicenseRef-scancode-proprietary-license AND LicenseRef-scancode-unknown AND MIT AND MS-PL AND MS-RL AND NGPL AND Spencer-86 AND TMate AND Unlicense AND WTFPL AND Zimbra-1.3 AND Zimbra-1.4",
                "LicenseRef-scancode-free-unknown",
                "LGPL-2.0-or-later AND MIT",
                "LicenseRef-scancode-commercial-license",
                "OFL-1.1",
                "CC-BY-3.0"
            ],
            "copyrights": [
                "(c) Sindre Sorhus",
                "Copyright (c) 2005 Tom Wu",
                "Copyright (c) 2005-2009 Tom Wu",
                "Copyright (c) 2007 Kris Zyp SitePen (www.sitepen.com)",
                "Copyright (c) 2011-2017 KARASZI Istvan <github@spam.raszi.hu>",
                "Copyright (c) 2012, Mark Cavage",
                "Copyright (c) 2012-2014 TJ Holowaychuk",
                "Copyright (c) 2013 Ted Unangst <tedu@openbsd.org>",
                "Copyright (c) 2013, Yahoo! Inc.",
                "Copyright (c) 2013-present, Facebook, Inc.",
                "Copyright (c) 2014 Call-Em-All",
                "Copyright (c) 2014 Jon Schlinkert",
                "Copyright (c) 2014 Jonathan Ong",
                "Copyright (c) 2014-2015, Jon Schlinkert",
                "Copyright (c) 2014-2017, Jon Schlinkert",
                "Copyright (c) 2014-2018, Jon Schlinkert",
                "Copyright (c) 2015 Douglas Christopher Wilson",
                "Copyright (c) 2015 Jed Watson",
                "Copyright (c) 2015 Jon Schlinkert",
                "Copyright (c) 2015, Jon Schlinkert",
                "Copyright (c) 2015, Salesforce.com, Inc.",
                "Copyright (c) 2015-2016, Jon Schlinkert",
                "Copyright (c) 2015-2017, Jon Schlinkert",
                "Copyright (c) 2015-2018, Jon Schlinkert",
                "Copyright (c) 2019 Kristoffer K.",
                "Copyright (c) Marak Squires",
                "Copyright (c) Microsoft Corporation",
                "Copyright (c) Sindre Sorhus <sindresorhus@gmail.com> (sindresorhus.com)",
                "Copyright (c) color inherit https://mui.com/",
                "Copyright 1997 Niels Provos <provos@physnet.uni-hamburg.de>",
                "Copyright 2009-2016 Jeremy Ashkenas, DocumentCloud and Investigative Reporters & Editors",
                "Copyright 2010 LearnBoost <dev@learnboost.com>",
                "Copyright 2010-2012 Mikeal Rogers",
                "Copyright 2011 Mark Cavage <mcavage@gmail.com>",
                "Copyright 2012 Joyent, Inc.",
                "Copyright 2012-2016 The Dojo Foundation <http://dojofoundation.org/>",
                "Copyright 2015 Joyent, Inc.",
                "Copyright 2015 Kyle E. Mitchell",
                "Copyright 2016 Joyent, Inc.",
                "Copyright 2016, Joyent Inc",
                "Copyright 2017 Joyent, Inc.",
                "Copyright 2018 IBM Corp.",
                "Copyright 2020",
                "Copyright 2022",
                "Copyright JS Foundation and other contributors <https://js.foundation/>",
                "Copyright JS Foundation and other contributors, https://js.foundation",
                "Copyright Jeremy Ashkenas, DocumentCloud and Investigative Reporters & Editors",
                "Copyright Joyent, Inc. and other Node contributors",
                "Copyright jQuery Foundation and other contributors <https://jquery.org/>",
                "copyright (c) 2018 Denis Pushkarev"
            ],
            "file-count": 40862,
            "sha256": "666bb11fdad40039919c40e8614b97c4b846bb8046ff8defec541085e3280ee0",
            "source": "https://github.com/mui/material-ui/archive/v5.11.2.zip",
            "status": "restricted"
        }
    ]
}
