{
    "id": "maven/mavencentral/org.apache.xmlbeans/xmlbeans/3.1.0",
    "license": "Apache-2.0 AND Apache-1.1",
    "authority": "https://gitlab.eclipse.org/eclipsefdn/emo-team/iplab/-/issues/12095",
    "source": "https://repo1.maven.org/maven2/org/apache/xmlbeans/xmlbeans/3.1.0/xmlbeans-3.1.0-sources.jar",
    "status": "approved",
    "scans": [
        {
            "date": "December 15, 2023 at 2:25:43 p.m. GMT",
            "authority": "https://gitlab.eclipse.org/eclipsefdn/emo-team/iplab/-/issues/12095",
            "scancode-version": "31.2.1",
            "licenses-discovered": [
                "Apache-2.0",
                "Apache-1.1",
                "Apache-2.0 AND LicenseRef-scancode-proprietary-license"
            ],
            "copyrights": [
                "Copyright (c) 2003 The Apache Software Foundation",
                "Copyright 2004 The Apache Software Foundation",
                "Copyright 2004-2018 The Apache Software Foundation",
                "Copyright 2017, 2018 The Apache Software Foundation",
                "Copyright 2019 The Apache Software Foundation",
                "SchemaAnnotationImpl (c) Retrieving",
                "SchemaAttributeGroupImpl (c) SchemaAnnotationImpl",
                "SchemaModelGroupImpl (c) SchemaAnnotationImpl",
                "copyright (c) 2003 BEA Systems Inc., <http://www.bea.com/>"
            ],
            "file-count": 1331,
            "sha256": "be30967a0851a18239f504c24b85254273a6125ed5911603a9c8f897d2409e0b",
            "source": "https://repo1.maven.org/maven2/org/apache/xmlbeans/xmlbeans/3.1.0/xmlbeans-3.1.0-sources.jar",
            "status": "restricted"
        }
    ]
}
