{
    "id": "maven/mavencentral/org.bytedeco/libdc1394/2.2.6-1.5.8",
    "license": "Apache-2.0 AND GPL-2.0 WITH Classpath-exception-2.0",
    "authority": "https://gitlab.eclipse.org/eclipsefdn/emo-team/iplab/-/issues/6844",
    "source": "https://search.maven.org/remotecontent?filepath=org/bytedeco/libdc1394/2.2.6-1.5.8/libdc1394-2.2.6-1.5.8-sources.jar",
    "status": "approved",
    "scans": [
        {
            "date": "January 27, 2023 at 8:56:25 p.m. GMT",
            "authority": "https://gitlab.eclipse.org/eclipsefdn/emo-team/iplab/-/issues/6844",
            "scancode-version": "31.2.1",
            "licenses-discovered": [
                "LGPL-2.1-or-later",
                "Apache-2.0 AND (GPL-2.0-or-later WITH Classpath-exception-2.0)"
            ],
            "copyrights": [
                "Copyright (c) 2000 Carnegie Mellon University",
                "Copyright (c) 2000-2001 SMART Technologies Inc.",
                "Copyright (c) 2001-2004",
                "Copyright (c) 2004- Nara Institute of Science and Technology",
                "Copyright (c) 2006- Massachussets Institute of Technology",
                "Copyright (c) 2013-2020 Samuel Audet"
            ],
            "file-count": 23,
            "sha256": "05b88ad17aedd836549208834ef14cb178563a221194961af1adccce11acc095",
            "source": "https://search.maven.org/remotecontent?filepath=org/bytedeco/libdc1394/2.2.6-1.5.8/libdc1394-2.2.6-1.5.8-sources.jar",
            "status": "restricted"
        }
    ]
}
