{
    "id": "npm/npmjs/-/msw/0.39.2",
    "license": "MIT",
    "licenses-discovered": [
        "MIT"
    ],
    "copyrights": [
        "Copyright (c) Artem Zakharchenko"
    ],
    "file-count": 416,
    "scancode-version": "30.1.0",
    "authority": "https://gitlab.eclipse.org/eclipsefdn/emo-team/iplab/-/issues/3304",
    "source": "https://github.com/mswjs/msw/archive/v0.39.2.zip",
    "status": "approved"
}