{
    "id": "maven/mavencentral/jakarta.interceptor/jakarta.interceptor-api/1.2.5",
    "license": "EPL-2.0 OR GPL-2.0-only WITH Classpath-exception-2.0",
    "authority": "https://gitlab.eclipse.org/eclipsefdn/emo-team/iplab/-/issues/8104",
    "source": "https://search.maven.org/remotecontent?filepath=jakarta/interceptor/jakarta.interceptor-api/1.2.5/jakarta.interceptor-api-1.2.5-sources.jar",
    "status": "approved",
    "scans": [
        {
            "date": "May 2, 2023 at 8:19:24 p.m. GMT",
            "authority": "https://gitlab.eclipse.org/eclipsefdn/emo-team/iplab/-/issues/8104",
            "scancode-version": "31.2.1",
            "licenses-discovered": [
                "CDDL-1.0 AND EPL-2.0 AND (GPL-2.0-only WITH Classpath-exception-2.0)",
                "EPL-2.0 AND (GPL-2.0-only WITH Classpath-exception-2.0)",
                "EPL-2.0 AND (GPL-2.0-only WITH Classpath-exception-2.0) AND LicenseRef-scancode-generic-export-compliance"
            ],
            "copyrights": [
                "Copyright (c) 1989, 1991 Free Software Foundation, Inc.",
                "Copyright (c) 1997, 2018 Oracle and/or its affiliates",
                "Copyright (c) 2009, 2018 Oracle and/or its affiliates",
                "Copyright (c) 2012, 2019 Oracle and/or its affiliates",
                "Copyright (c) 2013, 2018 Oracle and/or its affiliates",
                "Copyright (c) 2019 Eclipse Foundation",
                "copyrighted by the Free Software Foundation"
            ],
            "file-count": 16,
            "sha256": "4a9dd38a6590ba63370ed1854a01893f94e73d9c666f3ecaddcb716f6e8de5f5",
            "source": "https://search.maven.org/remotecontent?filepath=jakarta/interceptor/jakarta.interceptor-api/1.2.5/jakarta.interceptor-api-1.2.5-sources.jar",
            "status": "restricted"
        }
    ]
}
