{
    "id": "npm/npmjs/@volar/language-core/2.2.0-alpha.6",
    "license": "MIT",
    "authority": "https://gitlab.eclipse.org/eclipsefdn/emo-team/iplab/-/issues/14242",
    "source": "https://github.com/volarjs/volar.js/archive/refs/tags/v2.2.0-alpha.6.zip",
    "status": "approved",
    "scans": [
        {
            "date": "April 8, 2024 at 3:06:31 p.m. GMT",
            "authority": "https://gitlab.eclipse.org/eclipsefdn/emo-team/iplab/-/issues/14242",
            "scancode-version": "31.2.1",
            "licenses-discovered": [
                "MIT"
            ],
            "copyrights": [
                "Copyright (c) 2021-present Johnson Chu",
                "Copyright (c) 2023-present Johnson Chu"
            ],
            "file-count": 193,
            "sha256": "d75b4a1c80578a45267cc010619c8afbbb50b2bd897e392e8647a929aa4c3c0e",
            "source": "https://github.com/volarjs/volar.js/archive/refs/tags/v2.2.0-alpha.6.zip",
            "status": "approved"
        }
    ]
}