{
    "id": "maven/mavencentral/software.amazon.awssdk/secretsmanager/2.29.24",
    "license": "Apache-2.0",
    "authority": "https://gitlab.eclipse.org/eclipsefdn/emo-team/iplab/-/issues/17628",
    "source": "https://repo1.maven.org/maven2/software/amazon/awssdk/secretsmanager/2.29.24/secretsmanager-2.29.24-sources.jar",
    "status": "approved",
    "scans": [
        {
            "date": "December 4, 2024 at 4:41:58 a.m. GMT",
            "authority": "https://gitlab.eclipse.org/eclipsefdn/emo-team/iplab/-/issues/17628",
            "scancode-version": "31.2.1",
            "licenses-discovered": [
                "Apache-2.0"
            ],
            "copyrights": [
                "Copyright Amazon.com, Inc. or its affiliates"
            ],
            "file-count": 216,
            "sha256": "bf5b3ca0f186296d90fc8ea33dd2cafd83bf1d2361819a74490298cffd6b870a",
            "source": "https://repo1.maven.org/maven2/software/amazon/awssdk/secretsmanager/2.29.24/secretsmanager-2.29.24-sources.jar",
            "status": "approved"
        }
    ]
}