{
    "id": "maven/mavencentral/jakarta.transaction/jakarta.transaction-api/1.3.3",
    "license": "EPL-2.0 OR GPL-2.0 WITH Classpath-exception-2.0",
    "authority": "https://gitlab.eclipse.org/eclipsefdn/emo-team/iplab/-/issues/7701",
    "source": "https://search.maven.org/remotecontent?filepath=jakarta/transaction/jakarta.transaction-api/1.3.3/jakarta.transaction-api-1.3.3-sources.jar",
    "status": "approved",
    "scans": [
        {
            "date": "March 29, 2023 at 4:47:25 p.m. GMT",
            "authority": "https://gitlab.eclipse.org/eclipsefdn/emo-team/iplab/-/issues/7701",
            "scancode-version": "31.2.1",
            "licenses-discovered": [
                "CDDL-1.0 AND EPL-2.0 AND (GPL-2.0-only WITH Classpath-exception-2.0)",
                "EPL-2.0 AND (GPL-2.0-only WITH Classpath-exception-2.0)"
            ],
            "copyrights": [
                "Copyright (c) 1997, 2018 Oracle and/or its affiliates",
                "Copyright (c) 2010, 2018 Oracle and/or its affiliates",
                "Copyright (c) 2012, 2018 Oracle and/or its affiliates",
                "Copyright (c) 2013, 2018 Oracle and/or its affiliates",
                "Copyright (c) 2019 Eclipse Foundation"
            ],
            "file-count": 21,
            "sha256": "49c508684aec028e4631dd8df4cc39ccda6f3d8fa5226e7bccc14c4e78bc8a52",
            "source": "https://search.maven.org/remotecontent?filepath=jakarta/transaction/jakarta.transaction-api/1.3.3/jakarta.transaction-api-1.3.3-sources.jar",
            "status": "restricted"
        }
    ]
}
