{
    "id": "maven/mavencentral/com.vaadin/vaadin-core/24.3.7",
    "license": "Apache-2.0",
    "authority": "https://gitlab.eclipse.org/eclipsefdn/emo-team/iplab/-/issues/13766",
    "source": "https://repo1.maven.org/maven2/com/vaadin/vaadin-core/24.3.7/vaadin-core-24.3.7.jar",
    "status": "approved",
    "scans": [
        {
            "date": "March 15, 2024 at 1:34:10 p.m. GMT",
            "authority": "https://gitlab.eclipse.org/eclipsefdn/emo-team/iplab/-/issues/13766",
            "scancode-version": "31.2.1",
            "licenses-discovered": [
                "Apache-2.0"
            ],
            "copyrights": [
            ],
            "file-count": 3,
            "sha256": "545b875f94d96f7aa9bf9f1d6085095339bfe96111fee51d4fe689dc6ecc0b4f",
            "source": "https://repo1.maven.org/maven2/com/vaadin/vaadin-core/24.3.7/vaadin-core-24.3.7.jar",
            "status": "approved"
        }
    ]
}