{
    "id": "npm/npmjs/@types/cacheable-request/6.0.3",
    "license": "MIT",
    "authority": "https://gitlab.eclipse.org/eclipsefdn/emo-team/iplab/-/issues/4993",
    "source": "https://registry.npmjs.org/@types/cacheable-request/-/cacheable-request-6.0.3.tgz",
    "status": "approved",
    "scans": [
        {
            "date": "November 17, 2022 at 6:26:27 p.m. GMT",
            "authority": "https://gitlab.eclipse.org/eclipsefdn/emo-team/iplab/-/issues/4993",
            "scancode-version": "31.2.1",
            "licenses-discovered": [
                "MIT"
            ],
            "copyrights": [
                "Copyright (c) Microsoft Corporation"
            ],
            "file-count": 4,
            "sha256": "4534a252c5e75b5dcc7545a9c6557ce5dbc963e43dc18b8087f41e5f77758f9c",
            "source": "https://registry.npmjs.org/@types/cacheable-request/-/cacheable-request-6.0.3.tgz",
            "status": "approved"
        }
    ]
}