{
    "id": "project/dt.aas4j/-/eclipse-aas4j/0.0",
    "license": "Apache-2.0 AND MIT",
    "licenses-discovered": [
        "Apache-2.0 AND CC-BY-3.0 AND LicenseRef-scancode-free-unknown",
        "Apache-2.0",
        "MIT"
    ],
    "copyrights": [
        "Copyright (c) 2005-2020 The OPC Foundation, Inc.",
        "Copyright (c) 2005-2021 The OPC Foundation, Inc.",
        "Copyright (c) 2021 Fraunhofer-Gesellschaft zur Foerderung",
        "Copyright 2020 Fraunhofer IAIS"
    ],
    "file-count": 1301,
    "scancode-version": "31.2.1",
    "authority": "https://gitlab.eclipse.org/eclipsefdn/emo-team/iplab/-/issues/4689",
    "source": "https://github.com/eclipse-aas4j/aas4j/archive/refs/heads/main.zip",
    "status": "approved"
}
