{
    "id": "npm/npmjs/-/react-icons/5.1.0",
    "license": "Apache-2.0 AND CC-BY-3.0 AND CC-BY-4.0 AND CC-BY-SA-3.0 AND CC0-1.0 AND ISC AND MIT AND MPL-2.0 AND OFL-1.1 AND MIT AND (Apache-2.0 AND CC-BY-3.0 AND CC-BY-4.0 AND CC-BY-SA-3.0 AND CC0-1.0 AND MIT AND OFL-1.1)",
    "authority": "https://gitlab.eclipse.org/eclipsefdn/emo-team/iplab/-/issues/14386",
    "source": "https://registry.yarnpkg.com/react-icons/-/react-icons-5.1.0.tgz",
    "status": "approved",
    "scans": [
        {
            "date": "April 16, 2024 at 10:00:36 a.m. GMT",
            "authority": "https://gitlab.eclipse.org/eclipsefdn/emo-team/iplab/-/issues/14386",
            "scancode-version": "31.2.1",
            "licenses-discovered": [
                "Apache-2.0 AND CC-BY-3.0 AND CC-BY-4.0 AND CC-BY-SA-3.0 AND CC0-1.0 AND ISC AND MIT AND MPL-2.0 AND OFL-1.1",
                "MIT",
                "Apache-2.0 AND CC-BY-3.0 AND CC-BY-4.0 AND CC-BY-SA-3.0 AND CC0-1.0 AND MIT AND OFL-1.1"
            ],
            "copyrights": [
                "Copyright 2018"
            ],
            "file-count": 143,
            "sha256": "69b2bff021e9ed06af17f9f0404c62ed55a2d78a61715e74ad5ce5b7f9b34f05",
            "source": "https://registry.yarnpkg.com/react-icons/-/react-icons-5.1.0.tgz",
            "status": "approved"
        }
    ]
}