{
    "id": "npm/npmjs/-/core-js/3.27.0",
    "license": "MIT AND BSD-3-Clause",
    "authority": "https://gitlab.eclipse.org/eclipsefdn/emo-team/iplab/-/issues/6010",
    "source": "https://github.com/zloirock/core-js/archive/v3.27.0.zip",
    "status": "approved",
    "scans": [
        {
            "date": "December 28, 2022 at 4:07:37 a.m. GMT",
            "authority": "https://gitlab.eclipse.org/eclipsefdn/emo-team/iplab/-/issues/6010",
            "scancode-version": "31.2.1",
            "licenses-discovered": [
                "MIT",
                "JSON",
                "BSD-3-Clause"
            ],
            "copyrights": [
                "(c) 2014-2022 Denis Pushkarev",
                "(c) web-platform-tests contributors",
                "(c) zbar', base about:blank', href http://example.com/foo",
                "Copyright (c) 2014-2022 Denis Pushkarev",
                "copyright (c) 2014-2022 Denis Pushkarev"
            ],
            "file-count": 3610,
            "sha256": "a247fdf8a13286e9bba4084b0af270369e698f41f0631a8fb6d6c115c321b949",
            "source": "https://github.com/zloirock/core-js/archive/v3.27.0.zip",
            "status": "restricted"
        }
    ]
}
