{
    "id": "maven/mavencentral/org.robolectric/annotations/4.14.1",
    "license": "Apache-2.0",
    "authority": "https://gitlab.eclipse.org/eclipsefdn/emo-team/iplab/-/issues/19842",
    "source": "https://repo1.maven.org/maven2/org/robolectric/annotations/4.14.1/annotations-4.14.1-sources.jar",
    "status": "approved",
    "scans": [
        {
            "date": "March 3, 2025 at 5:58:56 a.m. GMT",
            "authority": "https://gitlab.eclipse.org/eclipsefdn/emo-team/iplab/-/issues/19842",
            "scancode-version": "31.2.1",
            "licenses-discovered": [
                "Apache-2.0"
            ],
            "copyrights": [
                "Copyright (c) 2023 The Android Open Source Project"
            ],
            "file-count": 24,
            "sha256": "953b95fb784ea2457564a28552dc33ab51d46f494252cc15706e1bb5dda5bf37",
            "source": "https://repo1.maven.org/maven2/org/robolectric/annotations/4.14.1/annotations-4.14.1-sources.jar",
            "status": "approved"
        }
    ]
}