{
    "id": "maven/mavencentral/org.mapstruct/mapstruct/1.5.3.Final",
    "license": "Apache-2.0",
    "authority": "https://gitlab.eclipse.org/eclipsefdn/emo-team/iplab/-/issues/6277",
    "source": "https://search.maven.org/remotecontent?filepath=org/mapstruct/mapstruct/1.5.3.Final/mapstruct-1.5.3.Final-sources.jar",
    "status": "approved",
    "scans": [
        {
            "date": "January 11, 2023 at 3:12:17 p.m. GMT",
            "authority": "https://gitlab.eclipse.org/eclipsefdn/emo-team/iplab/-/issues/6277",
            "scancode-version": "31.2.1",
            "licenses-discovered": [
                "Apache-2.0"
            ],
            "copyrights": [
                "Copyright MapStruct Authors"
            ],
            "file-count": 45,
            "sha256": "77beb15102d6b424ba21f67d870fd05f4b75a8948543abec0fb8cb7a3e1a653f",
            "source": "https://search.maven.org/remotecontent?filepath=org/mapstruct/mapstruct/1.5.3.Final/mapstruct-1.5.3.Final-sources.jar",
            "status": "approved"
        }
    ]
}