{
    "id": "npm/npmjs/-/vscode-messenger-webview/0.4.3",
    "license": "MIT",
    "authority": "https://gitlab.eclipse.org/eclipsefdn/emo-team/iplab/-/issues/10714",
    "source": "https://github.com/TypeFox/vscode-messenger/archive/refs/tags/v0.4.3.zip",
    "status": "approved",
    "scans": [
        {
            "date": "September 27, 2023 at 6:00:52 p.m. GMT",
            "authority": "https://gitlab.eclipse.org/eclipsefdn/emo-team/iplab/-/issues/10714",
            "scancode-version": "31.2.1",
            "licenses-discovered": [
                "MIT"
            ],
            "copyrights": [
                "Copyright 2022 TypeFox GmbH"
            ],
            "file-count": 59,
            "sha256": "5672b56f095e774d0c460bb2004ee9181ba6411edc44738f08488ebc3a752b16",
            "source": "https://github.com/TypeFox/vscode-messenger/archive/refs/tags/v0.4.3.zip",
            "status": "approved"
        }
    ]
}