{
    "id": "go/golang/golang.org%2Fx/oauth2/v0.10.0",
    "license": "BSD-3-Clause",
    "authority": "https://gitlab.eclipse.org/eclipsefdn/emo-team/iplab/-/issues/9283",
    "source": "https://proxy.golang.org/golang.org%2Fx/oauth2/@v/v0.10.0.zip",
    "status": "approved",
    "scans": [
        {
            "date": "July 6, 2023 at 1:46:09 p.m. GMT",
            "authority": "https://gitlab.eclipse.org/eclipsefdn/emo-team/iplab/-/issues/9283",
            "scancode-version": "31.2.1",
            "licenses-discovered": [
                "BSD-3-Clause"
            ],
            "copyrights": [
                "Copyright (c) 2009 The Go Authors",
                "Copyright 2014 The Go Authors",
                "Copyright 2015 The Go Authors",
                "Copyright 2015 The oauth2 Authors",
                "Copyright 2016 The Go Authors",
                "Copyright 2017 The Go Authors",
                "Copyright 2017 The oauth2 Authors",
                "Copyright 2018 The Go Authors",
                "Copyright 2018 The oauth2 Authors",
                "Copyright 2019 The Go Authors",
                "Copyright 2020 The Go Authors",
                "Copyright 2021 The Go Authors",
                "Copyright 2022 The Go Authors"
            ],
            "file-count": 99,
            "sha256": "1e81392776911f51a058ce10af21e9ce3cac6e6069f0ecb913e90e1dbe8c71b2",
            "source": "https://proxy.golang.org/golang.org%2Fx/oauth2/@v/v0.10.0.zip",
            "status": "approved"
        }
    ]
}