{
    "id": "crate/cratesio/-/bstr/1.7.0",
    "license": "(Apache-2.0 OR MIT) AND LicenseRef-Unicode-DFS-2019 AND Unicode-TOU",
    "authority": "https://gitlab.eclipse.org/eclipsefdn/emo-team/iplab/-/issues/11396",
    "source": "https://crates.io/api/v1/crates/bstr/1.7.0/download",
    "status": "approved",
    "scans": [
        {
            "date": "November 1, 2023 at 12:12:35 a.m. GMT",
            "authority": "https://gitlab.eclipse.org/eclipsefdn/emo-team/iplab/-/issues/11396",
            "scancode-version": "31.2.1",
            "licenses-discovered": [
                "Apache-2.0 AND MIT",
                "Apache-2.0",
                "MIT",
                "Apache-2.0 AND LicenseRef-scancode-unicode AND MIT",
                "LicenseRef-scancode-unicode"
            ],
            "copyrights": [
                "(c) 2021 Unicode(r), Inc.",
                "Copyright (c) 1991-2019 Unicode, Inc.",
                "Copyright (c) 2018-2019 Andrew Gallant"
            ],
            "file-count": 64,
            "sha256": "c79ad7fb2dd38f3dabd76b09c6a5a20c038fc0213ef1e9afd30eb777f120f019",
            "source": "https://crates.io/api/v1/crates/bstr/1.7.0/download",
            "status": "restricted"
        }
    ]
}
