{
    "id": "go/golang/github.com%2Fgrpc-ecosystem%2Fgrpc-gateway/v2/v2.20.0",
    "license": "BSD-3-Clause",
    "authority": "https://gitlab.eclipse.org/eclipsefdn/emo-team/iplab/-/issues/15875",
    "source": "https://proxy.golang.org/github.com%2Fgrpc-ecosystem%2Fgrpc-gateway/v2/@v/v2.20.0.zip",
    "status": "approved",
    "scans": [
        {
            "date": "August 14, 2024 at 1:06:42 p.m. GMT",
            "authority": "https://gitlab.eclipse.org/eclipsefdn/emo-team/iplab/-/issues/15875",
            "scancode-version": "31.2.1",
            "licenses-discovered": [
                "LicenseRef-scancode-free-unknown",
                "BSD-3-Clause",
                "JSON",
                "BSD-3-Clause AND JSON"
            ],
            "copyrights": [
                "Copyright (c) 2015, Gengo, Inc.",
                "Copyright 2009 The Go Authors",
                "Copyright 2010, 2019 The Go Authors"
            ],
            "file-count": 505,
            "sha256": "443d8ba620e7c9eb04e7fdf073d7dc4b15191246ff56ccc8b26863f4f45735b0",
            "source": "https://proxy.golang.org/github.com%2Fgrpc-ecosystem%2Fgrpc-gateway/v2/@v/v2.20.0.zip",
            "status": "restricted"
        }
    ]
}