{
    "id": "maven/mavencentral/org.springframework.boot/spring-boot/3.3.5",
    "license": "Apache-2.0",
    "authority": "https://gitlab.eclipse.org/eclipsefdn/emo-team/iplab/-/issues/16883",
    "source": "https://repo1.maven.org/maven2/org/springframework/boot/spring-boot/3.3.5/spring-boot-3.3.5-sources.jar",
    "status": "approved",
    "scans": [
        {
            "date": "October 28, 2024, 6:25:30 a.m. GMT",
            "authority": "https://gitlab.eclipse.org/eclipsefdn/emo-team/iplab/-/issues/16883",
            "scancode-version": "31.2.1",
            "licenses-discovered": [
                "Apache-2.0"
            ],
            "copyrights": [
                "Copyright 2002-2020 the original author or authors",
                "Copyright 2002-2021 the original author or authors",
                "Copyright 2002-2022 the original author or authors",
                "Copyright 2012-2019 the original author or authors",
                "Copyright 2012-2020 the original author or authors",
                "Copyright 2012-2021 the original author or authors",
                "Copyright 2012-2022 the original author or authors",
                "Copyright 2012-2023 the original author or authors",
                "Copyright 2012-2024 the original author or authors",
                "Copyright 2019-2023 the original author or authors"
            ],
            "file-count": 766,
            "sha256": "07d0d5bb4e39a20e6b04ccde091655e89e17426187c147067bce7a750301f253",
            "source": "https://repo1.maven.org/maven2/org/springframework/boot/spring-boot/3.3.5/spring-boot-3.3.5-sources.jar",
            "status": "approved"
        }
    ]
}