{
    "id": "git/github/google/go-cmp/v0.5.5",
    "license": "BSD-3-Clause",
    "licenses-discovered": [
        "BSD-3-Clause"
    ],
    "copyrights": [
        "Copyright (c) The Go Authors"
    ],
    "file-count": 57,
    "scancode-version": "30.1.0",
    "authority": "https://gitlab.eclipse.org/eclipsefdn/emo-team/iplab/-/issues/3438",
    "source": "https://github.com/google/go-cmp/archive/refs/tags/v0.5.5.zip",
    "status": "approved"
}