{
    "id": "nuget/nuget/-/xunit.assert/2.7.0",
    "license": "Apache-2.0 AND MIT",
    "authority": "https://gitlab.eclipse.org/eclipsefdn/emo-team/iplab/-/issues/13971",
    "source": "https://github.com/xunit/xunit/archive/refs/tags/2.7.0.zip",
    "status": "approved",
    "scans": [
        {
            "date": "March 21, 2024 at 5:37:09 p.m. GMT",
            "authority": "https://gitlab.eclipse.org/eclipsefdn/emo-team/iplab/-/issues/13971",
            "scancode-version": "31.2.1",
            "licenses-discovered": [
                "Apache-2.0 AND MIT",
                "Apache-2.0 AND LicenseRef-scancode-free-unknown",
                "JSON",
                "Apache-2.0",
                "MIT"
            ],
            "copyrights": [
                "Copyright (c) .NET Foundation",
                "Copyright (c) .NET Foundation and Contributors",
                "Copyright (c) .NET Foundation and contributors",
                "Copyright (c) 2015 .NET Foundation"
            ],
            "file-count": 715,
            "sha256": "c69aca18641d0aa451a6e64f28327c41622eeaea704ade47a12c03ff061ca2bb",
            "source": "https://github.com/xunit/xunit/archive/refs/tags/2.7.0.zip",
            "status": "restricted"
        }
    ]
}
