{
    "id": "maven/mavencentral/org.springframework.boot/spring-boot-starter-logging/3.1.1",
    "license": "Apache-2.0",
    "authority": "https://gitlab.eclipse.org/eclipsefdn/emo-team/iplab/-/issues/9343",
    "source": "https://repo.maven.apache.org/maven2/org/springframework/boot/spring-boot-starter-logging/3.1.1/spring-boot-starter-logging-3.1.1-sources.jar",
    "status": "approved",
    "scans": [
        {
            "date": "July 11, 2023 at 12:57:18 p.m. GMT",
            "authority": "https://gitlab.eclipse.org/eclipsefdn/emo-team/iplab/-/issues/9343",
            "scancode-version": "31.2.1",
            "licenses-discovered": [
                "Apache-2.0"
            ],
            "copyrights": [
            ],
            "file-count": 2,
            "sha256": "301efa7845cf9abb5217604f3998374fbc76c28dd8916801cb19ff729042bf61",
            "source": "https://repo.maven.apache.org/maven2/org/springframework/boot/spring-boot-starter-logging/3.1.1/spring-boot-starter-logging-3.1.1-sources.jar",
            "status": "approved"
        }
    ]
}