{
    "id": "p2/orbit/p2.eclipse.plugin/com.mysql.jdbc/5.1.26",
    "license": "GPL-2.0-only",
    "authority": "https://gitlab.eclipse.org/eclipsefdn/emo-team/iplab/-/issues/5320",
    "source": "https://repo1.maven.org/maven2/mysql/mysql-connector-java/5.1.26/mysql-connector-java-5.1.26-sources.jar",
    "status": "restricted",
    "workswith": [
        "modeling.emf.cdo"
    ],
    "scans": [
        {
            "date": "December 2, 2022 at 6:46:33 p.m. GMT",
            "authority": "https://gitlab.eclipse.org/eclipsefdn/emo-team/iplab/-/issues/5320",
            "scancode-version": "31.2.1",
            "licenses-discovered": [
                "GPL-2.0-only AND LicenseRef-scancode-mysql-floss-exception-2.0",
                "GPL-1.0-or-later AND GPL-3.0-only",
                "Apache-2.0 AND GPL-2.0-only AND LicenseRef-scancode-mysql-floss-exception-2.0",
                "GPL-2.0-only"
            ],
            "copyrights": [
                "Copyright (c) 2002, 2010, Oracle and/or its affiliates",
                "Copyright (c) 2002, 2011, Oracle and/or its affiliates",
                "Copyright (c) 2002, 2012, Oracle and/or its affiliates",
                "Copyright (c) 2002, 2013, Oracle and/or its affiliates",
                "Copyright (c) 2004, 2012, Oracle and/or its affiliates",
                "Copyright (c) 2004, 2013, Oracle and/or its affiliates",
                "Copyright (c) 2005, 2010, Oracle and/or its affiliates",
                "Copyright (c) 2005, 2012, Oracle and/or its affiliates",
                "Copyright (c) 2005, 2013, Oracle and/or its affiliates",
                "Copyright (c) 2007, 2010, Oracle and/or its affiliates",
                "Copyright (c) 2007, 2011, Oracle and/or its affiliates",
                "Copyright (c) 2007, 2012, Oracle and/or its affiliates",
                "Copyright (c) 2007, 2013, Oracle and/or its affiliates",
                "Copyright (c) 2008, 2010, Oracle and/or its affiliates",
                "Copyright (c) 2009, 2010, Oracle and/or its affiliates",
                "Copyright (c) 2009, 2012, Oracle and/or its affiliates",
                "Copyright (c) 2010, 2012 Oracle and/or its affiliates",
                "Copyright (c) 2010, 2012, Oracle and/or its affiliates",
                "Copyright (c) 2010, 2013, Oracle and/or its affiliates",
                "Copyright (c) 2010, Oracle and/or its affiliates",
                "Copyright (c) 2011, Oracle and/or its affiliates",
                "Copyright (c) 2012, 2013, Oracle and/or its affiliates",
                "Copyright (c) 2012, Oracle and/or its affiliates",
                "Copyright (c) 2013, Oracle and/or its affiliates"
            ],
            "file-count": 209,
            "sha256": "7c2e1bbd1c67ae73af2778f1fef57f94a6cc8cb7f946c9483629ce59ff82a25c",
            "source": "https://repo1.maven.org/maven2/mysql/mysql-connector-java/5.1.26/mysql-connector-java-5.1.26-sources.jar",
            "status": "restricted"
        }
    ]
}
