{
    "id": "npm/npmjs/-/core-js/3.34.0",
    "license": "MIT AND BSD-3-Clause",
    "authority": "https://gitlab.eclipse.org/eclipsefdn/emo-team/iplab/-/issues/11954",
    "source": "https://github.com/zloirock/core-js/archive/refs/tags/v3.34.0.zip",
    "status": "approved",
    "scans": [
        {
            "date": "December 13, 2023 at 9:16:38 p.m. GMT",
            "authority": "https://gitlab.eclipse.org/eclipsefdn/emo-team/iplab/-/issues/11954",
            "scancode-version": "31.2.1",
            "licenses-discovered": [
                "MIT",
                "LicenseRef-scancode-free-unknown",
                "JSON",
                "BSD-3-Clause"
            ],
            "copyrights": [
                "(c) 2014-2023 Denis Pushkarev",
                "(c) web-platform-tests contributors",
                "(c) zbar', base about:blank', href http://example.com/foo",
                "Copyright (c) 2012 Ecma International",
                "Copyright (c) 2014-2023 Denis Pushkarev",
                "copyright (c) 2014-2023 Denis Pushkarev"
            ],
            "file-count": 3858,
            "sha256": "77860ee345b7b7be283f8457d120ed7fe2b0dc6ea5c840e80b5503cd14acaafc",
            "source": "https://github.com/zloirock/core-js/archive/refs/tags/v3.34.0.zip",
            "status": "restricted"
        }
    ]
}
