{
    "id": "npm/npmjs/-/vscode-oniguruma/2.0.1",
    "license": "MIT AND BSD-2-Clause",
    "authority": "https://gitlab.eclipse.org/eclipsefdn/emo-team/iplab/-/issues/19506",
    "source": "https://github.com/microsoft/vscode-oniguruma/archive/refs/tags/v2.0.1.zip",
    "status": "approved",
    "scans": [
        {
            "date": "February 21, 2025 at 11:54:17 a.m. GMT",
            "authority": "https://gitlab.eclipse.org/eclipsefdn/emo-team/iplab/-/issues/19506",
            "scancode-version": "31.2.1",
            "licenses-discovered": [
                "MIT",
                "BSD-2-Clause"
            ],
            "copyrights": [
                "Copyright (c) 2002-2020 K.Kosako <kkosako0@gmail.com>",
                "Copyright (c) Microsoft Corporation"
            ],
            "file-count": 28,
            "sha256": "3d64567c1f5d1b970949ffdb3c6edd39ecb94fb4c70cc405587d13c932c32476",
            "source": "https://github.com/microsoft/vscode-oniguruma/archive/refs/tags/v2.0.1.zip",
            "status": "approved"
        }
    ]
}