{
    "id": "go/golang/honnef.co%2Fgo/tools/v0.0.0-20190102054323-c2f93a96b099",
    "license": "MIT AND (BSD-3-Clause AND MIT) AND BSD-3-Clause",
    "authority": "https://gitlab.eclipse.org/eclipsefdn/emo-team/iplab/-/issues/6128",
    "source": "https://proxy.golang.org/honnef.co%2Fgo/tools/@v/v0.0.0-20190102054323-c2f93a96b099.zip",
    "status": "approved",
    "scans": [
        {
            "date": "January 5, 2023 at 5:46:49 p.m. GMT",
            "authority": "https://gitlab.eclipse.org/eclipsefdn/emo-team/iplab/-/issues/6128",
            "scancode-version": "31.2.1",
            "licenses-discovered": [
                "MIT",
                "BSD-3-Clause AND MIT",
                "BSD-3-Clause"
            ],
            "copyrights": [
                "Copyright (c) 2009 The Go Authors",
                "Copyright (c) 2013 The Go Authors",
                "Copyright (c) 2016 Dominik Honnef",
                "Copyright (c) 2018 Dominik Honnef",
                "Copyright 2013 The Go Authors",
                "Copyright 2014 The Go Authors",
                "Copyright 2015 The Go Authors",
                "Copyright 2016 Dominik Honnef"
            ],
            "file-count": 297,
            "sha256": "9860f8a4cb535ae4ebdec509422f4f1c543b540104464bb4873d9e02e80d8c54",
            "source": "https://proxy.golang.org/honnef.co%2Fgo/tools/@v/v0.0.0-20190102054323-c2f93a96b099.zip",
            "status": "approved"
        }
    ]
}