{
    "id": "nuget/nuget/-/xunit.extensibility.execution/2.4.1",
    "license": "Apache-2.0 AND MIT",
    "licenses-discovered": [
        "Apache-2.0 AND MIT",
        "Apache-2.0 AND LicenseRef-scancode-free-unknown",
        "MIT"
    ],
    "copyrights": [
        "Copyright (c) .NET Foundation",
        "Copyright (c) .NET Foundation and Contributors"
    ],
    "file-count": 756,
    "scancode-version": "30.1.0",
    "authority": "https://gitlab.eclipse.org/eclipsefdn/emo-team/iplab/-/issues/3199",
    "source": "https://github.com/xunit/xunit/archive/refs/tags/2.4.1.zip",
    "status": "approved"
}
