{
    "id": "maven/mavencentral/org.springframework.cloud/spring-cloud-openfeign-core/3.1.5",
    "license": "Apache-2.0",
    "licenses-discovered": [
        "Apache-2.0"
    ],
    "copyrights": [
        "Copyright 2013-2022 the original author or authors",
        "Copyright 2014-2021 the original author or authors",
        "Copyright 2015-2021 the original author or authors",
        "Copyright 2015-2022 the original author or authors",
        "Copyright 2016-2021 the original author or authors",
        "Copyright 2016-2022 the original author or authors",
        "Copyright 2020-2022 the original author or authors",
        "Copyright 2021-2022 the original author or authors"
    ],
    "file-count": 86,
    "scancode-version": "31.2.1",
    "authority": "https://gitlab.eclipse.org/eclipsefdn/emo-team/iplab/-/issues/4724",
    "source": "https://search.maven.org/remotecontent?filepath=org/springframework/cloud/spring-cloud-openfeign-core/3.1.5/spring-cloud-openfeign-core-3.1.5-sources.jar",
    "status": "approved"
}