{
    "id": "maven/mavencentral/org.codehaus.plexus/plexus-compiler-javac/2.14.2",
    "license": "MIT AND (Apache-2.0 AND MIT) AND Apache-2.0",
    "authority": "https://gitlab.eclipse.org/eclipsefdn/emo-team/iplab/-/issues/12753",
    "source": "https://repo1.maven.org/maven2/org/codehaus/plexus/plexus-compiler-javac/2.14.2/plexus-compiler-javac-2.14.2-sources.jar",
    "status": "approved",
    "scans": [
        {
            "date": "January 11, 2024 at 1:46:25 p.m. GMT",
            "authority": "https://gitlab.eclipse.org/eclipsefdn/emo-team/iplab/-/issues/12753",
            "scancode-version": "31.2.1",
            "licenses-discovered": [
                "MIT",
                "Apache-2.0 AND MIT",
                "Apache-2.0"
            ],
            "copyrights": [
                "Copyright (c) 2005, The Codehaus",
                "Copyright 2004 The Apache Software Foundation"
            ],
            "file-count": 7,
            "sha256": "a4193254e5a98dabdf51d5eb2f0bbba3250486a7d0dbd4e81b667a7bc1be9057",
            "source": "https://repo1.maven.org/maven2/org/codehaus/plexus/plexus-compiler-javac/2.14.2/plexus-compiler-javac-2.14.2-sources.jar",
            "status": "approved"
        }
    ]
}