{
    "id": "npm/npmjs/@rollup/rollup-win32-x64-msvc/4.34.6",
    "license": "MIT AND (0BSD AND ISC AND MIT)",
    "authority": "https://gitlab.eclipse.org/eclipsefdn/emo-team/iplab/-/issues/19454",
    "source": "https://github.com/rollup/rollup/archive/refs/tags/v4.34.6.zip",
    "status": "approved",
    "scans": [
        {
            "date": "February 13, 2025 at 1:26:16 p.m. GMT",
            "authority": "https://gitlab.eclipse.org/eclipsefdn/emo-team/iplab/-/issues/19454",
            "scancode-version": "31.2.1",
            "licenses-discovered": [
                "MIT",
                "0BSD AND ISC AND MIT"
            ],
            "copyrights": [
                "Copyright (c) 2012-2019 Paul Miller (https://paulmillr.com), Elan Shanker",
                "Copyright (c) 2012-2019 Thorsten Lorenz, Paul Miller (https://paulmillr.com)",
                "Copyright (c) 2014-2016, Jon Schlinkert",
                "Copyright (c) 2014-2017, Jon Schlinkert",
                "Copyright (c) 2014-2018, Jon Schlinkert",
                "Copyright (c) 2014-present, Jon Schlinkert",
                "Copyright (c) 2015 Rich Harris",
                "Copyright (c) 2015, 2019 Elan Shanker",
                "Copyright (c) 2015-2023 Benjamin Coe, Isaac Z. Schlueter, and Contributors",
                "Copyright (c) 2015-present Rollup",
                "Copyright (c) 2015-present, Jon Schlinkert",
                "Copyright (c) 2016, Contributors",
                "Copyright (c) 2017 these people (https://github.com/rollup/rollup/graphs/contributors)",
                "Copyright (c) 2017-present, Jon Schlinkert",
                "Copyright (c) 2019 Elan Shanker, Paul Miller (https://paulmillr.com)",
                "Copyright (c) 2019 RollupJS",
                "Copyright (c) 2019 Sindre Sorhus <sindresorhus@gmail.com> (https://sindresorhus.com), Paul Miller (https://paulmillr.com)",
                "Copyright (c) 2019 by original authors",
                "Copyright (c) 2019 by original authors fontello.com",
                "Copyright (c) 2021-2024 Oleksii Raspopov, Kostiantyn Denysov, Anton Verinov",
                "Copyright (c) Luke Edwards <luke.edwards05@gmail.com> (lukeed.com)",
                "Copyright (c) Microsoft Corporation",
                "Copyright (c) Paul Miller (https://paulmillr.com)",
                "Copyright (c) Sindre Sorhus <sindresorhus@gmail.com> (https://sindresorhus.com)",
                "Copyright 2009-2020",
                "Copyright 2013-2016 by Paul Miller (http://paulmillr.com) and contributors",
                "Copyright 2018 Rich Harris",
                "copyright (c) 2014-2024 Denis Pushkarev"
            ],
            "file-count": 12681,
            "sha256": "064fb7bdeb2a6f4e6a53af004454a79abe479e7bd9d71457f8088e1c3dd373f8",
            "source": "https://github.com/rollup/rollup/archive/refs/tags/v4.34.6.zip",
            "status": "approved"
        }
    ]
}