{
    "id": "maven/mavencentral/org.wildfly.security/wildfly-elytron-credential-source-impl/2.2.1.Final",
    "license": "Apache-2.0",
    "authority": "https://gitlab.eclipse.org/eclipsefdn/emo-team/iplab/-/issues/9416",
    "source": "https://repo.maven.apache.org/maven2/org/wildfly/security/wildfly-elytron-credential-source-impl/2.2.1.Final/wildfly-elytron-credential-source-impl-2.2.1.Final-sources.jar",
    "status": "approved",
    "scans": [
        {
            "date": "July 14, 2023 at 1:59:49 p.m. GMT",
            "authority": "https://gitlab.eclipse.org/eclipsefdn/emo-team/iplab/-/issues/9416",
            "scancode-version": "31.2.1",
            "licenses-discovered": [
                "Apache-2.0"
            ],
            "copyrights": [
                "Copyright 2014 Red Hat, Inc., and individual contributors",
                "Copyright 2016 Red Hat, Inc., and individual contributors",
                "Copyright 2017 Red Hat, Inc., and individual contributors",
                "Copyright 2018 Red Hat, Inc., and individual contributors"
            ],
            "file-count": 12,
            "sha256": "59f249838063248a37a9926bd8725302a8d2a69f2ecdade6acfb821dbeffa381",
            "source": "https://repo.maven.apache.org/maven2/org/wildfly/security/wildfly-elytron-credential-source-impl/2.2.1.Final/wildfly-elytron-credential-source-impl-2.2.1.Final-sources.jar",
            "status": "approved"
        }
    ]
}