{
    "id": "nuget/nuget/-/Swashbuckle.AspNetCore/6.2.3",
    "license": "MIT AND Apache-2.0",
    "licenses-discovered": [
        "MIT",
        "Apache-2.0"
    ],
    "copyrights": [
        "Copyright (c) Richard Morris"
    ],
    "file-count": 372,
    "scancode-version": "30.1.0",
    "authority": "https://gitlab.eclipse.org/eclipsefdn/emo-team/iplab/-/issues/3182",
    "source": "https://github.com/domaindrivendev/Swashbuckle.AspNetCore/archive/refs/tags/v6.2.3.zip",
    "status": "approved"
}