{
    "license": "MIT",
    "file-count": 28,
    "authority": "https://gitlab.eclipse.org/eclipsefdn/emo-team/iplab/-/issues/984",
    "scancode-version": "21.3.31",
    "licenses-discovered": [
        "MIT"
    ],
    "id": "npm/npmjs/-/coa/1.0.4",
    "source": "https://github.com/veged/coa/archive/v1.0.4.zip",
    "status": "approved"
}