{
    "license": "BSD-3-Clause AND MIT",
    "file-count": 695,
    "authority": "https://gitlab.eclipse.org/eclipsefdn/emo-team/iplab/-/issues/1337",
    "scancode-version": "30.1.0",
    "licenses-discovered": [
        "MIT",
        "BSD-3-Clause"
    ],
    "id": "npm/npmjs/@pixi/math/5.3.10",
    "source": "https://github.com/pixijs/pixi.js/archive/v5.3.10.zip",
    "status": "approved"
}