{
    "id": "npm/npmjs/-/set-function-length/1.2.0",
    "license": "MIT",
    "authority": "https://gitlab.eclipse.org/eclipsefdn/emo-team/iplab/-/issues/12772",
    "source": "https://github.com/ljharb/set-function-length/archive/refs/tags/v1.2.0.zip",
    "status": "approved",
    "scans": [
        {
            "date": "January 15, 2024 at 4:55:08 a.m. GMT",
            "authority": "https://gitlab.eclipse.org/eclipsefdn/emo-team/iplab/-/issues/12772",
            "scancode-version": "31.2.1",
            "licenses-discovered": [
                "MIT"
            ],
            "copyrights": [
                "Copyright (c) Jordan Harband and contributors"
            ],
            "file-count": 17,
            "sha256": "43b94ba562b11fc3deae38813e48259f3cc713fc5cf3ef813734509d91af28bc",
            "source": "https://github.com/ljharb/set-function-length/archive/refs/tags/v1.2.0.zip",
            "status": "approved"
        }
    ]
}