{
    "id": "crate/cratesio/-/serde/1.0.210",
    "license": "Apache-2.0 or MIT",
    "authority": "https://gitlab.eclipse.org/eclipsefdn/emo-team/iplab/-/issues/16100",
    "source": "https://crates.io/api/v1/crates/serde/1.0.210/download",
    "status": "approved",
    "scans": [
        {
            "date": "September 10, 2024, 2:58:17 p.m. GMT",
            "authority": "https://gitlab.eclipse.org/eclipsefdn/emo-team/iplab/-/issues/16100",
            "scancode-version": "31.2.1",
            "licenses-discovered": [
                "Apache-2.0 AND MIT",
                "Apache-2.0",
                "MIT"
            ],
            "copyrights": [
                "(c), None Ok"
            ],
            "file-count": 27,
            "sha256": "c8e3592472072e6e22e0a54d5904d9febf8508f65fb8552499a1abc7d1078c3a",
            "source": "https://crates.io/api/v1/crates/serde/1.0.210/download",
            "status": "approved"
        }
    ]
}