{
    "id": "maven/mavencentral/org.springframework/spring-oxm/6.1.11",
    "license": "Apache-2.0",
    "authority": "https://gitlab.eclipse.org/eclipsefdn/emo-team/iplab/-/issues/15929",
    "source": "https://repo1.maven.org/maven2/org/springframework/spring-oxm/6.1.11/spring-oxm-6.1.11-sources.jar",
    "status": "approved",
    "scans": [
        {
            "date": "August 14, 2024 at 5:37:09 p.m. GMT",
            "authority": "https://gitlab.eclipse.org/eclipsefdn/emo-team/iplab/-/issues/15929",
            "scancode-version": "31.2.1",
            "licenses-discovered": [
                "Apache-2.0"
            ],
            "copyrights": [
                "Copyright 2002-2009 the original author or authors",
                "Copyright 2002-2012 the original author or authors",
                "Copyright 2002-2016 the original author or authors",
                "Copyright 2002-2018 the original author or authors",
                "Copyright 2002-2021 the original author or authors",
                "Copyright 2002-2022 the original author or authors",
                "Copyright 2002-2023 the original author or authors",
                "Copyright 2002-2024 the original author or authors"
            ],
            "file-count": 34,
            "sha256": "96f74650dc123b875eea98afd3a2797c91049554e0888ed63a54b3fd2793daaa",
            "source": "https://repo1.maven.org/maven2/org/springframework/spring-oxm/6.1.11/spring-oxm-6.1.11-sources.jar",
            "status": "approved"
        }
    ]
}