{
    "id": "maven/mavencentral/com.azure.resourcemanager/azure-resourcemanager-search/2.31.0",
    "license": "MIT",
    "authority": "https://gitlab.eclipse.org/eclipsefdn/emo-team/iplab/-/issues/10880",
    "source": "https://repo.maven.apache.org/maven2/com/azure/resourcemanager/azure-resourcemanager-search/2.31.0/azure-resourcemanager-search-2.31.0-sources.jar",
    "status": "approved",
    "scans": [
        {
            "date": "October 4, 2023 at 11:25:30 a.m. GMT",
            "authority": "https://gitlab.eclipse.org/eclipsefdn/emo-team/iplab/-/issues/10880",
            "scancode-version": "31.2.1",
            "licenses-discovered": [
                "MIT"
            ],
            "copyrights": [
                "(c) 2008 VeriSign, Inc.",
                "Copyright (c) Microsoft Corporation"
            ],
            "file-count": 76,
            "sha256": "ada77067bba7a81e547b46b9ce3abf8c3a9a1d3f3e39ebf04ccb86fc186f16cd",
            "source": "https://repo.maven.apache.org/maven2/com/azure/resourcemanager/azure-resourcemanager-search/2.31.0/azure-resourcemanager-search-2.31.0-sources.jar",
            "status": "approved"
        }
    ]
}