{
    "id": "npm/npmjs/@chromatic-com/storybook/1.2.25",
    "license": "MIT",
    "authority": "https://gitlab.eclipse.org/eclipsefdn/emo-team/iplab/-/issues/14019",
    "source": "https://github.com/chromaui/addon-visual-tests/archive/refs/tags/v1.2.25.zip",
    "status": "approved",
    "scans": [
        {
            "date": "March 22, 2024 at 5:16:04 p.m. GMT",
            "authority": "https://gitlab.eclipse.org/eclipsefdn/emo-team/iplab/-/issues/14019",
            "scancode-version": "31.2.1",
            "licenses-discovered": [
                "MIT"
            ],
            "copyrights": [
                "Copyright (c) 2023 Storybook"
            ],
            "file-count": 215,
            "sha256": "7cdfffc927f9f535104cf9ddc4a8fb5efec5da6935d4b578cfd288a367640a3e",
            "source": "https://github.com/chromaui/addon-visual-tests/archive/refs/tags/v1.2.25.zip",
            "status": "approved"
        }
    ]
}