{
    "id": "maven/mavencentral/com.azure/azure-security-keyvault-secrets/4.9.0",
    "license": "MIT",
    "authority": "https://gitlab.eclipse.org/eclipsefdn/emo-team/iplab/-/issues/16850",
    "source": "https://repo1.maven.org/maven2/com/azure/azure-security-keyvault-secrets/4.9.0/azure-security-keyvault-secrets-4.9.0-sources.jar",
    "status": "approved",
    "scans": [
        {
            "date": "October 22, 2024, 3:27:21 a.m. GMT",
            "authority": "https://gitlab.eclipse.org/eclipsefdn/emo-team/iplab/-/issues/16850",
            "scancode-version": "31.2.1",
            "licenses-discovered": [
                "MIT"
            ],
            "copyrights": [
                "Copyright (c) Microsoft Corporation"
            ],
            "file-count": 45,
            "sha256": "9429658c1b5bb9c1a9ec8add81e4f43d1d2872efa6b7414512a6640240ece8f5",
            "source": "https://repo1.maven.org/maven2/com/azure/azure-security-keyvault-secrets/4.9.0/azure-security-keyvault-secrets-4.9.0-sources.jar",
            "status": "approved"
        }
    ]
}