{
    "id": "maven/mavencentral/com.google.api/api-common/2.41.0",
    "license": "BSD-3-Clause",
    "authority": "https://gitlab.eclipse.org/eclipsefdn/emo-team/iplab/-/issues/17420",
    "source": "https://repo1.maven.org/maven2/com/google/api/api-common/2.41.0/api-common-2.41.0-sources.jar",
    "status": "approved",
    "scans": [
        {
            "date": "November 23, 2024, 4:57:14 a.m. GMT",
            "authority": "https://gitlab.eclipse.org/eclipsefdn/emo-team/iplab/-/issues/17420",
            "scancode-version": "31.2.1",
            "licenses-discovered": [
                "BSD-3-Clause"
            ],
            "copyrights": [
                "Copyright 2016, Google Inc.",
                "Copyright 2017, Google Inc.",
                "Copyright 2018, Google Inc.",
                "Copyright 2023, Google Inc."
            ],
            "file-count": 29,
            "sha256": "ab7d2c032296127dec01399b56d051051d16e66f03dd569bd28829defe82d69b",
            "source": "https://repo1.maven.org/maven2/com/google/api/api-common/2.41.0/api-common-2.41.0-sources.jar",
            "status": "approved"
        }
    ]
}