{
    "id": "maven/mavencentral/com.google.guava/guava/25.1-jre",
    "license": "Apache-2.0 AND CC0-1.0 AND CC-PDDC",
    "authority": "https://gitlab.eclipse.org/eclipsefdn/emo-team/iplab/-/issues/5109",
    "source": "https://search.maven.org/remotecontent?filepath=com/google/guava/guava/25.1-jre/guava-25.1-jre-sources.jar",
    "status": "approved",
    "scans": [
        {
            "date": "November 24, 2022 at 5:01:06 p.m. GMT",
            "authority": "https://gitlab.eclipse.org/eclipsefdn/emo-team/iplab/-/issues/5109",
            "scancode-version": "31.2.1",
            "licenses-discovered": [
                "Apache-2.0",
                "CC0-1.0",
                "Apache-2.0 AND CC0-1.0",
                "Apache-2.0 AND CC-PDDC"
            ],
            "copyrights": [
                "Copyright (c) 2005 The Guava Authors",
                "Copyright (c) 2006 The Guava Authors",
                "Copyright (c) 2007 The Guava Authors",
                "Copyright (c) 2008 The Guava Authors",
                "Copyright (c) 2009 The Guava Authors",
                "Copyright (c) 2010 The Guava Authors",
                "Copyright (c) 2011 The Guava Authors",
                "Copyright (c) 2012 The Guava Authors",
                "Copyright (c) 2013 The Guava Authors",
                "Copyright (c) 2014 The Guava Authors",
                "Copyright (c) 2015 The Guava Authors",
                "Copyright (c) 2016 The Guava Authors",
                "Copyright (c) 2017 The Guava Authors",
                "Copyright (c) 2018 The Guava Authors"
            ],
            "file-count": 571,
            "sha256": "b7ffb578b2bd6445c958356e308d1c46c9ea6fb868fc9444bc8bda3a41875a1b",
            "source": "https://search.maven.org/remotecontent?filepath=com/google/guava/guava/25.1-jre/guava-25.1-jre-sources.jar",
            "status": "restricted"
        }
    ]
}
