{
    "id": "npm/npmjs/-/eslint-plugin-react/7.34.1",
    "license": "MIT",
    "authority": "https://gitlab.eclipse.org/eclipsefdn/emo-team/iplab/-/issues/13825",
    "source": "https://github.com/jsx-eslint/eslint-plugin-react/archive/refs/tags/v7.34.1.zip",
    "status": "approved",
    "scans": [
        {
            "date": "March 18, 2024 at 3:36:19 a.m. GMT",
            "authority": "https://gitlab.eclipse.org/eclipsefdn/emo-team/iplab/-/issues/13825",
            "scancode-version": "31.2.1",
            "licenses-discovered": [
                "MIT"
            ],
            "copyrights": [
                "Copyright (c) 2014 Yannick Croissant",
                "Copyright (c) 2014 by Vitaly Puzrin",
                "copyright 2015 Alberto Rodriguez",
                "copyright 2015 Gyandeep Singh",
                "copyright 2015 Vitaly Puzrin"
            ],
            "file-count": 388,
            "sha256": "ed00b65130d874cfdb969af9d341ecc8acf62801dbe014a2da925fa4c154ce8f",
            "source": "https://github.com/jsx-eslint/eslint-plugin-react/archive/refs/tags/v7.34.1.zip",
            "status": "approved"
        }
    ]
}