{
    "id": "npm/npmjs/-/readable-stream/3.2.0",
    "license": "MIT",
    "licenses-discovered": [
        "MIT"
    ],
    "copyrights": [
        "Copyright Joyent, Inc. and other Node contributors"
    ],
    "file-count": 205,
    "scancode-version": "30.1.0",
    "authority": "https://gitlab.eclipse.org/eclipsefdn/emo-team/iplab/-/issues/2914",
    "source": "https://github.com/nodejs/readable-stream/archive/v3.2.0.zip",
    "status": "approved"
}