{
    "id": "maven/mavencentral/com.pinterest.ktlint/ktlint-ruleset-standard/0.49.0",
    "license": "MIT",
    "authority": "https://gitlab.eclipse.org/eclipsefdn/emo-team/iplab/-/issues/10185",
    "source": "https://repo.maven.apache.org/maven2/com/pinterest/ktlint/ktlint-ruleset-standard/0.49.0/ktlint-ruleset-standard-0.49.0-sources.jar",
    "status": "approved",
    "scans": [
        {
            "date": "August 23, 2023 at 1:47:43 p.m. GMT",
            "authority": "https://gitlab.eclipse.org/eclipsefdn/emo-team/iplab/-/issues/10185",
            "scancode-version": "31.2.1",
            "licenses-discovered": [
            ],
            "copyrights": [
            ],
            "file-count": 84,
            "sha256": "1e8530d32311ff4cc6d03895f92461e129a2a32481123c4cae7651fd15df604c",
            "source": "https://repo.maven.apache.org/maven2/com/pinterest/ktlint/ktlint-ruleset-standard/0.49.0/ktlint-ruleset-standard-0.49.0-sources.jar",
            "status": "restricted"
        }
    ]
}
