{
    "id": "maven/mavencentral/com.google.api.grpc/proto-google-cloud-bigquerystorage-v1/3.9.2",
    "license": "Apache-2.0",
    "authority": "https://gitlab.eclipse.org/eclipsefdn/emo-team/iplab/-/issues/16732",
    "source": "https://repo1.maven.org/maven2/com/google/api/grpc/proto-google-cloud-bigquerystorage-v1/3.9.2/proto-google-cloud-bigquerystorage-v1-3.9.2-sources.jar",
    "status": "approved",
    "scans": [
        {
            "date": "October 15, 2024, 6:03:01 p.m. GMT",
            "authority": "https://gitlab.eclipse.org/eclipsefdn/emo-team/iplab/-/issues/16732",
            "scancode-version": "31.2.1",
            "licenses-discovered": [
                "Apache-2.0"
            ],
            "copyrights": [
                "Copyright 2024 Google LLC"
            ],
            "file-count": 87,
            "sha256": "f30455e31dad786b5df5f5cc79f24e6a01458d7601107a57369c1cc0a9c3cc77",
            "source": "https://repo1.maven.org/maven2/com/google/api/grpc/proto-google-cloud-bigquerystorage-v1/3.9.2/proto-google-cloud-bigquerystorage-v1-3.9.2-sources.jar",
            "status": "approved"
        }
    ]
}