{
    "license": "Apache-2.0 AND GPL-1.0-or-later AND GPL-2.0-only",
    "file-count": 209,
    "authority": "https://gitlab.eclipse.org/eclipsefdn/emo-team/iplab/-/issues/1668",
    "scancode-version": "30.1.0",
    "licenses-discovered": [
        "Apache-2.0",
        "GPL-1.0-or-later",
        "GPL-2.0-only"
    ],
    "id": "p2/orbit/p2.eclipse-plugin/com.mysql.jdbc/5.1.26",
    "alternate-ids": [
        "maven/mavencentral/mysql/mysql-connector-java/5.1.26"
    ],
    "source": "https://search.maven.org/remotecontent?filepath=mysql/mysql-connector-java/5.1.26/mysql-connector-java-5.1.26-sources.jar",
    "status": "restricted",
    "workswith": [
        "modeling.emf.cdo"
    ]
}
