{
    "id": "maven/mavencentral/org.activiti/activiti-bpmn-model/8.6.0",
    "license": "Apache-2.0",
    "authority": "https://gitlab.eclipse.org/eclipsefdn/emo-team/iplab/-/issues/15926",
    "source": "https://maven.alfresco.com/nexus/service/local/repositories/activiti-releases/content//org/activiti/activiti-bpmn-model/8.6.0/activiti-bpmn-model-8.6.0-sources.jar",
    "status": "approved",
    "scans": [
        {
            "date": "August 14, 2024 at 5:34:34 p.m. GMT",
            "authority": "https://gitlab.eclipse.org/eclipsefdn/emo-team/iplab/-/issues/15926",
            "scancode-version": "31.2.1",
            "licenses-discovered": [
                "Apache-2.0"
            ],
            "copyrights": [
                "Copyright 2010-2020 Alfresco Software, Ltd."
            ],
            "file-count": 102,
            "sha256": "1825aa7caf8e1fc630599e8ee1dfbf692aaa6b4e2d7e5bde2e9389c35ec46c2d",
            "source": "https://maven.alfresco.com/nexus/service/local/repositories/activiti-releases/content//org/activiti/activiti-bpmn-model/8.6.0/activiti-bpmn-model-8.6.0-sources.jar",
            "status": "approved"
        }
    ]
}