{
    "id": "npm/npmjs/@storybook/core-client/7.0.21",
    "license": "MIT",
    "authority": "https://gitlab.eclipse.org/eclipsefdn/emo-team/iplab/-/issues/8926",
    "source": "https://registry.npmjs.org/@storybook/core-client/-/core-client-7.0.21.tgz",
    "status": "approved",
    "scans": [
        {
            "date": "June 15, 2023 at 3:41:05 p.m. GMT",
            "authority": "https://gitlab.eclipse.org/eclipsefdn/emo-team/iplab/-/issues/8926",
            "scancode-version": "31.2.1",
            "licenses-discovered": [
                "MIT"
            ],
            "copyrights": [
            ],
            "file-count": 11,
            "sha256": "7a9e2231dbf56b690f408213b497a63c142b0abe41ba5af7529f05de911cc5b2",
            "source": "https://registry.npmjs.org/@storybook/core-client/-/core-client-7.0.21.tgz",
            "status": "approved"
        }
    ]
}