{
    "id": "npm/npmjs/@protobufjs/utf8/1.1.0",
    "license": "BSD-3-Clause AND MIT",
    "authority": "https://gitlab.eclipse.org/eclipsefdn/emo-team/iplab/-/issues/19373",
    "source": "https://github.com/protobufjs/protobuf.js/archive/refs/tags/protobufjs-cli-v1.1.0.zip",
    "status": "approved",
    "scans": [
        {
            "date": "February 11, 2025 at 4:19:38 a.m. GMT",
            "authority": "https://gitlab.eclipse.org/eclipsefdn/emo-team/iplab/-/issues/19373",
            "scancode-version": "31.2.1",
            "licenses-discovered": [
                "LicenseRef-scancode-protobuf",
                "BSD-3-Clause",
                "MIT"
            ],
            "copyrights": [
                "(c) 2016, daniel",
                "Copyright (c) 2016 Chad Engler",
                "Copyright (c) 2016, Daniel Wirtz",
                "Copyright (c) 2016, Mapbox",
                "Copyright 2008 Google Inc.",
                "Copyright 2014, Google Inc."
            ],
            "file-count": 320,
            "sha256": "9e843ae1db450d88c413c5ba3626e6a597c750e441ac21a2fc339116d8ff47cc",
            "source": "https://github.com/protobufjs/protobuf.js/archive/refs/tags/protobufjs-cli-v1.1.0.zip",
            "status": "restricted"
        }
    ]
}