{
    "id": "p2/orbit/p2.eclipse-plugin/org.junit.platform.commons.source/1.8.1",
    "license": "EPL-2.0",
    "licenses-discovered": [
        "EPL-2.0"
    ],
    "copyrights": [
        "Copyright 2015-2021 the original author or authors"
    ],
    "file-count": 45,
    "scancode-version": "31.2.1",
    "authority": "https://gitlab.eclipse.org/eclipsefdn/emo-team/iplab/-/issues/3828",
    "source": "https://search.maven.org/remotecontent?filepath=org/junit/platform/junit-platform-commons/1.8.1/junit-platform-commons-1.8.1-sources.jar",
    "status": "approved"
}