{
    "id": "npm/npmjs/-/p-queue/8.1.0",
    "license": "MIT",
    "authority": "https://gitlab.eclipse.org/eclipsefdn/emo-team/iplab/-/issues/19244",
    "source": "https://github.com/sindresorhus/p-queue/archive/refs/tags/v8.1.0.zip",
    "status": "approved",
    "scans": [
        {
            "date": "January 31, 2025 at 4:54:34 p.m. GMT",
            "authority": "https://gitlab.eclipse.org/eclipsefdn/emo-team/iplab/-/issues/19244",
            "scancode-version": "31.2.1",
            "licenses-discovered": [
                "MIT"
            ],
            "copyrights": [
                "Copyright (c) Sindre Sorhus <sindresorhus@gmail.com> (https://sindresorhus.com)"
            ],
            "file-count": 16,
            "sha256": "02169adf87457786ed3a60c833bbb04c197d5ac22a9a8240690f6839b317c553",
            "source": "https://github.com/sindresorhus/p-queue/archive/refs/tags/v8.1.0.zip",
            "status": "approved"
        }
    ]
}