{
    "id": "crate/cratesio/-/zenoh-link-unixsock_stream/1.0.0",
    "license": "Apache-2.0 AND EPL-2.0 AND (EPL-2.0 OR Apache-2.0)",
    "authority": "https://gitlab.eclipse.org/eclipsefdn/emo-team/iplab/-/issues/16980",
    "source": "https://crates.io/api/v1/crates/zenoh-link-unixsock_stream/1.0.0/download",
    "status": "approved",
    "scans": [
        {
            "date": "October 31, 2024, 4:26:01 p.m. GMT",
            "authority": "https://gitlab.eclipse.org/eclipsefdn/emo-team/iplab/-/issues/16980",
            "scancode-version": "31.2.1",
            "licenses-discovered": [
                "Apache-2.0 AND EPL-2.0",
                "EPL-2.0 OR Apache-2.0"
            ],
            "copyrights": [
                "Copyright (c) 2023 ZettaScale Technology"
            ],
            "file-count": 6,
            "sha256": "3b42c8b1a3969376a0a6533405001b54d212f2fe50aa14b0eb1a4dece048f290",
            "source": "https://crates.io/api/v1/crates/zenoh-link-unixsock_stream/1.0.0/download",
            "status": "approved"
        }
    ]
}