{
    "id": "maven/mavencentral/org.geotools/gt-wmts/22.1",
    "license": "LGPL-2.0-or-later AND LGPL-2.1-only",
    "authority": "https://gitlab.eclipse.org/eclipsefdn/emo-team/iplab/-/issues/4879",
    "source": "https://repo.osgeo.org/repository/geotools-releases/org/geotools/gt-wmts/22.1/gt-wmts-22.1-sources.jar",
    "status": "approved",
    "scans": [
        {
            "date": "November 16, 2022 at 12:11:26 a.m. GMT",
            "authority": "https://gitlab.eclipse.org/eclipsefdn/emo-team/iplab/-/issues/4879",
            "scancode-version": "31.2.1",
            "licenses-discovered": [
                "LGPL-2.0-or-later",
                "LGPL-2.1-only"
            ],
            "copyrights": [
                "(c) 2017, Open Source Geospatial Foundation",
                "(c) 2019, Open Source Geospatial Foundation"
            ],
            "file-count": 28,
            "sha256": "5f50b479828553762e4629aa4c9a73ab04efd9f11b12a3ea8175d24383b84378",
            "source": "https://repo.osgeo.org/repository/geotools-releases/org/geotools/gt-wmts/22.1/gt-wmts-22.1-sources.jar",
            "status": "restricted"
        },
        {
            "date": "November 16, 2022 at 1:52:08 a.m. GMT",
            "authority": "https://gitlab.eclipse.org/eclipsefdn/emo-team/iplab/-/issues/4879",
            "scancode-version": "31.2.1",
            "licenses-discovered": [
                "LGPL-2.0-or-later",
                "LGPL-2.1-only"
            ],
            "copyrights": [
                "(c) 2017, Open Source Geospatial Foundation",
                "(c) 2019, Open Source Geospatial Foundation"
            ],
            "file-count": 28,
            "sha256": "5f50b479828553762e4629aa4c9a73ab04efd9f11b12a3ea8175d24383b84378",
            "source": "https://repo.osgeo.org/repository/geotools-releases/org/geotools/gt-wmts/22.1/gt-wmts-22.1-sources.jar",
            "status": "approved"
        }
    ]
}