{
    "license": "MIT",
    "file-count": 15,
    "authority": "https://gitlab.eclipse.org/eclipsefdn/emo-team/iplab/-/issues/1266",
    "scancode-version": "21.3.31",
    "licenses-discovered": [
        "MIT"
    ],
    "id": "npm/npmjs/webassemblyjs/wasm-edit/1.8.5",
    "source": "https://registry.yarnpkg.com/@webassemblyjs/wasm-edit/-/wasm-edit-1.8.5.tgz",
    "status": "approved"
}