{
    "id": "maven/mavencentral/org.json4s/json4s-core_2.12/4.0.7",
    "license": "Apache-2.0",
    "authority": "https://gitlab.eclipse.org/eclipsefdn/emo-team/iplab/-/issues/19669",
    "source": "https://repo1.maven.org/maven2/org/json4s/json4s-core_2.12/4.0.7/json4s-core_2.12-4.0.7-sources.jar",
    "status": "approved",
    "scans": [
        {
            "date": "February 28, 2025 at 11:41:08 p.m. GMT",
            "authority": "https://gitlab.eclipse.org/eclipsefdn/emo-team/iplab/-/issues/19669",
            "scancode-version": "31.2.1",
            "licenses-discovered": [
                "Apache-2.0"
            ],
            "copyrights": [
                "Copyright 2009-2010 WorldWide Conferencing, LLC"
            ],
            "file-count": 38,
            "sha256": "0077dab62162c73d1c244511d214dc2c55d5c2b439a8ce20531e7bdd0716910b",
            "source": "https://repo1.maven.org/maven2/org/json4s/json4s-core_2.12/4.0.7/json4s-core_2.12-4.0.7-sources.jar",
            "status": "approved"
        }
    ]
}