{
    "id": "crate/cratesio/-/isahc/1.7.2",
    "license": "MIT AND CC-BY-4.0 AND MPL-2.0",
    "authority": "https://gitlab.eclipse.org/eclipsefdn/emo-team/iplab/-/issues/9775",
    "source": "https://crates.io/api/v1/crates/isahc/1.7.2/download",
    "status": "approved",
    "scans": [
        {
            "date": "July 26, 2023 at 11:02:53 a.m. GMT",
            "authority": "https://gitlab.eclipse.org/eclipsefdn/emo-team/iplab/-/issues/9775",
            "scancode-version": "31.2.1",
            "licenses-discovered": [
                "MIT",
                "CC-BY-4.0",
                "CC-BY-4.0 AND MIT",
                "MPL-2.0"
            ],
            "copyrights": [
                "Copyright (c) 2019 Stephen M. Coakley"
            ],
            "file-count": 89,
            "sha256": "334e04b4d781f436dc315cb1e7515bd96826426345d498149e4bde36b67f8ee9",
            "source": "https://crates.io/api/v1/crates/isahc/1.7.2/download",
            "status": "approved"
        }
    ]
}