{
    "id": "npm/npmjs/@storybook/router/7.0.21",
    "license": "MIT",
    "authority": "https://gitlab.eclipse.org/eclipsefdn/emo-team/iplab/-/issues/8980",
    "source": "https://registry.npmjs.org/@storybook/router/-/router-7.0.21.tgz",
    "status": "approved",
    "scans": [
        {
            "date": "June 15, 2023 at 2:29:42 p.m. GMT",
            "authority": "https://gitlab.eclipse.org/eclipsefdn/emo-team/iplab/-/issues/8980",
            "scancode-version": "31.2.1",
            "licenses-discovered": [
                "MIT"
            ],
            "copyrights": [
            ],
            "file-count": 12,
            "sha256": "5eaee4e2423c9f5f53bc77ebf583e3c4370923d1600dbe8b78222f203501363d",
            "source": "https://registry.npmjs.org/@storybook/router/-/router-7.0.21.tgz",
            "status": "approved"
        }
    ]
}