{
    "id": "npm/npmjs/-/ngx-bootstrap/3.1.2",
    "license": "MIT",
    "licenses-discovered": [
        "MIT"
    ],
    "copyrights": [
        "(c) YYYY-MM-DD",
        "Copyright (c) Angular ng-bootstrap team",
        "Copyright (c) Dmitriy Shekhovtsov <valorkin@gmail.com>",
        "Copyright (c) Google, Inc. import EventEmitter, Injectable",
        "Copyright (c) JS Foundation and other contributors",
        "Copyright (c) Valor Software",
        "Copyright (c) ngrx",
        "Copyright Google Inc.",
        "Copyright Google LLC",
        "Copyright The Bootstrap Authors",
        "Copyright Twitter, Inc.",
        "copyright Waybury. https://useiconic.com/open"
    ],
    "file-count": 1427,
    "scancode-version": "30.1.0",
    "authority": "https://gitlab.eclipse.org/eclipsefdn/emo-team/iplab/-/issues/2908",
    "source": "https://github.com/valor-software/ngx-bootstrap/archive/v3.1.2.zip",
    "status": "approved"
}