{
    "id": "git/github/qt/qtbase/v6.6.1",
    "license": "BSD-3-Clause AND LGPL-2.1-only AND (LicenseRef-scancode-unknown-spdx OR GPL-3.0-only WITH Qt-GPL-exception-1.0) AND (LicenseRef-scancode-unknown-spdx OR LGPL-3.0-only-only OR GPL-2.0-only OR GPL-3.0-only) AND MIT AND GPL-1.0-or-later AND (AFL-3.0 AND Artistic-2.0 AND EPL-1.0 AND GPL-1.0-or-later AND ZPL-2.1) AND (CDDL-1.0 AND GPL-1.0-or-later) AND (GPL-1.0-or-later AND GPL-3.0-only) AND (GPL-1.0-or-later AND GPL-3.0-only AND LGPL-3.0-only) AND LGPL-2.0-or-later AND BSD-2-Clause AND (LGPL-2.1-only AND LGPL-3.0-only) AND (GPL-2.0-only AND GPL-3.0-only AND LGPL-2.0-only AND LGPL-2.1-only AND LGPL-3.0-only) AND Apache-2.0 AND GFDL-1.1-or-later AND (LicenseRef-scancode-unknown-spdx OR GFDL-1.3-no-invariants-only) AND (LicenseRef-scancode-unknown-spdx OR BSD-3-Clause) AND AFL-2.1 AND BSL-1.0 AND CC0-1.0 AND GFDL-1.3-only AND GPL-2.0-only AND GPL-3.0-only AND LGPL-3.0-only AND Qt-GPL-exception-1.0 AND (Apache-2.0 AND CC0-1.0) AND (Apache-2.0 AND CC0-1.0 AND OpenSSL) AND (LicenseRef-scancode-unknown-spdx OR GPL-3.0-only) AND (BSD-3-Clause AND FTL AND GPL-2.0-only AND GPL-3.0-only AND LicenseRef-scancode-unknown AND Zlib) AND (MIT AND MIT-open-group) AND (FTL AND GPL-2.0-only AND MIT AND MIT-open-group AND Zlib) AND FTL AND Zlib AND (FTL AND LicenseRef-scancode-generic-exception) AND MIT-Modern-Variant AND LicenseRef-scancode-other-permissive AND MIT-open-group AND (FTL AND LicenseRef-scancode-freetype-patent) AND (Apache-2.0 AND BSD-3-Clause AND CDDL-1.0 AND EPL-1.0 AND EPL-2.0 AND LGPL-2.1-only AND LicenseRef-scancode-mit-old-style AND MIT AND MPL-2.0) AND (LicenseRef-scancode-other-permissive AND MIT-Modern-Variant) AND (MIT AND MIT-Modern-Variant) AND (LicenseRef-scancode-unknown AND MIT-Modern-Variant) AND ISC AND LicenseRef-scancode-unicode AND (BSD-2-Clause AND BSD-3-Clause) AND IJG AND (BSD-3-Clause AND IJG AND Zlib) AND Libpng AND (Libpng AND libpng-2.0) AND MPL-2.0 AND (BSD-3-Clause AND MPL-2.0) AND LicenseRef-scancode-public-domain-disclaimer AND (CC0-1.0 AND LicenseRef-scancode-public-domain-disclaimer) AND LicenseRef-scancode-unknown-spdx AND LicenseRef-scancode-brian-gladman AND (BSD-2-Clause AND CC0-1.0) AND blessing AND (Bitstream-Vera AND LicenseRef-scancode-ams-fonts AND LicenseRef-scancode-public-domain-disclaimer) AND Bitstream-Vera AND LicenseRef-scancode-lcs-telegraphics AND LicenseRef-scancode-xfree86-1.0 AND Unicode-DFS-2016 AND (AFL-2.1 OR GPL-2.0-or-later) AND (AFL-2.1 AND GPL-2.0-only) AND (AFL-2.1 AND GPL-2.0-or-later) AND LicenseRef-scancode-khronos AND (BSD-2-Clause AND Imlib2 AND MIT-enna) AND (BSD-2-Clause AND FTL AND GPL-2.0-only AND HPND AND Imlib2 AND X11) AND (HPND AND X11) AND (Apache-2.0 AND MIT) AND (Apache-2.0 OR MIT) AND bzip2-1.0.6 AND (GPL-2.0-only AND Linux-syscall-note) AND (GPL-2.0-only WITH Linux-syscall-note) AND (BSD-4-Clause AND GPL-2.0-only AND MIT) AND LicenseRef-scancode-ietf AND (W3C AND W3C-19980720) AND LicenseRef-scancode-proprietary-license AND (CC0-1.0 AND LicenseRef-scancode-unicode) AND CC-PDDC AND (GPL-3.0-only AND LGPL-2.1-only AND LicenseRef-scancode-commercial-license) AND (Apache-2.0 AND LGPL-2.0-only AND LGPL-2.1-only AND LGPL-3.0-only) AND (CC-BY-3.0 AND LicenseRef-scancode-free-unknown AND MIT) AND (MIT AND Unlicense) AND (LicenseRef-scancode-proprietary-license AND MIT AND Unlicense) AND (LicenseRef-scancode-unknown-spdx OR LGPL-3.0-only-only OR GPL-2.0-only OR GPL-3.0-only AND (LicenseRef-scancode-unknown-spdx OR GPL-3.0-only WITH Qt-GPL-exception-1.0))",
    "authority": "https://gitlab.eclipse.org/eclipsefdn/emo-team/iplab/-/issues/12845",
    "source": "https://github.com/qt/qtbase/archive/refs/tags/v6.6.1.zip",
    "status": "approved",
    "scans": [
        {
            "date": "January 19, 2024 at 4:24:47 p.m. GMT",
            "authority": "https://gitlab.eclipse.org/eclipsefdn/emo-team/iplab/-/issues/12845",
            "scancode-version": "31.2.1",
            "licenses-discovered": [
                "BSD-3-Clause",
                "LGPL-2.1-only",
                "LicenseRef-scancode-unknown-spdx OR GPL-3.0-only WITH Qt-GPL-exception-1.0",
                "LicenseRef-scancode-unknown-spdx OR LGPL-3.0-only-only OR GPL-2.0-only OR GPL-3.0-only",
                "MIT",
                "GPL-1.0-or-later",
                "AFL-3.0 AND Artistic-2.0 AND EPL-1.0 AND GPL-1.0-or-later AND ZPL-2.1",
                "CDDL-1.0 AND GPL-1.0-or-later",
                "GPL-1.0-or-later AND GPL-3.0-only",
                "GPL-1.0-or-later AND GPL-3.0-only AND LGPL-3.0-only",
                "LGPL-2.0-or-later",
                "BSD-2-Clause",
                "LGPL-2.1-only AND LGPL-3.0-only",
                "GPL-2.0-only AND GPL-3.0-only AND LGPL-2.0-only AND LGPL-2.1-only AND LGPL-3.0-only",
                "Apache-2.0",
                "GFDL-1.1-or-later",
                "LicenseRef-scancode-unknown-spdx OR GFDL-1.3-no-invariants-only",
                "LicenseRef-scancode-unknown-spdx OR BSD-3-Clause",
                "AFL-2.1",
                "BSL-1.0",
                "CC0-1.0",
                "GFDL-1.3-only",
                "GPL-2.0-only",
                "GPL-3.0-only",
                "LGPL-3.0-only",
                "Qt-GPL-exception-1.0",
                "Apache-2.0 AND CC0-1.0",
                "Apache-2.0 AND CC0-1.0 AND OpenSSL",
                "LicenseRef-scancode-unknown-spdx OR GPL-3.0-only",
                "BSD-3-Clause AND FTL AND GPL-2.0-only AND GPL-3.0-only AND LicenseRef-scancode-unknown AND Zlib",
                "MIT AND MIT-open-group",
                "FTL AND GPL-2.0-only AND MIT AND MIT-open-group AND Zlib",
                "FTL",
                "Zlib",
                "FTL AND LicenseRef-scancode-generic-exception",
                "MIT-Modern-Variant",
                "LicenseRef-scancode-other-permissive",
                "MIT-open-group",
                "FTL AND LicenseRef-scancode-freetype-patent",
                "Apache-2.0 AND BSD-3-Clause AND CDDL-1.0 AND EPL-1.0 AND EPL-2.0 AND LGPL-2.1-only AND LicenseRef-scancode-mit-old-style AND MIT AND MPL-2.0",
                "LicenseRef-scancode-other-permissive AND MIT-Modern-Variant",
                "MIT AND MIT-Modern-Variant",
                "LicenseRef-scancode-unknown AND MIT-Modern-Variant",
                "ISC",
                "LicenseRef-scancode-unicode",
                "BSD-2-Clause AND BSD-3-Clause",
                "IJG",
                "BSD-3-Clause AND IJG AND Zlib",
                "Libpng",
                "Libpng AND libpng-2.0",
                "MPL-2.0",
                "BSD-3-Clause AND MPL-2.0",
                "LicenseRef-scancode-public-domain-disclaimer",
                "CC0-1.0 AND LicenseRef-scancode-public-domain-disclaimer",
                "LicenseRef-scancode-unknown-spdx",
                "LicenseRef-scancode-brian-gladman",
                "BSD-2-Clause AND CC0-1.0",
                "blessing",
                "Bitstream-Vera AND LicenseRef-scancode-ams-fonts AND LicenseRef-scancode-public-domain-disclaimer",
                "Bitstream-Vera",
                "LicenseRef-scancode-lcs-telegraphics",
                "LicenseRef-scancode-xfree86-1.0",
                "Unicode-DFS-2016",
                "AFL-2.1 OR GPL-2.0-or-later",
                "AFL-2.1 AND GPL-2.0-only",
                "AFL-2.1 AND GPL-2.0-or-later",
                "LicenseRef-scancode-khronos",
                "BSD-2-Clause AND Imlib2 AND MIT-enna",
                "BSD-2-Clause AND FTL AND GPL-2.0-only AND HPND AND Imlib2 AND X11",
                "HPND AND X11",
                "Apache-2.0 AND MIT",
                "Apache-2.0 OR MIT",
                "bzip2-1.0.6",
                "GPL-2.0-only AND Linux-syscall-note",
                "GPL-2.0-only WITH Linux-syscall-note",
                "BSD-4-Clause AND GPL-2.0-only AND MIT",
                "LicenseRef-scancode-ietf",
                "W3C AND W3C-19980720",
                "LicenseRef-scancode-proprietary-license",
                "CC0-1.0 AND LicenseRef-scancode-unicode",
                "CC-PDDC",
                "GPL-3.0-only AND LGPL-2.1-only AND LicenseRef-scancode-commercial-license",
                "Apache-2.0 AND LGPL-2.0-only AND LGPL-2.1-only AND LGPL-3.0-only",
                "CC-BY-3.0 AND LicenseRef-scancode-free-unknown AND MIT",
                "MIT AND Unlicense",
                "LicenseRef-scancode-proprietary-license AND MIT AND Unlicense",
                "LicenseRef-scancode-unknown-spdx OR LGPL-3.0-only-only OR GPL-2.0-only OR GPL-3.0-only AND (LicenseRef-scancode-unknown-spdx OR GPL-3.0-only WITH Qt-GPL-exception-1.0)"
            ],
            "copyrights": [
                "(c) ,$?o2Y$?1$? <$?E'O$?1$?e3/4UoU$?I!$?EI$?I http://www.w3.org/TR/NOTE-sgml-xml'>",
                "(c) 1947 Editions Gallimard",
                "(c) 1995-2023 Jean-loup Gailly and Mark Adler",
                "(c) 2003 by Bitstream, Inc.",
                "(c) 2006 M. Preus",
                "(c) 2006 Martin Preuss Schlie Close",
                "(c) 2012-2014 Daniel J. Bernstein <djb@cr.yp.to>",
                "(c) 2012-2014 Jean-Philippe Aumasson",
                "(c) 2017 Unicode(r), Inc.",
                "(c) 2022 Unicode(r), Inc.",
                "(c) 2023 The Qt Company",
                "(c) 2023 The Qt Company Ltd. Documentation",
                "(c) 2023 Unicode(r), Inc.",
                "(c) AExtensible Markup Language",
                "(c) AIC1998N2EWorld Wide Web Consortium",
                "(c) AIQAEBnI L",
                "(c) Alexandre PUKALL Avril 1998",
                "(c) American Mathematical Society",
                "(c) Carsten Haitzler and various",
                "(c) Carsten Haitzler and various contributors",
                "(c) Copyright IBM Corp. 2000",
                "(c) Copyright IBM Corp. 2003",
                "(c) Daniel M. Duley",
                "(c) E AIUeIACIy",
                "(c) EO*eUxICEI http://www.w3.org/TR/NOTE-sgml-xml",
                "(c) Ee-EaEuE OIuI",
                "(c) I$?iAT g3eCXMLdT g*e http://www.w3.org/XML",
                "(c) IaeH, ANH",
                "(c) QString n QString",
                "(c) SE0o OS",
                "(c) Tavmjong Bah",
                "(c) Tavmjung Bah",
                "(c) VS1997",
                "(c) Willem Monsuwe <willem@stack.nl>",
                "(c) by John Bradley",
                "(c) co",
                "COPYRIGHT BY SNK CORPORATION",
                "Copyright (c) 1 The Qt Company Ltd",
                "Copyright (c) 1987 X Consortium",
                "Copyright (c) 1987, 1988 X",
                "Copyright (c) 1987, 1988 X Consortium",
                "Copyright (c) 1989, 1991 Free Software Foundation, Inc.",
                "Copyright (c) 1990, 1994, 1998 The Open Group",
                "Copyright (c) 1991-1994, Thomas G. Lane",
                "Copyright (c) 1991-1995, Thomas G. Lane",
                "Copyright (c) 1991-1996, Thomas G. Lane",
                "Copyright (c) 1991-1996, Thomas G. Lane. Lossless JPEG",
                "Copyright (c) 1991-1997, Thomas G. Lane",
                "Copyright (c) 1991-1997, Thomas G. Lane. Lossless JPEG",
                "Copyright (c) 1991-1998, Thomas G. Lane",
                "Copyright (c) 1991-1998, Thomas G. Lane. Lossless JPEG",
                "Copyright (c) 1991-2012 Unicode, Inc.",
                "Copyright (c) 1991-2015 Unicode, Inc.",
                "Copyright (c) 1991-2020 Thomas G. Lane, Guido Vollbeding",
                "Copyright (c) 1991-2020, Thomas G. Lane, Guido Vollbeding",
                "Copyright (c) 1991-2022 Unicode, Inc.",
                "Copyright (c) 1991-2023 The libjpeg-turbo Project",
                "Copyright (c) 1992-1996, Thomas G. Lane",
                "Copyright (c) 1992-1997, Thomas G. Lane",
                "Copyright (c) 1994-1996, Thomas G. Lane",
                "Copyright (c) 1994-1996, Thomas G. Lane. Lossless JPEG",
                "Copyright (c) 1994-1997, Thomas G. Lane",
                "Copyright (c) 1994-1997, Thomas G. Lane. Lossless JPEG",
                "Copyright (c) 1994-1998, Thomas G. Lane",
                "Copyright (c) 1994-1998, Thomas G. Lane. Lossless JPEG",
                "Copyright (c) 1994-2002 World Wide Web Consortium, (Massachusetts Institute of Technology, Institut National de Recherche en Informatique et en Automatique, Keio University)",
                "Copyright (c) 1995, 1996 Frank J. T. Wojcik",
                "Copyright (c) 1995, 1996 Guy Eric Schalnat, Group 42, Inc.",
                "Copyright (c) 1995-1996 Dave",
                "Copyright (c) 1995-1996 Guy Eric Schalnat, Group",
                "Copyright (c) 1995-1996 Guy Eric Schalnat, Group 42, Inc.",
                "Copyright (c) 1995-1996 Paul",
                "Copyright (c) 1995-1996 Tim Wegner",
                "Copyright (c) 1995-1997, Thomas G. Lane",
                "Copyright (c) 1995-1997, Thomas G. Lane. Lossless JPEG",
                "Copyright (c) 1995-1998, Thomas G. Lane",
                "Copyright (c) 1995-2002 Jean-loup Gailly and Mark Adler",
                "Copyright (c) 1995-2003, 2010 Mark Adler",
                "Copyright (c) 1995-2003, 2010, 2014, 2016 Jean-loup Gailly, Mark Adler",
                "Copyright (c) 1995-2005, 2010 Mark Adler",
                "Copyright (c) 1995-2005, 2014, 2016 Jean-loup Gailly, Mark Adler",
                "Copyright (c) 1995-2011, 2016 Mark Adler",
                "Copyright (c) 1995-2016 Jean-loup Gailly, Mark Adler",
                "Copyright (c) 1995-2017 Jean-loup Gailly",
                "Copyright (c) 1995-2017 Mark Adler",
                "Copyright (c) 1995-2018 Jean-loup Gailly",
                "Copyright (c) 1995-2019 Mark Adler",
                "Copyright (c) 1995-2021 Jean-loup Gailly",
                "Copyright (c) 1995-2022 Jean-loup Gailly and Mark Adler",
                "Copyright (c) 1995-2022 Jean-loup Gailly, Mark Adler",
                "Copyright (c) 1995-2022 Mark Adler",
                "Copyright (c) 1995-2023 Jean-loup Gailly and Mark Adler",
                "Copyright (c) 1995-2023 Mark Adler",
                "Copyright (c) 1995-2023 The PNG Reference",
                "Copyright (c) 1995-2023 The PNG Reference Library Authors",
                "Copyright (c) 1996, 1997 Andreas Dilger",
                "Copyright (c) 1996, 1997 by Agner Fog",
                "Copyright (c) 1996-1997 Andreas",
                "Copyright (c) 1996-1997 Andreas Dilger",
                "Copyright (c) 1996-1997 Greg",
                "Copyright (c) 1996-1997 John",
                "Copyright (c) 1996-1997 Kevin",
                "Copyright (c) 1996-1997 Magnus",
                "Copyright (c) 1996-1997 Sam",
                "Copyright (c) 1996-1997 Tom",
                "Copyright (c) 1996-2022 by David Turner, Robert Wilhelm, and Werner Lemberg",
                "Copyright (c) 1996-2023 David Turner, Robert Wilhelm, Dominik Rottsches, and Werner",
                "Copyright (c) 1996-2023 Just van Rossum, David Turner, Robert Wilhelm, and Werner",
                "Copyright (c) 1996-2023 by David Turner, Robert Wilhelm, Werner Lemberg, and Dominik Rottsches",
                "Copyright (c) 1996-2023 by David Turner, Robert Wilhelm, and Werner Lemberg",
                "Copyright (c) 1996-2023 by Just van Rossum, David Turner, Robert Wilhelm, and Werner Lemberg",
                "Copyright (c) 1997-1998, Thomas G. Lane, Todd Newman",
                "Copyright (c) 1997-2012 University of Cambridge",
                "Copyright (c) 1997-2022 University of Cambridge",
                "Copyright (c) 1998 James Clark",
                "Copyright (c) 1998, Thomas G. Lane. Lossless JPEG",
                "Copyright (c) 1998-2000 Glenn Randers-Pehrson",
                "Copyright (c) 1998-2000 Tom",
                "Copyright (c) 1998-2000 Willem",
                "Copyright (c) 1998-2002,2004,2006-2013 Glenn Randers-Pehrson",
                "Copyright (c) 1998-2002,2004,2006-2013,2018 Glenn Randers-Pehrson",
                "Copyright (c) 1998-2002,2004,2006-2014,2016 Glenn Randers-Pehrson",
                "Copyright (c) 1998-2002,2004,2006-2014,2016,2018 Glenn Randers-Pehrson",
                "Copyright (c) 1998-2002,2004,2006-2016,2018 Glenn Randers-Pehrson",
                "Copyright (c) 1998-2002,2004,2006-2017 Glenn Randers-Pehrson",
                "Copyright (c) 1998-2002,2004,2006-2018 Glenn Randers-Pehrson",
                "Copyright (c) 1998-2002,2006-2016 Glenn Randers-Pehrson",
                "Copyright (c) 1998-2004 David Turner and Werner Lemberg",
                "Copyright (c) 1998-2005 David Turner and Werner",
                "Copyright (c) 1998-2005 David Turner and Werner Lemberg",
                "Copyright (c) 1998-2013, Brian Gladman, Worcester, UK.",
                "Copyright (c) 1998-2018 Glenn",
                "Copyright (c) 1998-2018 Glenn Randers-Pehrson",
                "Copyright (c) 1999 CERN - European Organization for Nuclear Research",
                "Copyright (c) 1999 David Turner",
                "Copyright (c) 1999 Ken Murchison",
                "Copyright (c) 1999, Ken Murchison",
                "Copyright (c) 1999-2006 MIYASAKA Masaru",
                "Copyright (c) 1999-2006, MIYASAKA Masaru",
                "Copyright (c) 2000 - 2019 The Legion of the Bouncy Castle Inc. (https://www.bouncycastle.org)",
                "Copyright (c) 2000 Carsten Haitzler and various contributors",
                "Copyright (c) 2000 Computing Research Labs, New Mexico State",
                "Copyright (c) 2000 by Francesco Zappa Nardelli",
                "Copyright (c) 2000, 2001, 2002, 2003, 2006, 2010 by Francesco Zappa Nardelli",
                "Copyright (c) 2000, 2001, 2002, 2007, 2008 Free Software Foundation, Inc. <https://fsf.org/>",
                "Copyright (c) 2000, 2001, 2003, 2008 by Francesco Zappa Nardelli",
                "Copyright (c) 2000, 2001, 2004-2007 by foobar",
                "Copyright (c) 2000, 2006 Sun Microsystems",
                "Copyright (c) 2000, 2006 Sun Microsystems, Inc.",
                "Copyright (c) 2000-2002, 2004, 2006-2018 Glenn Randers-Pehrson",
                "Copyright (c) 2000-2004, 2006-2011, 2013, 2014 by Francesco Zappa Nardelli",
                "Copyright (c) 2000-2011 INRIA, France Telecom",
                "Copyright (c) 2000-2011 ymnk, JCraft,Inc.",
                "Copyright (c) 2000-2014 Francesco Zappa",
                "Copyright (c) 2000-2015 www.hamcrest.org",
                "Copyright (c) 2000-2017 Eric S.",
                "Copyright (c) 2000-2017 Gilles",
                "Copyright (c) 2000-2017 James",
                "Copyright (c) 2000-2017 Julian",
                "Copyright (c) 2000-2017 Julian Seward",
                "Copyright (c) 2000-2017 Mandar",
                "Copyright (c) 2000-2017 Mans",
                "Copyright (c) 2000-2017 Simon-Pierre",
                "Copyright (c) 2000-2021 by foobar",
                "Copyright (c) 2000-2021 foobar",
                "Copyright (c) 2000-2022 Kitware, Inc. and Contributors",
                "Copyright (c) 2000-2023 Cosmin",
                "Copyright (c) 2000-2023 by David Turner, Robert Wilhelm, and Werner Lemberg",
                "Copyright (c) 2001 Alexander Peslyak",
                "Copyright (c) 2001 Robert Penner",
                "Copyright (c) 2001, 2002 by Francesco Zappa Nardelli",
                "Copyright (c) 2001, 2002, 2003, 2004 by Francesco Zappa Nardelli",
                "Copyright (c) 2001, 2002, 2003, 2008 by Francesco Zappa Nardelli",
                "Copyright (c) 2001, 2012 David Turner, Robert Wilhelm, and Werner",
                "Copyright (c) 2001, Eric D. Friedman",
                "Copyright (c) 2001-2002 by Francesco Zappa Nardelli",
                "Copyright (c) 2001-2006 Bart Massey, Jamey Sharp, and Josh",
                "Copyright (c) 2001-2008, 2011, 2013, 2014 by Francesco Zappa Nardelli",
                "Copyright (c) 2001-2014 Francesco Zappa Nardelli",
                "Copyright (c) 2001-2015 Francesco Zappa",
                "Copyright (c) 2001-2023 by David Turner, Robert Wilhelm, and Werner Lemberg",
                "Copyright (c) 2002, 2003 CodeFactory",
                "Copyright (c) 2002, 2003 CodeFactory AB",
                "Copyright (c) 2002, 2003, 2004, 2005 Red Hat, Inc.",
                "Copyright (c) 2002-2023 Roberto",
                "Copyright (c) 2002-2023 by David Turner, Robert Wilhelm, and Werner Lemberg",
                "Copyright (c) 2002-2023 by Roberto Alameda",
                "Copyright (c) 2003 Bitstream,Inc",
                "Copyright (c) 2003 Huw D M Davies",
                "Copyright (c) 2003 by Bitstream",
                "Copyright (c) 2003 by Bitstream, Inc.",
                "Copyright (c) 2003, 2006 Massachusetts Institute of Technology",
                "Copyright (c) 2003, 2006 Matteo",
                "Copyright (c) 2003, 2006 Matteo Frigo",
                "Copyright (c) 2003-2004 Lawrence E. Rosen",
                "Copyright (c) 2003-2017 Josef Weidendorfer",
                "Copyright (c) 2003-2023 David Turner, Robert Wilhelm, and Werner",
                "Copyright (c) 2003-2023 Masatake YAMATO and Redhat",
                "Copyright (c) 2003-2023 by David Turner, Robert Wilhelm, Werner Lemberg, and Dominik Rottsches",
                "Copyright (c) 2003-2023 by David Turner, Robert Wilhelm, and Werner Lemberg",
                "Copyright (c) 2003-2023 by Masatake YAMATO, Redhat K.K., David Turner, Robert Wilhelm, and Werner Lemberg",
                "Copyright (c) 2004 Andrey Panin <pazke@donpac.ru>",
                "Copyright (c) 2004, 2005 Daniel M.",
                "Copyright (c) 2004, 2005 Daniel M. Duley",
                "Copyright (c) 2004, 2005 Red Hat, Inc.",
                "Copyright (c) 2004, 2005 Tristan Grimmer",
                "Copyright (c) 2004, 2010 Mark Adler",
                "Copyright (c) 2004,2007,2008,2009,2010,2013,2021,2022,2023 Red Hat",
                "Copyright (c) 2004,2007,2008,2009,2010,2013,2021,2022,2023 Red Hat, Inc.",
                "Copyright (c) 2004,2007,2009 Red Hat, Inc.",
                "Copyright (c) 2004,2007,2009,2010 Red Hat, Inc.",
                "Copyright (c) 2004-2017 Mark Adler",
                "Copyright (c) 2004-2017 QOS.ch",
                "Copyright (c) 2004-2019 Mark Adler",
                "Copyright (c) 2004-2023 Albert",
                "Copyright (c) 2004-2023 David Turner, Robert Wilhelm, Werner Lemberg and George",
                "Copyright (c) 2004-2023 Masatake YAMATO, Redhat K.K, David Turner, Robert Wilhelm, and Werner",
                "Copyright (c) 2004-2023 by Albert",
                "Copyright (c) 2004-2023 by David Turner, Robert Wilhelm, Werner Lemberg and George Williams",
                "Copyright (c) 2004-2023 by David Turner, Robert Wilhelm, Werner Lemberg, and George Williams",
                "Copyright (c) 2004-2023 by David Turner, Robert Wilhelm, and Werner Lemberg",
                "Copyright (c) 2004-2023 by Masatake YAMATO and Redhat K.K.",
                "Copyright (c) 2004-2023 by Masatake YAMATO, Red Hat K.K., David Turner, Robert Wilhelm, and Werner Lemberg",
                "Copyright (c) 2004-2023 by Masatake YAMATO, Redhat K.K, David Turner, Robert Wilhelm, and Werner Lemberg",
                "Copyright (c) 2004-2023 by suzuki toshiya, Masatake YAMATO, Red",
                "Copyright (c) 2004-2023 by suzuki toshiya, Masatake YAMATO, Red Hat K.K., David Turner, Robert Wilhelm, and Werner Lemberg",
                "Copyright (c) 2004-2023 suzuki toshiya, Masatake YAMATO, Red Hat K.K., David Turner, Robert Wilhelm, and Werner",
                "Copyright (c) 2005 The Android Open Source Project",
                "Copyright (c) 2005 Werner Lemberg",
                "Copyright (c) 2005, 2007, 2008, 2013 George",
                "Copyright (c) 2005, 2007, 2008, 2013 by George Williams",
                "Copyright (c) 2005,2006,2020,2021,2022,2023 Behdad",
                "Copyright (c) 2005,2006,2020,2021,2022,2023 Behdad Esfahbod",
                "Copyright (c) 2005-2023 David",
                "Copyright (c) 2005-2023 by David Turner",
                "Copyright (c) 2005-2023 by David Turner, Robert Wilhelm, and Werner Lemberg",
                "Copyright (c) 2005-2023 by suzuki toshiya, Masatake YAMATO, Red Hat K.K., David Turner, Robert Wilhelm, and Werner Lemberg",
                "Copyright (c) 2006 Behdad Esfahbod",
                "Copyright (c) 2006 IBM",
                "Copyright (c) 2006 IBM Corporation",
                "Copyright (c) 2006 Peter",
                "Copyright (c) 2006 by Tavmjong",
                "Copyright (c) 2006 by Tavmjong Bah",
                "Copyright (c) 2006,2007 Laurent Montel, <montel@kde.org>",
                "Copyright (c) 2006-11-28 Charles Poynton",
                "Copyright (c) 2006-2023 by David Turner, Robert Wilhelm, and Werner Lemberg",
                "Copyright (c) 2007 Chris",
                "Copyright (c) 2007 Chris Wilson",
                "Copyright (c) 2007 Dmitry Timoshkov",
                "Copyright (c) 2007 Free Software Foundation, Inc. <http://fsf.org/>",
                "Copyright (c) 2007, 2010 Linux Foundation",
                "Copyright (c) 2007, 2010, 2012, 2013 Linux Foundation",
                "Copyright (c) 2007, 2012 Linux Foundation",
                "Copyright (c) 2007, 2013 Linux Foundation",
                "Copyright (c) 2007,2008,2009 Red Hat, Inc.",
                "Copyright (c) 2007,2008,2009,2010 Red Hat, Inc.",
                "Copyright (c) 2007-2008, Apple, Inc.",
                "Copyright (c) 2007-2014 Adobe Systems",
                "Copyright (c) 2007-2023 Derek Clegg and Michael",
                "Copyright (c) 2007-2023 Rahul Bhalerao <rahul.bhalerao@redhat.com>",
                "Copyright (c) 2007-2023 by David Turner",
                "Copyright (c) 2007-2023 by David Turner, Robert Wilhelm, and Werner Lemberg",
                "Copyright (c) 2007-2023 by Dereg Clegg and Michael Toftdal",
                "Copyright (c) 2007-2023 by Derek Clegg and Michael Toftdal",
                "Copyright (c) 2007-2023 by Rahul Bhalerao <rahul.bhalerao@redhat.com>",
                "Copyright (c) 2008 Laurent Montel, <montel@kde.org>",
                "Copyright (c) 2008,2010 Nokia Corporation",
                "Copyright (c) 2008,2010 Nokia Corporation and/or its subsidiary(-ies)",
                "Copyright (c) 2008-2009, Thomas Gleixner <tglx@linutronix.de>",
                "Copyright (c) 2008-2011, Red Hat, Inc., Ingo",
                "Copyright (c) 2008-2011, Red Hat, Inc., Ingo Molnar",
                "Copyright (c) 2008-2011, Red Hat, Inc., Peter Zijlstra",
                "Copyright (c) 2008-2018, Nathan Sweet",
                "Copyright (c) 2008-2023 David Turner, Robert Wilhelm, Werner Lemberg, and suzuki",
                "Copyright (c) 2008-2023 by David Turner, Robert Wilhelm, Werner Lemberg, and suzuki toshiya",
                "Copyright (c) 2008-2023 by David Turner, Robert Wilhelm, and Werner Lemberg",
                "Copyright (c) 2009 Dan Nicholson",
                "Copyright (c) 2009 Keith",
                "Copyright (c) 2009 Keith Stribley",
                "Copyright (c) 2009 Marco Martin <notmart@gmail.com>",
                "Copyright (c) 2009 Nokia Corporation",
                "Copyright (c) 2009 Red Hat, Inc.",
                "Copyright (c) 2009 Stephen Kelly <steveire@gmail.com>",
                "Copyright (c) 2009, 2011, 2014-2015, 2018, 2020, 2022, D. R. Commander",
                "Copyright (c) 2009, 2011, 2014-2015, 2020, 2022, D. R. Commander",
                "Copyright (c) 2009, 2011, 2015, 2022-2023, D. R. Commander",
                "Copyright (c) 2009, 2011-2012, 2014-2015, 2022, D. R. Commander",
                "Copyright (c) 2009, 2012 Pierre Ossman for Cendio AB",
                "Copyright (c) 2009, 2014-2015, 2020, 2022-2023, D. R. Commander",
                "Copyright (c) 2009, 2015, 2022-2023, D. R. Commander",
                "Copyright (c) 2009, 2023 Red Hat, Inc.",
                "Copyright (c) 2009,2010 Red Hat, Inc.",
                "Copyright (c) 2009-2011 Nokia Corporation and/or its subsidiary(-ies)",
                "Copyright (c) 2009-2011, 2013-2014, 2016-2017, 2020, 2022-2023, D. R. Commander",
                "Copyright (c) 2009-2011, 2014-2016, 2018-2023, D. R. Commander",
                "Copyright (c) 2009-2011, 2016, 2018-2019, 2022, D. R. Commander",
                "Copyright (c) 2009-2011, 2016, 2019, 2022-2023, D. R. Commander",
                "Copyright (c) 2009-2011, 2018, 2023, D. R. Commander",
                "Copyright (c) 2009-2012, 2015, 2022, D. R. Commander",
                "Copyright (c) 2009-2022 Zoltan Herczeg",
                "Copyright (c) 2009-2023 D. R. Commander",
                "Copyright (c) 2009-2023 Oran Agra and Mickey",
                "Copyright (c) 2009-2023 by Oran Agra and Mickey Gabel",
                "Copyright (c) 2010 Google, Inc.",
                "Copyright (c) 2010 Red Hat, Inc.",
                "Copyright (c) 2010, 2012-2023, D. R. Commander",
                "Copyright (c) 2010, 2015, 2022, D. R. Commander",
                "Copyright (c) 2010, 2015-2016, 2019-2020, 2022-2023, D. R. Commander",
                "Copyright (c) 2010, 2015-2016, 2022, D. R. Commander",
                "Copyright (c) 2010, 2015-2020, 2022-2023, D. R. Commander",
                "Copyright (c) 2010, 2016, 2018, 2022, D. R. Commander",
                "Copyright (c) 2010, 2016, 2018, 2022-2023, D. R. Commander",
                "Copyright (c) 2010, 2016, 2022, D. R. Commander",
                "Copyright (c) 2010, 2017 Craig A. Berry",
                "Copyright (c) 2010, 2020, D. R. Commander",
                "Copyright (c) 2010, 2022, D. R. Commander",
                "Copyright (c) 2010,2011,2012 Google, Inc.",
                "Copyright (c) 2010,2011,2012,2013 Google, Inc.",
                "Copyright (c) 2010,2011,2013 Google, Inc.",
                "Copyright (c) 2010,2012 Google, Inc.",
                "Copyright (c) 2010,2012,2013 Google, Inc.",
                "Copyright (c) 2010-2011, 2015-2016, 2021, D. R. Commander",
                "Copyright (c) 2010-2022 Google",
                "Copyright (c) 2010-2022 Google, Inc.",
                "Copyright (c) 2010-2022 Zoltan Herczeg",
                "Copyright (c) 2010-2023 Joel",
                "Copyright (c) 2010-2023 by Joel Klinghed",
                "Copyright (c) 2011 - 2012 Research",
                "Copyright (c) 2011 - 2013 BlackBerry Limited",
                "Copyright (c) 2011 - 2014 BlackBerry Limited",
                "Copyright (c) 2011 Codethink Limited",
                "Copyright (c) 2011 Google, Inc.",
                "Copyright (c) 2011 IETF Trust",
                "Copyright (c) 2011 Klaralvdalens Datakonsult AB, a KDAB Group company, info@kdab.com",
                "Copyright (c) 2011 Martin Hosken",
                "Copyright (c) 2011 Martin Hosken and SIL",
                "Copyright (c) 2011 Martin Hosken and SIL International",
                "Copyright (c) 2011 Olivier Goffart",
                "Copyright (c) 2011 Richard J. Moore <rich@kde.org>",
                "Copyright (c) 2011 Robin Burchell <robin+qt@viroteck.net>",
                "Copyright (c) 2011 SIL International",
                "Copyright (c) 2011 Thiago Macieira <thiago@kde.org>",
                "Copyright (c) 2011, 2014, 2022, D. R. Commander",
                "Copyright (c) 2011, 2014-2015, 2022, D. R. Commander",
                "Copyright (c) 2011, 2015, 2018, 2021-2022, D. R. Commander",
                "Copyright (c) 2011, 2015, 2020, 2022-2023, D. R. Commander",
                "Copyright (c) 2011,2012 Google, Inc.",
                "Copyright (c) 2011,2012,2013 Google, Inc.",
                "Copyright (c) 2011,2012,2014 Google, Inc.",
                "Copyright (c) 2011,2014 Google, Inc.",
                "Copyright (c) 2011-2016 Siarhei Siamashka",
                "Copyright (c) 2011-2018 The KDE community",
                "Copyright (c) 2012 - 2014 BlackBerry Limited",
                "Copyright (c) 2012 BogDan Vatra <bogdan@kde.org>",
                "Copyright (c) 2012 Collabora Ltd",
                "Copyright (c) 2012 David Faure <faure@kde.org>",
                "Copyright (c) 2012 Giuseppe D'Angelo <dangelog@gmail.com>",
                "Copyright (c) 2012 Google, Inc.",
                "Copyright (c) 2012 Grigori Goronzy <greg@kinoho.net>",
                "Copyright (c) 2012 Hewlett-Packard Development Company, L.P.",
                "Copyright (c) 2012 Intel Corporation",
                "Copyright (c) 2012 Jeremy Laine <jeremy.laine@m4x.org>",
                "Copyright (c) 2012 KDAB",
                "Copyright (c) 2012 Klaralvdalens Datakonsult AB",
                "Copyright (c) 2012 Klaralvdalens Datakonsult AB, a KDAB Group company, info@kdab.com",
                "Copyright (c) 2012 Mozilla Foundation",
                "Copyright (c) 2012 Nokia Corporation and/or its subsidiary(-ies)",
                "Copyright (c) 2012 Olivier Goffart <ogoffart@woboq.com>",
                "Copyright (c) 2012 Research",
                "Copyright (c) 2012 Thorbjorn Lund Martsum - tmartsum at gmail.com",
                "Copyright (c) 2012 Zilong Tan (eric.zltan@gmail.com)",
                "Copyright (c) 2012, 2015, 2022, D. R. Commander",
                "Copyright (c) 2012,2013 Google, Inc.",
                "Copyright (c) 2012,2013 Mozilla Foundation",
                "Copyright (c) 2012,2015 Mozilla",
                "Copyright (c) 2012,2015 Mozilla Foundation",
                "Copyright (c) 2012,2017 Google, Inc.",
                "Copyright (c) 2012,2018 Google, Inc.",
                "Copyright (c) 2012-2023 by David Turner, Robert Wilhelm, and Werner Lemberg",
                "Copyright (c) 2013 - 2014 BlackBerry Limited",
                "Copyright (c) 2013 2013 Thorbjorn Lund Martsum - tmartsum at gmail.com",
                "Copyright (c) 2013 Aleix Pol Gonzalez <aleixpol@kde.org>",
                "Copyright (c) 2013 BlackBerry Limited",
                "Copyright (c) 2013 BogDan Vatra <bogdan@kde.org>",
                "Copyright (c) 2013 Daniel Martin",
                "Copyright (c) 2013 David Faure <david.faure@kdab.com>",
                "Copyright (c) 2013 David Faure <faure+bluesystems@kde.org>",
                "Copyright (c) 2013 David Faure <faure@kde.org>",
                "Copyright (c) 2013 Google, Inc.",
                "Copyright (c) 2013 Imagination Technologies Limited, www.imgtec.com",
                "Copyright (c) 2013 Ivan Komissarov",
                "Copyright (c) 2013 John Layt <jlayt@kde.org>",
                "Copyright (c) 2013 Klaralvdalens Datakonsult AB",
                "Copyright (c) 2013 Klaralvdalens Datakonsult AB, a KDAB Group company, info@kdab.com",
                "Copyright (c) 2013 Konstantin Ritt",
                "Copyright (c) 2013 Laszlo Papp <lpapp@kde.org>",
                "Copyright (c) 2013 Linux Foundation",
                "Copyright (c) 2013 Olivier Goffart <ogoffart@woboq.com>",
                "Copyright (c) 2013 Red Hat, Inc.",
                "Copyright (c) 2013 Richard J. Moore <rich@kde.org>",
                "Copyright (c) 2013 Ruslan Nigmatullin <euroelessar@yandex.ru>",
                "Copyright (c) 2013 Samuel Gaist <samuel.gaist@deltech.ch>",
                "Copyright (c) 2013 Samuel Gaist <samuel.gaist@edeltech.ch>",
                "Copyright (c) 2013 Teo Mrnjavac <teo@kde.org>",
                "Copyright (c) 2013 Thorbjorn Lund Martsum - tmartsum at gmail.com",
                "Copyright (c) 2013 Thorbjorn Martsum - tmartsum at gmail.com",
                "Copyright (c) 2013, 2016, 2022, D. R. Commander",
                "Copyright (c) 2013, 2022, D. R. Commander",
                "Copyright (c) 2013, Linaro Limited",
                "Copyright (c) 2013, MIPS Technologies, Inc., California",
                "Copyright (c) 2013-2014 Linaro Limited",
                "Copyright (c) 2013-2014 MIPS Technologies, Inc.",
                "Copyright (c) 2013-2014 The Khronos Group Inc.",
                "Copyright (c) 2013-2015 Alexei Podtelezhnikov",
                "Copyright (c) 2013-2018 The Khronos Group Inc.",
                "Copyright (c) 2013-2022 Google",
                "Copyright (c) 2013-2023 Google, Inc. Google",
                "Copyright (c) 2013-2023 by David Turner, Robert Wilhelm, and Werner Lemberg",
                "Copyright (c) 2013-2023 by Google, Inc.",
                "Copyright (c) 2014 BlackBerry Limited",
                "Copyright (c) 2014 BogDan Vatra <bogdan@kde.org>",
                "Copyright (c) 2014 David Faure <david.faure@kdab.com>",
                "Copyright (c) 2014 Drew Parsons <dparsons@emerall.com>",
                "Copyright (c) 2014 Google, Inc.",
                "Copyright (c) 2014 Governikus GmbH & Co.",
                "Copyright (c) 2014 Ivan Komissarov",
                "Copyright (c) 2014 Ivan Komissarov <ABBAPOH@gmail.com>",
                "Copyright (c) 2014 Jeremy Laine <jeremy.laine@m4x.org>",
                "Copyright (c) 2014 John Layt <jlayt@kde.org>",
                "Copyright (c) 2014 Keith Gardner <kreios4004@gmail.com>",
                "Copyright (c) 2014 Klaralvdalens Datakonsult AB",
                "Copyright (c) 2014 Klaralvdalens Datakonsult AB, a KDAB Group company, info@kdab.com",
                "Copyright (c) 2014 Martin Graesslin <mgraesslin@kde.org>",
                "Copyright (c) 2014 Martin Grasslin <mgraesslin@kde.org>",
                "Copyright (c) 2014 Olivier Goffart <ogoffart@woboq.com>",
                "Copyright (c) 2014 Olivier Goffart <ogoffart@woboq.org>",
                "Copyright (c) 2014 Petroules Corporation",
                "Copyright (c) 2014 Robin Burchell <robin.burchell@viroteck.net>",
                "Copyright (c) 2014 Samuel Gaist <samuel.gaist@edeltech.ch>",
                "Copyright (c) 2014 by Southwest Research Institute",
                "Copyright (c) 2014, 2017, 2021-2022, D. R. Commander",
                "Copyright (c) 2014, 2022, D. R. Commander",
                "Copyright (c) 2014, MIPS Technologies, Inc., California",
                "Copyright (c) 2014-2015, 2018, 2020, 2022, D. R. Commander",
                "Copyright (c) 2014-2015, 2022, D. R. Commander",
                "Copyright (c) 2014-2022 Omar Cornut",
                "Copyright (c) 2015 Alex Trotsenko <alex1973tr@gmail.com>",
                "Copyright (c) 2015 Andre Klitzing <aklitzing@gmail.com>",
                "Copyright (c) 2015 Giuseppe D'Angelo <dangelog@gmail.com>",
                "Copyright (c) 2015 Google, Inc.",
                "Copyright (c) 2015 Green Hills Software",
                "Copyright (c) 2015 Intel Corporation",
                "Copyright (c) 2015 Ivan Komissarov <ABBAPOH@gmail.com>",
                "Copyright (c) 2015 Keith Gardner <kreios4004@gmail.com>",
                "Copyright (c) 2015 Klaralvdalens Datakonsult AB",
                "Copyright (c) 2015 Klaralvdalens Datakonsult AB, a KDAB Group company, info@kdab.com",
                "Copyright (c) 2015 Konstantin Ritt",
                "Copyright (c) 2015 Konstantin Ritt <ritt.ks@gmail.com>",
                "Copyright (c) 2015 Microsoft",
                "Copyright (c) 2015 Mikkel Krautz <mikkel@krautz.dk>",
                "Copyright (c) 2015 Mozilla Foundation",
                "Copyright (c) 2015 Olivier Goffart <ogoffart@woboq.com>",
                "Copyright (c) 2015 Pier Luigi Fiorini <pierluigi.fiorini@gmail.com>",
                "Copyright (c) 2015 Robin Burchell <robin.burchell@viroteck.net>",
                "Copyright (c) 2015 Samuel Gaist <samuel.gaist@edeltech.ch>",
                "Copyright (c) 2015 The Qt Company Ltd.",
                "Copyright (c) 2015 University of Cambridge",
                "Copyright (c) 2015 Viktor Szathmary",
                "Copyright (c) 2015 ownCloud Inc",
                "Copyright (c) 2015, 2018, 2021-2022, D. R. Commander",
                "Copyright (c) 2015, 2018, D. R. Commander",
                "Copyright (c) 2015, 2019, 2022, D. R. Commander",
                "Copyright (c) 2015, 2020 Google, Inc.",
                "Copyright (c) 2015, 2020, 2022, D. R. Commander",
                "Copyright (c) 2015, 2020, Google, Inc.",
                "Copyright (c) 2015, 2022, D. R. Commander",
                "Copyright (c) 2015, D. R. Commander",
                "Copyright (c) 2015, Google, Inc.",
                "Copyright (c) 2015, Matthieu Darbois",
                "Copyright (c) 2015-2016 LunarG, Inc.",
                "Copyright (c) 2015-2016 Oleksandr Tymoshenko <gonzo@bluezbox.com>",
                "Copyright (c) 2015-2016 The Khronos Group Inc.",
                "Copyright (c) 2015-2016 Valve Corporation",
                "Copyright (c) 2015-2016, 2018 Matthieu Darbois",
                "Copyright (c) 2015-2016, 2018, 2022, Matthieu Darbois",
                "Copyright (c) 2015-2016, 2018-2022, D. R. Commander",
                "Copyright (c) 2015-2017, 2019, 2021-2022, D. R. Commander",
                "Copyright (c) 2015-2019 Ebrahim Byagowi",
                "Copyright (c) 2015-2020 Ebrahim",
                "Copyright (c) 2015-2020 Ebrahim Byagowi",
                "Copyright (c) 2015-2020 The Khronos Group Inc.",
                "Copyright (c) 2015-2020, 2022, D. R. Commander",
                "Copyright (c) 2015-2021 Intel Corporation",
                "Copyright (c) 2015-2021 the original",
                "Copyright (c) 2015-2022 The Khronos Group Inc.",
                "Copyright (c) 2015-2022 University of Cambridge",
                "Copyright (c) 2015-2022 Werner",
                "Copyright (c) 2015-2023 by Werner Lemberg",
                "Copyright (c) 2016 Alex Trotsenko <alex1973tr@gmail.com>",
                "Copyright (c) 2016 BogDan Vatra <bogdan@kde.org>",
                "Copyright (c) 2016 Borgar Ovsthus",
                "Copyright (c) 2016 Daniel Dreibrodt",
                "Copyright (c) 2016 David Faure <david.faure@kdab.com>",
                "Copyright (c) 2016 David Faure <faure@kde.org>",
                "Copyright (c) 2016 Dmitry Shachnev <mitya57@gmail.com>",
                "Copyright (c) 2016 Elie Roux <elie.roux@telecom-bretagne.eu>",
                "Copyright (c) 2016 Giuseppe D'Angelo <dangelog@gmail.com>",
                "Copyright (c) 2016 Google, Inc.",
                "Copyright (c) 2016 Igalia",
                "Copyright (c) 2016 Igalia S.L.",
                "Copyright (c) 2016 Intel Corporation",
                "Copyright (c) 2016 Ivan Komissarov",
                "Copyright (c) 2016 Jeremy Laine <jeremy.laine@m4x.org>",
                "Copyright (c) 2016 Jolla Ltd",
                "Copyright (c) 2016 Kai Pastor",
                "Copyright (c) 2016 Keith Gardner <kreios4004@gmail.com>",
                "Copyright (c) 2016 Klaralvdalens Datakonsult AB",
                "Copyright (c) 2016 Klaralvdalens Datakonsult AB, a KDAB Group company, info@kdab.com",
                "Copyright (c) 2016 Kurt Pattyn <pattyn.kurt@gmail.com>",
                "Copyright (c) 2016 Laszlo Papp <lpapp@kde.org>",
                "Copyright (c) 2016 Olivier Goffart <ogoffart@woboq.com>",
                "Copyright (c) 2016 Pelagicore AG",
                "Copyright (c) 2016 QNX Software Systems",
                "Copyright (c) 2016 Research",
                "Copyright (c) 2016 Richard J. Moore <rich@kde.org>",
                "Copyright (c) 2016 Richard Moore <rich@kde.org>",
                "Copyright (c) 2016 Robin Burchell <robin.burchell@viroteck.net>",
                "Copyright (c) 2016 Ruslan Nigmatullin <euroelessar@yandex.ru>",
                "Copyright (c) 2016 Samuel Gaist <samuel.gaist@edeltech.ch>",
                "Copyright (c) 2016 Stephen Kelly",
                "Copyright (c) 2016 Stephen Kelly <steveire@gmail.com>",
                "Copyright (c) 2016 Sune Vuorela <sune@kde.org>",
                "Copyright (c) 2016 The Qt Company Ltd",
                "Copyright (c) 2016 The Qt Company Ltd.",
                "Copyright (c) 2016 Thiago Macieira <thiago@kde.org>",
                "Copyright (c) 2016 University of Cambridge",
                "Copyright (c) 2016 by Southwest Research Institute",
                "Copyright (c) 2016, 2018, 2022, Matthieu Darbois",
                "Copyright (c) 2016, 2021-2022, D. R. Commander",
                "Copyright (c) 2016, 2022, D. R. Commander",
                "Copyright (c) 2016, BogDan Vatra <bogdan@kde.org>",
                "Copyright (c) 2016, D. R. Commander",
                "Copyright (c) 2016-2018 University of Cambridge",
                "Copyright (c) 2016-2019 University of Cambridge",
                "Copyright (c) 2016-2020 Martin Mitas",
                "Copyright (c) 2016-2020 University of Cambridge",
                "Copyright (c) 2016-2021 University of Cambridge",
                "Copyright (c) 2016-2022 University of Cambridge",
                "Copyright (c) 2016-2023 by David Turner, Robert Wilhelm, and Werner Lemberg",
                "Copyright (c) 2017 Andre Klitzing",
                "Copyright (c) 2017 BogDan Vatra <bogdan@kde.org>",
                "Copyright (c) 2017 Borgar Ovsthus",
                "Copyright (c) 2017 Google, Inc.",
                "Copyright (c) 2017 Intel Corporation",
                "Copyright (c) 2017 Klaralvdalens Datakonsult AB, a KDAB Group company, info@kdab.com",
                "Copyright (c) 2017 Pier Luigi Fiorini <pierluigi.fiorini@gmail.com>",
                "Copyright (c) 2017 QNX Software Systems",
                "Copyright (c) 2017 Samuel Gaist <samuel.gaist@edeltech.ch>",
                "Copyright (c) 2017 Sean Barrett",
                "Copyright (c) 2017 The Qt Company Ltd.",
                "Copyright (c) 2017 itmeo",
                "Copyright (c) 2017, D. R. Commander",
                "Copyright (c) 2017,2018 Google, Inc.",
                "Copyright (c) 2017-2018 Red Hat, Inc",
                "Copyright (c) 2017-2018, D. R. Commander",
                "Copyright (c) 2017-2019 Advanced Micro Devices, Inc.",
                "Copyright (c) 2017-2022 Advanced Micro Devices, Inc.",
                "Copyright (c) 2017-2023 by David Turner, Robert Wilhelm, and Werner Lemberg",
                "Copyright (c) 2018 Adobe Inc.",
                "Copyright (c) 2018 BogDan Vatra <bogdan@kdab.com>",
                "Copyright (c) 2018 BogDan Vatra <bogdan@kde.org>",
                "Copyright (c) 2018 Cosmin Truta",
                "Copyright (c) 2018 Ebrahim Byagowi",
                "Copyright (c) 2018 Google, Inc.",
                "Copyright (c) 2018 Intel Corporation",
                "Copyright (c) 2018 Khaled Hosny",
                "Copyright (c) 2018 Kitware, Inc.",
                "Copyright (c) 2018 Klaralvdalens Datakonsult AB, a KDAB Group company, info@kdab.com",
                "Copyright (c) 2018 Luca Beldi <v.ronin@yahoo.it>",
                "Copyright (c) 2018 QNX Software Systems",
                "Copyright (c) 2018 Samuel Gaist <samuel.gaist@idiap.ch>",
                "Copyright (c) 2018 The Qt Company",
                "Copyright (c) 2018 The Qt Company Ltd.",
                "Copyright (c) 2018, Matthias Rancker",
                "Copyright (c) 2018,2019,2020 Adobe",
                "Copyright (c) 2018,2019,2020 Adobe, Inc",
                "Copyright (c) 2018,2021 Khaled",
                "Copyright (c) 2018,2021 Khaled Hosny",
                "Copyright (c) 2018-2019 Cosmin Truta",
                "Copyright (c) 2018-2019 Ebrahim Byagowi",
                "Copyright (c) 2018-2021 University of Cambridge",
                "Copyright (c) 2018-2022 Cosmin Truta",
                "Copyright (c) 2018-2023 Armin Hasitzka, David Turner, Robert Wilhelm, and Werner",
                "Copyright (c) 2018-2023 Cosmin Truta",
                "Copyright (c) 2018-2023 by Armin Hasitzka, David Turner, Robert Wilhelm, and Werner Lemberg",
                "Copyright (c) 2018-2023 by David Turner, Robert Wilhelm, Dominik Rottsches, and Werner Lemberg",
                "Copyright (c) 2018-2023 by David Turner, Robert Wilhelm, and Werner Lemberg",
                "Copyright (c) 2019 Adobe Inc.",
                "Copyright (c) 2019 Adobe, Inc.",
                "Copyright (c) 2019 BogDan Vatra <bogdan@kde.org>",
                "Copyright (c) 2019 Crimson AS <info@crimson.no>",
                "Copyright (c) 2019 Ebrahim Byagowi",
                "Copyright (c) 2019 Facebook, Inc.",
                "Copyright (c) 2019 Intel Corporation",
                "Copyright (c) 2019 Klaralvdalens Datakonsult AB",
                "Copyright (c) 2019 Klaralvdalens Datakonsult AB, a KDAB Group company, info@kdab.com",
                "Copyright (c) 2019 Klaralvdalens Datakonsult AB.",
                "Copyright (c) 2019 Mail.ru Group",
                "Copyright (c) 2019 Olivier Goffart <ogoffart@woboq.com>",
                "Copyright (c) 2019 Samuel Gaist <samuel.gaist@idiap.ch>",
                "Copyright (c) 2019 The Qt Company Ltd.",
                "Copyright (c) 2019 Volker Krause <vkrause@kde.org>",
                "Copyright (c) 2019 nyorain",
                "Copyright (c) 2019, BogDan Vatra <bogdan@kde.org>",
                "Copyright (c) 2019, Facebook Inc.",
                "Copyright (c) 2019,2020 Facebook",
                "Copyright (c) 2019,2020 Facebook, Inc.",
                "Copyright (c) 2019-2020 Arm Limited",
                "Copyright (c) 2019-2020 Ebrahim Byagowi",
                "Copyright (c) 2019-2020, Arm Limited",
                "Copyright (c) 2019-2022 Advanced Micro Devices, Inc.",
                "Copyright (c) 2019-2023 Nikhil Ramakrishnan, David Turner, Robert Wilhelm, and Werner",
                "Copyright (c) 2019-2023 by Nikhil Ramakrishnan, David Turner, Robert Wilhelm, and Werner Lemberg",
                "Copyright (c) 2020 Aleix Pol Gonzalez <aleixpol@kde.org>",
                "Copyright (c) 2020 Ebrahim Byagowi",
                "Copyright (c) 2020 Giuseppe D'Angelo <dangelog@gmail.com>",
                "Copyright (c) 2020 Google, Inc.",
                "Copyright (c) 2020 Harald Meyer",
                "Copyright (c) 2020 Intel Corporation",
                "Copyright (c) 2020 Klaralvdalens Datakonsult AB, a KDAB Group company, info@kdab.com",
                "Copyright (c) 2020 Olivier Goffart <ogoffart@woboq.com>",
                "Copyright (c) 2020 The Qt Company Ltd.",
                "Copyright (c) 2020, 2022, D. R. Commander",
                "Copyright (c) 2020, Arm Limited",
                "Copyright (c) 2020, Google, Inc.",
                "Copyright (c) 2020-2023 by David Turner, Robert Wilhelm, and Werner Lemberg",
                "Copyright (c) 2021 Alex Trotsenko",
                "Copyright (c) 2021 Alex Trotsenko <alex1973tr@gmail.com>",
                "Copyright (c) 2021 Behdad Esfahbod",
                "Copyright (c) 2021 David Faure <faure@kde.org>",
                "Copyright (c) 2021 Google, Inc.",
                "Copyright (c) 2021 Igor Kushnir <igorkuo@gmail.com>",
                "Copyright (c) 2021 Ilya Fedin <fedin-ilja2010@ya.ru>",
                "Copyright (c) 2021 Intel Corporation",
                "Copyright (c) 2021 Intel Corportaion",
                "Copyright (c) 2021 Khaled Hosny",
                "Copyright (c) 2021 Klaralvdalens Datakonsult AB, a KDAB Group company, info@kdab.com",
                "Copyright (c) 2021 Klaralvdalens Datakonsult AB.",
                "Copyright (c) 2021 The Qt Company Ltd.",
                "Copyright (c) 2021 zccrs <zccrs@live.com> , JiDe Zhang <zhangjide@uniontech.com>",
                "Copyright (c) 2021, 2022 Black Foundry",
                "Copyright (c) 2021, Alex Richardson",
                "Copyright (c) 2022 Behdad Esfahbod",
                "Copyright (c) 2022 Cosmin Truta",
                "Copyright (c) 2022 Giuseppe D'Angelo <dangelog@gmail.com>",
                "Copyright (c) 2022 Google, Inc.",
                "Copyright (c) 2022 Intel Corporation",
                "Copyright (c) 2022 Klaralvdalens Datakonsult AB, a KDAB Group company, info@kdab.com",
                "Copyright (c) 2022 Laszlo Papp <lpapp@kde.org>",
                "Copyright (c) 2022 Matthias",
                "Copyright (c) 2022 Matthias Clasen",
                "Copyright (c) 2022 Mimer Information Technology",
                "Copyright (c) 2022 Red Hat, Inc",
                "Copyright (c) 2022 Red Hat, Inc.",
                "Copyright (c) 2022 The Qt Company Ltd.",
                "Copyright (c) 2022 Two Blue Cubes Ltd.",
                "Copyright (c) 2022, D. R. Commander",
                "Copyright (c) 2022, Felix Hanau",
                "Copyright (c) 2022-2023 David Turner, Robert Wilhelm, Werner Lemberg, George Williams, and Dominik",
                "Copyright (c) 2022-2023 David Turner, Robert Wilhelm, Werner Lemberg, and Moazin",
                "Copyright (c) 2022-2023 by David Turner, Robert Wilhelm, Werner Lemberg, George Williams, and Dominik Rottsches",
                "Copyright (c) 2022-2023 by David Turner, Robert Wilhelm, Werner Lemberg, and Moazin Khatti",
                "Copyright (c) 2022-2023, D. R. Commander",
                "Copyright (c) 2023 Ahmad Samir <a.samirh78@gmail.com>",
                "Copyright (c) 2023 Behdad Esfahbod",
                "Copyright (c) 2023 Google, Inc.",
                "Copyright (c) 2023 Gradle Inc.",
                "Copyright (c) 2023 Intel Corporation",
                "Copyright (c) 2023 Intel Corpotation",
                "Copyright (c) 2023 Samuel Gaist <samuel.gaist@edeltech.ch>",
                "Copyright (c) 2023 The Qt Company Ltd.",
                "Copyright (c) 2023 The Qt Company Ltd. Contact http://www.qt.io/licensing",
                "Copyright (c) 2023 The Qt Company Ltd. SPDXLicenseIdentifier",
                "Copyright (c) Dominik Reichl <dominik.reichl@t-online.de>",
                "Copyright (c) Microsoft",
                "Copyright (c) Research In Motion Limited 2009",
                "Copyright (c) The Internet Society (1998)",
                "Copyright (c) The Internet Society (1999)",
                "Copyright (c) The Internet Society (2002)",
                "Copyright (c) World Wide Web Consortium, (Massachusetts Institute of Technology, Institut National de Recherche en Informatique et en Automatique, Keio University)",
                "Copyright 1985, 1987, 1990, 1998 The Open Group",
                "Copyright 1987 by Digital Equipment Corporation, Maynard, Massachusetts",
                "Copyright 1987, 1988 by Digital Equipment Corporation, Maynard, Massachusetts",
                "Copyright 1990, 1994, 1998 The Open Group",
                "Copyright 1991-1998 by LCS/Telegraphics",
                "Copyright 1991-2003 Such-and-such",
                "Copyright 1995-2022 Mark Adler",
                "Copyright 1995-2023 Jean-loup Gailly and Mark Adler",
                "Copyright 1995-2023 Mark Adler",
                "Copyright 1996-2001 by David Turner, Robert Wilhelm, and Werner Lemberg",
                "Copyright 1996-2001, 2002, 2003, 2004 by David Turner, Robert Wilhelm, and Werner Lemberg",
                "Copyright 1996-2002, 2006 by David Turner, Robert Wilhelm, and Werner Lemberg",
                "Copyright 1997 Fuji Xerox Information Systems Co.,Ltd.",
                "Copyright 1998 by Matthew Welch",
                "Copyright 1998 by Sun Microsystems, Inc.",
                "Copyright 1998-1999 by Sun Microsystems, Inc.",
                "Copyright 2000",
                "Copyright 2000 Computing Research Labs, New Mexico State University",
                "Copyright 2000, 2001, 2004 by Francesco Zappa Nardelli",
                "Copyright 2000, 2006 by Francesco Zappa Nardelli",
                "Copyright 2000-2001, 2002 by Francesco Zappa Nardelli",
                "Copyright 2000-2001, 2003 by Francesco Zappa Nardelli",
                "Copyright 2000-2010, 2012-2014 by Francesco Zappa Nardelli",
                "Copyright 2000-2016 by David Turner, Robert Wilhelm, and Werner Lemberg",
                "Copyright 2001, 2002, 2006 by Francesco Zappa Nardelli",
                "Copyright 2001, 2002, 2012 Francesco Zappa Nardelli",
                "Copyright 2001, 2012 by David Turner, Robert Wilhelm, and Werner Lemberg",
                "Copyright 2001-2002, 2011 Francesco Zappa Nardelli",
                "Copyright 2001-2004, 2011 Francesco Zappa Nardelli",
                "Copyright 2001-2014 Francesco Zappa Nardelli",
                "Copyright 2001-2015 Francesco Zappa Nardelli",
                "Copyright 2002, 2003, 2005, 2006, 2008, 2010, 2015 Adobe Systems",
                "Copyright 2003 Huw D M Davies for Codeweavers",
                "Copyright 2003 by Francesco Zappa Nardelli",
                "Copyright 2003 by Masatake YAMATO and Redhat K.K.",
                "Copyright 2003, 2005-2008, 2010 Adobe Systems Incorporated",
                "Copyright 2005-2011 Kitware, Inc.",
                "Copyright 2005-2022 by write David Turner, Robert Wilhelm, and Werner Lemberg",
                "Copyright 2006-2008 the V8 project authors",
                "Copyright 2006-2011, the V8 project authors",
                "Copyright 2006-2012, the V8 project",
                "Copyright 2006-2013 Adobe Systems Incorporated",
                "Copyright 2007 Dmitry Timoshkov",
                "Copyright 2007 Matthias Kretz <kretz@kde.org>",
                "Copyright 2007-2013 Adobe Systems Incorporated",
                "Copyright 2007-2014 Adobe Systems Incorporated",
                "Copyright 2008 Helio Chissini de Castro <helio@kde.org>",
                "Copyright 2009 Pierre Ossman <ossman@cendio.se> for Cendio AB",
                "Copyright 2009-2013 Adobe Systems Incorporated",
                "Copyright 2009-2014 Adobe Systems Incorporated",
                "Copyright 2010 the V8 project authors",
                "Copyright 2011 Fredrik Hoglund <fredrik@kde.org>",
                "Copyright 2011-2013 Adobe Systems Incorporated",
                "Copyright 2012 the V8 project authors",
                "Copyright 2012, Samuel Neves <sneves@dei.uc.pt>",
                "Copyright 2012-2014 Pier Luigi Fiorini <pierluigi.fiorini@gmail.com>",
                "Copyright 2013 Adobe Systems Incorporated",
                "Copyright 2013 Martin Grasslin <mgraesslin@kde.org>",
                "Copyright 2013 by Google, Inc. Google Author(s) Behdad Esfahbod",
                "Copyright 2013-2013 Tilera Corporation(jiwang@tilera.com)",
                "Copyright 2013-2014 Adobe Systems Incorporated",
                "Copyright 2014 Alex Merry <alex.merry@kde.org>",
                "Copyright 2014 Martin Grasslin <mgraesslin@kde.org>",
                "Copyright 2014 Mathieu Tarral <mathieu.tarral@gmail.com>",
                "Copyright 2014 The Chromium Authors",
                "Copyright 2014-2015 Alex Merry <alex.merry@kde.org>",
                "Copyright 2014-2016 The Chromium Authors",
                "Copyright 2015 The Chromium Authors",
                "Copyright 2015 The Roboto Mono Project",
                "Copyright 2015 the original author or authors",
                "Copyright 2015-2016 The Chromium Authors",
                "Copyright 2015-2022 The Khronos Group Inc.",
                "Copyright 2017 Two Blue Cubes Ltd.",
                "Copyright 2022 Intel Corporation",
                "Copyright Catch2 Authors",
                "Copyright International Color Consortium, 2015",
                "Copyright Richard Tobin, HCRC",
                "Copyright Zoltan Herczeg (hzmester@freemail.hu)",
                "Copyright property of CompuServe Incorporated",
                "IaeH, ANH (c) IaeH",
                "Launch (c) QShortcut",
                "QBrush (c) QPixmap",
                "QCompletionEngine (c) QMatchData",
                "QString (c) Name",
                "TestLayout (c) TestGraphicsWidget",
                "copyright (c) 1991-2020, Thomas G. Lane, Guido Vollbeding",
                "copyright (c) 1996-2000 by David Turner, Robert Wilhelm, and Werner Lemberg",
                "copyright (c) 1996-2002 The FreeType Project (www.freetype.org)",
                "copyright (c) The FreeType Project (www.freetype.org)",
                "copyright 00AE Emoji",
                "copyright 1991-1998 by LCS/Telegraphics",
                "copyright 1998 by Sun Microsystems, Inc.",
                "copyright 1999",
                "copyright 1999 by Sun Microsystems, Inc.",
                "copyright 2001",
                "copyright 2002 by W3C.",
                "copyright QRectF boundingBox QFixed",
                "copyright QString family QString",
                "copyrighted by me and others",
                "copyrighted by the Free Software Foundation"
            ],
            "file-count": 21171,
            "sha256": "cc86d01d903c04da8f7c29f2c84d957a5f451f926a0157619f8658a570866000",
            "source": "https://github.com/qt/qtbase/archive/refs/tags/v6.6.1.zip",
            "status": "restricted"
        }
    ]
}
