{
    "id": "npm/npmjs/-/elkjs/0.9.3",
    "license": "Apache-2.0 AND EPL-2.0",
    "authority": "https://gitlab.eclipse.org/eclipsefdn/emo-team/iplab/-/issues/16195",
    "source": "https://github.com/kieler/elkjs/archive/refs/tags/0.9.3.zip",
    "status": "approved",
    "scans": [
        {
            "date": "September 18, 2024, 8:04:13 p.m. GMT",
            "authority": "https://gitlab.eclipse.org/eclipsefdn/emo-team/iplab/-/issues/16195",
            "scancode-version": "31.2.1",
            "licenses-discovered": [
                "Apache-2.0",
                "EPL-2.0"
            ],
            "copyrights": [
                "(c) b.Vg",
                "Copyright (c) 2017 Kiel University and others",
                "Copyright (c) 2017, 2019 Kiel University and others",
                "Copyright (c) 2018 Kiel University and others",
                "Copyright (c) 2019 Kiel University and others",
                "Copyright (c) 2019 TypeFox and others",
                "Copyright (c) 2020 Kiel University and others",
                "Copyright (c) 2021 Kiel University and others",
                "Copyright 2015 the original author or authors",
                "Copyright 2020 Google LLC"
            ],
            "file-count": 106,
            "sha256": "6e71bd221dda40820b1aa03d6a818f913fd098f990d323196f3bf31401cc4438",
            "source": "https://github.com/kieler/elkjs/archive/refs/tags/0.9.3.zip",
            "status": "approved"
        }
    ]
}