{
    "id": "npm/npmjs/-/chromatic/11.25.2",
    "license": "MIT AND (BSD-2-Clause AND ISC AND MIT)",
    "authority": "https://gitlab.eclipse.org/eclipsefdn/emo-team/iplab/-/issues/19348",
    "source": "https://github.com/chromaui/chromatic-cli/archive/refs/tags/v11.25.2.zip",
    "status": "approved",
    "scans": [
        {
            "date": "February 6, 2025 at 10:27:57 a.m. GMT",
            "authority": "https://gitlab.eclipse.org/eclipsefdn/emo-team/iplab/-/issues/19348",
            "scancode-version": "31.2.1",
            "licenses-discovered": [
                "MIT",
                "BSD-2-Clause AND ISC AND MIT"
            ],
            "copyrights": [
                "Copyright (c) Chroma Software Inc."
            ],
            "file-count": 430,
            "sha256": "4501901e5f2d2f4d2d6c403146a9c6b5ba7e823bd736eb0bd46803b49a508bbb",
            "source": "https://github.com/chromaui/chromatic-cli/archive/refs/tags/v11.25.2.zip",
            "status": "approved"
        }
    ]
}