{
    "id": "maven/mavencentral/org.activiti/activiti-api-model-shared/8.4.0",
    "license": "Apache-2.0",
    "authority": "https://gitlab.eclipse.org/eclipsefdn/emo-team/iplab/-/issues/14521",
    "source": "https://maven.alfresco.com/nexus/service/local/repositories/activiti-releases/content//org/activiti/activiti-api-model-shared/8.4.0/activiti-api-model-shared-8.4.0-sources.jar",
    "status": "approved",
    "scans": [
        {
            "date": "April 24, 2024 at 4:15:11 a.m. GMT",
            "authority": "https://gitlab.eclipse.org/eclipsefdn/emo-team/iplab/-/issues/14521",
            "scancode-version": "31.2.1",
            "licenses-discovered": [
                "Apache-2.0"
            ],
            "copyrights": [
                "Copyright 2010-2020 Alfresco Software, Ltd."
            ],
            "file-count": 14,
            "sha256": "c9c0725abe1c586b832e5fe579f37b83490a81f3100f24e90329267874ac59ed",
            "source": "https://maven.alfresco.com/nexus/service/local/repositories/activiti-releases/content//org/activiti/activiti-api-model-shared/8.4.0/activiti-api-model-shared-8.4.0-sources.jar",
            "status": "approved"
        }
    ]
}