{
    "id": "maven/mavencentral/net.logstash.logback/logstash-logback-encoder/7.2",
    "license": "Apache-2.0 AND MIT AND Apache-2.0",
    "licenses-discovered": [
        "Apache-2.0 AND MIT",
        "Apache-2.0"
    ],
    "copyrights": [
        "Copyright Gil Tene",
        "Copyright LMAX Ltd.",
        "Copyright the original author or authors"
    ],
    "file-count": 250,
    "scancode-version": "30.1.0",
    "authority": "https://gitlab.eclipse.org/eclipsefdn/emo-team/iplab/-/issues/3226",
    "source": "https://search.maven.org/remotecontent?filepath=net/logstash/logback/logstash-logback-encoder/7.2/logstash-logback-encoder-7.2-sources.jar",
    "status": "approved"
}