{
    "id": "npm/npmjs/-/typescript/5.6.2",
    "license": "Apache-2.0 AND (CC-BY-4.0 AND LicenseRef-Unicode AND MIT AND W3C-20150513) AND BSD-3-Clause AND ODbL-1.0 AND MIT",
    "authority": "https://gitlab.eclipse.org/eclipsefdn/emo-team/iplab/-/issues/16106",
    "source": "https://github.com/microsoft/TypeScript/archive/refs/tags/v5.6.2.zip",
    "status": "approved",
    "scans": [
        {
            "date": "September 11, 2024, 6:13:13 p.m. GMT",
            "authority": "https://gitlab.eclipse.org/eclipsefdn/emo-team/iplab/-/issues/16106",
            "scancode-version": "31.2.1",
            "licenses-discovered": [
                "Apache-2.0",
                "CC-BY-4.0 AND LicenseRef-scancode-khronos AND LicenseRef-scancode-unicode AND LicenseRef-scancode-unknown AND MIT AND W3C-20150513",
                "ISC",
                "Apache-2.0 AND ISC AND MIT",
                "ODbL-1.0",
                "MIT"
            ],
            "copyrights": [
                "(c) Hello World",
                "(c) by W3C",
                "Copyright (c) 1991-2017 Unicode, Inc.",
                "Copyright (c) 2012 Ecma International",
                "Copyright (c) 2018 The Khronos Group Inc.",
                "Copyright (c) 2018 WHATWG",
                "Copyright (c) Microsoft",
                "Copyright (c) Microsoft Corporation",
                "Copyright (c) OpenStreetMap contributors 2010",
                "Copyright (c) YEAR W3C(r) (MIT, ERCIM, Keio, Beihang). Disclaimers",
                "Copyright 2009 the Sputnik authors",
                "Copyright 2015 MyCompany Inc."
            ],
            "file-count": 72617,
            "sha256": "ec8ba9b834893f7d787276fbe01461e60a0c536c41df27acce36bed29f5a7952",
            "source": "https://github.com/microsoft/TypeScript/archive/refs/tags/v5.6.2.zip",
            "status": "restricted"
        }
    ]
}