{
    "id": "npm/npmjs/-/yargs/17.6.2",
    "license": "MIT",
    "licenses-discovered": [
        "MIT"
    ],
    "copyrights": [
        "Copyright 2010 James Halliday (mail@substack.net)",
        "Copyright 2014 Contributors (ben@npmjs.com)"
    ],
    "file-count": 61,
    "scancode-version": "31.2.1",
    "authority": "https://gitlab.eclipse.org/eclipsefdn/emo-team/iplab/-/issues/4619",
    "source": "https://registry.npmjs.org/yargs/-/yargs-17.6.2.tgz",
    "status": "approved"
}