{
    "id": "npm/npmjs/-/react-player/2.13.0",
    "license": "MIT",
    "authority": "https://gitlab.eclipse.org/eclipsefdn/emo-team/iplab/-/issues/10673",
    "source": "https://github.com/cookpete/react-player/archive/refs/tags/v2.13.0.zip",
    "status": "approved",
    "scans": [
        {
            "date": "September 26, 2023 at 3:32:55 p.m. GMT",
            "authority": "https://gitlab.eclipse.org/eclipsefdn/emo-team/iplab/-/issues/10673",
            "scancode-version": "31.2.1",
            "licenses-discovered": [
                "MIT"
            ],
            "copyrights": [
                "(c) Sindre Sorhus",
                "Copyright (c) 2013-present, Facebook, Inc.",
                "Copyright (c) Facebook, Inc. and its affiliates",
                "Copyright (c) Pete Cook http://cookpete.com"
            ],
            "file-count": 96,
            "sha256": "af80fe5f76499b343ca3a1b6ab360c23f9ae524778e95c9af80532b776462311",
            "source": "https://github.com/cookpete/react-player/archive/refs/tags/v2.13.0.zip",
            "status": "approved"
        }
    ]
}