{
    "id": "-/-/vscode/language-features-subset/1.96.0",
    "license": "MIT AND Apache-2.0",
    "authority": "https://gitlab.eclipse.org/eclipsefdn/emo-team/iplab/-/issues/17828",
    "source": "https://gitlab.eclipse.org/-/project/46/uploads/49c9a8c98049febbf5950bba21190284/language-features-1.96.0.zip",
    "status": "approved",
    "scans": [
        {
            "date": "December 11, 2024 at 7:52:30 p.m. GMT",
            "authority": "https://gitlab.eclipse.org/eclipsefdn/emo-team/iplab/-/issues/17828",
            "scancode-version": "31.2.1",
            "licenses-discovered": [
                "MIT",
                "Apache-2.0"
            ],
            "copyrights": [
                "Copyright (c) Microsoft Corporation"
            ],
            "file-count": 34,
            "sha256": "cd90790ca9767e30c824df0002ddeb7b3f46f49a8b86fedf2d5d227e13673011",
            "source": "https://gitlab.eclipse.org/-/project/46/uploads/49c9a8c98049febbf5950bba21190284/language-features-1.96.0.zip",
            "status": "approved"
        }
    ]
}