{
    "id": "git/github/golang/sys/059865788121",
    "license": "BSD-3-Clause",
    "authority": "https://gitlab.eclipse.org/eclipsefdn/emo-team/iplab/-/issues/5556",
    "source": "https://github.com/golang/sys/archive/059865788121.zip",
    "status": "approved",
    "scans": [
        {
            "date": "December 9, 2022 at 1:12:42 p.m. GMT",
            "authority": "https://gitlab.eclipse.org/eclipsefdn/emo-team/iplab/-/issues/5556",
            "scancode-version": "31.2.1",
            "licenses-discovered": [
                "BSD-3-Clause"
            ],
            "copyrights": [
                "Copyright (c) 2009 The Go Authors",
                "Copyright 2009 The Go Authors",
                "Copyright 2009,2010 The Go Authors",
                "Copyright 2010 The Go Authors",
                "Copyright 2011 The Go Authors",
                "Copyright 2012 The Go Authors",
                "Copyright 2013 The Go Authors",
                "Copyright 2014 The Go Authors",
                "Copyright 2015 The Go Authors",
                "Copyright 2016 The Go Authors",
                "Copyright 2017 The Go Authors",
                "Copyright 2018 The Go Authors",
                "Copyright 2019 The Go Authors",
                "Copyright 2020 The Go Authors"
            ],
            "file-count": 463,
            "sha256": "7eedb3d35cbbadecce8dd1a014e383f2b096843d21c00f8987c402a20e9a1a1f",
            "source": "https://github.com/golang/sys/archive/059865788121.zip",
            "status": "approved"
        }
    ]
}