{
    "id": "npm/npmjs/@angular-devkit/architect/0.1703.12",
    "license": "MIT",
    "authority": "https://gitlab.eclipse.org/eclipsefdn/emo-team/iplab/-/issues/19646",
    "source": "https://registry.npmjs.org/@angular-devkit/architect/-/architect-0.1703.12.tgz",
    "status": "approved",
    "scans": [
        {
            "date": "February 28, 2025 at 11:02:00 p.m. GMT",
            "authority": "https://gitlab.eclipse.org/eclipsefdn/emo-team/iplab/-/issues/19646",
            "scancode-version": "31.2.1",
            "licenses-discovered": [
                "MIT"
            ],
            "copyrights": [
                "Copyright (c) 2017 Google, Inc.",
                "Copyright Google LLC"
            ],
            "file-count": 73,
            "sha256": "3481e540ebacbf77588f7052114e99142a9c11da00da74a0bcc64870bb04c318",
            "source": "https://registry.npmjs.org/@angular-devkit/architect/-/architect-0.1703.12.tgz",
            "status": "approved"
        }
    ]
}