{
    "id": "git/github/envoyproxy/go-control-plane/v0.9.4",
    "license": "Apache-2.0",
    "authority": "https://gitlab.eclipse.org/eclipsefdn/emo-team/iplab/-/issues/5173",
    "source": "https://github.com/envoyproxy/go-control-plane/archive/refs/tags/v0.9.4.zip",
    "status": "approved",
    "scans": [
        {
            "date": "November 25, 2022 at 6:06:41 a.m. GMT",
            "authority": "https://gitlab.eclipse.org/eclipsefdn/emo-team/iplab/-/issues/5173",
            "scancode-version": "31.2.1",
            "licenses-discovered": [
                "Apache-2.0"
            ],
            "copyrights": [
                "Copyright 2018 Envoyproxy",
                "Copyright 2019 Envoyproxy"
            ],
            "file-count": 689,
            "sha256": "135bee294bac3a51a5027b28217c750da8611952b4584aec7975e2ec98317325",
            "source": "https://github.com/envoyproxy/go-control-plane/archive/refs/tags/v0.9.4.zip",
            "status": "approved"
        }
    ]
}