{
    "id": "npm/npmjs/@types/geojson/7946.0.13",
    "license": "MIT",
    "authority": "https://gitlab.eclipse.org/eclipsefdn/emo-team/iplab/-/issues/11480",
    "source": "https://registry.yarnpkg.com/@types/geojson/-/geojson-7946.0.13.tgz",
    "status": "approved",
    "scans": [
        {
            "date": "November 9, 2023 at 9:41:34 a.m. GMT",
            "authority": "https://gitlab.eclipse.org/eclipsefdn/emo-team/iplab/-/issues/11480",
            "scancode-version": "31.2.1",
            "licenses-discovered": [
                "MIT"
            ],
            "copyrights": [
                "Copyright (c) Microsoft Corporation"
            ],
            "file-count": 4,
            "sha256": "8977c0ab3faa2f93b4b7a2a5047cddec18e1f8c20327ad968732cce8782df706",
            "source": "https://registry.yarnpkg.com/@types/geojson/-/geojson-7946.0.13.tgz",
            "status": "approved"
        }
    ]
}