{
    "id": "nuget/nuget/-/Yarp.ReverseProxy/2.1.0",
    "license": "MIT AND Apache-2.0",
    "authority": "https://gitlab.eclipse.org/eclipsefdn/emo-team/iplab/-/issues/15636",
    "source": "https://github.com/microsoft/reverse-proxy/archive/refs/tags/v2.1.0.zip",
    "status": "approved",
    "scans": [
        {
            "date": "July 8, 2024 at 1:48:12 p.m. GMT",
            "authority": "https://gitlab.eclipse.org/eclipsefdn/emo-team/iplab/-/issues/15636",
            "scancode-version": "31.2.1",
            "licenses-discovered": [
                "MIT",
                "Apache-2.0 AND BSD-3-Clause AND LicenseRef-scancode-ms-net-library",
                "Apache-2.0"
            ],
            "copyrights": [
                "(c) Microsoft Corporation",
                "(c) else https://datatracker.ietf.org/doc/html/rfc3986",
                "Copyright (c) .NET Foundation",
                "Copyright (c) .NET Foundation and Contributors",
                "Copyright (c) Microsoft Corporation"
            ],
            "file-count": 972,
            "sha256": "8d9eb4ba2a52cc6c9d6d272231b345b77820dbe0c8d25ac85f00e982aaf57842",
            "source": "https://github.com/microsoft/reverse-proxy/archive/refs/tags/v2.1.0.zip",
            "status": "restricted"
        }
    ]
}