{
    "license": "MIT",
    "file-count": 64,
    "authority": "https://gitlab.eclipse.org/eclipsefdn/emo-team/iplab/-/issues/1131",
    "scancode-version": "21.3.31",
    "licenses-discovered": [
        "MIT"
    ],
    "id": "npm/npmjs/-/snabbdom/3.1.0",
    "source": "https://github.com/snabbdom/snabbdom/archive/v3.1.0.zip",
    "status": "approved"
}