{
    "id": "npm/npmjs/@lerna/create/7.1.1",
    "license": "MIT AND (ISC AND MIT) AND ISC",
    "authority": "https://gitlab.eclipse.org/eclipsefdn/emo-team/iplab/-/issues/9357",
    "source": "https://github.com/lerna/lerna/archive/refs/tags/7.1.1.zip",
    "status": "approved",
    "scans": [
        {
            "date": "July 11, 2023 at 5:00:14 p.m. GMT",
            "authority": "https://gitlab.eclipse.org/eclipsefdn/emo-team/iplab/-/issues/9357",
            "scancode-version": "31.2.1",
            "licenses-discovered": [
                "MIT",
                "ISC AND MIT",
                "ISC"
            ],
            "copyrights": [
                "Copyright (c) 2015-present Lerna",
                "Copyright (c) 2018 Tester McPerson <test@example.com>"
            ],
            "file-count": 1740,
            "sha256": "3bd8df9c4419c5aeae9c5f8a1f8be5cb0380a3afc9937e59d70232b9047d974c",
            "source": "https://github.com/lerna/lerna/archive/refs/tags/7.1.1.zip",
            "status": "approved"
        }
    ]
}