{
    "id": "maven/mavencentral/com.jcraft/jzlib/1.0.7",
    "license": "BSD-3-Clause AND Zlib",
    "licenses-discovered": [
        "BSD-3-Clause AND Zlib"
    ],
    "file-count": 14,
    "scancode-version": "30.1.0",
    "authority": "https://gitlab.eclipse.org/eclipsefdn/emo-team/iplab/-/issues/2536",
    "source": "https://search.maven.org/remotecontent?filepath=com/jcraft/jzlib/1.0.7/jzlib-1.0.7-sources.jar",
    "status": "approved"
}