{
    "id": "crate/cratesio/-/base64/0.21.2",
    "license": "Apache-2.0 AND MIT AND Apache-2.0 AND MIT",
    "authority": "https://gitlab.eclipse.org/eclipsefdn/emo-team/iplab/-/issues/9764",
    "source": "https://crates.io/api/v1/crates/base64/0.21.2/download",
    "status": "approved",
    "scans": [
        {
            "date": "July 26, 2023 at 9:22:13 a.m. GMT",
            "authority": "https://gitlab.eclipse.org/eclipsefdn/emo-team/iplab/-/issues/9764",
            "scancode-version": "31.2.1",
            "licenses-discovered": [
                "Apache-2.0 AND MIT",
                "Apache-2.0",
                "MIT"
            ],
            "copyrights": [
                "Copyright (c) 2015 Alice Maz"
            ],
            "file-count": 37,
            "sha256": "604178f6c5c21f02dc555784810edfb88d34ac2c73b2eae109655649ee73ce3d",
            "source": "https://crates.io/api/v1/crates/base64/0.21.2/download",
            "status": "approved"
        }
    ]
}