{
    "id": "git/github/dawidd6/action-download-artifact/v2",
    "license": "Apache-2.0 AND BSD-2-Clause AND BSD-3-Clause AND CC-BY-SA-4.0 AND ISC AND MIT",
    "authority": "https://gitlab.eclipse.org/eclipsefdn/emo-team/iplab/-/issues/8007",
    "source": "https://github.com/dawidd6/action-download-artifact/archive/refs/tags/v2.zip",
    "status": "approved",
    "scans": [
        {
            "date": "April 27, 2023 at 1:13:58 p.m. GMT",
            "authority": "https://gitlab.eclipse.org/eclipsefdn/emo-team/iplab/-/issues/8007",
            "scancode-version": "31.2.1",
            "licenses-discovered": [
                "MIT",
                "BSD-3-Clause",
                "LicenseRef-scancode-proprietary-license AND MIT",
                "Apache-2.0",
                "ISC",
                "ISC AND MIT",
                "CC-BY-SA-4.0 AND ISC",
                "CC-BY-SA-4.0",
                "BSD-3-Clause AND MIT",
                "BSD-2-Clause"
            ],
            "copyrights": [
                "(c) Sindre Sorhus (https://sindresorhus.com)",
                "(c) extraPathPercentEncodeSet.has",
                "Copyright (c) 2010-2020 Robert Kieffer and other contributors",
                "Copyright (c) 2011-2017 KARASZI Istvan <github@spam.raszi.hu>",
                "Copyright (c) 2012 Another-D-Mention Software and other contributors",
                "Copyright (c) 2012 Koichi Kobayashi",
                "Copyright (c) 2012-2014, Bram Stein",
                "Copyright (c) 2013 Julian Gruber <julian@juliangruber.com>",
                "Copyright (c) 2014 KARASZI Istvan",
                "Copyright (c) 2014, Domenic Denicola",
                "Copyright (c) 2014-2017, Jon Schlinkert",
                "Copyright (c) 2015-2016 Sebastian Mayr",
                "Copyright (c) 2016 David Frank",
                "Copyright (c) 2018 Octokit",
                "Copyright (c) 2018, Gregor Martynus (https://github.com/gr2m)",
                "Copyright (c) 2019 Octokit",
                "Copyright (c) 2019, Jon Schlinkert (https://github.com/jonschlinkert)",
                "Copyright (c) 2020 Dawid Dziurla",
                "Copyright (c) 2022 Jason Mulligan",
                "Copyright (c) 2022, Jason Mulligan",
                "Copyright (c) GitHub, Inc.",
                "Copyright (c) Gregor Martynus and contributors",
                "Copyright (c) Isaac Z. Schlueter",
                "Copyright (c) Isaac Z. Schlueter and Contributors",
                "Copyright (c) Paul Johnston 1999 - 2009 Other contributors Greg Holt, Andrew Kepert, Ydnar, Lostinet",
                "Copyright (c) Sindre Sorhus <sindresorhus@gmail.com> (sindresorhus.com)",
                "Copyright 2011, Sebastian Tschan https://blueimp.net",
                "Copyright 2018 Gregor Martynus and other contributors",
                "Copyright 2019 GitHub",
                "Copyright 2020 Gregor Martynus",
                "Copyright Joyent, Inc. and other Node contributors",
                "copyright 2022 Jason Mulligan <jason.mulligan@avoidwork.com>"
            ],
            "file-count": 571,
            "sha256": "e5df1a95442144ec8671ced4b49dd65a1b069f8eafc8a96d0185b9e9e861dcfe",
            "source": "https://github.com/dawidd6/action-download-artifact/archive/refs/tags/v2.zip",
            "status": "restricted"
        }
    ]
}
