{
    "id": "maven/mavencentral/com.azure.resourcemanager/azure-resourcemanager-appservice/2.39.0",
    "license": "MIT",
    "authority": "https://gitlab.eclipse.org/eclipsefdn/emo-team/iplab/-/issues/15082",
    "source": "https://repo1.maven.org/maven2/com/azure/resourcemanager/azure-resourcemanager-appservice/2.39.0/azure-resourcemanager-appservice-2.39.0-sources.jar",
    "status": "approved",
    "scans": [
        {
            "date": "June 6, 2024 at 10:02:45 a.m. GMT",
            "authority": "https://gitlab.eclipse.org/eclipsefdn/emo-team/iplab/-/issues/15082",
            "scancode-version": "31.2.1",
            "licenses-discovered": [
                "MIT"
            ],
            "copyrights": [
                "(c) 2008 VeriSign, Inc.",
                "Copyright (c) Microsoft Corporation"
            ],
            "file-count": 916,
            "sha256": "ef834e33370d37f669d5ab03958e61e14da89bf4e5f155e60d4c4b60984d732c",
            "source": "https://repo1.maven.org/maven2/com/azure/resourcemanager/azure-resourcemanager-appservice/2.39.0/azure-resourcemanager-appservice-2.39.0-sources.jar",
            "status": "approved"
        }
    ]
}