{
    "id": "maven/mavencentral/org.wildfly.security/wildfly-elytron-sasl-gs2/2.4.2.Final",
    "license": "Apache-2.0",
    "authority": "https://gitlab.eclipse.org/eclipsefdn/emo-team/iplab/-/issues/15760",
    "source": "https://repo1.maven.org/maven2/org/wildfly/security/wildfly-elytron-sasl-gs2/2.4.2.Final/wildfly-elytron-sasl-gs2-2.4.2.Final-sources.jar",
    "status": "approved",
    "scans": [
        {
            "date": "July 24, 2024 at 1:56:26 p.m. GMT",
            "authority": "https://gitlab.eclipse.org/eclipsefdn/emo-team/iplab/-/issues/15760",
            "scancode-version": "31.2.1",
            "licenses-discovered": [
                "Apache-2.0"
            ],
            "copyrights": [
                "Copyright 2015 Red Hat, Inc., and individual contributors",
                "Copyright 2018 Red Hat, Inc., and individual contributors"
            ],
            "file-count": 11,
            "sha256": "b2f97f66c59ed4a08c84a2f1df98398e89acc80a444eefad12ad6209d02cacf8",
            "source": "https://repo1.maven.org/maven2/org/wildfly/security/wildfly-elytron-sasl-gs2/2.4.2.Final/wildfly-elytron-sasl-gs2-2.4.2.Final-sources.jar",
            "status": "approved"
        }
    ]
}