{
    "id": "p2/orbit/p2.eclipse.plugin/org.apache.batik.extension/1.18.0.v20241009-1200",
    "license": "Apache-2.0",
    "authority": "https://gitlab.eclipse.org/eclipsefdn/emo-team/iplab/-/issues/16587",
    "source": "https://repo1.maven.org/maven2/org/apache/xmlgraphics/batik-extension/1.18/batik-extension-1.18-sources.jar",
    "status": "approved",
    "scans": [
        {
            "date": "October 15, 2024, 4:17:19 a.m. GMT",
            "authority": "https://gitlab.eclipse.org/eclipsefdn/emo-team/iplab/-/issues/16587",
            "scancode-version": "31.2.1",
            "licenses-discovered": [
                "Apache-2.0"
            ],
            "copyrights": [
            ],
            "file-count": 41,
            "sha256": "6a280cd814b130d4ff3b64ff2649176b18b5c696f213aa617e516b37cfdc4ca3",
            "source": "https://repo1.maven.org/maven2/org/apache/xmlgraphics/batik-extension/1.18/batik-extension-1.18-sources.jar",
            "status": "approved"
        }
    ]
}