{
    "id": "npm/npmjs/@typescript-eslint/scope-manager/6.7.3",
    "license": "BSD-2-Clause AND (BSD-2-Clause AND ISC AND MIT) AND MIT",
    "authority": "https://gitlab.eclipse.org/eclipsefdn/emo-team/iplab/-/issues/10791",
    "source": "https://github.com/typescript-eslint/typescript-eslint/archive/refs/tags/v6.7.3.zip",
    "status": "approved",
    "scans": [
        {
            "date": "October 3, 2023 at 4:42:22 a.m. GMT",
            "authority": "https://gitlab.eclipse.org/eclipsefdn/emo-team/iplab/-/issues/10791",
            "scancode-version": "31.2.1",
            "licenses-discovered": [
                "BSD-2-Clause",
                "BSD-2-Clause AND ISC AND MIT",
                "MIT"
            ],
            "copyrights": [
                "Copyright (c) 2016 unional",
                "Copyright (c) 2019 typescript-eslint and other contributors",
                "Copyright (c) 2021 typescript-eslint and other contributors",
                "Copyright (c) 2023 typescript-eslint and other contributors",
                "Copyright JS Foundation and other contributors, https://js.foundation",
                "Copyright Joyent, Inc. and other Node contributors"
            ],
            "file-count": 7593,
            "sha256": "b68adea2d70798e4dd1cd1e6c984a1a2f1905071522cb127c717a8b975dda93e",
            "source": "https://github.com/typescript-eslint/typescript-eslint/archive/refs/tags/v6.7.3.zip",
            "status": "approved"
        }
    ]
}