{
    "id": "npm/npmjs/@angular-devkit/build-webpack/0.1602.12",
    "license": "MIT",
    "authority": "https://gitlab.eclipse.org/eclipsefdn/emo-team/iplab/-/issues/13297",
    "source": "https://github.com/angular/angular-cli/pull/0.1602.12.patch",
    "status": "approved",
    "scans": [
        {
            "date": "February 19, 2024 at 3:32:56 p.m. GMT",
            "authority": "https://gitlab.eclipse.org/eclipsefdn/emo-team/iplab/-/issues/13297",
            "scancode-version": "31.2.1",
            "licenses-discovered": [
            ],
            "copyrights": [
            ],
            "file-count": 1,
            "sha256": "461de34289f9a7c6980d41cc7bacfe11a1f5bcd0eb7df8b7544b70be2b52faa0",
            "source": "https://github.com/angular/angular-cli/pull/0.1602.12.patch",
            "status": "restricted"
        }
    ]
}
