{
    "id": "pypi/pypi/-/filelock/3.12.0",
    "license": "Unlicense",
    "authority": "https://gitlab.eclipse.org/eclipsefdn/emo-team/iplab/-/issues/8009",
    "source": "https://files.pythonhosted.org/packages/24/85/cf4df939cc0a037ebfe18353005e775916faec24dcdbc7a2f6539ad9d943/filelock-3.12.0.tar.gz",
    "status": "approved",
    "scans": [
        {
            "date": "April 27, 2023 at 1:05:41 p.m. GMT",
            "authority": "https://gitlab.eclipse.org/eclipsefdn/emo-team/iplab/-/issues/8009",
            "scancode-version": "31.2.1",
            "licenses-discovered": [
                "Unlicense",
                "LicenseRef-scancode-free-unknown AND Unlicense"
            ],
            "copyrights": [
            ],
            "file-count": 15,
            "sha256": "fc03ae43288c013d2ea83c8597001b1129db351aad9c57fe2409327916b8e718",
            "source": "https://files.pythonhosted.org/packages/24/85/cf4df939cc0a037ebfe18353005e775916faec24dcdbc7a2f6539ad9d943/filelock-3.12.0.tar.gz",
            "status": "restricted"
        }
    ]
}
