{
    "id": "maven/mavencentral/org.jacoco/org.jacoco.ant/0.7.6.201602180812",
    "license": "BSD-3-Clause AND EPL-1.0 AND EPL-1.0",
    "licenses-discovered": [
        "BSD-3-Clause AND EPL-1.0",
        "EPL-1.0"
    ],
    "copyrights": [
        "Copyright (c) France Telecom",
        "Copyright (c) Mountainminds GmbH & Co. KG and Contributors"
    ],
    "file-count": 12,
    "scancode-version": "30.1.0",
    "authority": "https://gitlab.eclipse.org/eclipsefdn/emo-team/iplab/-/issues/2942",
    "source": "https://search.maven.org/remotecontent?filepath=org/jacoco/org.jacoco.ant/0.7.6.201602180812/org.jacoco.ant-0.7.6.201602180812-sources.jar",
    "status": "approved"
}