{
    "id": "git/github/prometheus/common/v0.4.1",
    "license": "Apache-2.0 AND BSD-3-Clause",
    "licenses-discovered": [
        "Apache-2.0",
        "BSD-3-Clause"
    ],
    "file-count": 117,
    "scancode-version": "30.1.0",
    "authority": "https://gitlab.eclipse.org/eclipsefdn/emo-team/iplab/-/issues/2630",
    "source": "https://github.com/prometheus/common/archive/refs/tags/v0.4.1.zip",
    "status": "approved"
}