{
    "id": "maven/mavencentral/org.apache.jena/jena-rdfconnection/4.9.0",
    "license": "Apache-2.0",
    "authority": "https://gitlab.eclipse.org/eclipsefdn/emo-team/iplab/-/issues/14703",
    "source": "https://repo1.maven.org/maven2/org/apache/jena/jena-rdfconnection/4.9.0/jena-rdfconnection-4.9.0-sources.jar",
    "status": "approved",
    "scans": [
        {
            "date": "May 14, 2024 at 7:38:40 a.m. GMT",
            "authority": "https://gitlab.eclipse.org/eclipsefdn/emo-team/iplab/-/issues/14703",
            "scancode-version": "31.2.1",
            "licenses-discovered": [
                "Apache-2.0"
            ],
            "copyrights": [
            ],
            "file-count": 34,
            "sha256": "af4cab4965bfd4cbeb363bbb355820815aad2c2f4922d22154a12e1f15cff34c",
            "source": "https://repo1.maven.org/maven2/org/apache/jena/jena-rdfconnection/4.9.0/jena-rdfconnection-4.9.0-sources.jar",
            "status": "approved"
        }
    ]
}