{
    "id": "git/github/envoyproxy/protoc-gen-validate/v0.1.0",
    "license": "BSD-3-Clause AND BSD-2-Clause AND Apache-2.0 AND MIT AND (LicenseRef-W3C-IP AND BSD-3-Clause) AND CC-BY-3.0",
    "authority": "https://gitlab.eclipse.org/eclipsefdn/emo-team/iplab/-/issues/5205",
    "source": "https://github.com/envoyproxy/protoc-gen-validate/archive/refs/tags/v0.1.0.zip",
    "status": "approved",
    "scans": [
        {
            "date": "November 25, 2022 at 6:46:57 a.m. GMT",
            "authority": "https://gitlab.eclipse.org/eclipsefdn/emo-team/iplab/-/issues/5169",
            "scancode-version": "31.2.1",
            "licenses-discovered": [
                "CC-BY-4.0 AND MIT",
                "Apache-2.0",
                "BSD-2-Clause",
                "BSD-3-Clause",
                "MIT",
                "BSD-2-Clause AND BSD-3-Clause",
                "BSD-3-Clause AND CC-BY-SA-1.0 AND CC-BY-SA-2.5 AND CC-BY-SA-3.0",
                "BSD-3-Clause AND CC-BY-SA-1.0 AND CC-BY-SA-2.0 AND CC-BY-SA-2.5 AND CC-BY-SA-3.0"
            ],
            "copyrights": [
                "(c) (c) A",
                "(c) (c) AAEE",
                "(c) 2015 The Go Authors",
                "(c) AeHa (c)",
                "(c) Bv",
                "(c) EAiE (c)",
                "(c) EeAoq (c)",
                "(c) EmeEBu (c)",
                "(c) aA\"AE (c) 1AE",
                "(c) cc.fr",
                "(c) if err p.JoinGroup en0, &net.UDPAddr IP group",
                "(c) lEEe (c) AE",
                "(c) oav!A (c) AY I",
                "(c) uSSg1/2a+-N (c) OY",
                "Copyright (c) 2004, 2006 The Linux Foundation and its contributors",
                "Copyright (c) 2009 Apple Inc.",
                "Copyright (c) 2009 The Go Authors",
                "Copyright (c) 2013, The GoGo Authors",
                "Copyright (c) 2014 Steve Francia <spf@spf13.com>",
                "Copyright (c) 2015 Ian Coleman",
                "Copyright (c) 2015 Jerry Jacobs <jerry.jacobs@xor-gate.org>",
                "Copyright (c) 2015 Steve Francia <spf@spf13.com>",
                "Copyright (c) 2015 The Go Authors",
                "Copyright (c) 2015, The GoGo Authors",
                "Copyright (c) 2016 Steve Francia <spf@spf13.com>",
                "Copyright (c) 2016, The GoGo Authors",
                "Copyright (c) 2017, The GoGo Authors",
                "Copyright (c) 2018",
                "Copyright (c) 2018 Steve Francia <spf@spf13.com>",
                "Copyright (c) 2018, The GoGo Authors",
                "Copyright (c) s",
                "Copyright 2008 Google Inc.",
                "Copyright 2009 The Go Authors",
                "Copyright 2010 The Go Authors",
                "Copyright 2010 The Go Authors. https://github.com/golang/protobuf",
                "Copyright 2011 The Go Authors",
                "Copyright 2012 The Go Authors",
                "Copyright 2013 The Go Authors",
                "Copyright 2013 tsuru authors",
                "Copyright 2014 The Go Authors",
                "Copyright 2015 The Go Authors",
                "Copyright 2016 The Go Authors",
                "Copyright 2017 The Go Authors",
                "Copyright 2018 The Go Authors",
                "Portions Copyright (c) 2015 The Hugo Authors",
                "Portions Copyright 2016-present Bjorn Erik Pedersen <bjorn.erik.pedersen@gmail.com>"
            ],
            "file-count": 2640,
            "sha256": "582e6d3a2e6a20226d894071c74357521cb17adbe752ec1ee6fe615e6a2a31ab",
            "source": "https://github.com/envoyproxy/protoc-gen-validate/archive/refs/tags/v0.1.0.zip",
            "status": "restricted"
        },
        {
            "date": "November 25, 2022 at 11:06:44 p.m. GMT",
            "authority": "https://gitlab.eclipse.org/eclipsefdn/emo-team/iplab/-/issues/5205",
            "scancode-version": "31.2.1",
            "licenses-discovered": [
                "CC-BY-4.0 AND MIT",
                "Apache-2.0",
                "BSD-2-Clause",
                "BSD-3-Clause",
                "MIT",
                "BSD-2-Clause AND BSD-3-Clause",
                "BSD-3-Clause AND CC-BY-SA-1.0 AND CC-BY-SA-2.5 AND CC-BY-SA-3.0",
                "BSD-3-Clause AND CC-BY-SA-1.0 AND CC-BY-SA-2.0 AND CC-BY-SA-2.5 AND CC-BY-SA-3.0"
            ],
            "copyrights": [
                "(c) (c) A",
                "(c) (c) AAEE",
                "(c) 2015 The Go Authors",
                "(c) AeHa (c)",
                "(c) Bv",
                "(c) EAiE (c)",
                "(c) EeAoq (c)",
                "(c) EmeEBu (c)",
                "(c) aA\"AE (c) 1AE",
                "(c) cc.fr",
                "(c) if err p.JoinGroup en0, &net.UDPAddr IP group",
                "(c) lEEe (c) AE",
                "(c) oav!A (c) AY I",
                "(c) uSSg1/2a+-N (c) OY",
                "Copyright (c) 2004, 2006 The Linux Foundation and its contributors",
                "Copyright (c) 2009 Apple Inc.",
                "Copyright (c) 2009 The Go Authors",
                "Copyright (c) 2013, The GoGo Authors",
                "Copyright (c) 2014 Steve Francia <spf@spf13.com>",
                "Copyright (c) 2015 Ian Coleman",
                "Copyright (c) 2015 Jerry Jacobs <jerry.jacobs@xor-gate.org>",
                "Copyright (c) 2015 Steve Francia <spf@spf13.com>",
                "Copyright (c) 2015 The Go Authors",
                "Copyright (c) 2015, The GoGo Authors",
                "Copyright (c) 2016 Steve Francia <spf@spf13.com>",
                "Copyright (c) 2016, The GoGo Authors",
                "Copyright (c) 2017, The GoGo Authors",
                "Copyright (c) 2018",
                "Copyright (c) 2018 Steve Francia <spf@spf13.com>",
                "Copyright (c) 2018, The GoGo Authors",
                "Copyright (c) s",
                "Copyright 2008 Google Inc.",
                "Copyright 2009 The Go Authors",
                "Copyright 2010 The Go Authors",
                "Copyright 2010 The Go Authors. https://github.com/golang/protobuf",
                "Copyright 2011 The Go Authors",
                "Copyright 2012 The Go Authors",
                "Copyright 2013 The Go Authors",
                "Copyright 2013 tsuru authors",
                "Copyright 2014 The Go Authors",
                "Copyright 2015 The Go Authors",
                "Copyright 2016 The Go Authors",
                "Copyright 2017 The Go Authors",
                "Copyright 2018 The Go Authors",
                "Portions Copyright (c) 2015 The Hugo Authors",
                "Portions Copyright 2016-present Bjorn Erik Pedersen <bjorn.erik.pedersen@gmail.com>"
            ],
            "file-count": 2640,
            "sha256": "582e6d3a2e6a20226d894071c74357521cb17adbe752ec1ee6fe615e6a2a31ab",
            "source": "https://github.com/envoyproxy/protoc-gen-validate/archive/refs/tags/v0.1.0.zip",
            "status": "restricted"
        }
    ]
}
