{
    "id": "nuget/nuget/-/ReportPortal.Shared/3.6.0",
    "license": "Apache-2.0",
    "authority": "https://gitlab.eclipse.org/eclipsefdn/emo-team/iplab/-/issues/10587",
    "source": "https://github.com/reportportal/commons-net/archive/refs/tags/3.6.0.zip",
    "status": "approved",
    "scans": [
        {
            "date": "September 19, 2023 at 9:41:20 a.m. GMT",
            "authority": "https://gitlab.eclipse.org/eclipsefdn/emo-team/iplab/-/issues/10587",
            "scancode-version": "31.2.1",
            "licenses-discovered": [
                "Apache-2.0"
            ],
            "copyrights": [
            ],
            "file-count": 156,
            "sha256": "da7147b0ff2d5140f5984aada2a90baab90898ec9bd7a0f7aba5e86e8bb07976",
            "source": "https://github.com/reportportal/commons-net/archive/refs/tags/3.6.0.zip",
            "status": "approved"
        }
    ]
}