{
    "id": "maven/mavencentral/org.eclipse.dataspaceconnector/transaction-datasource-spi/0.0.1-20220922.4-20230220.143048-1",
    "license": "Apache-2.0",
    "authority": "https://gitlab.eclipse.org/eclipsefdn/emo-team/iplab/-/issues/7679",
    "source": "https://search.maven.org/remotecontent?filepath=org/eclipse/dataspaceconnector/transaction-datasource-spi/0.0.1-milestone-6/transaction-datasource-spi-0.0.1-milestone-6-sources.jar",
    "status": "approved",
    "scans": [
        {
            "date": "March 28, 2023 at 9:31:28 p.m. GMT",
            "authority": "https://gitlab.eclipse.org/eclipsefdn/emo-team/iplab/-/issues/7679",
            "scancode-version": "31.2.1",
            "licenses-discovered": [
                "Apache-2.0"
            ],
            "copyrights": [
                "Copyright (c) 2021 Microsoft Corporation"
            ],
            "file-count": 2,
            "sha256": "34b8cfb7507ff92ea8166c8a95b2eb729bd3b543428aaf1ded78d91045f7138d",
            "source": "https://search.maven.org/remotecontent?filepath=org/eclipse/dataspaceconnector/transaction-datasource-spi/0.0.1-milestone-6/transaction-datasource-spi-0.0.1-milestone-6-sources.jar",
            "status": "approved"
        }
    ]
}