{
    "id": "npm/npmjs/-/identity-function/1.0.0",
    "license": "LicenseRef-Public-domain",
    "authority": "https://gitlab.eclipse.org/eclipsefdn/emo-team/iplab/-/issues/11983",
    "source": "https://registry.yarnpkg.com/identity-function/-/identity-function-1.0.0.tgz",
    "status": "approved",
    "scans": [
        {
            "date": "December 13, 2023 at 4:19:17 p.m. GMT",
            "authority": "https://gitlab.eclipse.org/eclipsefdn/emo-team/iplab/-/issues/11983",
            "scancode-version": "31.2.1",
            "licenses-discovered": [
            ],
            "copyrights": [
            ],
            "file-count": 4,
            "sha256": "624a5af7ad42c1656695725616f26d40c3c3c4e13796da6f8913f64b61a9a1d8",
            "source": "https://registry.yarnpkg.com/identity-function/-/identity-function-1.0.0.tgz",
            "status": "restricted"
        }
    ]
}
