{
    "id": "maven/mavencentral/org.webjars/webjars-locator/0.46",
    "license": "MIT",
    "licenses-discovered": [
        "MIT"
    ],
    "copyrights": [
    ],
    "file-count": 8,
    "scancode-version": "31.2.1",
    "authority": "https://gitlab.eclipse.org/eclipsefdn/emo-team/iplab/-/issues/4360",
    "source": "https://search.maven.org/remotecontent?filepath=org/webjars/webjars-locator/0.46/webjars-locator-0.46-sources.jar",
    "status": "approved"
}