{
    "id": "npm/npmjs/-/vite-node/0.31.0",
    "license": "MIT AND (Apache-2.0 AND BSD-3-Clause AND ISC AND MIT)",
    "authority": "https://gitlab.eclipse.org/eclipsefdn/emo-team/iplab/-/issues/8298",
    "source": "https://github.com/vitest-dev/vitest/archive/v0.31.0.zip",
    "status": "approved",
    "scans": [
        {
            "date": "May 4, 2023 at 6:06:40 p.m. GMT",
            "authority": "https://gitlab.eclipse.org/eclipsefdn/emo-team/iplab/-/issues/8298",
            "scancode-version": "31.2.1",
            "licenses-discovered": [
                "MIT",
                "Apache-2.0 AND BSD-3-Clause AND ISC AND MIT"
            ],
            "copyrights": [
                "(c) 2021 Anthony Fu (https://github.com/antfu)",
                "(c) 2021-Present Anthony Fu (https://github.com/antfu), Matias Capeletto (https://github.com/patak-dev)",
                "Copyright (c) 2008-2016 Pivotal Labs",
                "Copyright (c) 2010-2014, Christian Johansen, christian@cjohansen.no",
                "Copyright (c) 2011 Einar Otto Stangvik <einaros@gmail.com>",
                "Copyright (c) 2013 Arnout Kazemier and contributors",
                "Copyright (c) 2013 Jake Luer <jake@alogicalparadox.com> (http://alogicalparadox.com)",
                "Copyright (c) 2014 Bob Lauer",
                "Copyright (c) 2014 Permission",
                "Copyright (c) 2014-2016, Jon Schlinkert",
                "Copyright (c) 2014-2017, Jon Schlinkert",
                "Copyright (c) 2014-2018, Jon Schlinkert",
                "Copyright (c) 2014-2020 Teambition",
                "Copyright (c) 2014-present, Jon Schlinkert",
                "Copyright (c) 2015 Matteo Collina",
                "Copyright (c) 2015 Rich Harris",
                "Copyright (c) 2015, 2019 Elan Shanker",
                "Copyright (c) 2015, Contributors",
                "Copyright (c) 2015-2020, Matteo Collina <matteo.collina@gmail.com>",
                "Copyright (c) 2015-present, Jon Schlinkert",
                "Copyright (c) 2016 Luigi Pinca and contributors",
                "Copyright (c) 2017-present, Jon Schlinkert",
                "Copyright (c) 2018 Made With MOXY Lda",
                "Copyright (c) 2018 Terkel Gjervig Nielsen",
                "Copyright (c) 2018, Sinon.JS",
                "Copyright (c) 2018-2020, Andrea Giammarchi",
                "Copyright (c) 2020 Ben Lesh",
                "Copyright (c) 2021 Anthony Fu <https://github.com/antfu>",
                "Copyright (c) 2021-PRESENT Anthony Fu, Matias Capeletto and Vitest",
                "Copyright (c) 2021-Present Anthony Fu <https://github.com/antfu>",
                "Copyright (c) 2021-Present Matias Capeletto <https://github.com/patak-dev>",
                "Copyright (c) DC",
                "Copyright (c) Denis Malinochkin",
                "Copyright (c) Facebook, Inc. and its affiliates",
                "Copyright (c) Feross Aboukhadijeh",
                "Copyright (c) Hiroki Osame <hiroki.osame@gmail.com>",
                "Copyright (c) Isaac Z. Schlueter and Contributors",
                "Copyright (c) Kevin Martensson <kevinmartensson@gmail.com>",
                "Copyright (c) Luke Edwards <luke.edwards05@gmail.com> (lukeed.com)",
                "Copyright (c) Pooya Parsa <pooya@pi0.io>",
                "Copyright (c) Sindre Sorhus <sindresorhus@gmail.com> (https://sindresorhus.com)",
                "Copyright (c) Sindre Sorhus <sindresorhus@gmail.com> (sindresorhus.com)",
                "Copyright (c) Stephen Sugden <me@stephensugden.com> (stephensugden.com)",
                "Copyright 2019 Justin Ridgewell <jridgewell@google.com>",
                "Copyright 2022 Justin Ridgewell <justin@ridgewell.name>",
                "Copyright 2022 ehmicky <ehmicky@gmail.com>",
                "Copyright Mathias Bynens <https://mathiasbynens.be/>"
            ],
            "file-count": 1170,
            "sha256": "4750527cf80ea9c0751e5af8ef8746e845499c2950e2429a20667da9c90e3c4f",
            "source": "https://github.com/vitest-dev/vitest/archive/v0.31.0.zip",
            "status": "approved"
        }
    ]
}