{
    "id": "maven/mavencentral/net.sf.tweety.arg/deductive/1.12",
    "license": "LGPL-3.0-or-later",
    "authority": "https://gitlab.eclipse.org/eclipsefdn/emo-team/iplab/-/issues/17239",
    "source": "https://repo1.maven.org/maven2/net/sf/tweety/arg/deductive/1.12/deductive-1.12-sources.jar",
    "status": "approved",
    "scans": [
        {
            "date": "November 14, 2024, 8:39:20 p.m. GMT",
            "authority": "https://gitlab.eclipse.org/eclipsefdn/emo-team/iplab/-/issues/17239",
            "scancode-version": "31.2.1",
            "licenses-discovered": [
                "LGPL-3.0-or-later"
            ],
            "copyrights": [
                "Copyright 2016 The TweetyProject Team <http://tweetyproject.org/contact/>",
                "Copyright 2017 The TweetyProject Team <http://tweetyproject.org/contact/>"
            ],
            "file-count": 29,
            "sha256": "1815e2a980e11cb25cc94e82d13fa0e7ff407c5711381ed6fec85a624e1582ff",
            "source": "https://repo1.maven.org/maven2/net/sf/tweety/arg/deductive/1.12/deductive-1.12-sources.jar",
            "status": "approved"
        }
    ]
}