{
    "id": "npm/npmjs/@vscode/vsce/2.19.0",
    "license": "MIT AND (ISC AND MIT)",
    "authority": "https://gitlab.eclipse.org/eclipsefdn/emo-team/iplab/-/issues/9082",
    "source": "https://registry.npmjs.org/@vscode/vsce/-/vsce-2.19.0.tgz",
    "status": "approved",
    "scans": [
        {
            "date": "June 15, 2023 at 6:40:26 p.m. GMT",
            "authority": "https://gitlab.eclipse.org/eclipsefdn/emo-team/iplab/-/issues/9082",
            "scancode-version": "31.2.1",
            "licenses-discovered": [
                "MIT",
                "ISC AND MIT"
            ],
            "copyrights": [
                "Copyright (c) 2010 Benjamin Thomas, Robert Kieffer",
                "Copyright (c) 2011 TJ Holowaychuk <tj@vision-media.ca>",
                "Copyright (c) 2014 Josh Wolfe",
                "Copyright (c) 2014 KARASZI Istvan",
                "Copyright (c) 2015 Microsoft",
                "Copyright (c) Isaac Z. Schlueter and Contributors",
                "Copyright (c) Microsoft Corporation",
                "Copyright 2012-2015 The Dojo Foundation <http://dojofoundation.org/>",
                "copyright 2009-2015 Jeremy Ashkenas, DocumentCloud and Investigative Reporters & Editors <http://underscorejs.org/>"
            ],
            "file-count": 22,
            "sha256": "0e07827d53842c81d10d81c7a30adc34c22d9bb98ff3f76ccb811ed75a816cc7",
            "source": "https://registry.npmjs.org/@vscode/vsce/-/vsce-2.19.0.tgz",
            "status": "approved"
        }
    ]
}