{
    "id": "maven/mavencentral/com.fasterxml.jackson.jakarta.rs/jackson-jakarta-rs-base/2.15.2",
    "license": "Apache-2.0",
    "authority": "https://gitlab.eclipse.org/eclipsefdn/emo-team/iplab/-/issues/9235",
    "source": "https://repo.maven.apache.org/maven2/com/fasterxml/jackson/jakarta/rs/jackson-jakarta-rs-base/2.15.2/jackson-jakarta-rs-base-2.15.2-sources.jar",
    "status": "approved",
    "scans": [
        {
            "date": "July 4, 2023 at 9:34:06 a.m. GMT",
            "authority": "https://gitlab.eclipse.org/eclipsefdn/emo-team/iplab/-/issues/9235",
            "scancode-version": "31.2.1",
            "licenses-discovered": [
                "Apache-2.0"
            ],
            "copyrights": [
            ],
            "file-count": 22,
            "sha256": "d7020cc9209ba735999f513933a73aa661f4878f58440cc151e1cfdf9db2ef25",
            "source": "https://repo.maven.apache.org/maven2/com/fasterxml/jackson/jakarta/rs/jackson-jakarta-rs-base/2.15.2/jackson-jakarta-rs-base-2.15.2-sources.jar",
            "status": "approved"
        }
    ]
}