{
    "id": "nuget/nuget/-/JsonSchema.Net/7.0.2",
    "license": "MIT AND OFL-1.1 AND CC-BY-SA-4.0",
    "authority": "https://gitlab.eclipse.org/eclipsefdn/emo-team/iplab/-/issues/15171",
    "source": "https://github.com/gregsdennis/json-everything/archive/refs/tags/schema-v7.0.2.zip",
    "status": "approved",
    "scans": [
        {
            "date": "June 13, 2024 at 5:04:30 p.m. GMT",
            "authority": "https://gitlab.eclipse.org/eclipsefdn/emo-team/iplab/-/issues/15171",
            "scancode-version": "31.2.1",
            "licenses-discovered": [
                "MIT",
                "OFL-1.1",
                "MIT AND OFL-1.1",
                "CC-BY-SA-4.0"
            ],
            "copyrights": [
                "Copyright (c) 2014 Waybury",
                "Copyright (c) 2024 Greg Dennis",
                "Copyright 2011-2021 The Bootstrap Authors",
                "Copyright 2011-2021 Twitter, Inc."
            ],
            "file-count": 1076,
            "sha256": "83be4d8b55e52d9834ac67b8e33fe82497f1a5d0dc66dd2e155bc8986585fbaa",
            "source": "https://github.com/gregsdennis/json-everything/archive/refs/tags/schema-v7.0.2.zip",
            "status": "approved"
        }
    ]
}