{
    "id": "p2/orbit/p2.eclipse-plugin/org.apache.maven.plugins.maven-enforcer-plugin/1.4.1",
    "license": "Apache-2.0",
    "licenses-discovered": [
        "Apache-2.0"
    ],
    "file-count": 7,
    "scancode-version": "30.1.0",
    "authority": "https://gitlab.eclipse.org/eclipsefdn/emo-team/iplab/-/issues/2203",
    "source": "https://search.maven.org/remotecontent?filepath=org/apache/maven/plugins/maven-enforcer-plugin/1.4.1/maven-enforcer-plugin-1.4.1-sources.jar",
    "status": "approved"
}