{
    "id": "npm/npmjs/-/xterm/4.17.0",
    "license": "MIT",
    "licenses-discovered": [
        "MIT"
    ],
    "file-count": 110,
    "scancode-version": "30.1.0",
    "authority": "https://gitlab.eclipse.org/eclipsefdn/emo-team/iplab/-/issues/1949",
    "source": "https://registry.npmjs.org/xterm/-/xterm-4.17.0.tgz",
    "status": "approved"
}