{
    "id": "npm/npmjs/-/nise/5.1.1",
    "license": "BSD-3-Clause",
    "licenses-discovered": [
        "BSD-3-Clause"
    ],
    "file-count": 39,
    "scancode-version": "30.1.0",
    "authority": "https://gitlab.eclipse.org/eclipsefdn/emo-team/iplab/-/issues/1944",
    "source": "https://github.com/sinonjs/nise/archive/v5.1.1.zip",
    "status": "approved"
}