{
    "id": "maven/mavencentral/org.scalatra/scalatra_2.12/2.6.3",
    "license": "BSD-2-Clause",
    "authority": "https://gitlab.eclipse.org/eclipsefdn/emo-team/iplab/-/issues/5093",
    "source": "https://search.maven.org/remotecontent?filepath=org/scalatra/scalatra_2.12/2.6.3/scalatra_2.12-2.6.3-sources.jar",
    "status": "approved",
    "scans": [
        {
            "date": "November 24, 2022 at 5:22:44 p.m. GMT",
            "authority": "https://gitlab.eclipse.org/eclipsefdn/emo-team/iplab/-/issues/5093",
            "scancode-version": "31.2.1",
            "licenses-discovered": [
            ],
            "copyrights": [
            ],
            "file-count": 69,
            "sha256": "eab32c8ad5771550c96086994bda90dab72d661471327a9801582221b9063f28",
            "source": "https://search.maven.org/remotecontent?filepath=org/scalatra/scalatra_2.12/2.6.3/scalatra_2.12-2.6.3-sources.jar",
            "status": "restricted"
        }
    ]
}
