{
    "id": "maven/mavencentral/org.hdrhistogram/HdrHistogram/2.1.12",
    "license": "CC0-1.0",
    "authority": "https://gitlab.eclipse.org/eclipsefdn/emo-team/iplab/-/issues/15259",
    "source": "https://repo1.maven.org/maven2/org/hdrhistogram/HdrHistogram/2.1.12/HdrHistogram-2.1.12-sources.jar",
    "status": "approved",
    "scans": [
        {
            "date": "June 14, 2024 at 3:58:53 p.m. GMT",
            "authority": "https://gitlab.eclipse.org/eclipsefdn/emo-team/iplab/-/issues/15259",
            "scancode-version": "31.2.1",
            "licenses-discovered": [
                "CC0-1.0"
            ],
            "copyrights": [
            ],
            "file-count": 55,
            "sha256": "694ba8e66af54ae338a36eef6d1e0bbbeb85f6773965841dd449f669643ae8ba",
            "source": "https://repo1.maven.org/maven2/org/hdrhistogram/HdrHistogram/2.1.12/HdrHistogram-2.1.12-sources.jar",
            "status": "approved"
        }
    ]
}