{
    "id": "go/golang/github.com%2Fcheckpoint-restore%2Fgo-criu/v4/v4.1.0",
    "license": "Apache-2.0",
    "authority": "https://gitlab.eclipse.org/eclipsefdn/emo-team/iplab/-/issues/12524",
    "source": "https://proxy.golang.org/github.com%2Fcheckpoint-restore%2Fgo-criu/v4/@v/v4.1.0.zip",
    "status": "approved",
    "scans": [
        {
            "date": "December 26, 2023 at 6:26:38 a.m. GMT",
            "authority": "https://gitlab.eclipse.org/eclipsefdn/emo-team/iplab/-/issues/12524",
            "scancode-version": "31.2.1",
            "licenses-discovered": [
                "Apache-2.0"
            ],
            "copyrights": [
            ],
            "file-count": 22,
            "sha256": "e0413b7c67d41b9e77207db083387d2eb300356541f9048c7ff0670ba7ace524",
            "source": "https://proxy.golang.org/github.com%2Fcheckpoint-restore%2Fgo-criu/v4/@v/v4.1.0.zip",
            "status": "approved"
        }
    ]
}