{
    "id": "nuget/nuget/-/Serilog/3.0.1",
    "license": "Apache-2.0",
    "authority": "https://gitlab.eclipse.org/eclipsefdn/emo-team/iplab/-/issues/10063",
    "source": "https://github.com/serilog/serilog/archive/refs/tags/v3.0.1.zip",
    "status": "approved",
    "scans": [
        {
            "date": "August 17, 2023 at 4:34:23 a.m. GMT",
            "authority": "https://gitlab.eclipse.org/eclipsefdn/emo-team/iplab/-/issues/10063",
            "scancode-version": "31.2.1",
            "licenses-discovered": [
                "Apache-2.0"
            ],
            "copyrights": [
                "Copyright 2013-2015 Serilog",
                "Copyright 2013-2016 Serilog",
                "Copyright 2013-2017 Serilog",
                "Copyright 2013-2018 Serilog",
                "Copyright 2013-2020 Serilog",
                "Copyright 2013-2021 Serilog",
                "Copyright 2015 Serilog",
                "Copyright 2016 Serilog",
                "Copyright 2016-2020 Serilog",
                "Copyright 2017 Serilog",
                "Copyright 2019 Serilog",
                "Copyright 2019-2020 Serilog",
                "Copyright 2020 Serilog",
                "Copyright 2021 Serilog",
                "IsValidInDestructuringHint (c) IsValidInPropertyName (c)",
                "copyright (c) 2013-2020 Serilog"
            ],
            "file-count": 250,
            "sha256": "ef9a51b1cd805d1b428de8f760d08d43d9382c5aa7bbaee24f082f6aec98baab",
            "source": "https://github.com/serilog/serilog/archive/refs/tags/v3.0.1.zip",
            "status": "approved"
        }
    ]
}