{
    "id": "npm/npmjs/@mui/private-theming/5.4.4",
    "license": "MIT",
    "licenses-discovered": [
        "LicenseRef-scancode-commercial-license AND MIT",
        "MIT"
    ],
    "copyrights": [
        "Copyright (c) Call-Em-All"
    ],
    "file-count": 40,
    "scancode-version": "30.1.0",
    "authority": "https://gitlab.eclipse.org/eclipsefdn/emo-team/iplab/-/issues/2993",
    "source": "https://registry.npmjs.org/@mui/private-theming/-/private-theming-5.4.4.tgz",
    "status": "approved"
}
