{
    "id": "npm/npmjs/@vscode/win32-app-container-tokens/0.1.0",
    "license": "MIT",
    "authority": "https://gitlab.eclipse.org/eclipsefdn/emo-team/iplab/-/issues/6439",
    "source": "https://registry.npmjs.org/@vscode/win32-app-container-tokens/-/win32-app-container-tokens-0.1.0.tgz",
    "status": "approved",
    "scans": [
        {
            "date": "January 20, 2023 at 6:12:38 p.m. GMT",
            "authority": "https://gitlab.eclipse.org/eclipsefdn/emo-team/iplab/-/issues/6439",
            "scancode-version": "31.2.1",
            "licenses-discovered": [
                "MIT"
            ],
            "copyrights": [
                "Copyright (c) Microsoft Corporation"
            ],
            "file-count": 45,
            "sha256": "b1b688cc280d0aece0099750a08a77f6f60c4a01a489fdb33073b5b460cfa05c",
            "source": "https://registry.npmjs.org/@vscode/win32-app-container-tokens/-/win32-app-container-tokens-0.1.0.tgz",
            "status": "approved"
        }
    ]
}