{
    "id": "maven/mavencentral/com.googlecode.xmemcached/xmemcached/2.4.8",
    "license": "Apache-2.0 AND (CDDL-1.0 OR (GPL-2.0-only WITH Classpath-exception-2.0)) AND CDDL-1.0",
    "authority": "https://gitlab.eclipse.org/eclipsefdn/emo-team/iplab/-/issues/15811",
    "source": "https://repo1.maven.org/maven2/com/googlecode/xmemcached/xmemcached/2.4.8/xmemcached-2.4.8-sources.jar",
    "status": "approved",
    "scans": [
        {
            "date": "July 24, 2024 at 4:57:39 p.m. GMT",
            "authority": "https://gitlab.eclipse.org/eclipsefdn/emo-team/iplab/-/issues/15811",
            "scancode-version": "31.2.1",
            "licenses-discovered": [
                "Apache-2.0",
                "CDDL-1.0 AND (GPL-2.0-only WITH Classpath-exception-2.0)",
                "Apache-2.0 AND CC-PDDC AND CDDL-1.0 AND (GPL-2.0-only WITH Classpath-exception-2.0)",
                "CDDL-1.0",
                "CC-PDDC"
            ],
            "copyrights": [
                "Copyright (c) 2006 Dustin Sallings <dustin@spy.net>",
                "Copyright (c) 2007 Dustin Sallings <dustin+html@spy.net>",
                "Copyright 1997-2008 Sun Microsystems, Inc.",
                "Copyright 2004-2005 the original author or authors",
                "Copyright 2007 Sun Microsystems, Inc.",
                "Copyright 2007-2008 Sun Microsystems, Inc.",
                "Copyright 2008 dennis zhuang",
                "Copyright 2008-2009 dennis zhuang",
                "Copyright 2009-2010 dennis",
                "Copyright 2009-2010 dennis zhuang"
            ],
            "file-count": 231,
            "sha256": "1bba16617b923e8870809c0bc18a89e6b614af773d064354a2cb2fbdcd7b4042",
            "source": "https://repo1.maven.org/maven2/com/googlecode/xmemcached/xmemcached/2.4.8/xmemcached-2.4.8-sources.jar",
            "status": "restricted"
        }
    ]
}