{
    "id": "npm/npmjs/@tsconfig/node18/2.0.0",
    "license": "MIT",
    "authority": "https://gitlab.eclipse.org/eclipsefdn/emo-team/iplab/-/issues/8115",
    "source": "https://registry.npmjs.org/@tsconfig/node18/-/node18-2.0.0.tgz",
    "status": "approved",
    "scans": [
        {
            "date": "May 3, 2023 at 10:03:40 a.m. GMT",
            "authority": "https://gitlab.eclipse.org/eclipsefdn/emo-team/iplab/-/issues/8115",
            "scancode-version": "31.2.1",
            "licenses-discovered": [
                "MIT"
            ],
            "copyrights": [
                "Copyright (c) Microsoft Corporation"
            ],
            "file-count": 4,
            "sha256": "caf6609ec722c09622b007707d1662f565efffd65c971d72d48b6bf716e37d5d",
            "source": "https://registry.npmjs.org/@tsconfig/node18/-/node18-2.0.0.tgz",
            "status": "approved"
        }
    ]
}