{
    "id": "pypi/pypi/-/mistune/2.0.5",
    "license": "BSD-3-Clause",
    "authority": "https://gitlab.eclipse.org/eclipsefdn/emo-team/iplab/-/issues/15020",
    "source": "https://files.pythonhosted.org/packages/fb/6b/d8013058fcdb0088b4130164fc961e15c50d30302f60a349c16bdfda9770/mistune-2.0.5.tar.gz",
    "status": "approved",
    "scans": [
        {
            "date": "May 29, 2024 at 4:33:51 p.m. GMT",
            "authority": "https://gitlab.eclipse.org/eclipsefdn/emo-team/iplab/-/issues/15020",
            "scancode-version": "31.2.1",
            "licenses-discovered": [
                "BSD-3-Clause"
            ],
            "copyrights": [
                "Copyright (c) 2014, Hsiaoming Yang",
                "copyright (c) Hsiaoming Yang"
            ],
            "file-count": 65,
            "sha256": "0246113cb2492db875c6be56974a7c893333bf26cd92891c85f63151cee09d34",
            "source": "https://files.pythonhosted.org/packages/fb/6b/d8013058fcdb0088b4130164fc961e15c50d30302f60a349c16bdfda9770/mistune-2.0.5.tar.gz",
            "status": "approved"
        }
    ]
}