{
    "id": "maven/mavencentral/com.azure/azure-storage-common/12.27.1",
    "license": "MIT",
    "authority": "https://gitlab.eclipse.org/eclipsefdn/emo-team/iplab/-/issues/16851",
    "source": "https://repo1.maven.org/maven2/com/azure/azure-storage-common/12.27.1/azure-storage-common-12.27.1-sources.jar",
    "status": "approved",
    "scans": [
        {
            "date": "October 22, 2024, 3:28:23 a.m. GMT",
            "authority": "https://gitlab.eclipse.org/eclipsefdn/emo-team/iplab/-/issues/16851",
            "scancode-version": "31.2.1",
            "licenses-discovered": [
                "MIT"
            ],
            "copyrights": [
                "Copyright (c) Microsoft Corporation"
            ],
            "file-count": 62,
            "sha256": "54ce5c04a98e20144d5cd2e1bddc940b2cb7f6210d1c5b08cea203c17486a9ec",
            "source": "https://repo1.maven.org/maven2/com/azure/azure-storage-common/12.27.1/azure-storage-common-12.27.1-sources.jar",
            "status": "approved"
        }
    ]
}