{
    "id": "maven/mavencentral/io.grpc/grpc-googleapis/1.55.1",
    "license": "Apache-2.0",
    "authority": "https://gitlab.eclipse.org/eclipsefdn/emo-team/iplab/-/issues/9636",
    "source": "https://repo.maven.apache.org/maven2/io/grpc/grpc-googleapis/1.55.1/grpc-googleapis-1.55.1-sources.jar",
    "status": "approved",
    "scans": [
        {
            "date": "July 19, 2023 at 12:56:25 p.m. GMT",
            "authority": "https://gitlab.eclipse.org/eclipsefdn/emo-team/iplab/-/issues/9636",
            "scancode-version": "31.2.1",
            "licenses-discovered": [
                "Apache-2.0"
            ],
            "copyrights": [
                "Copyright 2021 The gRPC",
                "Copyright 2022 The gRPC"
            ],
            "file-count": 5,
            "sha256": "19cf1cae3aeb68ed3c7312fe2f3b316f4f0e1e4de221e57c895518eb28f9c18b",
            "source": "https://repo.maven.apache.org/maven2/io/grpc/grpc-googleapis/1.55.1/grpc-googleapis-1.55.1-sources.jar",
            "status": "approved"
        }
    ]
}