{
    "id": "pypi/pypi/-/sphinxcontrib-plantuml/0.30",
    "license": "BSD-2-Clause AND BSD-3-Clause",
    "authority": "https://gitlab.eclipse.org/eclipsefdn/emo-team/iplab/-/issues/19884",
    "source": "https://files.pythonhosted.org/packages/4d/e0/91ee50f1a020e2ed48d370a054f94b012ba0d757214a420ac43c9327f818/sphinxcontrib-plantuml-0.30.tar.gz",
    "status": "approved",
    "scans": [
        {
            "date": "March 4, 2025 at 10:05:49 a.m. GMT",
            "authority": "https://gitlab.eclipse.org/eclipsefdn/emo-team/iplab/-/issues/19884",
            "scancode-version": "31.2.1",
            "licenses-discovered": [
                "BSD-2-Clause",
                "BSD-3-Clause"
            ],
            "copyrights": [
                "Copyright (c) 2010-2019 Yuya Nishihara <yuya@tcha.org>",
                "Copyright 2007-2009 by the Sphinx team",
                "Copyright 2010 by Yuya Nishihara <yuya@tcha.org>"
            ],
            "file-count": 18,
            "sha256": "2a1266ca43bddf44640ae44107003df4490de2b3c3154a0d627cfb63e9a169bf",
            "source": "https://files.pythonhosted.org/packages/4d/e0/91ee50f1a020e2ed48d370a054f94b012ba0d757214a420ac43c9327f818/sphinxcontrib-plantuml-0.30.tar.gz",
            "status": "approved"
        }
    ]
}