{
    "id": "maven/mavencentral/org.keycloak/keycloak-server-spi-private/22.0.4",
    "license": "Apache-2.0",
    "authority": "https://gitlab.eclipse.org/eclipsefdn/emo-team/iplab/-/issues/11308",
    "source": "https://repo.maven.apache.org/maven2/org/keycloak/keycloak-server-spi-private/22.0.4/keycloak-server-spi-private-22.0.4-sources.jar",
    "status": "approved",
    "scans": [
        {
            "date": "October 26, 2023 at 7:43:16 p.m. GMT",
            "authority": "https://gitlab.eclipse.org/eclipsefdn/emo-team/iplab/-/issues/11308",
            "scancode-version": "31.2.1",
            "licenses-discovered": [
                "Apache-2.0"
            ],
            "copyrights": [
                "(c) 2016 Red Hat Inc.",
                "Copyright 2016 Analytical Graphics, Inc. and/or its affiliates and other contributors",
                "Copyright 2016 Red Hat, Inc. and/or its affiliates and other contributors",
                "Copyright 2016 Red Hat, Inc. and/or its affiliates ~ and other contributors",
                "Copyright 2016 Red Hat, Inc., and individual contributors",
                "Copyright 2017 Red Hat, Inc. and/or its affiliates and other contributors",
                "Copyright 2018 Red Hat, Inc. and/or its affiliates and other contributors",
                "Copyright 2019 Red Hat, Inc. and/or its affiliates and other contributors",
                "Copyright 2020 Red Hat, Inc. and/or its affiliates and other contributors",
                "Copyright 2021 Red Hat, Inc. and/or its affiliates and other contributors",
                "Copyright 2022 Red Hat, Inc. and/or its affiliates and other contributors",
                "Copyright 2023 Red Hat, Inc. and/or its affiliates and other contributors"
            ],
            "file-count": 509,
            "sha256": "b863a82172c74b37fe3a63c8e0d53ccadf5ba37b294809035f09168531a5ea8e",
            "source": "https://repo.maven.apache.org/maven2/org/keycloak/keycloak-server-spi-private/22.0.4/keycloak-server-spi-private-22.0.4-sources.jar",
            "status": "approved"
        }
    ]
}