{
    "id": "maven/mavencentral/org.bytedeco/javacpp-platform/1.5.8",
    "license": "Apache-2.0 or GPL-2.0-or-later WITH Classpath-exception-2.0",
    "authority": "https://gitlab.eclipse.org/eclipsefdn/emo-team/iplab/-/issues/6825",
    "source": "https://search.maven.org/remotecontent?filepath=org/bytedeco/javacpp-platform/1.5.8/javacpp-platform-1.5.8-sources.jar",
    "status": "approved",
    "scans": [
        {
            "date": "January 27, 2023 at 9:07:56 p.m. GMT",
            "authority": "https://gitlab.eclipse.org/eclipsefdn/emo-team/iplab/-/issues/6825",
            "scancode-version": "31.2.1",
            "licenses-discovered": [
                "Apache-2.0 AND (GPL-2.0-or-later WITH Classpath-exception-2.0)"
            ],
            "copyrights": [
            ],
            "file-count": 3,
            "sha256": "a9146e00ce8480a2405f8daf9357b941ac1fd0f3ce956979e42bf53b4383dd03",
            "source": "https://search.maven.org/remotecontent?filepath=org/bytedeco/javacpp-platform/1.5.8/javacpp-platform-1.5.8-sources.jar",
            "status": "restricted"
        }
    ]
}
