{
    "id": "npm/npmjs/@types/jest/29.2.6",
    "license": "MIT",
    "authority": "https://gitlab.eclipse.org/eclipsefdn/emo-team/iplab/-/issues/6932",
    "source": "https://registry.npmjs.org/@types/jest/-/jest-29.2.6.tgz",
    "status": "approved",
    "scans": [
        {
            "date": "February 2, 2023 at 5:51:37 p.m. GMT",
            "authority": "https://gitlab.eclipse.org/eclipsefdn/emo-team/iplab/-/issues/6932",
            "scancode-version": "31.2.1",
            "licenses-discovered": [
                "MIT"
            ],
            "copyrights": [
                "Copyright (c) Microsoft Corporation"
            ],
            "file-count": 4,
            "sha256": "1731ab413e3dc40f928d9d1a18fc22333aafd655c69d0af093d73651d63d655f",
            "source": "https://registry.npmjs.org/@types/jest/-/jest-29.2.6.tgz",
            "status": "approved"
        }
    ]
}