{
    "id": "go/golang/cloud.google.com/go/v0.78.0",
    "license": "Apache-2.0 AND (Apache-2.0 AND BSD-3-Clause) AND BSD-2-Clause AND BSD-3-Clause",
    "authority": "https://gitlab.eclipse.org/eclipsefdn/emo-team/iplab/-/issues/6111",
    "source": "https://proxy.golang.org/cloud.google.com/go/@v/v0.78.0.zip",
    "status": "approved",
    "scans": [
        {
            "date": "January 5, 2023 at 11:42:55 p.m. GMT",
            "authority": "https://gitlab.eclipse.org/eclipsefdn/emo-team/iplab/-/issues/6111",
            "scancode-version": "31.2.1",
            "licenses-discovered": [
                "Apache-2.0",
                "Apache-2.0 AND BSD-3-Clause",
                "BSD-2-Clause",
                "BSD-3-Clause"
            ],
            "copyrights": [
                "Copyright (c) 1996-1998 John D. Polstra",
                "Copyright (c) 2001 David E. O'Brien",
                "Copyright (c) 2020 The Go Authors",
                "Copyright 2014 Google LLC",
                "Copyright 2016 Google LLC",
                "Copyright 2017 Google LLC",
                "Copyright 2017 The Go Authors",
                "Copyright 2017, Google LLC",
                "Copyright 2018 Google Inc.",
                "Copyright 2018 Google LLC",
                "Copyright 2019 Google LLC",
                "Copyright 2020 Google Inc.",
                "Copyright 2020 Google LLC",
                "Copyright 2020 The Go Authors",
                "Copyright 2020, Google LLC",
                "Copyright 2021 Google LLC",
                "Portions Copyright 2018 Google LLC."
            ],
            "file-count": 894,
            "sha256": "dd1abc963a0e5dc3eb4a5bb8876eb886e3aa0ea83bb350a783a0780e80ae303b",
            "source": "https://proxy.golang.org/cloud.google.com/go/@v/v0.78.0.zip",
            "status": "approved"
        }
    ]
}