{
    "id": "npm/npmjs/-/vue3-json-viewer/2.2.2",
    "license": "MIT AND ISC",
    "authority": "https://gitlab.eclipse.org/eclipsefdn/emo-team/iplab/-/issues/12936",
    "source": "https://github.com/qiuquanwu/vue3-json-viewer/archive/refs/tags/正式版.zip",
    "status": "approved",
    "scans": [
        {
            "date": "January 29, 2024 at 12:48:49 p.m. GMT",
            "authority": "https://gitlab.eclipse.org/eclipsefdn/emo-team/iplab/-/issues/12936",
            "scancode-version": "31.2.1",
            "licenses-discovered": [
                "MIT",
                "ISC"
            ],
            "copyrights": [
                "Copyright (c) 2020 isfive"
            ],
            "file-count": 30,
            "sha256": "9d948c1cf4a27729f87e5c8e6e60a651fcee98eb82343673a6f65938ba03a833",
            "source": "https://github.com/qiuquanwu/vue3-json-viewer/archive/refs/tags/正式版.zip",
            "status": "approved"
        }
    ]
}