{
    "id": "maven/mavencentral/io.grpc/grpc-stub/1.61.1",
    "license": "Apache-2.0",
    "authority": "https://gitlab.eclipse.org/eclipsefdn/emo-team/iplab/-/issues/13398",
    "source": "https://repo1.maven.org/maven2/io/grpc/grpc-stub/1.61.1/grpc-stub-1.61.1-sources.jar",
    "status": "approved",
    "scans": [
        {
            "date": "February 26, 2024 at 9:58:54 a.m. GMT",
            "authority": "https://gitlab.eclipse.org/eclipsefdn/emo-team/iplab/-/issues/13398",
            "scancode-version": "31.2.1",
            "licenses-discovered": [
                "Apache-2.0"
            ],
            "copyrights": [
                "Copyright 2014 The gRPC",
                "Copyright 2015 The gRPC",
                "Copyright 2016 The gRPC",
                "Copyright 2017 The gRPC",
                "Copyright 2018 The gRPC",
                "Copyright 2019 The gRPC",
                "Copyright 2021 The gRPC"
            ],
            "file-count": 18,
            "sha256": "d3fb47ebc8bdce446cea2277182a04f5100a5bd5c965b451e1886a4f80fe41be",
            "source": "https://repo1.maven.org/maven2/io/grpc/grpc-stub/1.61.1/grpc-stub-1.61.1-sources.jar",
            "status": "approved"
        }
    ]
}