{
    "id": "project/automotive.tractusx/-/dft-frontend/2.0.0",
    "license": "Apache-2.0",
    "authority": "https://gitlab.eclipse.org/eclipsefdn/emo-team/iplab/-/issues/8446",
    "source": "https://github.com/eclipse-tractusx/dft-frontend/pull/10/files",
    "status": "approved",
    "scans": [
        {
            "date": "May 12, 2023 at 2:19:47 p.m. GMT",
            "authority": "https://gitlab.eclipse.org/eclipsefdn/emo-team/iplab/-/issues/8446",
            "scancode-version": "31.2.1",
            "licenses-discovered": [
                "Apache-2.0 AND BSD-2-Clause AND BSD-3-Clause AND CC0-1.0 AND LicenseRef-scancode-unknown"
            ],
            "copyrights": [
                "(c) 2023 GitHub, Inc.",
                "Copyright (c) 2021, 2022, 2023 T-Systems International GmbH",
                "Copyright (c) 2021,2022,2023 Contributors"
            ],
            "file-count": 1,
            "sha256": "b3e5d2ff43db06724bc982d3a36bf43b9ab4d71a42acae0795edb19c4d72b738",
            "source": "https://github.com/eclipse-tractusx/dft-frontend/pull/10/files",
            "status": "restricted"
        }
    ]
}
