{
    "id": "maven/mavencentral/org.jsoup/jsoup/1.14.3",
    "license": "MIT",
    "licenses-discovered": [
        "MIT",
        "Apache-2.0 AND GPL-1.0-or-later AND MIT"
    ],
    "file-count": 75,
    "scancode-version": "30.1.0",
    "authority": "https://gitlab.eclipse.org/eclipsefdn/emo-team/iplab/-/issues/2511",
    "source": "https://search.maven.org/remotecontent?filepath=org/jsoup/jsoup/1.14.3/jsoup-1.14.3-sources.jar",
    "status": "approved"
}
