{
    "id": "maven/mavencentral/org.apache.lucene/lucene-misc/8.9.0",
    "license": "Apache-2.0",
    "authority": "https://gitlab.eclipse.org/eclipsefdn/emo-team/iplab/-/issues/6157",
    "source": "https://search.maven.org/remotecontent?filepath=org/apache/lucene/lucene-misc/8.9.0/lucene-misc-8.9.0-sources.jar",
    "status": "approved",
    "scans": [
        {
            "date": "January 6, 2023 at 10:01:05 p.m. GMT",
            "authority": "https://gitlab.eclipse.org/eclipsefdn/emo-team/iplab/-/issues/6157",
            "scancode-version": "31.2.1",
            "licenses-discovered": [
                "Apache-2.0"
            ],
            "copyrights": [
            ],
            "file-count": 44,
            "sha256": "047071623dc3ed0d97b589af2ac01743bc49a45bc80fe6b9e127d4bed245c3c7",
            "source": "https://search.maven.org/remotecontent?filepath=org/apache/lucene/lucene-misc/8.9.0/lucene-misc-8.9.0-sources.jar",
            "status": "approved"
        }
    ]
}