{
    "id": "maven/mavencentral/com.softwaremill.quicklens/quicklens_2.13/1.9.3",
    "license": "Apache-2.0",
    "authority": "https://gitlab.eclipse.org/eclipsefdn/emo-team/iplab/-/issues/9635",
    "source": "https://repo.maven.apache.org/maven2/com/softwaremill/quicklens/quicklens_2.13/1.9.3/quicklens_2.13-1.9.3-sources.jar",
    "status": "approved",
    "scans": [
        {
            "date": "July 19, 2023 at 12:57:56 p.m. GMT",
            "authority": "https://gitlab.eclipse.org/eclipsefdn/emo-team/iplab/-/issues/9635",
            "scancode-version": "31.2.1",
            "licenses-discovered": [
            ],
            "copyrights": [
            ],
            "file-count": 3,
            "sha256": "9f46ad0a1abe40f0c6444abd3d169a19919af345867a8e9a0317fad83a9ccd31",
            "source": "https://repo.maven.apache.org/maven2/com/softwaremill/quicklens/quicklens_2.13/1.9.3/quicklens_2.13-1.9.3-sources.jar",
            "status": "restricted"
        }
    ]
}
