{
    "id": "git/github/microsoft/vscode-js-debug/v1.70.0",
    "license": "MIT",
    "authority": "https://gitlab.eclipse.org/eclipsefdn/emo-team/iplab/-/issues/7309",
    "source": "https://github.com/microsoft/vscode-js-debug/archive/refs/tags/v1.70.0.zip",
    "status": "approved",
    "scans": [
        {
            "date": "March 2, 2023 at 3:57:11 p.m. GMT",
            "authority": "https://gitlab.eclipse.org/eclipsefdn/emo-team/iplab/-/issues/7309",
            "scancode-version": "31.2.1",
            "licenses-discovered": [
                "MIT"
            ],
            "copyrights": [
                "(c) 2014-2019 Evan",
                "Copyright (c) 2015-2020 Max Woolf",
                "Copyright (c) Lutz Roeder",
                "Copyright (c) Microsoft",
                "Copyright (c) Microsoft Corporation",
                "Copyright Microsoft Corporation",
                "copyright (c) 2020 Denis Pushkarev"
            ],
            "file-count": 848,
            "sha256": "b8684d11b056452add91072c2e895e97fc2c6a0161834cdcbd925790bbfa37d8",
            "source": "https://github.com/microsoft/vscode-js-debug/archive/refs/tags/v1.70.0.zip",
            "status": "approved"
        }
    ]
}