{
    "id": "maven/mavencentral/io.smallrye.common/smallrye-common-constraint/2.9.0",
    "license": "Apache-2.0",
    "authority": "https://gitlab.eclipse.org/eclipsefdn/emo-team/iplab/-/issues/17878",
    "source": "https://repo1.maven.org/maven2/io/smallrye/common/smallrye-common-constraint/2.9.0/smallrye-common-constraint-2.9.0-sources.jar",
    "status": "approved",
    "scans": [
        {
            "date": "December 13, 2024 at 1:26:31 p.m. GMT",
            "authority": "https://gitlab.eclipse.org/eclipsefdn/emo-team/iplab/-/issues/17878",
            "scancode-version": "31.2.1",
            "licenses-discovered": [
            ],
            "copyrights": [
            ],
            "file-count": 9,
            "sha256": "da7f1a7f455da82b661938e8e5110d9966c1cfa1bbd4637d760869c82400c2d6",
            "source": "https://repo1.maven.org/maven2/io/smallrye/common/smallrye-common-constraint/2.9.0/smallrye-common-constraint-2.9.0-sources.jar",
            "status": "restricted"
        }
    ]
}