{
    "id": "go/golang/github.com%2Fgolang/mock/v1.4.0",
    "license": "Apache-2.0",
    "authority": "https://gitlab.eclipse.org/eclipsefdn/emo-team/iplab/-/issues/5738",
    "source": "https://proxy.golang.org/github.com%2Fgolang/mock/@v/v1.4.0.zip",
    "status": "approved",
    "scans": [
        {
            "date": "December 13, 2022 at 1:34:07 p.m. GMT",
            "authority": "https://gitlab.eclipse.org/eclipsefdn/emo-team/iplab/-/issues/5738",
            "scancode-version": "31.2.1",
            "licenses-discovered": [
                "Apache-2.0"
            ],
            "copyrights": [
                "Copyright 2010 Google Inc.",
                "Copyright 2011 Google Inc.",
                "Copyright 2012 Google Inc.",
                "Copyright 2019 Google LLC",
                "Copyright 2020 Google Inc."
            ],
            "file-count": 97,
            "sha256": "87ead41d6c15a2f0d77a4730c5695cead63904ca16be24bd9600aad5825f2665",
            "source": "https://proxy.golang.org/github.com%2Fgolang/mock/@v/v1.4.0.zip",
            "status": "approved"
        }
    ]
}