{
    "id": "maven/mavencentral/org.springframework.boot/spring-boot-starter-jetty/1.5.17.RELEASE",
    "license": "Apache-2.0",
    "licenses-discovered": [
    ],
    "file-count": 2,
    "scancode-version": "30.1.0",
    "authority": "https://gitlab.eclipse.org/eclipsefdn/emo-team/iplab/-/issues/2309",
    "source": "https://search.maven.org/remotecontent?filepath=org/springframework/boot/spring-boot-starter-jetty/1.5.17.RELEASE/spring-boot-starter-jetty-1.5.17.RELEASE-sources.jar",
    "status": "approved"
}
