{
    "id": "maven/mavencentral/org.gradle/gradle-antlr/7.6.2",
    "license": "Apache-2.0 AND BSD-3-Clause AND CDDL-1.0 AND EPL-1.0 AND EPL-2.0 AND LGPL-2.1-only AND LicenseRef-scancode-mit-old-style AND MIT AND MPL-2.0 AND Apache-2.0 AND MIT AND (Apache-2.0 AND MIT) AND (GPL-2.0-only WITH Classpath-exception-2.0) AND (GPL-3.0-only AND MIT AND Zlib) AND (GPL-3.0-only AND MIT) AND (Apache-2.0 AND CC-BY-SA-4.0 AND MIT) AND (Apache-2.0 AND CC-BY-NC-SA-4.0 AND MIT) AND (Apache-2.0 AND SAX-PD AND W3C) AND BSD-3-Clause AND (Apache-2.0 AND BSD-3-Clause) AND (ANTLR-PD-fallback AND BSD-3-Clause AND GPL-3.0-or-later) AND (Apache-2.0 AND CC-BY-2.5) AND (Apache-2.0 AND LGPL-3.0-only) AND LGPL-2.1-only AND (Apache-2.0 OR LGPL-2.1-only) AND EPL-1.0 AND BSD-2-Clause AND Classpath-exception-2.0 AND (GPL-2.0-only AND MIT) AND MPL-2.0 AND (Apache-2.0 AND BSD-3-Clause AND MIT) AND (Apache-2.0 AND GPL-1.0-or-later) AND EPL-2.0 AND (BSD-3-Clause AND MIT) AND LicenseRef-scancode-indiana-extreme AND LicenseRef-scancode-w3c-docs-20021231 AND (W3C AND W3C-19980720) AND SAX-PD AND (LicenseRef-scancode-unknown AND W3C) AND (Apache-2.0 AND EPL-1.0)",
    "authority": "https://gitlab.eclipse.org/eclipsefdn/emo-team/iplab/-/issues/9839",
    "source": "https://services.gradle.org/distributions/gradle-7.6.2-all.zip",
    "status": "restricted",
    "scans": [
        {
            "date": "August 3, 2023 at 2:30:06 p.m. GMT",
            "authority": "https://gitlab.eclipse.org/eclipsefdn/emo-team/iplab/-/issues/9839",
            "scancode-version": "31.2.1",
            "licenses-discovered": [
                "Apache-2.0 AND BSD-3-Clause AND CDDL-1.0 AND EPL-1.0 AND EPL-2.0 AND LGPL-2.1-only AND LicenseRef-scancode-mit-old-style AND MIT AND MPL-2.0",
                "Apache-2.0",
                "MIT",
                "Apache-2.0 AND MIT",
                "GPL-2.0-only WITH Classpath-exception-2.0",
                "GPL-3.0-only AND MIT AND Zlib",
                "GPL-3.0-only AND MIT",
                "Apache-2.0 AND CC-BY-SA-4.0 AND MIT",
                "Apache-2.0 AND CC-BY-NC-SA-4.0 AND MIT",
                "Apache-2.0 AND SAX-PD AND W3C",
                "BSD-3-Clause",
                "Apache-2.0 AND BSD-3-Clause",
                "ANTLR-PD-fallback AND BSD-3-Clause AND GPL-3.0-or-later",
                "Apache-2.0 AND CC-BY-2.5",
                "Apache-2.0 AND LGPL-3.0-only",
                "LGPL-2.1-only",
                "Apache-2.0 OR LGPL-2.1-only",
                "EPL-1.0",
                "BSD-2-Clause",
                "Classpath-exception-2.0",
                "GPL-2.0-only AND MIT",
                "MPL-2.0",
                "Apache-2.0 AND BSD-3-Clause AND MIT",
                "Apache-2.0 AND GPL-1.0-or-later",
                "EPL-2.0",
                "BSD-3-Clause AND MIT",
                "LicenseRef-scancode-indiana-extreme",
                "LicenseRef-scancode-w3c-docs-20021231",
                "W3C AND W3C-19980720",
                "SAX-PD",
                "LicenseRef-scancode-unknown AND W3C",
                "Apache-2.0 AND EPL-1.0"
            ],
            "copyrights": [
                "(c) 1995-2013 Jean-loup Gailly and Mark Adler",
                "(c) 1998 VeriSign, Inc.",
                "(c) 1999 Entrust.net Limited1301 Entrust.net Certification",
                "(c) 1999 Entrust.net Limited1:08 1Entrust.net Secure Server Certification",
                "(c) 1999 VeriSign, Inc.",
                "(c) 2006 Entrust",
                "(c) 2006 VeriSign, Inc.",
                "(c) 2006 thawte, Inc.",
                "(c) 2007 GeoTrust Inc.",
                "(c) 2007 VeriSign, Inc.",
                "(c) 2007 thawte, Inc.",
                "(c) 2008 GeoTrust Inc.",
                "(c) 2008 VeriSign, Inc.",
                "(c) 2008 thawte, Inc.",
                "(c) 2009-2016 Stuart Knightley",
                "(c) 2014 - 2019 YOOtheme",
                "(c) 2014 Stuart Knightley, David Duponchel",
                "(c) 2014-2017 Vitaly Puzrin and Andrey Tupitsin",
                "(c) JS Foundation and other contributors",
                "(c) OpenJS Foundation and other contributors",
                "(c) https://gradle.com' Gradle Inc. 2021",
                "(c) https://gradle.com' Gradle Inc. 2022",
                "(https://dotty.epfl.ch) Copyright 2012-2020 EPFL",
                "Copyright (c) 1991, 1999 Free Software Foundation, Inc.",
                "Copyright (c) 1997, 2020 Oracle and/or its affiliates",
                "Copyright (c) 1999 CERN - European Organization for Nuclear Research",
                "Copyright (c) 2000 - 2019 The Legion of the Bouncy Castle Inc. (https://www.bouncycastle.org)",
                "Copyright (c) 2000-2006, www.hamcrest.org",
                "Copyright (c) 2000-2011 INRIA, France Telecom",
                "Copyright (c) 2000-2011 ymnk, JCraft,Inc.",
                "Copyright (c) 2000-2015 www.hamcrest.org",
                "Copyright (c) 2000-2021 The Legion of the Bouncy Castle Inc. (https://www.bouncycastle.org)",
                "Copyright (c) 2001, Eric D. Friedman",
                "Copyright (c) 2001-2003, ThoughtWorks, Inc. 651 W Washington Ave. Suite 500 Chicago, IL 60661 USA",
                "Copyright (c) 2002 Extreme! Lab, Indiana University",
                "Copyright (c) 2002,2003,2004,2005,2006,2007 Atsuhiko Yamanaka, JCraft,Inc.",
                "Copyright (c) 2002-2016, the original author or authors",
                "Copyright (c) 2002-2020 Sebastiano Vigna",
                "Copyright (c) 2003, 2020 Oracle and/or its affiliates",
                "Copyright (c) 2004 World Wide Web Consortium, (Massachusetts Institute of Technology, European Research Consortium for Informatics and Mathematics, Keio University)",
                "Copyright (c) 2004-2017 QOS.ch",
                "Copyright (c) 2005, 2018 Oracle and/or its affiliates",
                "Copyright (c) 2005, 2019 Oracle and/or its affiliates",
                "Copyright (c) 2005, 2020 Oracle and/or its affiliates",
                "Copyright (c) 2006, Javolution (http://javolution.org)",
                "Copyright (c) 2007 John Resig, http://jquery.com",
                "Copyright (c) 2007 build.year Amazon.com",
                "Copyright (c) 2007, Eclipse Foundation, Inc.",
                "Copyright (c) 2007- Amazon.com",
                "Copyright (c) 2007-2019 Gradle, Inc.",
                "Copyright (c) 2008, Imran M Yousuf <imyousuf@smartitengineering.com>",
                "Copyright (c) 2008-2018, Nathan Sweet",
                "Copyright (c) 2009, 2020 Oracle and/or its affiliates",
                "Copyright (c) 2009, Google Inc.",
                "Copyright (c) 2009, Igor Fedorenko <igor@ifedorenko.com>",
                "Copyright (c) 2009-2011 FuseSource Corp. http://fusesource.com",
                "Copyright (c) 2009-2017 the original",
                "Copyright (c) 2009-2022 Jonathan Hedley <https://jsoup.org/>",
                "Copyright (c) 2010 Ivan Bozhanov (vakata.com)",
                "Copyright (c) 2010, Matthias Sohn <matthias.sohn@sap.com> and others",
                "Copyright (c) 2012 The ANTLR Project",
                "Copyright (c) 2012-2017 The ANTLR Project",
                "Copyright (c) 2013, 2018, Oracle and/or its affiliates",
                "Copyright (c) 2013, 2020 Oracle and/or its affiliates",
                "Copyright (c) 2014, 2020 Oracle and/or its affiliates",
                "Copyright (c) 2015, 2018, Oracle and/or its affiliates",
                "Copyright (c) 2015-2021 the original",
                "Copyright (c) 2016 Daniel Dreibrodt",
                "Copyright (c) 2017",
                "Copyright (c) 2017, 2018 Oracle and/or its affiliates",
                "Copyright (c) 2018 Oracle and/or its affiliates",
                "Copyright (c) 2018, 2019 Oracle and/or its affiliates",
                "Copyright (c) 2018, 2020 Oracle and/or its affiliates",
                "Copyright (c) 2019, 2020 Eclipse Foundation",
                "Copyright (c) 2020 Oracle and/or its affiliates",
                "Copyright (c) 2020, 2022, Oracle and/or its affiliates",
                "Copyright (c) World Wide Web Consortium, (Massachusetts Institute of Technology, European Research Consortium for Informatics and Mathematics, Keio University)",
                "Copyright 2000-2018 JetBrains s.r.o.",
                "Copyright 2003-2012 the original author or authors",
                "Copyright 2007 the original author or authors",
                "Copyright 2007-2008 the original author or authors",
                "Copyright 2007-2009 the original author or authors",
                "Copyright 2007-2014 the original author or authors",
                "Copyright 2008 the original author or authors",
                "Copyright 2008-2018 Timothy Wall",
                "Copyright 2009 the original author or authors",
                "Copyright 2010 the original author or authors",
                "Copyright 2011 the original author or authors",
                "Copyright 2012 the original author or authors",
                "Copyright 2012-2020 Lightbend, Inc",
                "Copyright 2013 the original author or authors",
                "Copyright 2013, Red Hat, Inc. and/or its subsidiaries or affiliates",
                "Copyright 2014 the original author or authors",
                "Copyright 2015 the original author or authors",
                "Copyright 2016 the original author or authors",
                "Copyright 2017 the original author or authors",
                "Copyright 2018 the original author or authors",
                "Copyright 2019 the original author or authors",
                "Copyright 2020 the original author or authors",
                "Copyright 2021 the original author or authors",
                "Copyright 2022 the original author or authors",
                "Copyright 2023 the original author or authors",
                "Copyright JS Foundation and other contributors",
                "Copyright Jeremy Rayner 2007",
                "Copyright The Codehaus Foundation",
                "Copyright jQuery Foundation and other contributors",
                "Nekorrektno (c) Stas",
                "copyright 2009', version 2.3.1",
                "copyright xmlns:xslthl http://xslthl.sf.net",
                "copyrighted by the Free Software Foundation"
            ],
            "file-count": 89461,
            "sha256": "5861dcc093556fef71cdde8cbae9887be70a8bf40e0f5856b61181ae92dccf33",
            "source": "https://services.gradle.org/distributions/gradle-7.6.2-all.zip",
            "status": "restricted"
        }
    ]
}