{
    "id": "npm/npmjs/@mui/x-license-pro/5.17.0",
    "license": "MIT",
    "licenses-discovered": [
        "MIT"
    ],
    "copyrights": [
        "Copyright (c) Material-UI SAS"
    ],
    "file-count": 93,
    "scancode-version": "30.1.0",
    "authority": "https://gitlab.eclipse.org/eclipsefdn/emo-team/iplab/-/issues/3494",
    "source": "https://registry.npmjs.org/@mui/x-license-pro/-/x-license-pro-5.17.0.tgz",
    "status": "approved"
}