{
    "id": "npm/npmjs/@storybook/addon-measure/7.0.21",
    "license": "MIT",
    "authority": "https://gitlab.eclipse.org/eclipsefdn/emo-team/iplab/-/issues/9050",
    "source": "https://registry.npmjs.org/@storybook/addon-measure/-/addon-measure-7.0.21.tgz",
    "status": "approved",
    "scans": [
        {
            "date": "June 15, 2023 at 4:38:31 p.m. GMT",
            "authority": "https://gitlab.eclipse.org/eclipsefdn/emo-team/iplab/-/issues/9050",
            "scancode-version": "31.2.1",
            "licenses-discovered": [
                "MIT"
            ],
            "copyrights": [
            ],
            "file-count": 16,
            "sha256": "ad7e36f475a2fb0bf87e73e096ef2fff7bbee87f6e2728cf7d6e69f4cce503b1",
            "source": "https://registry.npmjs.org/@storybook/addon-measure/-/addon-measure-7.0.21.tgz",
            "status": "approved"
        }
    ]
}