{
    "id": "maven/mavencentral/io.micrometer/micrometer-core/1.12.0",
    "license": "Apache-2.0 AND (Apache-2.0 AND MIT)",
    "authority": "https://gitlab.eclipse.org/eclipsefdn/emo-team/iplab/-/issues/11678",
    "source": "https://repo1.maven.org/maven2/io/micrometer/micrometer-core/1.12.0/micrometer-core-1.12.0-sources.jar",
    "status": "approved",
    "scans": [
        {
            "date": "November 23, 2023 at 6:55:16 a.m. GMT",
            "authority": "https://gitlab.eclipse.org/eclipsefdn/emo-team/iplab/-/issues/11678",
            "scancode-version": "31.2.1",
            "licenses-discovered": [
                "Apache-2.0",
                "Apache-2.0 AND MIT"
            ],
            "copyrights": [
                "Copyright (c) 2004-2011 QOS.ch",
                "Copyright 2002-2017 the original author or authors",
                "Copyright 2010 Google Inc.",
                "Copyright 2012 The Netty Project",
                "Copyright 2012-2019 the original author or authors",
                "Copyright 2013 The Netty Project",
                "Copyright 2013-2022 the original author or authors",
                "Copyright 2017 The Netty Project",
                "Copyright 2017 VMware, Inc.",
                "Copyright 2017-2021 VMware, Inc.",
                "Copyright 2018 VMware, Inc.",
                "Copyright 2019 VMware, Inc.",
                "Copyright 2020 VMware, Inc.",
                "Copyright 2021 VMware, Inc.",
                "Copyright 2022 VMware, Inc.",
                "Copyright 2022 the original author or authors",
                "Copyright 2023 VMware, Inc.",
                "Copyright 2023 the original author or authors"
            ],
            "file-count": 351,
            "sha256": "31f603cc77d60d071136998ef5944dce625a79f346ef69c150d2ad930d00037a",
            "source": "https://repo1.maven.org/maven2/io/micrometer/micrometer-core/1.12.0/micrometer-core-1.12.0-sources.jar",
            "status": "approved"
        }
    ]
}