{
    "id": "maven/mavencentral/org.apache.lucene/lucene-queries/9.7.0",
    "license": "Apache-2.0",
    "authority": "https://gitlab.eclipse.org/eclipsefdn/emo-team/iplab/-/issues/10010",
    "source": "https://repo.maven.apache.org/maven2/org/apache/lucene/lucene-queries/9.7.0/lucene-queries-9.7.0-sources.jar",
    "status": "approved",
    "scans": [
        {
            "date": "August 10, 2023 at 9:38:37 a.m. GMT",
            "authority": "https://gitlab.eclipse.org/eclipsefdn/emo-team/iplab/-/issues/10010",
            "scancode-version": "31.2.1",
            "licenses-discovered": [
                "Apache-2.0"
            ],
            "copyrights": [
            ],
            "file-count": 166,
            "sha256": "b744b3fc3c99c1dee473bfabd876c89e2fb4b21f5ee28498b29b2fb11f41c53a",
            "source": "https://repo.maven.apache.org/maven2/org/apache/lucene/lucene-queries/9.7.0/lucene-queries-9.7.0-sources.jar",
            "status": "approved"
        }
    ]
}