{
    "id": "p2/orbit/p2.eclipse-plugin/org.apache.maven.plugins.maven-dependency-plugin/3.0.1",
    "license": "Apache-2.0",
    "licenses-discovered": [
        "Apache-2.0"
    ],
    "file-count": 59,
    "scancode-version": "30.1.0",
    "authority": "https://gitlab.eclipse.org/eclipsefdn/emo-team/iplab/-/issues/2192",
    "source": "https://search.maven.org/remotecontent?filepath=org/apache/maven/plugins/maven-dependency-plugin/3.0.1/maven-dependency-plugin-3.0.1-sources.jar",
    "status": "approved"
}