{
    "id": "maven/mavencentral/com.azure.resourcemanager/azure-resourcemanager-msi/2.39.0",
    "license": "MIT",
    "authority": "https://gitlab.eclipse.org/eclipsefdn/emo-team/iplab/-/issues/15093",
    "source": "https://repo1.maven.org/maven2/com/azure/resourcemanager/azure-resourcemanager-msi/2.39.0/azure-resourcemanager-msi-2.39.0-sources.jar",
    "status": "approved",
    "scans": [
        {
            "date": "June 6, 2024 at 10:58:50 a.m. GMT",
            "authority": "https://gitlab.eclipse.org/eclipsefdn/emo-team/iplab/-/issues/15093",
            "scancode-version": "31.2.1",
            "licenses-discovered": [
                "MIT"
            ],
            "copyrights": [
                "(c) 2008 VeriSign, Inc.",
                "Copyright (c) Microsoft Corporation"
            ],
            "file-count": 40,
            "sha256": "363cf9f98d7f18ba4e30a17e721f18fc60883bffcd7716b1079a086a263f9388",
            "source": "https://repo1.maven.org/maven2/com/azure/resourcemanager/azure-resourcemanager-msi/2.39.0/azure-resourcemanager-msi-2.39.0-sources.jar",
            "status": "approved"
        }
    ]
}