{
    "id": "go/golang/github.com%2Fcilium/ebpf/v0.7.0",
    "license": "MIT AND BSD-3-Clause AND BSD-2-Clause AND (LGPL-2.1-only OR BSD-2-Clause)",
    "authority": "https://gitlab.eclipse.org/eclipsefdn/emo-team/iplab/-/issues/12224",
    "source": "https://proxy.golang.org/github.com%2Fcilium/ebpf/@v/v0.7.0.zip",
    "status": "approved",
    "scans": [
        {
            "date": "December 21, 2023 at 3:44:26 p.m. GMT",
            "authority": "https://gitlab.eclipse.org/eclipsefdn/emo-team/iplab/-/issues/12224",
            "scancode-version": "31.2.1",
            "licenses-discovered": [
                "MIT",
                "BSD-3-Clause AND GPL-1.0-or-later",
                "GPL-2.0-only AND MIT",
                "GPL-1.0-or-later AND MIT",
                "GPL-1.0-or-later",
                "BSD-2-Clause",
                "LGPL-2.1-only OR BSD-2-Clause",
                "LicenseRef-scancode-other-copyleft"
            ],
            "copyrights": [
                "Copyright (c) 2015-2017 Cloudflare, Inc.",
                "Copyright (c) 2017 Nathan Sweet",
                "Copyright (c) 2018, 2019 Cloudflare",
                "Copyright (c) 2019"
            ],
            "file-count": 200,
            "sha256": "8591e96d9be4780ce83da65ee7a346ccaa93901a160cc8afb47386fe341b1ddb",
            "source": "https://proxy.golang.org/github.com%2Fcilium/ebpf/@v/v0.7.0.zip",
            "status": "restricted"
        }
    ]
}
