{
    "id": "maven/mavencentral/io.quarkus/quarkus-oidc-common/3.17.4",
    "license": "Apache-2.0",
    "authority": "https://gitlab.eclipse.org/eclipsefdn/emo-team/iplab/-/issues/17918",
    "source": "https://repo1.maven.org/maven2/io/quarkus/quarkus-oidc-common/3.17.4/quarkus-oidc-common-3.17.4-sources.jar",
    "status": "approved",
    "scans": [
        {
            "date": "December 13, 2024 at 1:57:01 p.m. GMT",
            "authority": "https://gitlab.eclipse.org/eclipsefdn/emo-team/iplab/-/issues/17918",
            "scancode-version": "31.2.1",
            "licenses-discovered": [
            ],
            "copyrights": [
            ],
            "file-count": 19,
            "sha256": "b110037290b97dc47997f145852cf98737faee1b8adb8e62e28208a9ebd8758a",
            "source": "https://repo1.maven.org/maven2/io/quarkus/quarkus-oidc-common/3.17.4/quarkus-oidc-common-3.17.4-sources.jar",
            "status": "restricted"
        }
    ]
}