{
    "id": "npm/npmjs/-/vite-require/0.2.3",
    "license": "MIT",
    "authority": "https://gitlab.eclipse.org/eclipsefdn/emo-team/iplab/-/issues/7440",
    "source": "https://github.com/vite-plugin/vite-require/archive/v0.2.3.zip",
    "status": "approved",
    "scans": [
        {
            "date": "March 22, 2023 at 10:30:57 a.m. GMT",
            "authority": "https://gitlab.eclipse.org/eclipsefdn/emo-team/iplab/-/issues/7440",
            "scancode-version": "31.2.1",
            "licenses-discovered": [
                "MIT"
            ],
            "copyrights": [
                "Copyright (c) 2022 Vite"
            ],
            "file-count": 21,
            "sha256": "ed2f83a6cdb36d3dbdd4da3fde1b857a43b25bd950a9e153a342bd6f5cee4c59",
            "source": "https://github.com/vite-plugin/vite-require/archive/v0.2.3.zip",
            "status": "approved"
        }
    ]
}