{
    "id": "maven/mavencentral/org.activiti/activiti-spring-resource-loader/8.0.0",
    "license": "Apache-2.0",
    "authority": "https://gitlab.eclipse.org/eclipsefdn/emo-team/iplab/-/issues/12469",
    "source": "https://maven.alfresco.com/nexus/service/local/repositories/activiti-releases/content//org/activiti/activiti-spring-resource-loader/8.0.0/activiti-spring-resource-loader-8.0.0-sources.jar",
    "status": "approved",
    "scans": [
        {
            "date": "January 2, 2024 at 8:52:05 p.m. GMT",
            "authority": "https://gitlab.eclipse.org/eclipsefdn/emo-team/iplab/-/issues/12469",
            "scancode-version": "31.2.1",
            "licenses-discovered": [
                "Apache-2.0"
            ],
            "copyrights": [
                "Copyright 2010-2020 Alfresco Software, Ltd."
            ],
            "file-count": 4,
            "sha256": "f5a7f0994c89791a9d294cbe336ec9cd5a1e8a8b713ce1525272ee64ab828fb5",
            "source": "https://maven.alfresco.com/nexus/service/local/repositories/activiti-releases/content//org/activiti/activiti-spring-resource-loader/8.0.0/activiti-spring-resource-loader-8.0.0-sources.jar",
            "status": "approved"
        }
    ]
}