{
    "id": "maven/mavencentral/io.micrometer/micrometer-observation/1.13.0",
    "license": "Apache-2.0",
    "authority": "https://gitlab.eclipse.org/eclipsefdn/emo-team/iplab/-/issues/14829",
    "source": "https://repo1.maven.org/maven2/io/micrometer/micrometer-observation/1.13.0/micrometer-observation-1.13.0-sources.jar",
    "status": "approved",
    "scans": [
        {
            "date": "May 20, 2024 at 11:00:16 p.m. GMT",
            "authority": "https://gitlab.eclipse.org/eclipsefdn/emo-team/iplab/-/issues/14829",
            "scancode-version": "31.2.1",
            "licenses-discovered": [
                "Apache-2.0"
            ],
            "copyrights": [
                "Copyright 2002-2021 the original author or authors",
                "Copyright 2021 VMware, Inc.",
                "Copyright 2022 VMware, Inc.",
                "Copyright 2023 VMware, Inc."
            ],
            "file-count": 39,
            "sha256": "d35f0b2ac300f8754b1b4d7d33f0f59d03e8d7991442de1ffe81efd3c4fb7036",
            "source": "https://repo1.maven.org/maven2/io/micrometer/micrometer-observation/1.13.0/micrometer-observation-1.13.0-sources.jar",
            "status": "approved"
        }
    ]
}