{
    "id": "crate/cratesio/-/zenoh-link-unixsock_stream/1.2.1",
    "license": "Apache-2.0 AND EPL-2.0 AND (EPL-2.0 OR Apache-2.0)",
    "authority": "https://gitlab.eclipse.org/eclipsefdn/emo-team/iplab/-/issues/19425",
    "source": "https://crates.io/api/v1/crates/zenoh-link-unixsock_stream/1.2.1/download",
    "status": "approved",
    "scans": [
        {
            "date": "February 12, 2025 at 10:02:08 a.m. GMT",
            "authority": "https://gitlab.eclipse.org/eclipsefdn/emo-team/iplab/-/issues/19425",
            "scancode-version": "31.2.1",
            "licenses-discovered": [
                "Apache-2.0 AND EPL-2.0",
                "EPL-2.0 OR Apache-2.0"
            ],
            "copyrights": [
                "Copyright (c) 2023 ZettaScale Technology"
            ],
            "file-count": 6,
            "sha256": "6419e5d8a50d9fb993e855622c123043a8171a18a886b52c2dba1f18b72ab3dd",
            "source": "https://crates.io/api/v1/crates/zenoh-link-unixsock_stream/1.2.1/download",
            "status": "approved"
        }
    ]
}