{
    "id": "maven/mavencentral/com.google.auth/google-auth-library-oauth2-http/1.29.0",
    "license": "BSD-3-Clause",
    "authority": "https://gitlab.eclipse.org/eclipsefdn/emo-team/iplab/-/issues/16921",
    "source": "https://repo1.maven.org/maven2/com/google/auth/google-auth-library-oauth2-http/1.29.0/google-auth-library-oauth2-http-1.29.0-sources.jar",
    "status": "approved",
    "scans": [
        {
            "date": "October 28, 2024, 2:25:10 p.m. GMT",
            "authority": "https://gitlab.eclipse.org/eclipsefdn/emo-team/iplab/-/issues/16921",
            "scancode-version": "31.2.1",
            "licenses-discovered": [
                "BSD-3-Clause"
            ],
            "copyrights": [
                "Copyright 2015, Google Inc.",
                "Copyright 2016, Google Inc.",
                "Copyright 2017, Google Inc.",
                "Copyright 2018, Google Inc.",
                "Copyright 2019, Google Inc.",
                "Copyright 2019, Google LLC",
                "Copyright 2020, Google LLC",
                "Copyright 2021 Google LLC",
                "Copyright 2022 Google LLC",
                "Copyright 2022, Google Inc.",
                "Copyright 2023 Google LLC",
                "Copyright 2023, Google Inc.",
                "Copyright 2024 Google LLC"
            ],
            "file-count": 76,
            "sha256": "8334b209e7d1934850ee3370575c57ba274f965bbba7a92716580cae678a9275",
            "source": "https://repo1.maven.org/maven2/com/google/auth/google-auth-library-oauth2-http/1.29.0/google-auth-library-oauth2-http-1.29.0-sources.jar",
            "status": "approved"
        }
    ]
}