{
    "id": "maven/mavencentral/org.apache.sshd/sshd-osgi/2.9.1",
    "license": "Apache-2.0 AND ISC",
    "authority": "https://gitlab.eclipse.org/eclipsefdn/emo-team/iplab/-/issues/5967",
    "source": "https://search.maven.org/remotecontent?filepath=org/apache/sshd/sshd-osgi/2.9.1/sshd-osgi-2.9.1-sources.jar",
    "status": "approved",
    "scans": [
        {
            "date": "December 22, 2022 at 12:02:01 p.m. GMT",
            "authority": "https://gitlab.eclipse.org/eclipsefdn/emo-team/iplab/-/issues/5967",
            "scancode-version": "31.2.1",
            "licenses-discovered": [
                "Apache-2.0",
                "ISC"
            ],
            "copyrights": [
                "Copyright (c) 2006 Damien Miller <djm@mindrot.org>"
            ],
            "file-count": 735,
            "sha256": "5043c5400827ba69a8b55be747fb0d47d679a5fc9e16acabc368d17a40546627",
            "source": "https://search.maven.org/remotecontent?filepath=org/apache/sshd/sshd-osgi/2.9.1/sshd-osgi-2.9.1-sources.jar",
            "status": "approved"
        }
    ]
}