{
    "id": "maven/mavencentral/org.eclipse.dataspaceconnector/jersey/0.0.1-20220922.4-20230220.143048-1",
    "license": "Apache-2.0",
    "authority": "https://gitlab.eclipse.org/eclipsefdn/emo-team/iplab/-/issues/7654",
    "source": "https://search.maven.org/remotecontent?filepath=org/eclipse/dataspaceconnector/jersey/0.0.1-milestone-6/jersey-0.0.1-milestone-6-sources.jar",
    "status": "approved",
    "scans": [
        {
            "date": "March 28, 2023 at 9:41:58 p.m. GMT",
            "authority": "https://gitlab.eclipse.org/eclipsefdn/emo-team/iplab/-/issues/7654",
            "scancode-version": "31.2.1",
            "licenses-discovered": [
                "Apache-2.0"
            ],
            "copyrights": [
                "Copyright (c) 2020 - 2022 Microsoft Corporation",
                "Copyright (c) 2020, 2021 Microsoft Corporation",
                "Copyright (c) 2022 Bayerische Motoren Werke Aktiengesellschaft",
                "Copyright (c) 2022 Microsoft Corporation"
            ],
            "file-count": 13,
            "sha256": "ca1baab68073c8c9c1087329cd4afca1b6289d59b5d063a21e09ad98e93b7d3e",
            "source": "https://search.maven.org/remotecontent?filepath=org/eclipse/dataspaceconnector/jersey/0.0.1-milestone-6/jersey-0.0.1-milestone-6-sources.jar",
            "status": "approved"
        }
    ]
}