{
    "id": "npm/npmjs/-/rc-field-form/2.7.0",
    "license": "MIT",
    "authority": "https://gitlab.eclipse.org/eclipsefdn/emo-team/iplab/-/issues/18895",
    "source": "https://github.com/react-component/field-form/archive/refs/tags/v2.7.0.zip",
    "status": "approved",
    "scans": [
        {
            "date": "January 18, 2025 at 1:07:13 p.m. GMT",
            "authority": "https://gitlab.eclipse.org/eclipsefdn/emo-team/iplab/-/issues/18895",
            "scancode-version": "31.2.1",
            "licenses-discovered": [
                "MIT"
            ],
            "copyrights": [
                "Copyright (c) 2019-present react-component"
            ],
            "file-count": 109,
            "sha256": "8d58d5c4c41f2ed1618173876969898433c8d671d6d9ab8db7e4c323fd0981c3",
            "source": "https://github.com/react-component/field-form/archive/refs/tags/v2.7.0.zip",
            "status": "approved"
        }
    ]
}