{
    "id": "maven/mavencentral/com.vladsch.flexmark/flexmark-ext-gfm-users/0.64.8",
    "license": "BSD-2-Clause AND CC-BY-SA-4.0",
    "authority": "https://gitlab.eclipse.org/eclipsefdn/emo-team/iplab/-/issues/11331",
    "source": "https://repo.maven.apache.org/maven2/com/vladsch/flexmark/flexmark-ext-gfm-users/0.64.8/flexmark-ext-gfm-users-0.64.8-sources.jar",
    "status": "approved",
    "scans": [
        {
            "date": "October 26, 2023 at 7:13:00 p.m. GMT",
            "authority": "https://gitlab.eclipse.org/eclipsefdn/emo-team/iplab/-/issues/11331",
            "scancode-version": "31.2.1",
            "licenses-discovered": [
            ],
            "copyrights": [
            ],
            "file-count": 13,
            "sha256": "d41badad89ddae3d7908164f995109fed7031f2c4398fa6073b49878d7ff9f36",
            "source": "https://repo.maven.apache.org/maven2/com/vladsch/flexmark/flexmark-ext-gfm-users/0.64.8/flexmark-ext-gfm-users-0.64.8-sources.jar",
            "status": "restricted"
        }
    ]
}
