{
    "id": "go/golang/github.com%2Flithammer%2Fshortuuid/v3/v3.0.4",
    "license": "MIT",
    "authority": "https://gitlab.eclipse.org/eclipsefdn/emo-team/iplab/-/issues/12312",
    "source": "https://proxy.golang.org/github.com%2Flithammer%2Fshortuuid/v3/@v/v3.0.4.zip",
    "status": "approved",
    "scans": [
        {
            "date": "December 20, 2023 at 7:41:25 p.m. GMT",
            "authority": "https://gitlab.eclipse.org/eclipsefdn/emo-team/iplab/-/issues/12312",
            "scancode-version": "31.2.1",
            "licenses-discovered": [
                "MIT"
            ],
            "copyrights": [
                "Copyright (c) 2018 Peter Lithammer"
            ],
            "file-count": 10,
            "sha256": "bc0801144c9802bb47a26987b86ed86e87553175e82ed9dcb50752d576512e4b",
            "source": "https://proxy.golang.org/github.com%2Flithammer%2Fshortuuid/v3/@v/v3.0.4.zip",
            "status": "approved"
        }
    ]
}