{
    "id": "maven/mavencentral/org.apache.lucene/lucene-misc/9.7.0",
    "license": "Apache-2.0",
    "authority": "https://gitlab.eclipse.org/eclipsefdn/emo-team/iplab/-/issues/10013",
    "source": "https://repo.maven.apache.org/maven2/org/apache/lucene/lucene-misc/9.7.0/lucene-misc-9.7.0-sources.jar",
    "status": "approved",
    "scans": [
        {
            "date": "August 10, 2023 at 9:34:34 a.m. GMT",
            "authority": "https://gitlab.eclipse.org/eclipsefdn/emo-team/iplab/-/issues/10013",
            "scancode-version": "31.2.1",
            "licenses-discovered": [
                "Apache-2.0"
            ],
            "copyrights": [
            ],
            "file-count": 34,
            "sha256": "f6f56615fce9da352c5dddccad67c199ec87b0ad28ed504a07ebdbf5817f940c",
            "source": "https://repo.maven.apache.org/maven2/org/apache/lucene/lucene-misc/9.7.0/lucene-misc-9.7.0-sources.jar",
            "status": "approved"
        }
    ]
}