{
    "id": "npm/npmjs/@babel/plugin-proposal-decorators/7.22.5",
    "license": "MIT",
    "authority": "https://gitlab.eclipse.org/eclipsefdn/emo-team/iplab/-/issues/9148",
    "source": "https://registry.npmjs.org/@babel/plugin-proposal-decorators/-/plugin-proposal-decorators-7.22.5.tgz",
    "status": "approved",
    "scans": [
        {
            "date": "June 22, 2023 at 2:47:48 a.m. GMT",
            "authority": "https://gitlab.eclipse.org/eclipsefdn/emo-team/iplab/-/issues/9148",
            "scancode-version": "31.2.1",
            "licenses-discovered": [
                "MIT"
            ],
            "copyrights": [
                "Copyright (c) 2014-present Sebastian McKenzie and other contributors"
            ],
            "file-count": 9,
            "sha256": "988dbede131ab41ca3e63844ecc02fe1deb1db59ac24b425641618cd357724c6",
            "source": "https://registry.npmjs.org/@babel/plugin-proposal-decorators/-/plugin-proposal-decorators-7.22.5.tgz",
            "status": "approved"
        }
    ]
}