{
    "id": "npm/npmjs/-/regjsparser/0.11.2",
    "license": "BSD-2-Clause AND (BSD-2-Clause AND BSD-3-Clause)",
    "authority": "https://gitlab.eclipse.org/eclipsefdn/emo-team/iplab/-/issues/17033",
    "source": "https://registry.npmjs.org/regjsparser/-/regjsparser-0.11.2.tgz",
    "status": "approved",
    "scans": [
        {
            "date": "November 5, 2024, 10:37:14 a.m. GMT",
            "authority": "https://gitlab.eclipse.org/eclipsefdn/emo-team/iplab/-/issues/17033",
            "scancode-version": "31.2.1",
            "licenses-discovered": [
                "BSD-2-Clause",
                "BSD-2-Clause AND BSD-3-Clause"
            ],
            "copyrights": [
                "Copyright (c) Julian Viereck and Contributors"
            ],
            "file-count": 6,
            "sha256": "702eef53d72a1f8ffebc04715ece5f1e9207ba9090bb84f22a923a0967be183f",
            "source": "https://registry.npmjs.org/regjsparser/-/regjsparser-0.11.2.tgz",
            "status": "approved"
        }
    ]
}