{
    "id": "go/golang/github.com%2Fhashicorp/serf/v0.9.5",
    "license": "MPL-2.0 AND LicenseRef-scancode-proprietary-license",
    "authority": "https://gitlab.eclipse.org/eclipsefdn/emo-team/iplab/-/issues/12513",
    "source": "https://proxy.golang.org/github.com%2Fhashicorp/serf/@v/v0.9.5.zip",
    "status": "approved",
    "scans": [
        {
            "date": "December 26, 2023 at 6:46:28 a.m. GMT",
            "authority": "https://gitlab.eclipse.org/eclipsefdn/emo-team/iplab/-/issues/12513",
            "scancode-version": "31.2.1",
            "licenses-discovered": [
                "MPL-2.0",
                "LicenseRef-scancode-proprietary-license"
            ],
            "copyrights": [
                "(c) 2009-2013 Torstein Honsi",
                "Copyright Hashicorp 2013"
            ],
            "file-count": 256,
            "sha256": "b26c9916768043e9480615b4032f9f7d18ee2cdad6a7f75436570610df30fadf",
            "source": "https://proxy.golang.org/github.com%2Fhashicorp/serf/@v/v0.9.5.zip",
            "status": "restricted"
        }
    ]
}
