{
    "id": "-/sourceforge/lpg/lpg-java-runtime/2.0.17",
    "license": "EPL-1.0",
    "authority": "https://gitlab.eclipse.org/eclipsefdn/emo-team/iplab/-/issues/11250",
    "source": "https://sourceforge.net/projects/lpg/files/LPG/v2.0.17/lpg-java-runtime-src-2.0.17.zip/download",
    "status": "approved",
    "scans": [
        {
            "date": "October 26, 2023 at 5:20:34 p.m. GMT",
            "authority": "https://gitlab.eclipse.org/eclipsefdn/emo-team/iplab/-/issues/11250",
            "scancode-version": "31.2.1",
            "licenses-discovered": [
                "EPL-1.0"
            ],
            "copyrights": [
            ],
            "file-count": 61,
            "sha256": "734b3a84a4ae750817bd59e1b8ab68a464f40c8041bc9986798614d4d4380aa8",
            "source": "https://sourceforge.net/projects/lpg/files/LPG/v2.0.17/lpg-java-runtime-src-2.0.17.zip/download",
            "status": "approved"
        }
    ]
}