{
    "id": "npm/npmjs/@types/node/14.18.33",
    "license": "MIT",
    "licenses-discovered": [
        "MIT"
    ],
    "copyrights": [
        "Copyright (c) Microsoft Corporation"
    ],
    "file-count": 91,
    "scancode-version": "31.2.1",
    "authority": "https://gitlab.eclipse.org/eclipsefdn/emo-team/iplab/-/issues/4611",
    "source": "https://registry.npmjs.org/@types/node/-/node-14.18.33.tgz",
    "status": "approved"
}