{
    "id": "nuget/nuget/-/EFCore.NamingConventions/8.0.3",
    "license": "Apache-2.0",
    "authority": "https://gitlab.eclipse.org/eclipsefdn/emo-team/iplab/-/issues/13983",
    "source": "https://github.com/efcore/EFCore.NamingConventions/archive/refs/tags/v8.0.3.zip",
    "status": "approved",
    "scans": [
        {
            "date": "March 21, 2024 at 5:01:14 p.m. GMT",
            "authority": "https://gitlab.eclipse.org/eclipsefdn/emo-team/iplab/-/issues/13983",
            "scancode-version": "31.2.1",
            "licenses-discovered": [
                "Apache-2.0"
            ],
            "copyrights": [
                "(c) Shay Rojansky Entity Framework Core",
                "Copyright (c) .NET Foundation",
                "Shay Rojansky Copyright 2023"
            ],
            "file-count": 33,
            "sha256": "2bc3a3223b726bd6b9bd622a2e9ce885e97d277976413c3da24cef515905880f",
            "source": "https://github.com/efcore/EFCore.NamingConventions/archive/refs/tags/v8.0.3.zip",
            "status": "approved"
        }
    ]
}