{
    "license": "Apache-2.0 AND CC-PDDC",
    "file-count": 203,
    "authority": "https://gitlab.eclipse.org/eclipsefdn/emo-team/iplab/-/issues/1704",
    "scancode-version": "30.1.0",
    "licenses-discovered": [
        "Apache-2.0",
        "CC-PDDC"
    ],
    "id": "maven/mavencentral/org.sonatype.sisu/sisu-guice/2.1.7",
    "source": "https://search.maven.org/remotecontent?filepath=org/sonatype/sisu/sisu-guice/2.1.7/sisu-guice-2.1.7-sources.jar",
    "status": "approved"
}
