{
    "id": "git/github/modern-go/reflect2/v1.0.1",
    "license": "Apache-2.0",
    "licenses-discovered": [
        "Apache-2.0"
    ],
    "copyrights": [
    ],
    "file-count": 37,
    "scancode-version": "30.1.0",
    "authority": "https://gitlab.eclipse.org/eclipsefdn/emo-team/iplab/-/issues/3562",
    "source": "https://github.com/modern-go/reflect2/archive/refs/tags/v1.0.1.zip",
    "status": "approved"
}