{
    "id": "maven/mavencentral/com.vaadin/vaadin-combo-box-flow/24.6.5",
    "license": "Apache-2.0",
    "authority": "https://gitlab.eclipse.org/eclipsefdn/emo-team/iplab/-/issues/19773",
    "source": "https://repo1.maven.org/maven2/com/vaadin/vaadin-combo-box-flow/24.6.5/vaadin-combo-box-flow-24.6.5-sources.jar",
    "status": "approved",
    "scans": [
        {
            "date": "March 1, 2025 at 3:05:14 a.m. GMT",
            "authority": "https://gitlab.eclipse.org/eclipsefdn/emo-team/iplab/-/issues/19773",
            "scancode-version": "31.2.1",
            "licenses-discovered": [
                "Apache-2.0"
            ],
            "copyrights": [
                "Copyright 2000-2024 Vaadin Ltd."
            ],
            "file-count": 19,
            "sha256": "c93ac28bf9bd754e16fd58ae687b500572c23c8911a757fead8e04305fad33b0",
            "source": "https://repo1.maven.org/maven2/com/vaadin/vaadin-combo-box-flow/24.6.5/vaadin-combo-box-flow-24.6.5-sources.jar",
            "status": "approved"
        }
    ]
}