{
    "id": "nuget/nuget/-/AutomaticGraphLayout/1.1.12",
    "license": "MIT AND Apache-2.0 AND (BSD-2-Clause AND BSD-3-Clause AND MIT) AND (BSD-3-Clause AND MIT) AND X11 AND BSD-3-Clause",
    "authority": "https://gitlab.eclipse.org/eclipsefdn/emo-team/iplab/-/issues/15995",
    "source": "https://github.com/microsoft/automatic-graph-layout/archive/refs/tags/v1.1.zip",
    "status": "approved",
    "scans": [
        {
            "date": "September 11, 2024, 3:12:20 a.m. GMT",
            "authority": "https://gitlab.eclipse.org/eclipsefdn/emo-team/iplab/-/issues/15995",
            "scancode-version": "31.2.1",
            "licenses-discovered": [
                "MIT",
                "Apache-2.0",
                "BSD-2-Clause AND BSD-3-Clause AND MIT",
                "BSD-3-Clause AND MIT",
                "X11",
                "BSD-3-Clause"
            ],
            "copyrights": [
                "(c) . ObjectC",
                "(c) 2008 VeriSign, Inc.",
                "(c) Copyright 2006-2016 Microsoft Corp.",
                "(c) Microsoft Corporation",
                "Copyright (c) 2005",
                "Copyright (c) 2005-2011 Wayne Kelly, QUT Queensland University of Technology StringBuffer",
                "Copyright (c) 2006",
                "Copyright (c) 2006-2015 Microsoft Corporation",
                "Copyright (c) 2010-2014, The Dojo Foundation",
                "Copyright (c) 2011 Ariya Hidayat <ariya.hidayat@gmail.com>",
                "Copyright (c) 2012",
                "Copyright (c) 2012 Ariya Hidayat <ariya.hidayat@gmail.com>",
                "Copyright (c) 2012 Arpad Borsos <arpad.borsos@googlemail.com>",
                "Copyright (c) 2012 Joost-Wim Boekesteijn <joost-wim@boekesteijn.nl>",
                "Copyright (c) 2012 Kris Kowal <kris.kowal@cixar.com>",
                "Copyright (c) 2012 Mathias Bynens <mathias@qiwi.be>",
                "Copyright (c) 2012 Yusuke Suzuki <utatane.tea@gmail.com>",
                "Copyright (c) 2012-2014, The Dojo Foundation",
                "Copyright (c) 2013",
                "Copyright (c) 2013 Ariya Hidayat <ariya.hidayat@gmail.com>",
                "Copyright (c) 2013 Josh Baldwin https://github.com/jbaldwin/require.d.ts",
                "Copyright (c) 2013 Mathias Bynens <mathias@qiwi.be>",
                "Copyright (c) 2013 Thaddee Tyl <thaddee.tyl@gmail.com>",
                "Copyright (c) 2013-2014, The Dojo Foundation",
                "Copyright (c) 2014",
                "Copyright (c) 2015",
                "Copyright (c) 2017",
                "Copyright (c) 2019",
                "Copyright (c) 2021",
                "Copyright (c) MS 2006",
                "Copyright (c) MSIT 2007",
                "Copyright (c) MSIT 2008",
                "Copyright (c) Microsoft 2008",
                "Copyright (c) Microsoft 2009",
                "Copyright (c) Microsoft 2010",
                "Copyright (c) Microsoft 2011",
                "Copyright (c) Microsoft Corporation",
                "Copyright (c) Microsoft Corporation en-US MSAGL Graph Layout",
                "Copyright (c) Microsoft IT 2009",
                "Copyright (c) Microsoft IT 2010",
                "Copyright (c) Microsoft Research LTD 2012",
                "Copyright (c) Wayne Kelly, QUT 2005-2010",
                "Copyright 2009-2011 Mozilla Foundation and contributors",
                "Copyright 2010 (c) Mihai Bazon <mihai.bazon@gmail.com>",
                "Copyright 2010-2014 JavaScript",
                "Copyright 2011 Mozilla Foundation and contributors",
                "Copyright 2011 The Closure Compiler Authors",
                "Copyright 2012 (c) Mihai Bazon <mihai.bazon@gmail.com>",
                "Copyright 2012 Robert Gust-Bardon <http://robert.gust-bardon.org/>",
                "Copyright 2013 TypeScript",
                "Copyright John Gough, 2006-2010",
                "Copyright MS 2005",
                "Copyright Microsoft Corporation",
                "Copyright Wayne Kelly, John Gough 2005-2011",
                "Copyright jQuery Foundation and other contributors",
                "Label (c) XEdge"
            ],
            "file-count": 22051,
            "sha256": "37ed170a1515e5acaa66e74d8f9b7ce65a215d5f86217e631b0f15ccbda6a098",
            "source": "https://github.com/microsoft/automatic-graph-layout/archive/refs/tags/v1.1.zip",
            "status": "approved"
        }
    ]
}