{
    "id": "maven/mavencentral/org.springframework.boot/spring-boot-starter-hateoas/3.4.3",
    "license": "Apache-2.0",
    "authority": "https://gitlab.eclipse.org/eclipsefdn/emo-team/iplab/-/issues/19808",
    "source": "https://repo1.maven.org/maven2/org/springframework/boot/spring-boot-starter-hateoas/3.4.3/spring-boot-starter-hateoas-3.4.3-sources.jar",
    "status": "approved",
    "scans": [
        {
            "date": "March 1, 2025 at 3:32:10 a.m. GMT",
            "authority": "https://gitlab.eclipse.org/eclipsefdn/emo-team/iplab/-/issues/19808",
            "scancode-version": "31.2.1",
            "licenses-discovered": [
                "Apache-2.0"
            ],
            "copyrights": [
            ],
            "file-count": 2,
            "sha256": "f60aad32ca41e176f16314cf2283a05781a2851a9338e07499f1468928ff526e",
            "source": "https://repo1.maven.org/maven2/org/springframework/boot/spring-boot-starter-hateoas/3.4.3/spring-boot-starter-hateoas-3.4.3-sources.jar",
            "status": "approved"
        }
    ]
}