{
    "id": "maven/mavencentral/com.fasterxml.jackson.module/jackson-module-parameter-names/2.14.1",
    "license": "Apache-2.0",
    "authority": "https://gitlab.eclipse.org/eclipsefdn/emo-team/iplab/-/issues/5938",
    "source": "https://search.maven.org/remotecontent?filepath=com/fasterxml/jackson/module/jackson-module-parameter-names/2.14.1/jackson-module-parameter-names-2.14.1-sources.jar",
    "status": "approved",
    "scans": [
        {
            "date": "December 21, 2022 at 6:52:41 p.m. GMT",
            "authority": "https://gitlab.eclipse.org/eclipsefdn/emo-team/iplab/-/issues/5938",
            "scancode-version": "31.2.1",
            "licenses-discovered": [
            ],
            "copyrights": [
            ],
            "file-count": 9,
            "sha256": "b2c5c2b5efe514644cb9d74cfe15bce5a79cb675e5c6aad159259c6cd7befb64",
            "source": "https://search.maven.org/remotecontent?filepath=com/fasterxml/jackson/module/jackson-module-parameter-names/2.14.1/jackson-module-parameter-names-2.14.1-sources.jar",
            "status": "restricted"
        }
    ]
}
