{
    "id": "npm/npmjs/-/typescript/4.0.5",
    "license": "Apache-2.0",
    "licenses-discovered": [
        "Apache-2.0",
        "CC-BY-4.0",
        "LicenseRef-scancode-khronos",
        "LicenseRef-scancode-unicode",
        "MIT",
        "ISC"
    ],
    "file-count": 56417,
    "scancode-version": "30.1.0",
    "authority": "https://gitlab.eclipse.org/eclipsefdn/emo-team/iplab/-/issues/2103",
    "source": "https://github.com/Microsoft/TypeScript/archive/v4.0.5.zip",
    "status": "approved"
}
