{
    "id": "npm/npmjs/@octokit/types/5.1.0",
    "license": "MIT",
    "licenses-discovered": [
        "MIT"
    ],
    "copyrights": [
        "Copyright (c) 2019 Octokit"
    ],
    "file-count": 49,
    "scancode-version": "31.2.1",
    "authority": "https://gitlab.eclipse.org/eclipsefdn/emo-team/iplab/-/issues/4130",
    "source": "https://registry.npmjs.org/@octokit/types/-/types-5.1.0.tgz",
    "status": "approved"
}