{
    "id": "git/github/nodejs/node/v18.10.0",
    "license": "Apache-2.0 AND Artistic-2.0 AND BSD-2-Clause AND BSD-3-Clause AND CC0-1.0 AND GPL-2.0-or-later AND ICU AND ISC AND LicenseRef-scancode-autoconf-simple-exception-2.0 AND LicenseRef-scancode-public-domain-disclaimer AND LicenseRef-scancode-unicode AND MIT AND NAIST-2003 AND NTP AND Zlib AND MIT AND LicenseRef-scancode-proprietary-license AND CC0-1.0 AND BSD-2-Clause AND (FSFULLR AND LicenseRef-scancode-fsf-unlimited-no-warranty) AND (GPL-2.0-or-later AND LicenseRef-scancode-autoconf-simple-exception-2.0) AND (GPL-3.0-or-later AND LicenseRef-scancode-autoconf-simple-exception AND LicenseRef-scancode-free-unknown) AND (FSFUL AND GPL-2.0-or-later AND Libtool-exception) AND X11 AND NTP AND (GPL-2.0-or-later AND GPL-3.0-or-later AND Libtool-exception) AND LicenseRef-scancode-fsf-unlimited-no-warranty AND FSFAP AND LGPL-2.1-or-later AND (GPL-3.0-or-later AND LicenseRef-scancode-autoconf-macro-exception) AND (FSFUL AND FSFULLR AND GPL-2.0-or-later AND Libtool-exception) AND FSFULLR AND ISC AND BSD-3-Clause AND (BSD-3-Clause AND LicenseRef-scancode-unknown) AND (0BSD AND BSD-2-Clause AND BSD-3-Clause AND MIT) AND (BSD-2-Clause AND CC0-1.0) AND (GPL-2.0-or-later AND GPL-3.0-or-later AND LicenseRef-scancode-autoconf-simple-exception AND LicenseRef-scancode-autoconf-simple-exception-2.0 AND LicenseRef-scancode-unicode AND LicenseRef-scancode-unicode-icu-58 AND NTP) AND LicenseRef-scancode-unicode AND (LicenseRef-scancode-other-permissive AND LicenseRef-scancode-unicode) AND (LicenseRef-scancode-proprietary-license AND LicenseRef-scancode-unicode) AND (ICU AND LicenseRef-scancode-unicode) AND (BSD-3-Clause AND LicenseRef-scancode-unicode) AND (LicenseRef-scancode-fsf-unlimited-no-warranty AND MIT) AND (BSD-3-Clause AND MIT) AND Artistic-2.0 AND LicenseRef-scancode-unknown-spdx AND GPL-1.0-or-later AND (ISC AND MIT) AND MIT-0 AND Apache-2.0 AND (CC-BY-SA-4.0 AND ISC) AND (BSD-2-Clause AND BSD-3-Clause) AND (MIT AND WTFPL) AND WTFPL AND (Apache-2.0 AND MIT) AND CC-BY-3.0 AND (BSD-3-Clause AND CC-BY-SA-4.0 AND CC0-1.0 AND CDDL-1.0 AND CDDL-1.1) AND LicenseRef-scancode-mit-synopsys AND LicenseRef-scancode-other-permissive AND OpenSSL AND (BSD-3-Clause AND GPL-2.0-only AND OpenSSL) AND (BSD-3-Clause AND OpenSSL) AND (BSD-3-Clause AND GPL-1.0-or-later AND OpenSSL) AND (Apache-2.0 AND BSD-3-Clause AND LicenseRef-scancode-other-permissive AND LicenseRef-scancode-proprietary-license AND OpenSSL) AND (Apache-2.0 AND OpenSSL) AND (Apache-2.0 AND BSD-2-Clause AND OpenSSL) AND (LicenseRef-scancode-public-domain-disclaimer AND OpenSSL) AND (BSD-2-Clause AND OpenSSL) AND (LicenseRef-scancode-snprintf AND OpenSSL) AND (LicenseRef-scancode-other-permissive AND OpenSSL) AND (BSD-3-Clause AND GPL-2.0-or-later AND LGPL-2.1-or-later AND MPL-1.1 AND OpenSSL) AND (BSD-Source-Code AND OpenSSL) AND (CC0-1.0 AND OpenSSL) AND (Artistic-1.0 AND GPL-1.0-only AND GPL-1.0-or-later) AND (Artistic-1.0-Perl AND GPL-1.0-or-later) AND (Artistic-1.0 AND Artistic-1.0-Perl AND GPL-1.0-or-later) AND (Artistic-1.0 AND GPL-1.0-or-later) AND (BSD-2-Clause AND BSD-3-Clause AND ISC AND MIT) AND CC-BY-4.0 AND (CC-BY-4.0 AND MIT) AND BSD-1-Clause AND (Autoconf-exception-2.0 AND GPL-3.0-or-later) AND (Autoconf-exception-2.0 AND GPL-2.0-or-later) AND (Apache-2.0 AND BSD-3-Clause) AND LicenseRef-scancode-sunpro AND (BSD-3-Clause AND LicenseRef-scancode-google-patent-license-webm) AND (BSD-3-Clause AND LicenseRef-scancode-proprietary-license) AND (BSD-3-Clause AND LicenseRef-scancode-bsd-3-clause-jtag) AND bzip2-1.0.6 AND (BSD-3-Clause AND GPL-2.0-only) AND (Apache-2.0 AND LicenseRef-scancode-mit-addition) AND (BSD-3-Clause AND LicenseRef-scancode-pcre) AND (BSD-2-Clause AND MIT) AND (BSD-3-Clause AND LicenseRef-scancode-json-pd) AND (BSD-3-Clause AND LicenseRef-scancode-ecma-no-patent) AND Python-2.0 AND Zlib AND LicenseRef-scancode-info-zip-2009-01 AND (FSFAP AND MIT) AND MPL-2.0 AND (ICU AND MIT AND OpenSSL) AND curl AND BSD-2-Clause-Views AND (BSD-2-Clause AND BSD-3-Clause AND MIT) AND 0BSD AND (CC0-1.0 AND MIT)",
    "licenses-discovered": [
        "Apache-2.0 AND Artistic-2.0 AND BSD-2-Clause AND BSD-3-Clause AND CC0-1.0 AND GPL-2.0-or-later AND ICU AND ISC AND LicenseRef-scancode-autoconf-simple-exception-2.0 AND LicenseRef-scancode-public-domain-disclaimer AND LicenseRef-scancode-unicode AND MIT AND NAIST-2003 AND NTP AND Zlib",
        "MIT",
        "LicenseRef-scancode-proprietary-license",
        "CC0-1.0",
        "BSD-2-Clause",
        "FSFULLR AND LicenseRef-scancode-fsf-unlimited-no-warranty",
        "GPL-2.0-or-later AND LicenseRef-scancode-autoconf-simple-exception-2.0",
        "GPL-3.0-or-later AND LicenseRef-scancode-autoconf-simple-exception AND LicenseRef-scancode-free-unknown",
        "FSFUL AND GPL-2.0-or-later AND Libtool-exception",
        "X11",
        "NTP",
        "GPL-2.0-or-later AND GPL-3.0-or-later AND Libtool-exception",
        "LicenseRef-scancode-fsf-unlimited-no-warranty",
        "FSFAP",
        "LGPL-2.1-or-later",
        "GPL-3.0-or-later AND LicenseRef-scancode-autoconf-macro-exception",
        "FSFUL AND FSFULLR AND GPL-2.0-or-later AND Libtool-exception",
        "FSFULLR",
        "ISC",
        "BSD-3-Clause",
        "BSD-3-Clause AND LicenseRef-scancode-unknown",
        "0BSD AND BSD-2-Clause AND BSD-3-Clause AND MIT",
        "BSD-2-Clause AND CC0-1.0",
        "GPL-2.0-or-later AND GPL-3.0-or-later AND LicenseRef-scancode-autoconf-simple-exception AND LicenseRef-scancode-autoconf-simple-exception-2.0 AND LicenseRef-scancode-unicode AND LicenseRef-scancode-unicode-icu-58 AND NTP",
        "LicenseRef-scancode-unicode",
        "LicenseRef-scancode-other-permissive AND LicenseRef-scancode-unicode",
        "LicenseRef-scancode-proprietary-license AND LicenseRef-scancode-unicode",
        "ICU AND LicenseRef-scancode-unicode",
        "BSD-3-Clause AND LicenseRef-scancode-unicode",
        "LicenseRef-scancode-fsf-unlimited-no-warranty AND MIT",
        "BSD-3-Clause AND MIT",
        "Artistic-2.0",
        "LicenseRef-scancode-unknown-spdx",
        "GPL-1.0-or-later",
        "ISC AND MIT",
        "MIT-0",
        "Apache-2.0",
        "CC-BY-SA-4.0 AND ISC",
        "BSD-2-Clause AND BSD-3-Clause",
        "MIT AND WTFPL",
        "WTFPL",
        "Apache-2.0 AND MIT",
        "CC-BY-3.0",
        "BSD-3-Clause AND CC-BY-SA-4.0 AND CC0-1.0 AND CDDL-1.0 AND CDDL-1.1",
        "LicenseRef-scancode-mit-synopsys",
        "LicenseRef-scancode-other-permissive",
        "OpenSSL",
        "BSD-3-Clause AND GPL-2.0-only AND OpenSSL",
        "BSD-3-Clause AND OpenSSL",
        "BSD-3-Clause AND GPL-1.0-or-later AND OpenSSL",
        "Apache-2.0 AND BSD-3-Clause AND LicenseRef-scancode-other-permissive AND LicenseRef-scancode-proprietary-license AND OpenSSL",
        "Apache-2.0 AND OpenSSL",
        "Apache-2.0 AND BSD-2-Clause AND OpenSSL",
        "LicenseRef-scancode-public-domain-disclaimer AND OpenSSL",
        "BSD-2-Clause AND OpenSSL",
        "LicenseRef-scancode-snprintf AND OpenSSL",
        "LicenseRef-scancode-other-permissive AND OpenSSL",
        "BSD-3-Clause AND GPL-2.0-or-later AND LGPL-2.1-or-later AND MPL-1.1 AND OpenSSL",
        "BSD-Source-Code AND OpenSSL",
        "CC0-1.0 AND OpenSSL",
        "Artistic-1.0 AND GPL-1.0-only AND GPL-1.0-or-later",
        "Artistic-1.0-Perl AND GPL-1.0-or-later",
        "Artistic-1.0 AND Artistic-1.0-Perl AND GPL-1.0-or-later",
        "Artistic-1.0 AND GPL-1.0-or-later",
        "BSD-2-Clause AND BSD-3-Clause AND ISC AND MIT",
        "CC-BY-4.0",
        "CC-BY-4.0 AND MIT",
        "BSD-1-Clause",
        "Autoconf-exception-2.0 AND GPL-3.0-or-later",
        "Autoconf-exception-2.0 AND GPL-2.0-or-later",
        "Apache-2.0 AND BSD-3-Clause",
        "LicenseRef-scancode-sunpro",
        "BSD-3-Clause AND LicenseRef-scancode-google-patent-license-webm",
        "BSD-3-Clause AND LicenseRef-scancode-proprietary-license",
        "BSD-3-Clause AND LicenseRef-scancode-bsd-3-clause-jtag",
        "bzip2-1.0.6",
        "BSD-3-Clause AND GPL-2.0-only",
        "Apache-2.0 AND LicenseRef-scancode-mit-addition",
        "BSD-3-Clause AND LicenseRef-scancode-pcre",
        "BSD-2-Clause AND MIT",
        "BSD-3-Clause AND LicenseRef-scancode-json-pd",
        "BSD-3-Clause AND LicenseRef-scancode-ecma-no-patent",
        "Python-2.0",
        "Zlib",
        "LicenseRef-scancode-info-zip-2009-01",
        "FSFAP AND MIT",
        "MPL-2.0",
        "ICU AND MIT AND OpenSSL",
        "curl",
        "BSD-2-Clause-Views",
        "BSD-2-Clause AND BSD-3-Clause AND MIT",
        "0BSD",
        "CC0-1.0 AND MIT"
    ],
    "copyrights": [
        "(c) (c) COMMA",
        "(c) . + Received",
        "(c) . a Construct",
        "(c) . inline UBool",
        "(c) Andrea Giammarchi",
        "(c) CharacterEscape ControlEscape",
        "(c) Denis Pushkarev",
        "(c) Entrust",
        "(c) Entrust, Inc. - for",
        "(c) Entrust.net",
        "(c) Gary Court",
        "(c) Harri Porten <porten@kde.org>",
        "(c) IsSpace (c)",
        "(c) Ll (c)",
        "(c) Luke Edwards (https://lukeed.com)",
        "(c) Mg (c)",
        "(c) Petka Antonov, John-David Dalton, Sindre Sorhus",
        "(c) Rl (c)",
        "(c) Scott Baxter. Course Outline. Basic CDMA Principles. Coding",
        "(c) Sindre Sorhus (http://sindresorhus.com)",
        "(c) Sindre Sorhus (https://sindresorhus.com)",
        "(c) Steven Levithan <http://xregexp.com/>",
        "(c) Titus Wormer",
        "(c) VeriSign, Inc.",
        "(c) and later Unicode, Inc. and others",
        "(c) d (c) D",
        "(c) e (c) E",
        "(c) i (c) I",
        "(c) int putchar(int c) http://pubs.opengroup.org/onlinepubs/000095399/functions/putchar.html",
        "(c) l (c) L",
        "(c) r (c) R",
        "(c) t (c) T",
        "(c) u (c) U",
        "(c) y (c) Y",
        "(c) z (c) Z",
        "(c) zbar', base about:blank', href http://example.com/foo",
        "AddRawLiteralChar (c) AddLiteralChar (c)",
        "CharCanBeKeyword (c) AddLiteralChar (c)",
        "Copyright (c) - Daniel Stenberg",
        "Copyright (c) - Gilles Vollant, Even Rouault, Mathias Svensson",
        "Copyright (c) - Stichting Mathematisch Centrum Amsterdam",
        "Copyright (c) - The Regents",
        "Copyright (c) - by Christian Ammer",
        "Copyright (c) - fengmk2 <fengmk2@gmail.com>",
        "Copyright (c) ARM, Inc.",
        "Copyright (c) Agoric",
        "Copyright (c) Alex Seville <hi@alexanderseville.com>",
        "Copyright (c) Alexander Chemeris",
        "Copyright (c) Alexander Shtuchkin",
        "Copyright (c) Alexey Raspopov, Kostiantyn Denysov, Anton Verinov",
        "Copyright (c) Alfred Klomp",
        "Copyright (c) Allan Caffee <allan.caffee@gmail.com>",
        "Copyright (c) Andrea Giammarchi",
        "Copyright (c) Andris Reinman",
        "Copyright (c) Andy Polyakov <appro@openssl.org>",
        "Copyright (c) Apple Computer, Inc.",
        "Copyright (c) Apple Inc.",
        "Copyright (c) Ariya Hidayat <ariya.hidayat@gmail.com>",
        "Copyright (c) Arpad Borsos <arpad.borsos@googlemail.com>",
        "Copyright (c) Aseem Kishore, and others",
        "Copyright (c) Baptiste Lepilleur",
        "Copyright (c) Bastien ROUCARIES",
        "Copyright (c) Ben Briggs <beneb.info@gmail.com> (http://beneb.info)",
        "Copyright (c) Ben Noordhuis <info@bnoordhuis.nl>",
        "Copyright (c) Benjamin Kosnik <bkoz@redhat.com>",
        "Copyright (c) Berkeley Software Design, Inc.",
        "Copyright (c) Bjoern Hoehrmann <bjoern@hoehrmann.de>",
        "Copyright (c) Brett Zamir",
        "Copyright (c) Brian Eugene Wilson, Robert Martin Campbell",
        "Copyright (c) Christian Persch",
        "Copyright (c) Christopher Jeffrey. (MIT Licensed) https://github.com/markedjs/marked",
        "Copyright (c) CloudFlare, Inc.",
        "Copyright (c) Colin Ihrig and Contributors",
        "Copyright (c) Computer Systems and Communication Lab, Institute of Information Science, Academia Sinica",
        "Copyright (c) Corepack contributors",
        "Copyright (c) Corporation for National Research Initiatives",
        "Copyright (c) DABH (https://github.com/DABH)",
        "Copyright (c) Dan Nicholson",
        "Copyright (c) Dan Nicholson <dbn.lists@gmail.com>",
        "Copyright (c) Dan Winship",
        "Copyright (c) Daniel J. Bernstein",
        "Copyright (c) Daniel Richard G. <skunk@iSKUNK.ORG>",
        "Copyright (c) Daniel Stenberg <daniel@haxx.se>",
        "Copyright (c) Dariusz Dwornikowski",
        "Copyright (c) Dave Justice",
        "Copyright (c) David Frank",
        "Copyright (c) Denis Malinochkin",
        "Copyright (c) Diego Petteno",
        "Copyright (c) Dmitry Ivanov",
        "Copyright (c) Domenic Denicola <d@domenic.me>",
        "Copyright (c) Dominic Tarr",
        "Copyright (c) Douglas Christopher Wilson",
        "Copyright (c) Ecma International",
        "Copyright (c) EdelKey Project",
        "Copyright (c) Elan Shanker",
        "Copyright (c) Elan Shanker, Blaine Bublitz <blaine.bublitz@gmail.com> , Eric Schoffstall <yo@contra.io> and other contributors",
        "Copyright (c) Elijah Insua",
        "Copyright (c) Emergya",
        "Copyright (c) Enrico M. Crisostomo <enrico.m.crisostomo@gmail.com>",
        "Copyright (c) Eric A. Young, Tim J. Hudson",
        "Copyright (c) Ethan Arrowood",
        "Copyright (c) Even Rouault",
        "Copyright (c) Evgeny Poberezkin",
        "Copyright (c) Facebook, Inc.",
        "Copyright (c) Federico Romero",
        "Copyright (c) Feross Aboukhadijeh",
        "Copyright (c) Free Software Foundation, Inc.",
        "Copyright (c) Gajus Kuizinas (http://gajus.com/)",
        "Copyright (c) George Zahariev",
        "Copyright (c) Gil Tene",
        "Copyright (c) Gilles Vollant",
        "Copyright (c) Gilles Vollant (minizip) http://www.winimage.com/zLibDll/minizip.html",
        "Copyright (c) Google Inc.",
        "Copyright (c) Gregory P. Ward",
        "Copyright (c) Guy Bedford",
        "Copyright (c) Heather Arthur <fayearthur@gmail.com>",
        "Copyright (c) Henri Torgemane",
        "Copyright (c) Human Who Codes",
        "Copyright (c) IBM Corp.",
        "Copyright (c) IBM Corporation and Others",
        "Copyright (c) IBM and others",
        "Copyright (c) IndigoUnited",
        "Copyright (c) Info-ZIP.",
        "Copyright (c) Ingvar Stepanyan <me@rreverser.com>",
        "Copyright (c) Intel Corporation",
        "Copyright (c) Intel Corporation + Authors",
        "Copyright (c) Intel Corporation Jim Kukunas",
        "Copyright (c) International Business Machines Corporation",
        "Copyright (c) International Business Machines Corporation and others",
        "Copyright (c) International Business Machines Corporation, Google and others",
        "Copyright (c) International Business Machines s Corporation and others",
        "Copyright (c) Irakli Gozalishvili <rfobic@gmail.com>",
        "Copyright (c) Isaac Z. Schlueter",
        "Copyright (c) Isaac Z. Schlueter and Contributors",
        "Copyright (c) Isaac Z. Schlueter, Ben Noordhuis, and Contributors",
        "Copyright (c) Isaac Z. Schlueter, Kat Marchan, npm, Inc., and Contributors",
        "Copyright (c) Ivan Nikulin <ifaaan@gmail.com>",
        "Copyright (c) Ivan Sagalaev",
        "Copyright (c) JP Richardson",
        "Copyright (c) James Halliday",
        "Copyright (c) James Halliday <mail@substack.net>",
        "Copyright (c) James Talmage <james.talmage@jrtechnical.com>",
        "Copyright (c) Jean-Philippe Aumasson",
        "Copyright (c) Jean-Philippe Aumasson <jeanphilippe.aumasson@gmail.com>",
        "Copyright (c) Jean-loup Gailly",
        "Copyright (c) Jean-loup Gailly and Mark Adler",
        "Copyright (c) Jean-loup Gailly, Mark Adler",
        "Copyright (c) Jed Watson",
        "Copyright (c) Jeremy Lal <kapouer@melix.org>",
        "Copyright (c) Joel Feenstra",
        "Copyright (c) John Darrington <j.darrington@elvis.murdoch.edu.au>",
        "Copyright (c) John Freeman <jfreeman08@gmail.com>",
        "Copyright (c) Jon Schlinkert",
        "Copyright (c) Jonathan Hartley",
        "Copyright (c) Jonathan Ong",
        "Copyright (c) Jonathan Ong me@jongleberry.com and Contributors",
        "Copyright (c) Joost-Wim Boekesteijn <joost-wim@boekesteijn.nl>",
        "Copyright (c) Joseph Wynn",
        "Copyright (c) Josh Glazebrook",
        "Copyright (c) Josh Junon",
        "Copyright (c) Julian Gruber <julian@juliangruber.com>",
        "Copyright (c) Julian Seward",
        "Copyright (c) KISA(Korea Information Security Agency)",
        "Copyright (c) Kael Zhang <i@kael.me> , contributors http://kael.me",
        "Copyright (c) Kasper Unn Weihe",
        "Copyright (c) Kazuhiko Arase",
        "Copyright (c) Kenneth MacKay",
        "Copyright (c) Kevin Decker",
        "Copyright (c) Kevin Decker <kpdecker@gmail.com>",
        "Copyright (c) Kevin Martensson <kevinmartensson@gmail.com>",
        "Copyright (c) Kris Kowal <http://cixar.com/~kris.kowal>",
        "Copyright (c) Kris Kowal <kris.kowal@cixar.com>",
        "Copyright (c) Kungliga Tekniska Hogskolan (Royal Institute of Technology, Stockholm, Sweden)",
        "Copyright (c) Kyle E. Mitchell",
        "Copyright (c) LeRoy Benjamin Sharon",
        "Copyright (c) Luke Edwards <luke.edwards05@gmail.com> (lukeed.com)",
        "Copyright (c) Made With MOXY Lda",
        "Copyright (c) Marak Squires",
        "Copyright (c) Mark Adler",
        "Copyright (c) Marko Kreen <markokr@gmail.com>",
        "Copyright (c) Mathias Bynens <mathias@qiwi.be>",
        "Copyright (c) Mathias Pettersson and Brian Hammond",
        "Copyright (c) Mathias Svensson http://result42.com",
        "Copyright (c) Matt Warren",
        "Copyright (c) Matteo Collina",
        "Copyright (c) Matteo Collina <matteo.collina@gmail.com>",
        "Copyright (c) Matteo Collina and Undici contributors",
        "Copyright (c) Matthieu Darbois",
        "Copyright (c) Meryn Stol",
        "Copyright (c) Michael Barker",
        "Copyright (c) Michael Ficarra <escodegen.copyright@michael.ficarra.me>",
        "Copyright (c) Michael Garvin",
        "Copyright (c) Microsoft Corporation",
        "Copyright (c) Mike Frysinger <vapier@gentoo.org>",
        "Copyright (c) Mikeal Rogers",
        "Copyright (c) Nathan Rajlich",
        "Copyright (c) Nathan Rajlich <nathan@tootallnate.net>",
        "Copyright (c) National Security Research Institute",
        "Copyright (c) Network Resonance, Inc.",
        "Copyright (c) Nick Galbreath",
        "Copyright (c) Nikita Skovoroda <chalkerx@gmail.com>",
        "Copyright (c) Node.js contributors",
        "Copyright (c) Open JS Foundation",
        "Copyright (c) Oracle and/or its affiliates",
        "Copyright (c) Orlin Georgiev",
        "Copyright (c) Pai-Hsiang Hsiao",
        "Copyright (c) Paolo Borelli",
        "Copyright (c) Paul Johnston",
        "Copyright (c) Paul Johnston - Other contributors Greg Holt, Andrew Kepert, Ydnar, Lostinet",
        "Copyright (c) Paul Vorbach <paul@vorba.ch>",
        "Copyright (c) Permission",
        "Copyright (c) Petka Antonov Sindre Sorhus",
        "Copyright (c) Philip Withnall",
        "Copyright (c) Python Software Foundation",
        "Copyright (c) RTFM, Inc.",
        "Copyright (c) Ramesh Nair (http://www.hiddentao.com/)",
        "Copyright (c) Raynos",
        "Copyright (c) Rebecca Turner",
        "Copyright (c) Rebecca Turner <me@re-becca.org>",
        "Copyright (c) Refael Ackeramnn <refack@gmail.com>",
        "Copyright (c) Rich Harris",
        "Copyright (c) Richard Levitte <richard@levitte.org>",
        "Copyright (c) Robert Gust-Bardon <donate@robert.gust-bardon.org>",
        "Copyright (c) Robert Kowalski",
        "Copyright (c) Robert Kowalski and Isaac Z. Schlueter",
        "Copyright (c) Robin Berjon",
        "Copyright (c) Roy Riojas",
        "Copyright (c) Roy Stogner <roystgnr@ices.utexas.edu>",
        "Copyright (c) Sam Hocevar <sam@hocevar.net>",
        "Copyright (c) Saul Ibarra Corretge <saghul@gmail.com>",
        "Copyright (c) Scott James Remnant",
        "Copyright (c) Scott James Remnant <scott@netsplit.com>",
        "Copyright (c) Sebastian McKenzie and other contributors",
        "Copyright (c) Sergey Rubanov (https://github.com/chicoxyzzy)",
        "Copyright (c) Sergii Iavorskyi",
        "Copyright (c) Shannon Moeller <me@shannonmoeller.com> (shannonmoeller.com)",
        "Copyright (c) Simon Seyock",
        "Copyright (c) Sindre Sorhus <sindresorhus@gmail.com> (https://sindresorhus.com)",
        "Copyright (c) Sindre Sorhus <sindresorhus@gmail.com> (https://sindresorhus.com), Paul Miller (https://paulmillr.com)",
        "Copyright (c) Sindre Sorhus <sindresorhus@gmail.com> (sindresorhus.com)",
        "Copyright (c) Sony Mobile Communications AB",
        "Copyright (c) Steven G. Johnson <stevenj@alum.mit.edu>",
        "Copyright (c) StrongLoop Inc.",
        "Copyright (c) Sun Microsystems Inc.",
        "Copyright (c) TJ Holowaychuk",
        "Copyright (c) TJ Holowaychuk <tj@vision-media.ca>",
        "Copyright (c) TaBE Project",
        "Copyright (c) Tatsuhiro Tsujikawa",
        "Copyright (c) Teambition",
        "Copyright (c) The Android Open Source Project",
        "Copyright (c) The OpenTSA Project",
        "Copyright (c) The Perl Foundation",
        "Copyright (c) The Regents of the University of California",
        "Copyright (c) The WebRTC project",
        "Copyright (c) Thiago de Arruda",
        "Copyright (c) Thiago de Arruda <tpadilha84@gmail.com>",
        "Copyright (c) Thomas Robinson <280north.com>",
        "Copyright (c) Thomas Watson Steen",
        "Copyright (c) Thorsten Lorenz <thlorenz@gmx.de>",
        "Copyright (c) Tim Caswell",
        "Copyright (c) Tim Koschutzki (tim@debuggable.com) Felix Geisendorfer (felix@debuggable.com)",
        "Copyright (c) Tim Oxley",
        "Copyright (c) Timo Teras <timo.teras@gmail.com>",
        "Copyright (c) Titus Wormer <tituswormer@gmail.com>",
        "Copyright (c) Tjarda Koster, https://jelloween.deviantart.com",
        "Copyright (c) Tom Howard <tomhoward@users.sf.net>",
        "Copyright (c) Tom Wu",
        "Copyright (c) Toru Nagashima",
        "Copyright (c) Ujjwal Sharma",
        "Copyright (c) Unicode, Inc.",
        "Copyright (c) University of Cambridge",
        "Copyright (c) Vercel, Inc.",
        "Copyright (c) Viktor Dukhovni <openssl-users@dukhovni.org>",
        "Copyright (c) WISeKey,C CH Not Valid Before",
        "Copyright (c) WISeKey,C CH Serial",
        "Copyright (c) Wojciech Mula",
        "Copyright (c) X Consortium",
        "Copyright (c) Xan Lopez",
        "Copyright (c) Yahoo! Inc.",
        "Copyright (c) Yusuke Suzuki (twitter Constellation) and other contributors",
        "Copyright (c) Yusuke Suzuki <utatane.tea@gmail.com>",
        "Copyright (c) Zack Weinberg <zackw@panix.com>",
        "Copyright (c) Zeit, Inc.",
        "Copyright (c) Zilong Yao",
        "Copyright (c) and GNU",
        "Copyright (c) and WIDE Project",
        "Copyright (c) and later Unicode, Inc.",
        "Copyright (c) and later Unicode, Inc. and others",
        "Copyright (c) angus croll",
        "Copyright (c) argparse.js authors",
        "Copyright (c) by Andrew Selivanov",
        "Copyright (c) by Armin Ronacher and contributors",
        "Copyright (c) by Baptiste Lepilleur",
        "Copyright (c) by Brad House",
        "Copyright (c) by Daniel Stenberg",
        "Copyright (c) by Ingvar Stepanyan",
        "Copyright (c) by Internet Software Consortium",
        "Copyright (c) by Internet Systems Consortium, Inc.",
        "Copyright (c) by Jakub Hrozek <jhrozek@redhat.com>",
        "Copyright (c) by John Schember",
        "Copyright (c) by John Schember <john@nachtimwald.com>",
        "Copyright (c) by Jun Woong",
        "Copyright (c) by Sun Microsystems, Inc.",
        "Copyright (c) by Vitaly Puzrin",
        "Copyright (c) by the Brotli Authors",
        "Copyright (c) by the Jinja Team",
        "Copyright (c) by various contributors",
        "Copyright (c) jQuery Foundation, Inc. and Contributors",
        "Copyright (c) libuv project contributors",
        "Copyright (c) nghttp2 contributors",
        "Copyright (c) nghttp3 contributors",
        "Copyright (c) ngtcp2 contributors",
        "Copyright (c) node-modules and other contributors",
        "Copyright (c) npm, Inc. and Contributors",
        "Copyright (c) npm, Inc., Isaac Z. Schlueter, and Contributors",
        "Copyright (c) print International Business Machines Corporation and others",
        "Copyright (c) the Dart project",
        "Copyright (c) xine project",
        "Copyright - Refael Ackermann",
        "Copyright 20xx-20yy The OpenSSL Project",
        "Copyright Acorn",
        "Copyright Akamai Technologies",
        "Copyright Andreas Rossberg",
        "Copyright Andrey Sitnik <andrey@sitnik.ru> and other contributors",
        "Copyright BaishanCloud",
        "Copyright Bert Belder",
        "Copyright Chih-Hao Tsai Beckman Institute, University of Illinois c-tsai4@uiuc.edu http://casper.beckman.uiuc.edu/~c-tsai4",
        "Copyright Contributors",
        "Copyright Cryptography Research, Inc.",
        "Copyright Danny Sonnenschein <my.card.god@web.de>",
        "Copyright Dominick Meglio",
        "Copyright Dulin Marat and other contributors",
        "Copyright Fedor Indutny",
        "Copyright Gary Court",
        "Copyright Gilles Vollant - http://www.winimage.com/zLibDll",
        "Copyright GitHub Inc.",
        "Copyright Google LLC",
        "Copyright Isaac Z.",
        "Copyright JS Foundation and other contributors, https://js.foundation",
        "Copyright James Halliday (mail@substack.net) and Isaac Z. Schlueter (i@izs.me)",
        "Copyright Jeremy Ashkenas, DocumentCloud and Investigative Reporters & Editors",
        "Copyright Joyent, Inc. and other Node contributors",
        "Copyright Justin Ridgewell <jridgewell@google.com>",
        "Copyright Justin Ridgewell <justin@ridgewell.name>",
        "Copyright Kat Marchan",
        "Copyright Kevin Decker <https://github.com/kpdecker/six-speed/>",
        "Copyright Kilian Valkhof",
        "Copyright Kornel Lesinski",
        "Copyright Logan Smyth <loganfsmyth@gmail.com>",
        "Copyright M. J. Dominus",
        "Copyright Mathias Bynens <https://mathiasbynens.be/>",
        "Copyright Mozilla Corporation",
        "Copyright Mozilla Foundation and contributors",
        "Copyright NTT (Nippon Telegraph and Telephone Corporation)",
        "Copyright Nara Institute of Science and Technology",
        "Copyright Nicolo Ribaudo",
        "Copyright Niels Provos <provos@citi.umich.edu>",
        "Copyright Nokia",
        "Copyright OpenJS Foundation and other contributors <https://openjsf.org/>",
        "Copyright OpenJS Foundation and other contributors, <www.openjsf.org>",
        "Copyright Pallets",
        "Copyright Patrick Powell",
        "Copyright Red Hat, Inc.",
        "Copyright Ribose Inc.",
        "Copyright Ribose Inc. (https://www.ribose.com)",
        "Copyright Samuel Neves <sneves@dei.uc.pt>",
        "Copyright Sebastian McKenzie <sebmck@gmail.com>",
        "Copyright Siemens AG",
        "Copyright Simon Lydell",
        "Copyright The Chromium Authors",
        "Copyright The Closure Compiler",
        "Copyright The Closure Library",
        "Copyright The Go Authors",
        "Copyright The OpenSSL Authors",
        "Copyright The OpenSSL Project",
        "Copyright The V8 Authors",
        "Copyright The libuv project and contributors",
        "Copyright Thorsten Lorenz",
        "Copyright UnionTech",
        "Copyright UnionTech (https://www.uniontech.com)",
        "Copyright VMS Software, Inc.",
        "Copyright and onwards Google Inc.",
        "Copyright by <danny.sonnenschein@platynum.ch>",
        "Copyright by Ben Greear <greearb@candelatech.com>",
        "Copyright by Dominick Meglio",
        "Copyright by Google, Inc.",
        "Copyright by Sam Mikes",
        "Copyright by the Massachusetts Institute of Technology",
        "Copyright datetime.now .year the V8 project",
        "Copyright libuv project and contributors",
        "Copyright libuv project and other Node contributors",
        "Copyright npm, Inc.",
        "Copyright the Sputnik authors",
        "Copyright the V8 project",
        "Copyright the libuv project contributors",
        "Copyright various",
        "Copyright web-platform-tests contributors",
        "Copyright year the V8 project",
        "DeoptimizeFunction (c) ClearFunctionFeedback (c)",
        "UnicodeString src (c) UnicodeString",
        "copyright (c) Denis Pushkarev",
        "copyright (c) by Armin Ronacher",
        "copyright (c) by Mark Jason Dominus <mjd@cpan.org>",
        "copyright Alexander Chemeris. Three",
        "copyright Berkeley Software Design Inc, Kenneth MacKay and Emergya",
        "copyright Google Inc. and Sony Mobile Communications AB.",
        "copyright Jeremy Ashkenas, DocumentCloud and Investigative Reporters & Editors <http://underscorejs.org/>",
        "copyright Niels Provos. Two",
        "copyright Titus Wormer",
        "copyright by Steven Levithan",
        "copyright libuv contributors",
        "copyright the Internet Systems Consortium, Inc.",
        "copyrighted by Apple Computer, Inc.",
        "copyrighted by Sun Microsystems Inc.",
        "copyrighted by the Free Software Foundation",
        "copyrighted by the University of Cambridge and Google, Inc."
    ],
    "file-count": 37846,
    "scancode-version": "30.1.0",
    "authority": "https://gitlab.eclipse.org/eclipsefdn/emo-team/iplab/-/issues/3550",
    "source": "https://github.com/nodejs/node/archive/refs/tags/v18.10.0.zip",
    "status": "restricted"
}