{
    "id": "npm/npmjs/@babel/preset-modules/0.1.6-no-external-plugins",
    "license": "MIT",
    "authority": "https://gitlab.eclipse.org/eclipsefdn/emo-team/iplab/-/issues/9932",
    "source": "https://github.com/babel/preset-modules/archive/refs/tags/v0.1.6-no-external-plugins.zip",
    "status": "approved",
    "scans": [
        {
            "date": "August 11, 2023 at 12:20:49 a.m. GMT",
            "authority": "https://gitlab.eclipse.org/eclipsefdn/emo-team/iplab/-/issues/9932",
            "scancode-version": "31.2.1",
            "licenses-discovered": [
                "MIT"
            ],
            "copyrights": [
                "Copyright (c) 2020 Babel"
            ],
            "file-count": 191,
            "sha256": "bae568706b08b6db9f4c15b1cebab04db1cb369a3aa1500afc69b0e627ea1b15",
            "source": "https://github.com/babel/preset-modules/archive/refs/tags/v0.1.6-no-external-plugins.zip",
            "status": "approved"
        }
    ]
}