{
    "id": "go/golang/github.com%2FBurntSushi/toml/v1.2.1",
    "license": "MIT AND BSD-3-Clause",
    "authority": "https://gitlab.eclipse.org/eclipsefdn/emo-team/iplab/-/issues/10677",
    "source": "https://github.com/BurntSushi/toml/archive/refs/tags/v1.2.1.zip",
    "status": "approved",
    "scans": [
        {
            "date": "September 26, 2023 at 3:27:08 p.m. GMT",
            "authority": "https://gitlab.eclipse.org/eclipsefdn/emo-team/iplab/-/issues/10677",
            "scancode-version": "31.2.1",
            "licenses-discovered": [
                "MIT",
                "BSD-3-Clause"
            ],
            "copyrights": [
                "Copyright (c) 2013 TOML authors",
                "Copyright (c) 2018 TOML authors",
                "Copyright 2010 The Go Authors"
            ],
            "file-count": 482,
            "sha256": "c7947bc1f216244fdf99b7c99a61742ca30319587c1a9d05a9bed39f301d56de",
            "source": "https://github.com/BurntSushi/toml/archive/refs/tags/v1.2.1.zip",
            "status": "approved"
        }
    ]
}