{
    "id": "maven/mavencentral/org.apache.accumulo/accumulo-core/1.10.2",
    "license": "Apache-2.0 AND BSD-3-Clause AND Apache-2.0 AND BSD-3-Clause",
    "licenses-discovered": [
        "Apache-2.0 AND BSD-3-Clause",
        "Apache-2.0",
        "BSD-3-Clause"
    ],
    "copyrights": [
        "Copyright (c) 2005, European Commission project OneLab",
        "Copyright (c) 2011 The Guava Authors"
    ],
    "file-count": 620,
    "scancode-version": "31.2.1",
    "authority": "https://gitlab.eclipse.org/eclipsefdn/emo-team/iplab/-/issues/4456",
    "source": "https://search.maven.org/remotecontent?filepath=org/apache/accumulo/accumulo-core/1.10.2/accumulo-core-1.10.2-sources.jar",
    "status": "approved"
}