{
    "id": "maven/mavencentral/org.apache.xmlgraphics/batik-transcoder/1.17",
    "license": "Apache-2.0",
    "authority": "https://gitlab.eclipse.org/eclipsefdn/emo-team/iplab/-/issues/10156",
    "source": "https://repo.maven.apache.org/maven2/org/apache/xmlgraphics/batik-transcoder/1.17/batik-transcoder-1.17-sources.jar",
    "status": "approved",
    "scans": [
        {
            "date": "August 22, 2023 at 10:58:47 a.m. GMT",
            "authority": "https://gitlab.eclipse.org/eclipsefdn/emo-team/iplab/-/issues/10156",
            "scancode-version": "31.2.1",
            "licenses-discovered": [
                "Apache-2.0"
            ],
            "copyrights": [
            ],
            "file-count": 49,
            "sha256": "02abba08e8fe0b7a36e39990bfd5ced7d1b7d2e6ad0d4de904f3747dda48d253",
            "source": "https://repo.maven.apache.org/maven2/org/apache/xmlgraphics/batik-transcoder/1.17/batik-transcoder-1.17-sources.jar",
            "status": "approved"
        }
    ]
}