{
    "id": "maven/mavencentral/io.fabric8/kubernetes-model-flowcontrol/6.4.0",
    "license": "Apache-2.0",
    "authority": "https://gitlab.eclipse.org/eclipsefdn/emo-team/iplab/-/issues/6601",
    "source": "https://search.maven.org/remotecontent?filepath=io/fabric8/kubernetes-model-flowcontrol/6.4.0/kubernetes-model-flowcontrol-6.4.0-sources.jar",
    "status": "approved",
    "scans": [
        {
            "date": "January 24, 2023 at 8:48:42 a.m. GMT",
            "authority": "https://gitlab.eclipse.org/eclipsefdn/emo-team/iplab/-/issues/6601",
            "scancode-version": "31.2.1",
            "licenses-discovered": [
                "Apache-2.0"
            ],
            "copyrights": [
                "Copyright (c) 2015 Red Hat, Inc."
            ],
            "file-count": 185,
            "sha256": "f81558e5879df4d1790213a97e038ccb0330b7d2a27641334e3573cedce399ea",
            "source": "https://search.maven.org/remotecontent?filepath=io/fabric8/kubernetes-model-flowcontrol/6.4.0/kubernetes-model-flowcontrol-6.4.0-sources.jar",
            "status": "approved"
        }
    ]
}