{
    "id": "crate/cratesio/-/is-terminal/0.4.13",
    "license": "MIT",
    "authority": "https://gitlab.eclipse.org/eclipsefdn/emo-team/iplab/-/issues/17306",
    "source": "https://crates.io/api/v1/crates/is-terminal/0.4.13/download",
    "status": "approved",
    "scans": [
        {
            "date": "November 19, 2024, 4:13:56 p.m. GMT",
            "authority": "https://gitlab.eclipse.org/eclipsefdn/emo-team/iplab/-/issues/17306",
            "scancode-version": "31.2.1",
            "licenses-discovered": [
                "MIT",
                "LicenseRef-scancode-proprietary-license"
            ],
            "copyrights": [
                "Copyright (c) 2015-2019 Doug Tangren"
            ],
            "file-count": 8,
            "sha256": "261f68e344040fbd0edea105bef17c66edf46f984ddb1115b775ce31be948f4b",
            "source": "https://crates.io/api/v1/crates/is-terminal/0.4.13/download",
            "status": "restricted"
        }
    ]
}