{
    "id": "npm/npmjs/@nightwatch/html-reporter-template/0.2.1",
    "license": "MIT",
    "authority": "https://gitlab.eclipse.org/eclipsefdn/emo-team/iplab/-/issues/8311",
    "source": "https://github.com/nightwatchjs/html-reporter/archive/v0.2.1.zip",
    "status": "approved",
    "scans": [
        {
            "date": "May 4, 2023 at 5:36:40 p.m. GMT",
            "authority": "https://gitlab.eclipse.org/eclipsefdn/emo-team/iplab/-/issues/8311",
            "scancode-version": "31.2.1",
            "licenses-discovered": [
                "MIT"
            ],
            "copyrights": [
                "Copyright (c) 2021, BrowserStack Limited. https://www.browserstack.com"
            ],
            "file-count": 145,
            "sha256": "4b24d61d959bea06be8a1252478dcab679ee8c03e741d645a9c1e428ce197caf",
            "source": "https://github.com/nightwatchjs/html-reporter/archive/v0.2.1.zip",
            "status": "approved"
        }
    ]
}