{
    "id": "maven/mavencentral/com.google.cloud/google-cloud-core/2.44.1",
    "license": "Apache-2.0",
    "authority": "https://gitlab.eclipse.org/eclipsefdn/emo-team/iplab/-/issues/16740",
    "source": "https://repo1.maven.org/maven2/com/google/cloud/google-cloud-core/2.44.1/google-cloud-core-2.44.1-sources.jar",
    "status": "approved",
    "scans": [
        {
            "date": "October 15, 2024, 6:10:36 p.m. GMT",
            "authority": "https://gitlab.eclipse.org/eclipsefdn/emo-team/iplab/-/issues/16740",
            "scancode-version": "31.2.1",
            "licenses-discovered": [
                "Apache-2.0"
            ],
            "copyrights": [
                "Copyright 2015 Google LLC",
                "Copyright 2016 Google LLC",
                "Copyright 2017 Google LLC",
                "Copyright 2020 Google LLC",
                "Copyright 2023 Google LLC"
            ],
            "file-count": 50,
            "sha256": "1878d4414057b0b40a615f9227da4c6cb4257c3bc3467247178b34440540dee3",
            "source": "https://repo1.maven.org/maven2/com/google/cloud/google-cloud-core/2.44.1/google-cloud-core-2.44.1-sources.jar",
            "status": "approved"
        }
    ]
}