{
    "id": "project/eclipse.pde/-/eclipse.pdePR1054/0.0",
    "license": "EPL-2.0",
    "authority": "https://gitlab.eclipse.org/eclipsefdn/emo-team/iplab/-/issues/12777",
    "source": "https://github.com/eclipse-pde/eclipse.pde/pull/1054.patch",
    "status": "approved",
    "scans": [
        {
            "date": "January 15, 2024 at 8:57:54 p.m. GMT",
            "authority": "https://gitlab.eclipse.org/eclipsefdn/emo-team/iplab/-/issues/12777",
            "scancode-version": "31.2.1",
            "licenses-discovered": [
                "EPL-2.0"
            ],
            "copyrights": [
                "Copyright (c) 2015, 2021 bndtools project and others",
                "Copyright (c) 2015, 2024 bndtools project and others"
            ],
            "file-count": 1,
            "sha256": "c49b27c2d5780b2e6a7ac18d3efc3c55489d9f5fcb0045958880966c47c30b53",
            "source": "https://github.com/eclipse-pde/eclipse.pde/pull/1054.patch",
            "status": "restricted"
        }
    ]
}
