{
    "id": "npm/npmjs/-/css-loader/7.0.0",
    "license": "MIT AND Apache-2.0",
    "authority": "https://gitlab.eclipse.org/eclipsefdn/emo-team/iplab/-/issues/14230",
    "source": "https://github.com/webpack-contrib/css-loader/archive/refs/tags/v7.0.0.zip",
    "status": "approved",
    "scans": [
        {
            "date": "April 5, 2024 at 7:52:13 a.m. GMT",
            "authority": "https://gitlab.eclipse.org/eclipsefdn/emo-team/iplab/-/issues/14230",
            "scancode-version": "31.2.1",
            "licenses-discovered": [
                "MIT",
                "Apache-2.0"
            ],
            "copyrights": [
                "Copyright 2011 Google Inc.",
                "Copyright JS Foundation and other contributors"
            ],
            "file-count": 539,
            "sha256": "f04d1161218eaa2e1711723ce116aebb5ef8503da3c20512438126353e7f300e",
            "source": "https://github.com/webpack-contrib/css-loader/archive/refs/tags/v7.0.0.zip",
            "status": "approved"
        }
    ]
}