{
    "id": "maven/mavencentral/io.fabric8/openshift-model-operator/6.6.0",
    "license": "Apache-2.0",
    "authority": "https://gitlab.eclipse.org/eclipsefdn/emo-team/iplab/-/issues/8338",
    "source": "https://search.maven.org/remotecontent?filepath=io/fabric8/openshift-model-operator/6.6.0/openshift-model-operator-6.6.0-sources.jar",
    "status": "approved",
    "scans": [
        {
            "date": "May 5, 2023 at 5:54:59 a.m. GMT",
            "authority": "https://gitlab.eclipse.org/eclipsefdn/emo-team/iplab/-/issues/8338",
            "scancode-version": "31.2.1",
            "licenses-discovered": [
                "Apache-2.0"
            ],
            "copyrights": [
                "Copyright (c) 2015 Red Hat, Inc."
            ],
            "file-count": 672,
            "sha256": "37f13446f18108d00f254e53273ca77985be82e0a496bae11dd14f1041ce147d",
            "source": "https://search.maven.org/remotecontent?filepath=io/fabric8/openshift-model-operator/6.6.0/openshift-model-operator-6.6.0-sources.jar",
            "status": "approved"
        }
    ]
}