{
    "license": "Apache-2.0 AND MIT",
    "file-count": 163,
    "authority": "https://gitlab.eclipse.org/eclipsefdn/emo-team/iplab/-/issues/1494",
    "scancode-version": "30.1.0",
    "licenses-discovered": [
        "MIT",
        "Apache-2.0"
    ],
    "id": "maven/mavencentral/org.codehaus.plexus/plexus-container-default/1.0-alpha-8",
    "source": "https://search.maven.org/remotecontent?filepath=org/codehaus/plexus/plexus-container-default/1.0-alpha-8/plexus-container-default-1.0-alpha-8-sources.jar",
    "status": "approved"
}