{
    "id": "npm/npmjs/@types/autosuggest-highlight/3.2.3",
    "license": "MIT",
    "authority": "https://gitlab.eclipse.org/eclipsefdn/emo-team/iplab/-/issues/11672",
    "source": "https://registry.yarnpkg.com/@types/autosuggest-highlight/-/autosuggest-highlight-3.2.3.tgz",
    "status": "approved",
    "scans": [
        {
            "date": "November 22, 2023 at 10:08:33 a.m. GMT",
            "authority": "https://gitlab.eclipse.org/eclipsefdn/emo-team/iplab/-/issues/11672",
            "scancode-version": "31.2.1",
            "licenses-discovered": [
                "MIT"
            ],
            "copyrights": [
                "Copyright (c) Microsoft Corporation"
            ],
            "file-count": 6,
            "sha256": "2d1ddcd395446ecc4368c3d2b6028cdb0c15ecb32aa4672afcc0ac7958c581fc",
            "source": "https://registry.yarnpkg.com/@types/autosuggest-highlight/-/autosuggest-highlight-3.2.3.tgz",
            "status": "approved"
        }
    ]
}