{
    "id": "maven/mavencentral/org.apache.lucene/lucene-misc/9.11.0",
    "license": "Apache-2.0",
    "authority": "https://gitlab.eclipse.org/eclipsefdn/emo-team/iplab/-/issues/15124",
    "source": "https://repo1.maven.org/maven2/org/apache/lucene/lucene-misc/9.11.0/lucene-misc-9.11.0-sources.jar",
    "status": "approved",
    "scans": [
        {
            "date": "June 7, 2024 at 2:44:15 p.m. GMT",
            "authority": "https://gitlab.eclipse.org/eclipsefdn/emo-team/iplab/-/issues/15124",
            "scancode-version": "31.2.1",
            "licenses-discovered": [
                "Apache-2.0"
            ],
            "copyrights": [
            ],
            "file-count": 37,
            "sha256": "4796fbcce1686e4e4dcf442548a85c65caf3d49a139e9d182e1edc5e2a37fc0a",
            "source": "https://repo1.maven.org/maven2/org/apache/lucene/lucene-misc/9.11.0/lucene-misc-9.11.0-sources.jar",
            "status": "approved"
        }
    ]
}