{
    "id": "npm/npmjs/-/rc-table/7.45.6",
    "license": "MIT",
    "authority": "https://gitlab.eclipse.org/eclipsefdn/emo-team/iplab/-/issues/14854",
    "source": "https://registry.yarnpkg.com/rc-table/-/rc-table-7.45.6.tgz",
    "status": "approved",
    "scans": [
        {
            "date": "May 21, 2024 at 12:31:04 p.m. GMT",
            "authority": "https://gitlab.eclipse.org/eclipsefdn/emo-team/iplab/-/issues/14854",
            "scancode-version": "31.2.1",
            "licenses-discovered": [
                "MIT"
            ],
            "copyrights": [
                "Copyright (c) 2015-present Alipay.com, https://www.alipay.com"
            ],
            "file-count": 196,
            "sha256": "0c525778167b6ad734dce53bf9493af3d61557c6c77c8104f41d9671ebd5ab86",
            "source": "https://registry.yarnpkg.com/rc-table/-/rc-table-7.45.6.tgz",
            "status": "approved"
        }
    ]
}