{
    "id": "npm/npmjs/-/v-treeview/0.2.1",
    "license": "MIT",
    "authority": "https://gitlab.eclipse.org/eclipsefdn/emo-team/iplab/-/issues/7454",
    "source": "https://registry.yarnpkg.com/v-treeview/-/v-treeview-0.2.1.tgz",
    "status": "approved",
    "scans": [
        {
            "date": "March 22, 2023 at 10:20:10 a.m. GMT",
            "authority": "https://gitlab.eclipse.org/eclipsefdn/emo-team/iplab/-/issues/7454",
            "scancode-version": "31.2.1",
            "licenses-discovered": [
                "MIT"
            ],
            "copyrights": [
                "Copyright (c) 2018 Hyounwoo"
            ],
            "file-count": 9,
            "sha256": "4a585741bdf1f40cb241feb10e2f36b3d81b3a71bafc2b7fb1f775e179b5161e",
            "source": "https://registry.yarnpkg.com/v-treeview/-/v-treeview-0.2.1.tgz",
            "status": "approved"
        }
    ]
}