{
    "license": "CC-BY-SA-4.0 AND MIT",
    "file-count": 245,
    "authority": "https://gitlab.eclipse.org/eclipsefdn/emo-team/iplab/-/issues/1821",
    "scancode-version": "30.1.0",
    "licenses-discovered": [
        "MIT",
        "LicenseRef-scancode-unknown-license-reference",
        "LicenseRef-scancode-html5",
        "CC-BY-SA-4.0",
        "LicenseRef-scancode-unknown"
    ],
    "id": "npm/npmjs/-/parse5/4.0.0",
    "source": "https://github.com/inikulin/parse5/archive/v4.0.0.zip",
    "status": "approved"
}
