{
    "id": "npm/npmjs/-/mini-css-extract-plugin/2.9.2",
    "license": "MIT AND Apache-2.0",
    "authority": "https://gitlab.eclipse.org/eclipsefdn/emo-team/iplab/-/issues/17035",
    "source": "https://github.com/webpack-contrib/mini-css-extract-plugin/archive/refs/tags/v2.9.2.zip",
    "status": "approved",
    "scans": [
        {
            "date": "November 5, 2024, 10:46:54 a.m. GMT",
            "authority": "https://gitlab.eclipse.org/eclipsefdn/emo-team/iplab/-/issues/17035",
            "scancode-version": "31.2.1",
            "licenses-discovered": [
                "MIT",
                "Apache-2.0"
            ],
            "copyrights": [
                "Copyright 2011 Google Inc.",
                "Copyright JS Foundation and other contributors"
            ],
            "file-count": 1046,
            "sha256": "e9915cccdb6777c08f5639ba5954aaeb511552bcdeee5a4eec3a63264c3708a1",
            "source": "https://github.com/webpack-contrib/mini-css-extract-plugin/archive/refs/tags/v2.9.2.zip",
            "status": "approved"
        }
    ]
}