{
    "id": "go/golang/github.com%2Fdocopt/docopt-go/v0.0.0-20180111231733-ee0de3bc6815",
    "license": "MIT",
    "authority": "https://gitlab.eclipse.org/eclipsefdn/emo-team/iplab/-/issues/5650",
    "source": "https://proxy.golang.org/github.com%2Fdocopt/docopt-go/@v/v0.0.0-20180111231733-ee0de3bc6815.zip",
    "status": "approved",
    "scans": [
        {
            "date": "December 12, 2022 at 3:34:16 a.m. GMT",
            "authority": "https://gitlab.eclipse.org/eclipsefdn/emo-team/iplab/-/issues/5650",
            "scancode-version": "31.2.1",
            "licenses-discovered": [
                "MIT"
            ],
            "copyrights": [
                "Copyright (c) 2013 Keith Batten",
                "Copyright (c) 2013 Keith Batten, kbatten@gmail.com",
                "Copyright (c) 2016 David Irvine"
            ],
            "file-count": 36,
            "sha256": "00aad861d150c62598ca4fb01cfbe15c2eefb5186df7e5d4a59286dcf09556c8",
            "source": "https://proxy.golang.org/github.com%2Fdocopt/docopt-go/@v/v0.0.0-20180111231733-ee0de3bc6815.zip",
            "status": "approved"
        }
    ]
}