{
    "id": "maven/mavencentral/org.apache.camel.springboot/camel-direct-starter/3.21.0",
    "license": "Apache-2.0",
    "authority": "https://gitlab.eclipse.org/eclipsefdn/emo-team/iplab/-/issues/10277",
    "source": "https://repo.maven.apache.org/maven2/org/apache/camel/springboot/camel-direct-starter/3.21.0/camel-direct-starter-3.21.0-sources.jar",
    "status": "approved",
    "scans": [
        {
            "date": "September 6, 2023 at 11:33:55 a.m. GMT",
            "authority": "https://gitlab.eclipse.org/eclipsefdn/emo-team/iplab/-/issues/10277",
            "scancode-version": "31.2.1",
            "licenses-discovered": [
                "Apache-2.0"
            ],
            "copyrights": [
            ],
            "file-count": 8,
            "sha256": "88e1a597b3f62ca0b05d542ff64ba351f0c22c8b9c5aae14f79ac0b35dbb5232",
            "source": "https://repo.maven.apache.org/maven2/org/apache/camel/springboot/camel-direct-starter/3.21.0/camel-direct-starter-3.21.0-sources.jar",
            "status": "approved"
        }
    ]
}