{
    "id": "maven/mavencentral/io.github.resilience4j/resilience4j-spring-boot3/2.0.2",
    "license": "Apache-2.0",
    "authority": "https://gitlab.eclipse.org/eclipsefdn/emo-team/iplab/-/issues/7276",
    "source": "https://search.maven.org/remotecontent?filepath=io/github/resilience4j/resilience4j-spring-boot3/2.0.2/resilience4j-spring-boot3-2.0.2-sources.jar",
    "status": "approved",
    "scans": [
        {
            "date": "February 28, 2023 at 4:44:31 p.m. GMT",
            "authority": "https://gitlab.eclipse.org/eclipsefdn/emo-team/iplab/-/issues/7276",
            "scancode-version": "31.2.1",
            "licenses-discovered": [
                "Apache-2.0"
            ],
            "copyrights": [
                "Copyright 2017 Bohdan Storozhuk",
                "Copyright 2017 Robert Winkler",
                "Copyright 2018 Clint Checketts",
                "Copyright 2019 Bohdan Storozhuk",
                "Copyright 2019 Ingyu Hwang",
                "Copyright 2019 Kyuhyen Hwang",
                "Copyright 2019 Mahmoud Romeh",
                "Copyright 2019 Robert Winkler",
                "Copyright 2019 lespinsideg",
                "Copyright 2020 Ingyu Hwang",
                "Copyright 2020 Kyuhyen Hwang",
                "Copyright 2020 Vijay Ram",
                "Copyright 2020 krnsaurabh"
            ],
            "file-count": 61,
            "sha256": "fb736a19cc96014256b694545a094f697038e6a098e141557fdb1e90787f05a7",
            "source": "https://search.maven.org/remotecontent?filepath=io/github/resilience4j/resilience4j-spring-boot3/2.0.2/resilience4j-spring-boot3-2.0.2-sources.jar",
            "status": "approved"
        }
    ]
}