{
    "id": "go/golang/github.com%2Ffatih/color/v1.7.0",
    "license": "MIT",
    "authority": "https://gitlab.eclipse.org/eclipsefdn/emo-team/iplab/-/issues/12418",
    "source": "https://proxy.golang.org/github.com%2Ffatih/color/@v/v1.7.0.zip",
    "status": "approved",
    "scans": [
        {
            "date": "December 21, 2023 at 10:58:13 a.m. GMT",
            "authority": "https://gitlab.eclipse.org/eclipsefdn/emo-team/iplab/-/issues/12418",
            "scancode-version": "31.2.1",
            "licenses-discovered": [
                "MIT"
            ],
            "copyrights": [
                "Copyright (c) 2013 Fatih Arslan"
            ],
            "file-count": 8,
            "sha256": "6036f0b31167280b696b5efb43603e71bce31420fb3428afdf74a68bb3a3ebef",
            "source": "https://proxy.golang.org/github.com%2Ffatih/color/@v/v1.7.0.zip",
            "status": "approved"
        }
    ]
}