{
    "id": "maven/mavencentral/org.jboss.forge.roaster/roaster-jdt/2.19.5.Final",
    "license": "EPL-1.0",
    "licenses-discovered": [
        "EPL-1.0",
        "Classpath-exception-2.0"
    ],
    "file-count": 1392,
    "scancode-version": "30.1.0",
    "authority": "https://gitlab.eclipse.org/eclipsefdn/emo-team/iplab/-/issues/2062",
    "source": "https://search.maven.org/remotecontent?filepath=org/jboss/forge/roaster/roaster-jdt/2.19.5.Final/roaster-jdt-2.19.5.Final-sources.jar",
    "status": "approved"
}
