{
    "id": "npm/npmjs/-/rimraf/4.1.2",
    "license": "ISC",
    "authority": "https://gitlab.eclipse.org/eclipsefdn/emo-team/iplab/-/issues/7085",
    "source": "https://github.com/isaacs/rimraf/archive/v4.1.2.zip",
    "status": "approved",
    "scans": [
        {
            "date": "February 13, 2023 at 9:26:03 a.m. GMT",
            "authority": "https://gitlab.eclipse.org/eclipsefdn/emo-team/iplab/-/issues/7085",
            "scancode-version": "31.2.1",
            "licenses-discovered": [
                "ISC"
            ],
            "copyrights": [
                "Copyright (c) 2011-2023 Isaac Z. Schlueter and Contributors",
                "Copyright (c) Isaac Z. Schlueter and Contributors"
            ],
            "file-count": 68,
            "sha256": "65ef40bcebfcbea426e251270b82260f878fdd0a59929c6e34e67b6aa5e83cbf",
            "source": "https://github.com/isaacs/rimraf/archive/v4.1.2.zip",
            "status": "approved"
        }
    ]
}