{
    "id": "npm/npmjs/@babel/helper-member-expression-to-functions/7.22.5",
    "license": "MIT",
    "authority": "https://gitlab.eclipse.org/eclipsefdn/emo-team/iplab/-/issues/8966",
    "source": "https://registry.npmjs.org/@babel/helper-member-expression-to-functions/-/helper-member-expression-to-functions-7.22.5.tgz",
    "status": "approved",
    "scans": [
        {
            "date": "June 15, 2023 at 2:57:47 p.m. GMT",
            "authority": "https://gitlab.eclipse.org/eclipsefdn/emo-team/iplab/-/issues/8966",
            "scancode-version": "31.2.1",
            "licenses-discovered": [
                "MIT"
            ],
            "copyrights": [
                "Copyright (c) 2014-present Sebastian McKenzie and other contributors"
            ],
            "file-count": 7,
            "sha256": "450d32f9016cc941ac951f60082d16dd26f9a3c83748812a0faf9a87a84a701a",
            "source": "https://registry.npmjs.org/@babel/helper-member-expression-to-functions/-/helper-member-expression-to-functions-7.22.5.tgz",
            "status": "approved"
        }
    ]
}