{
    "id": "npm/npmjs/-/node-gyp/9.4.0",
    "license": "MIT AND BSD-3-Clause",
    "authority": "https://gitlab.eclipse.org/eclipsefdn/emo-team/iplab/-/issues/9085",
    "source": "https://registry.yarnpkg.com/node-gyp/-/node-gyp-9.4.0.tgz",
    "status": "approved",
    "scans": [
        {
            "date": "June 15, 2023 at 6:35:56 p.m. GMT",
            "authority": "https://gitlab.eclipse.org/eclipsefdn/emo-team/iplab/-/issues/9085",
            "scancode-version": "31.2.1",
            "licenses-discovered": [
                "MIT",
                "BSD-3-Clause"
            ],
            "copyrights": [
                "Copyright (c) 2009 Google Inc.",
                "Copyright (c) 2011 Google Inc.",
                "Copyright (c) 2012 Google Inc.",
                "Copyright (c) 2012 Nathan Rajlich <nathan@tootallnate.net>",
                "Copyright (c) 2012 The Chromium Authors",
                "Copyright (c) 2013 Google Inc.",
                "Copyright (c) 2014 Google Inc.",
                "Copyright (c) 2016 Ben Noordhuis <info@bnoordhuis.nl>",
                "Copyright (c) 2020 Node.js contributors",
                "Copyright (c) Microsoft Corporation",
                "Copyright 2013 Google Inc.",
                "Copyright 2013 The Chromium Authors",
                "Copyright 2014 Google Inc.",
                "Copyright 2017 - Refael Ackermann"
            ],
            "file-count": 135,
            "sha256": "ba2994ae1479e5a93925ec5ccc2ea547bd0409d441805ec90dfa04233a3c8e87",
            "source": "https://registry.yarnpkg.com/node-gyp/-/node-gyp-9.4.0.tgz",
            "status": "approved"
        }
    ]
}