{
    "id": "maven/mavencentral/org.ow2.asm/asm-commons/9.5",
    "license": "BSD-3-Clause",
    "authority": "https://gitlab.eclipse.org/eclipsefdn/emo-team/iplab/-/issues/7553",
    "source": "https://search.maven.org/remotecontent?filepath=org/ow2/asm/asm-commons/9.5/asm-commons-9.5-sources.jar",
    "status": "approved",
    "scans": [
        {
            "date": "March 27, 2023 at 2:20:57 p.m. GMT",
            "authority": "https://gitlab.eclipse.org/eclipsefdn/emo-team/iplab/-/issues/7553",
            "scancode-version": "31.2.1",
            "licenses-discovered": [
                "BSD-3-Clause"
            ],
            "copyrights": [
                "Copyright (c) 2000-2011 INRIA, France Telecom"
            ],
            "file-count": 26,
            "sha256": "1a8047715ef4b1fc3fb7114c6914b9a23251d9ac15332be3f1a891557c45dfb0",
            "source": "https://search.maven.org/remotecontent?filepath=org/ow2/asm/asm-commons/9.5/asm-commons-9.5-sources.jar",
            "status": "approved"
        }
    ]
}