{
    "id": "maven/mavencentral/io.micrometer/micrometer-commons/1.14.1",
    "license": "Apache-2.0 AND (Apache-2.0 AND MIT)",
    "authority": "https://gitlab.eclipse.org/eclipsefdn/emo-team/iplab/-/issues/17272",
    "source": "https://repo1.maven.org/maven2/io/micrometer/micrometer-commons/1.14.1/micrometer-commons-1.14.1-sources.jar",
    "status": "approved",
    "scans": [
        {
            "date": "November 19, 2024, 12:39:24 a.m. GMT",
            "authority": "https://gitlab.eclipse.org/eclipsefdn/emo-team/iplab/-/issues/17272",
            "scancode-version": "31.2.1",
            "licenses-discovered": [
                "Apache-2.0",
                "Apache-2.0 AND MIT"
            ],
            "copyrights": [
                "Copyright (c) 2004-2011 QOS.ch",
                "Copyright 2002-2017 the original author or authors",
                "Copyright 2012 The Netty Project",
                "Copyright 2013 The Netty Project",
                "Copyright 2017 The Netty Project",
                "Copyright 2017 VMware, Inc.",
                "Copyright 2017-2021 VMware, Inc.",
                "Copyright 2019 VMware, Inc.",
                "Copyright 2022 VMware, Inc.",
                "Copyright 2023 VMware, Inc.",
                "Copyright 2023 the original author or authors"
            ],
            "file-count": 36,
            "sha256": "e1a4a8e453cf27d161c5b1222756a0c7e51e02d4014c7667e06633b459eea82e",
            "source": "https://repo1.maven.org/maven2/io/micrometer/micrometer-commons/1.14.1/micrometer-commons-1.14.1-sources.jar",
            "status": "approved"
        }
    ]
}