{
    "id": "project/automotive/muto/liveui-react/0.0",
    "license": "Apache-2.0",
    "licenses-discovered": [
        "Apache-2.0"
    ],
    "copyrights": [
        "Copyright Composiv Inc and its affiliates"
    ],
    "file-count": 19,
    "scancode-version": "30.1.0",
    "authority": "https://gitlab.eclipse.org/eclipsefdn/emo-team/iplab/-/issues/2752",
    "source": "https://github.com/composiv/liveui-react/archive/refs/heads/master.zip",
    "status": "approved"
}