{
    "id": "p2/orbit/p2.eclipse-plugin/org.springframework.boot.spring-boot-maven-plugin/1.5.8",
    "license": "Apache-2.0",
    "licenses-discovered": [
        "Apache-2.0"
    ],
    "file-count": 21,
    "scancode-version": "30.1.0",
    "authority": "https://gitlab.eclipse.org/eclipsefdn/emo-team/iplab/-/issues/2303",
    "source": "https://search.maven.org/remotecontent?filepath=org/springframework/boot/spring-boot-maven-plugin/1.5.5.RELEASE/spring-boot-maven-plugin-1.5.5.RELEASE-sources.jar",
    "status": "approved"
}