{
    "id": "npm/npmjs/-/node-ssh/13.1.0",
    "license": "MIT",
    "authority": "https://gitlab.eclipse.org/eclipsefdn/emo-team/iplab/-/issues/10094",
    "source": "https://github.com/steelbrain/node-ssh/archive/refs/tags/v13.1.0.zip",
    "status": "approved",
    "scans": [
        {
            "date": "August 21, 2023 at 8:57:33 a.m. GMT",
            "authority": "https://gitlab.eclipse.org/eclipsefdn/emo-team/iplab/-/issues/10094",
            "scancode-version": "31.2.1",
            "licenses-discovered": [
                "MIT"
            ],
            "copyrights": [
                "Copyright (c) 2014-2021 Steel Brain"
            ],
            "file-count": 34,
            "sha256": "b349a80caf016563d95f4b4a8cc6fddcfdd25429771b241f2d90ef73a7ee7e9b",
            "source": "https://github.com/steelbrain/node-ssh/archive/refs/tags/v13.1.0.zip",
            "status": "approved"
        }
    ]
}