{
    "id": "maven/mavencentral/org.json/json/20250107",
    "license": "LicenseRef-Public-domain",
    "authority": "https://gitlab.eclipse.org/eclipsefdn/emo-team/iplab/-/issues/19178",
    "source": "https://repo1.maven.org/maven2/org/json/json/20250107/json-20250107-sources.jar",
    "status": "approved",
    "scans": [
        {
            "date": "January 22, 2025 at 3:46:27 a.m. GMT",
            "authority": "https://gitlab.eclipse.org/eclipsefdn/emo-team/iplab/-/issues/19178",
            "scancode-version": "31.2.1",
            "licenses-discovered": [
            ],
            "copyrights": [
            ],
            "file-count": 29,
            "sha256": "851c5efe8d4e8cc231d05c6172f4400bc2e078708945b0ad4dafc8f428af956f",
            "source": "https://repo1.maven.org/maven2/org/json/json/20250107/json-20250107-sources.jar",
            "status": "restricted"
        }
    ]
}