{
    "id": "maven/mavencentral/org.apache.activemq/artemis-plugin/2.27.1",
    "license": "Apache-2.0",
    "authority": "https://gitlab.eclipse.org/eclipsefdn/emo-team/iplab/-/issues/6744",
    "source": "https://search.maven.org/remotecontent?filepath=org/apache/activemq/artemis-plugin/2.27.1/artemis-plugin-2.27.1-sources.jar",
    "status": "approved",
    "scans": [
        {
            "date": "January 27, 2023 at 12:12:37 p.m. GMT",
            "authority": "https://gitlab.eclipse.org/eclipsefdn/emo-team/iplab/-/issues/6744",
            "scancode-version": "31.2.1",
            "licenses-discovered": [
                "Apache-2.0"
            ],
            "copyrights": [
            ],
            "file-count": 6,
            "sha256": "067a740bec0611790821834d57fd76cb0b95f74ad301a119533fe9afc9633b20",
            "source": "https://search.maven.org/remotecontent?filepath=org/apache/activemq/artemis-plugin/2.27.1/artemis-plugin-2.27.1-sources.jar",
            "status": "approved"
        }
    ]
}