{
    "id": "maven/mavencentral/com.fasterxml.jackson.jaxrs/jackson-jaxrs-json-provider/2.16.0",
    "license": "Apache-2.0",
    "authority": "https://gitlab.eclipse.org/eclipsefdn/emo-team/iplab/-/issues/11604",
    "source": "https://repo1.maven.org/maven2/com/fasterxml/jackson/jaxrs/jackson-jaxrs-json-provider/2.16.0/jackson-jaxrs-json-provider-2.16.0-sources.jar",
    "status": "approved",
    "scans": [
        {
            "date": "November 16, 2023 at 9:19:13 a.m. GMT",
            "authority": "https://gitlab.eclipse.org/eclipsefdn/emo-team/iplab/-/issues/11604",
            "scancode-version": "31.2.1",
            "licenses-discovered": [
                "Apache-2.0"
            ],
            "copyrights": [
            ],
            "file-count": 15,
            "sha256": "d87272ff7eebe1950c5f7e9685b6031f4c887e1cc4feac4b35afefd68742fac5",
            "source": "https://repo1.maven.org/maven2/com/fasterxml/jackson/jaxrs/jackson-jaxrs-json-provider/2.16.0/jackson-jaxrs-json-provider-2.16.0-sources.jar",
            "status": "approved"
        }
    ]
}