{
    "license": "Apache-2.0",
    "file-count": 31,
    "authority": "https://gitlab.eclipse.org/eclipsefdn/emo-team/iplab/-/issues/1697",
    "scancode-version": "30.1.0",
    "licenses-discovered": [
        "Apache-2.0"
    ],
    "id": "maven/mavencentral/org.apache.jena/jena-dboe-trans-data/3.14.0",
    "source": "https://search.maven.org/remotecontent?filepath=org/apache/jena/jena-dboe-trans-data/3.14.0/jena-dboe-trans-data-3.14.0-sources.jar",
    "status": "approved"
}