{
    "id": "npm/npmjs/@typescript-eslint/eslint-plugin/5.59.1",
    "license": "BSD-2-Clause AND MIT",
    "authority": "https://gitlab.eclipse.org/eclipsefdn/emo-team/iplab/-/issues/8045",
    "source": "https://github.com/typescript-eslint/typescript-eslint/archive/v5.59.1.zip",
    "status": "approved",
    "scans": [
        {
            "date": "April 28, 2023 at 5:29:26 p.m. GMT",
            "authority": "https://gitlab.eclipse.org/eclipsefdn/emo-team/iplab/-/issues/8045",
            "scancode-version": "31.2.1",
            "licenses-discovered": [
                "BSD-2-Clause",
                "MIT"
            ],
            "copyrights": [
                "Copyright (c) 2016 unional",
                "Copyright (c) 2019 typescript-eslint and other contributors",
                "Copyright (c) 2021 typescript-eslint and other contributors",
                "Copyright JS Foundation and other contributors, https://js.foundation",
                "Copyright Joyent, Inc. and other Node contributors"
            ],
            "file-count": 6939,
            "sha256": "88639b171c50d81b153aa80b0465a22c010e16c4c912d8c98f9d70edca64b098",
            "source": "https://github.com/typescript-eslint/typescript-eslint/archive/v5.59.1.zip",
            "status": "approved"
        }
    ]
}