{
    "id": "maven/mavencentral/io.netty/netty-codec-dns/4.2.0.Alpha4",
    "license": "Apache-2.0",
    "authority": "https://gitlab.eclipse.org/eclipsefdn/emo-team/iplab/-/issues/16112",
    "source": "https://repo1.maven.org/maven2/io/netty/netty-codec-dns/4.2.0.Alpha4/netty-codec-dns-4.2.0.Alpha4-sources.jar",
    "status": "approved",
    "scans": [
        {
            "date": "September 11, 2024, 11:49:32 p.m. GMT",
            "authority": "https://gitlab.eclipse.org/eclipsefdn/emo-team/iplab/-/issues/16112",
            "scancode-version": "31.2.1",
            "licenses-discovered": [
                "Apache-2.0"
            ],
            "copyrights": [
                "Copyright 2014 The Netty Project",
                "Copyright 2015 The Netty Project",
                "Copyright 2016 The Netty Project",
                "Copyright 2019 The Netty Project",
                "Copyright 2021 The Netty Project",
                "Copyright 2024 The Netty Project"
            ],
            "file-count": 46,
            "sha256": "d17a8001237a0f01c6cb61f2c215de1ccf9c3732353469fec14efeadbec0268f",
            "source": "https://repo1.maven.org/maven2/io/netty/netty-codec-dns/4.2.0.Alpha4/netty-codec-dns-4.2.0.Alpha4-sources.jar",
            "status": "approved"
        }
    ]
}