{
    "id": "project/automotive.tractusx/-/bpdm/4.0.0-SNAPSHOT",
    "license": "Apache-2.0",
    "authority": "https://gitlab.eclipse.org/eclipsefdn/emo-team/iplab/-/issues/8097",
    "source": "https://github.com/eclipse-tractusx/bpdm/pull/111.patch",
    "status": "approved",
    "scans": [
        {
            "date": "May 2, 2023 at 4:02:43 p.m. GMT",
            "authority": "https://gitlab.eclipse.org/eclipsefdn/emo-team/iplab/-/issues/8097",
            "scancode-version": "31.2.1",
            "licenses-discovered": [
                "Apache-2.0"
            ],
            "copyrights": [
                "Copyright (c) 2021,2023 Contributors"
            ],
            "file-count": 1,
            "sha256": "c07e93e4032b9655fc1567730a80a2aac634f2306f8515b2cc21175b7b24f83d",
            "source": "https://github.com/eclipse-tractusx/bpdm/pull/111.patch",
            "status": "restricted"
        }
    ]
}
