{
    "id": "npm/npmjs/-/pdfjs-dist/4.6.82",
    "license": "Apache-2.0 AND LicenseRef-Non-commercial AND MPL-2.0 AND CC-BY-NC-1.0 AND (MPL-1.1 OR GPL-2.0-or-later OR LGPL-2.1-or-later) AND (Apache-2.0 AND MIT) AND CC-BY-NC-ND",
    "authority": "https://gitlab.eclipse.org/eclipsefdn/emo-team/iplab/-/issues/16054",
    "source": "https://github.com/mozilla/pdf.js/archive/refs/tags/v4.6.82.zip",
    "status": "restricted",
    "scans": [
        {
            "date": "September 3, 2024 at 9:33:10 a.m. GMT",
            "authority": "https://gitlab.eclipse.org/eclipsefdn/emo-team/iplab/-/issues/16054",
            "scancode-version": "31.2.1",
            "licenses-discovered": [
                "Apache-2.0",
                "MPL-2.0",
                "MIT",
                "Apache-2.0 AND CC-BY-SA-2.5",
                "CC0-1.0",
                "CC-PDDC",
                "BSD-3-Clause",
                "BSD-2-Clause",
                "OFL-1.1",
                "AGPL-3.0-or-later AND LicenseRef-scancode-commercial-license",
                "Apache-2.0 AND MIT",
                "AGPL-3.0-or-later",
                "CC-BY-NC-1.0",
                "LicenseRef-scancode-proprietary-license",
                "CC-BY-NC-ND-3.0",
                "GPL-2.0-or-later AND LGPL-2.1-or-later AND MPL-1.1"
            ],
            "copyrights": [
                "(c) 2007 Red Hat, Inc.",
                "(c) 2012-2014 Metromile Inc.",
                "(c) Copyright 2010 Core Performance",
                "(c) Mozilla and individual contributors",
                "(c) OpenJS Foundation and other contributors",
                "(c) RenderX 2000 XSL Formatting Objects Test Suite",
                "(c) The Document Foundation",
                "(c) available from the ASN",
                "Copyright (c) 2001-2018, AMYUNI Technologies Inc. http://www.amyuni.com",
                "Copyright (c) 2007 Red Hat, Inc.",
                "Copyright (c) 2007 by WindJack Solutions, Inc.",
                "Copyright (c) 2008-2016 Pivotal Labs",
                "Copyright (c) 2012 Red Hat, Inc.",
                "Copyright 1990-2009 Adobe Systems Incorporated",
                "Copyright 1990-2015 Adobe Systems Incorporated",
                "Copyright 1996-2003 Glyph & Cog, LLC",
                "Copyright 2003 - 2012 Aspose Pty Ltd.",
                "Copyright 2011-2018 The Bootstrap Authors",
                "Copyright 2011-2018 The Bootstrap Authors (https://github.com/twbs/bootstrap/graphs/contributors)",
                "Copyright 2011-2018 Twitter, Inc.",
                "Copyright 2012 Mozilla Foundation",
                "Copyright 2013 Mozilla Foundation",
                "Copyright 2013 Rob Wu <rob@robwu.nl> https://github.com/Rob",
                "Copyright 2014 Mozilla Foundation",
                "Copyright 2014 Opera Software ASA",
                "Copyright 2014 PDFium Authors",
                "Copyright 2015 Mozilla Foundation",
                "Copyright 2016 Mozilla Foundation",
                "Copyright 2017 Mozilla Foundation",
                "Copyright 2018 Mozilla Foundation",
                "Copyright 2019 Mozilla Foundation",
                "Copyright 2020 Mozilla Foundation",
                "Copyright 2021 Mozilla Foundation",
                "Copyright 2022 Mozilla Foundation",
                "Copyright 2023 Mozilla Foundation",
                "Copyright 2024 Mozilla Foundation",
                "Copyright Copyright 1990-2009 Adobe Systems Incorporated",
                "Copyright c(cid:13) 2009 ACM",
                "copyright (c) 2010 Google Corporation",
                "copyright 2014 Foxit Software Inc. http://www.foxitsoftware.com"
            ],
            "file-count": 2030,
            "sha256": "7fcb354392e905fe9af717e828818fe57caaa0c7f2bbdede207aca2735afcf06",
            "source": "https://github.com/mozilla/pdf.js/archive/refs/tags/v4.6.82.zip",
            "status": "restricted"
        }
    ]
}