{
    "id": "maven/mavencentral/org.apache.groovy/groovy-servlet/4.0.19",
    "license": "Apache-2.0",
    "authority": "https://gitlab.eclipse.org/eclipsefdn/emo-team/iplab/-/issues/14213",
    "source": "https://repo1.maven.org/maven2/org/apache/groovy/groovy-servlet/4.0.19/groovy-servlet-4.0.19-sources.jar",
    "status": "approved",
    "scans": [
        {
            "date": "April 4, 2024 at 12:49:00 a.m. GMT",
            "authority": "https://gitlab.eclipse.org/eclipsefdn/emo-team/iplab/-/issues/14213",
            "scancode-version": "31.2.1",
            "licenses-discovered": [
                "Apache-2.0"
            ],
            "copyrights": [
            ],
            "file-count": 9,
            "sha256": "561c96147e209164e873ebfc9c8fa0d2c400b25b5e90943d0e0cecaf1f25e351",
            "source": "https://repo1.maven.org/maven2/org/apache/groovy/groovy-servlet/4.0.19/groovy-servlet-4.0.19-sources.jar",
            "status": "approved"
        }
    ]
}