{
    "id": "npm/npmjs/@typescript-eslint/eslint-plugin/6.19.0",
    "license": "BSD-2-Clause AND (BSD-2-Clause AND ISC AND MIT) AND MIT",
    "authority": "https://gitlab.eclipse.org/eclipsefdn/emo-team/iplab/-/issues/12778",
    "source": "https://github.com/typescript-eslint/typescript-eslint/archive/refs/tags/v6.19.0.zip",
    "status": "approved",
    "scans": [
        {
            "date": "January 16, 2024 at 9:24:23 a.m. GMT",
            "authority": "https://gitlab.eclipse.org/eclipsefdn/emo-team/iplab/-/issues/12778",
            "scancode-version": "31.2.1",
            "licenses-discovered": [
                "BSD-2-Clause",
                "BSD-2-Clause AND ISC AND MIT",
                "MIT"
            ],
            "copyrights": [
                "Copyright (c) 2016 unional",
                "Copyright (c) 2019 typescript-eslint and other contributors",
                "Copyright (c) 2021 typescript-eslint and other contributors",
                "Copyright (c) 2023 typescript-eslint and other contributors",
                "Copyright JS Foundation and other contributors, https://js.foundation",
                "Copyright Joyent, Inc. and other Node contributors"
            ],
            "file-count": 6885,
            "sha256": "6c775382c393d66dcbe1b40f38db4cfb6babe6929d7e77bcbad85cbfebf8d438",
            "source": "https://github.com/typescript-eslint/typescript-eslint/archive/refs/tags/v6.19.0.zip",
            "status": "approved"
        }
    ]
}