{
    "id": "maven/mavencentral/org.apache.poi/poi/3.11",
    "license": "Apache-2.0 AND CPL-1.0 AND Apache-2.0",
    "licenses-discovered": [
        "Apache-2.0 AND CPL-1.0",
        "Apache-2.0"
    ],
    "file-count": 1001,
    "scancode-version": "30.1.0",
    "authority": "https://gitlab.eclipse.org/eclipsefdn/emo-team/iplab/-/issues/2234",
    "source": "https://search.maven.org/remotecontent?filepath=org/apache/poi/poi/3.11/poi-3.11-sources.jar",
    "status": "approved",
    "copyrights": [
        "Copyright (c) BEA Systems, <http://www.bea.com/>",
        "Copyright (c) Valek Filippov (frob@df.ru)",
        "Copyright (c) World Wide Web Consortium (Massachusetts Institute of Technology, European Research Consortium for Informatics and Mathematics, Keio University)",
        "Copyright The Apache Software Foundation",
        "Copyright Yuval Oren"
    ]
}