{
    "id": "-/-/vscode/language-features-subset/1.91.0",
    "license": "MIT AND (Apache-2.0 AND MIT AND W3C) AND Apache-2.0",
    "authority": "https://gitlab.eclipse.org/eclipsefdn/emo-team/iplab/-/issues/15614",
    "source": "https://gitlab.eclipse.org/eclipsefdn/emo-team/iplab/uploads/ffafd4f7236795b85859e394a0ee1dc0/language-features-1.91.0.zip",
    "status": "approved",
    "scans": [
        {
            "date": "July 3, 2024 at 10:17:23 p.m. GMT",
            "authority": "https://gitlab.eclipse.org/eclipsefdn/emo-team/iplab/-/issues/15614",
            "scancode-version": "31.2.1",
            "licenses-discovered": [
                "MIT",
                "Apache-2.0 AND MIT AND W3C",
                "Apache-2.0"
            ],
            "copyrights": [
                "Copyright (c) 2015 W3C(r) MIT, ERCIM, Keio",
                "Copyright (c) Microsoft Corporation",
                "Copyright Drifty Co. http://drifty.com/"
            ],
            "file-count": 176,
            "sha256": "5b4615f44fb1118dbe6c7c0d62f995c61728c002fba73793739346ed8724758b",
            "source": "https://gitlab.eclipse.org/eclipsefdn/emo-team/iplab/uploads/ffafd4f7236795b85859e394a0ee1dc0/language-features-1.91.0.zip",
            "status": "approved"
        }
    ]
}