{
    "id": "git/github/labstack/gommon/v0.3.0",
    "license": "MIT",
    "licenses-discovered": [
        "MIT"
    ],
    "copyrights": [
        "Copyright (c) labstack"
    ],
    "file-count": 21,
    "scancode-version": "30.1.0",
    "authority": "https://gitlab.eclipse.org/eclipsefdn/emo-team/iplab/-/issues/3616",
    "source": "https://github.com/labstack/gommon/archive/refs/tags/v0.3.0.zip",
    "status": "approved"
}