{
    "id": "project/automotive.uprotocol/eclipse-uprotocol/uprotocol-core-api/effbfd6a79a27dd5fe7f63f5c54f2c19dc30ce30",
    "license": "Apache-2.0",
    "authority": "https://gitlab.eclipse.org/eclipsefdn/emo-team/iplab/-/issues/8576",
    "source": "https://github.com/eclipse-uprotocol/uprotocol-core-api/archive/effbfd6a79a27dd5fe7f63f5c54f2c19dc30ce30.zip",
    "status": "approved",
    "scans": [
        {
            "date": "May 31, 2023 at 6:13:13 p.m. GMT",
            "authority": "https://gitlab.eclipse.org/eclipsefdn/emo-team/iplab/-/issues/8576",
            "scancode-version": "31.2.1",
            "licenses-discovered": [
                "Apache-2.0"
            ],
            "copyrights": [
            ],
            "file-count": 12,
            "sha256": "d9e511c7d6998fc34c3c5304fef41f3a05aa32f8e5a79c2bce40f1167197eec4",
            "source": "https://github.com/eclipse-uprotocol/uprotocol-core-api/archive/effbfd6a79a27dd5fe7f63f5c54f2c19dc30ce30.zip",
            "status": "restricted"
        }
    ]
}
