{
    "id": "project/ecd.opensmartclide/eclipse-opensmartclide/smartclide-service-discovery-poc/c5a6a2b7fdee43631bc6593918e2d189578dfada",
    "license": "EPL-2.0",
    "authority": "https://gitlab.eclipse.org/eclipsefdn/emo-team/iplab/-/issues/6899",
    "source": "https://github.com/eclipse-opensmartclide/smartclide-service-discovery-poc/archive/c5a6a2b7fdee43631bc6593918e2d189578dfada.zip",
    "status": "restricted",
    "scans": [
        {
            "date": "January 30, 2023 at 9:34:00 p.m. GMT",
            "authority": "https://gitlab.eclipse.org/eclipsefdn/emo-team/iplab/-/issues/6899",
            "scancode-version": "31.2.1",
            "licenses-discovered": [
                "EPL-2.0"
            ],
            "copyrights": [
                "Copyright (c) 2021-2022 AIR Institute",
                "Copyright (c) 2022 AIR Institute"
            ],
            "file-count": 39,
            "sha256": "89d1b188e74d989d14303c5dd3dd54a790f5b81eba72ab50b6160fb1c610be6e",
            "source": "https://github.com/eclipse-opensmartclide/smartclide-service-discovery-poc/archive/c5a6a2b7fdee43631bc6593918e2d189578dfada.zip",
            "status": "restricted"
        }
    ]
}