{
    "license": "Apache-2.0",
    "file-count": 120,
    "authority": "https://gitlab.eclipse.org/eclipsefdn/emo-team/iplab/-/issues/1150",
    "scancode-version": "21.3.31",
    "licenses-discovered": [
        "Apache-2.0"
    ],
    "id": "maven/mavencentral/io.opencensus/opencensus-api/0.18.0",
    "source": "https://search.maven.org/remotecontent?filepath=io/opencensus/opencensus-api/0.18.0/opencensus-api-0.18.0-sources.jar",
    "status": "approved"
}