{
    "id": "maven/mavencentral/io.hypersistence/hypersistence-utils-hibernate-60/3.6.1",
    "license": "Apache-2.0",
    "authority": "https://gitlab.eclipse.org/eclipsefdn/emo-team/iplab/-/issues/11892",
    "source": "https://repo1.maven.org/maven2/io/hypersistence/hypersistence-utils-hibernate-60/3.6.1/hypersistence-utils-hibernate-60-3.6.1-sources.jar",
    "status": "approved",
    "scans": [
        {
            "date": "December 13, 2023 at 7:25:27 a.m. GMT",
            "authority": "https://gitlab.eclipse.org/eclipsefdn/emo-team/iplab/-/issues/11892",
            "scancode-version": "31.2.1",
            "licenses-discovered": [
            ],
            "copyrights": [
            ],
            "file-count": 140,
            "sha256": "95579b6c74c8150b70f99c760db3fefd65b8362fb542ef9e4c4bf52921cab5ef",
            "source": "https://repo1.maven.org/maven2/io/hypersistence/hypersistence-utils-hibernate-60/3.6.1/hypersistence-utils-hibernate-60-3.6.1-sources.jar",
            "status": "restricted"
        }
    ]
}
