{
    "license": "Apache-2.0 AND MIT AND Python-2.0",
    "file-count": 117,
    "authority": "https://gitlab.eclipse.org/eclipsefdn/emo-team/iplab/-/issues/1420",
    "scancode-version": "30.1.0",
    "licenses-discovered": [
        "MIT",
        "Python-2.0",
        "Apache-2.0"
    ],
    "id": "pypi/pypi/-/urllib3/1.25.10",
    "source": "https://files.pythonhosted.org/packages/81/f4/87467aeb3afc4a6056e1fe86626d259ab97e1213b1dfec14c7cb5f538bf0/urllib3-1.25.10.tar.gz",
    "status": "restricted"
}