{
    "id": "maven/mavencentral/org.apache.xmlgraphics/batik-script/1.17",
    "license": "Apache-2.0",
    "authority": "https://gitlab.eclipse.org/eclipsefdn/emo-team/iplab/-/issues/10148",
    "source": "https://repo.maven.apache.org/maven2/org/apache/xmlgraphics/batik-script/1.17/batik-script-1.17-sources.jar",
    "status": "approved",
    "scans": [
        {
            "date": "August 22, 2023 at 11:11:12 a.m. GMT",
            "authority": "https://gitlab.eclipse.org/eclipsefdn/emo-team/iplab/-/issues/10148",
            "scancode-version": "31.2.1",
            "licenses-discovered": [
                "Apache-2.0"
            ],
            "copyrights": [
            ],
            "file-count": 23,
            "sha256": "242f16bcc80f4873b598c9c10b0f2ee0dfb6eae0b4e44d8cda73b2570edefa65",
            "source": "https://repo.maven.apache.org/maven2/org/apache/xmlgraphics/batik-script/1.17/batik-script-1.17-sources.jar",
            "status": "approved"
        }
    ]
}