{
    "id": "maven/mavencentral/org.geotools.ogc/net.opengis.ows/31.0",
    "license": "LGPL-2.1-only",
    "authority": "https://gitlab.eclipse.org/eclipsefdn/emo-team/iplab/-/issues/13879",
    "source": "https://repo.osgeo.org/repository/geotools-releases/org/geotools/ogc/net.opengis.ows/31.0/net.opengis.ows-31.0-sources.jar",
    "status": "approved",
    "scans": [
        {
            "date": "March 19, 2024 at 9:44:14 p.m. GMT",
            "authority": "https://gitlab.eclipse.org/eclipsefdn/emo-team/iplab/-/issues/13879",
            "scancode-version": "31.2.1",
            "licenses-discovered": [
            ],
            "copyrights": [
                "Copyright (c) 2006 Open Geospatial Consortium, Inc.",
                "Copyright (c) 2009 Open Geospatial Consortium. To"
            ],
            "file-count": 414,
            "sha256": "c5d23964b3fd9b6ca7200d4419d736998f0edd24f5e8b4ccea7fbc1367a45154",
            "source": "https://repo.osgeo.org/repository/geotools-releases/org/geotools/ogc/net.opengis.ows/31.0/net.opengis.ows-31.0-sources.jar",
            "status": "restricted"
        }
    ]
}
