{
    "license": "ISC AND MIT",
    "file-count": 4,
    "authority": "https://gitlab.eclipse.org/eclipsefdn/emo-team/iplab/-/issues/1026",
    "scancode-version": "21.3.31",
    "licenses-discovered": [
        "MIT",
        "ISC"
    ],
    "id": "npm/npmjs/@webassemblyjs/helper-fsm/1.7.11",
    "source": "https://registry.npmjs.org/@webassemblyjs/helper-fsm/-/helper-fsm-1.7.11.tgz",
    "status": "approved"
}