{
    "id": "maven/mavencentral/io.fabric8/kubernetes-client/6.11.0",
    "license": "Apache-2.0",
    "authority": "https://gitlab.eclipse.org/eclipsefdn/emo-team/iplab/-/issues/14157",
    "source": "https://repo1.maven.org/maven2/io/fabric8/kubernetes-client/6.11.0/kubernetes-client-6.11.0-sources.jar",
    "status": "approved",
    "scans": [
        {
            "date": "March 26, 2024 at 4:27:45 p.m. GMT",
            "authority": "https://gitlab.eclipse.org/eclipsefdn/emo-team/iplab/-/issues/14157",
            "scancode-version": "31.2.1",
            "licenses-discovered": [
                "Apache-2.0"
            ],
            "copyrights": [
                "Copyright (c) 2015 Red Hat, Inc."
            ],
            "file-count": 136,
            "sha256": "bda207d4c77c4c92fe6dfbbd11e9a69ac1bb8f16bdd72a88d26858c56d32536b",
            "source": "https://repo1.maven.org/maven2/io/fabric8/kubernetes-client/6.11.0/kubernetes-client-6.11.0-sources.jar",
            "status": "approved"
        }
    ]
}