{
    "id": "maven/mavencentral/io.circe/circe-parser_2.13/0.14.2",
    "license": "Apache-2.0",
    "licenses-discovered": [
    ],
    "copyrights": [
    ],
    "file-count": 2,
    "scancode-version": "31.2.1",
    "authority": "https://gitlab.eclipse.org/eclipsefdn/emo-team/iplab/-/issues/4468",
    "source": "https://search.maven.org/remotecontent?filepath=io/circe/circe-parser_2.13/0.14.2/circe-parser_2.13-0.14.2-sources.jar",
    "status": "approved"
}
