{
    "id": "go/golang/github.com%2Fgrpc-ecosystem/grpc-gateway/v1.16.0",
    "license": "BSD-3-CLause AND Apache-2.0",
    "authority": "https://gitlab.eclipse.org/eclipsefdn/emo-team/iplab/-/issues/11077",
    "source": "https://proxy.golang.org/github.com%2Fgrpc-ecosystem/grpc-gateway/@v/v1.16.0.zip",
    "status": "approved",
    "scans": [
        {
            "date": "October 16, 2023 at 9:28:14 a.m. GMT",
            "authority": "https://gitlab.eclipse.org/eclipsefdn/emo-team/iplab/-/issues/11077",
            "scancode-version": "31.2.1",
            "licenses-discovered": [
                "LicenseRef-scancode-free-unknown",
                "BSD-3-Clause",
                "JSON",
                "BSD-3-Clause AND JSON",
                "Apache-2.0"
            ],
            "copyrights": [
                "Copyright (c) 2015, Gengo, Inc.",
                "Copyright (c) 2015, Google Inc.",
                "Copyright 2010 The Go Authors",
                "Copyright 2017 Google Inc.",
                "Copyright 2018 Google LLC",
                "Copyright 2018 Google LLC."
            ],
            "file-count": 337,
            "sha256": "377b03aef288b34ed894449d3ddba40d525dd7fb55de6e79045cdf499e7fe565",
            "source": "https://proxy.golang.org/github.com%2Fgrpc-ecosystem/grpc-gateway/@v/v1.16.0.zip",
            "status": "restricted"
        }
    ]
}
