{
    "id": "npm/npmjs/-/eslint-plugin-require-explicit-generics/1.0.0",
    "license": "MIT",
    "authority": "https://gitlab.eclipse.org/eclipsefdn/emo-team/iplab/-/issues/11941",
    "source": "https://registry.yarnpkg.com/eslint-plugin-require-explicit-generics/-/eslint-plugin-require-explicit-generics-1.0.0.tgz",
    "status": "approved",
    "scans": [
        {
            "date": "December 13, 2023 at 10:30:32 p.m. GMT",
            "authority": "https://gitlab.eclipse.org/eclipsefdn/emo-team/iplab/-/issues/11941",
            "scancode-version": "31.2.1",
            "licenses-discovered": [
                "MIT"
            ],
            "copyrights": [
            ],
            "file-count": 3,
            "sha256": "cb5ea2f4aae7523b557a977b4e0028d72a8ed59107fb970b0bd37e99f7b06cb1",
            "source": "https://registry.yarnpkg.com/eslint-plugin-require-explicit-generics/-/eslint-plugin-require-explicit-generics-1.0.0.tgz",
            "status": "approved"
        }
    ]
}