{
    "id": "maven/mavencentral/org.apache.aries.spifly/org.apache.aries.spifly.dynamic.bundle/1.3.7",
    "license": "Apache-2.0",
    "authority": "https://gitlab.eclipse.org/eclipsefdn/emo-team/iplab/-/issues/15243",
    "source": "https://repo1.maven.org/maven2/org/apache/aries/spifly/org.apache.aries.spifly.dynamic.bundle/1.3.7/org.apache.aries.spifly.dynamic.bundle-1.3.7-sources.jar",
    "status": "approved",
    "scans": [
        {
            "date": "June 14, 2024 at 11:15:46 a.m. GMT",
            "authority": "https://gitlab.eclipse.org/eclipsefdn/emo-team/iplab/-/issues/15243",
            "scancode-version": "31.2.1",
            "licenses-discovered": [
                "Apache-2.0"
            ],
            "copyrights": [
            ],
            "file-count": 75,
            "sha256": "d5ff48c4252b8a55761587917fe2e3f280d3e113029f04c2cd1787c1dbf64fd2",
            "source": "https://repo1.maven.org/maven2/org/apache/aries/spifly/org.apache.aries.spifly.dynamic.bundle/1.3.7/org.apache.aries.spifly.dynamic.bundle-1.3.7-sources.jar",
            "status": "approved"
        }
    ]
}