{
    "id": "maven/mavencentral/io.fabric8/openshift-model-whereabouts/6.4.0",
    "license": "Apache-2.0",
    "authority": "https://gitlab.eclipse.org/eclipsefdn/emo-team/iplab/-/issues/6591",
    "source": "https://search.maven.org/remotecontent?filepath=io/fabric8/openshift-model-whereabouts/6.4.0/openshift-model-whereabouts-6.4.0-sources.jar",
    "status": "approved",
    "scans": [
        {
            "date": "January 24, 2023 at 9:02:28 a.m. GMT",
            "authority": "https://gitlab.eclipse.org/eclipsefdn/emo-team/iplab/-/issues/6591",
            "scancode-version": "31.2.1",
            "licenses-discovered": [
                "Apache-2.0"
            ],
            "copyrights": [
                "Copyright (c) 2015 Red Hat, Inc."
            ],
            "file-count": 36,
            "sha256": "51d9fbe3edea6fad1f702b84e8e83fa69d32f6a50d27c8e1b1aaf1318cfff28b",
            "source": "https://search.maven.org/remotecontent?filepath=io/fabric8/openshift-model-whereabouts/6.4.0/openshift-model-whereabouts-6.4.0-sources.jar",
            "status": "approved"
        }
    ]
}