{
    "id": "npm/npmjs/-/glob/10.3.10",
    "license": "ISC AND CC-BY-SA-4.0",
    "authority": "https://gitlab.eclipse.org/eclipsefdn/emo-team/iplab/-/issues/15388",
    "source": "https://github.com/isaacs/node-glob/archive/refs/tags/v10.3.10.zip",
    "status": "approved",
    "scans": [
        {
            "date": "June 14, 2024 at 11:29:32 p.m. GMT",
            "authority": "https://gitlab.eclipse.org/eclipsefdn/emo-team/iplab/-/issues/15388",
            "scancode-version": "31.2.1",
            "licenses-discovered": [
                "ISC",
                "CC-BY-SA-4.0"
            ],
            "copyrights": [
                "Copyright (c) 2009-2023 Isaac Z. Schlueter and Contributors"
            ],
            "file-count": 79,
            "sha256": "b1f8da252d0bd54a7f7f6b07b87b30da92d5737b76f9870c6d905ccdaa41b124",
            "source": "https://github.com/isaacs/node-glob/archive/refs/tags/v10.3.10.zip",
            "status": "approved"
        }
    ]
}