{
    "id": "p2/orbit/p2.eclipse.plugin/org.apache.httpcomponents.client5.httpclient5/5.3.1.v20240126-0900",
    "license": "Apache-2.0",
    "authority": "https://gitlab.eclipse.org/eclipsefdn/emo-team/iplab/-/issues/12912",
    "source": "https://repo1.maven.org/maven2/org/apache/httpcomponents/client5/httpclient5/5.3.1/httpclient5-5.3.1-sources.jar",
    "status": "approved",
    "scans": [
        {
            "date": "January 26, 2024 at 9:08:53 a.m. GMT",
            "authority": "https://gitlab.eclipse.org/eclipsefdn/emo-team/iplab/-/issues/12912",
            "scancode-version": "31.2.1",
            "licenses-discovered": [
                "Apache-2.0"
            ],
            "copyrights": [
            ],
            "file-count": 371,
            "sha256": "fd9b36ede8dacf26a4a879795e80103d85b412e552a0cd088a593e94748d0c9a",
            "source": "https://repo1.maven.org/maven2/org/apache/httpcomponents/client5/httpclient5/5.3.1/httpclient5-5.3.1-sources.jar",
            "status": "approved"
        }
    ]
}