{
    "id": "npm/npmjs/-/array-includes/3.1.6",
    "license": "MIT",
    "licenses-discovered": [
        "MIT"
    ],
    "copyrights": [
        "Copyright (c) 2015 Jordan Harband"
    ],
    "file-count": 16,
    "scancode-version": "31.2.1",
    "authority": "https://gitlab.eclipse.org/eclipsefdn/emo-team/iplab/-/issues/4577",
    "source": "https://registry.npmjs.org/array-includes/-/array-includes-3.1.6.tgz",
    "status": "approved"
}