{
    "id": "maven/mavencentral/software.amazon.awssdk/arns/2.29.1",
    "license": "Apache-2.0",
    "authority": "https://gitlab.eclipse.org/eclipsefdn/emo-team/iplab/-/issues/16994",
    "source": "https://repo1.maven.org/maven2/software/amazon/awssdk/arns/2.29.1/arns-2.29.1-sources.jar",
    "status": "approved",
    "scans": [
        {
            "date": "November 1, 2024, 3:35:59 a.m. GMT",
            "authority": "https://gitlab.eclipse.org/eclipsefdn/emo-team/iplab/-/issues/16994",
            "scancode-version": "31.2.1",
            "licenses-discovered": [
                "Apache-2.0"
            ],
            "copyrights": [
                "Copyright Amazon.com, Inc. or its affiliates"
            ],
            "file-count": 6,
            "sha256": "0c8a22eb91bafafb4f2bc61a638dd833c182c42f2becf639854e041ed59aaf9c",
            "source": "https://repo1.maven.org/maven2/software/amazon/awssdk/arns/2.29.1/arns-2.29.1-sources.jar",
            "status": "approved"
        }
    ]
}