{
    "id": "npm/npmjs/@types/node/22.9.0",
    "license": "MIT",
    "authority": "https://gitlab.eclipse.org/eclipsefdn/emo-team/iplab/-/issues/17030",
    "source": "https://registry.npmjs.org/@types/node/-/node-22.9.0.tgz",
    "status": "approved",
    "scans": [
        {
            "date": "November 5, 2024, 9:55:13 a.m. GMT",
            "authority": "https://gitlab.eclipse.org/eclipsefdn/emo-team/iplab/-/issues/17030",
            "scancode-version": "31.2.1",
            "licenses-discovered": [
                "MIT"
            ],
            "copyrights": [
                "Copyright (c) Microsoft Corporation",
                "Copyright Node.js contributors"
            ],
            "file-count": 67,
            "sha256": "8c502db09acce005d8ed708c3be1bd4bf50255aab4ec47bcc38321c453ac01e4",
            "source": "https://registry.npmjs.org/@types/node/-/node-22.9.0.tgz",
            "status": "approved"
        }
    ]
}