{
    "id": "npm/npmjs/@nx/devkit/19.8.2",
    "license": "MIT",
    "authority": "https://gitlab.eclipse.org/eclipsefdn/emo-team/iplab/-/issues/16355",
    "source": "https://github.com/nrwl/nx/archive/refs/tags/19.8.2.zip",
    "status": "approved",
    "scans": [
        {
            "date": "September 26, 2024, 8:21:26 p.m. GMT",
            "authority": "https://gitlab.eclipse.org/eclipsefdn/emo-team/iplab/-/issues/16355",
            "scancode-version": "31.2.1",
            "licenses-discovered": [
                "MIT",
                "TMate",
                "LicenseRef-scancode-commercial-license",
                "Apache-2.0",
                "GPL-3.0-only AND JSON AND MIT",
                "JSON AND MIT",
                "LicenseRef-scancode-commercial-license AND LicenseRef-scancode-proprietary-license",
                "MIT AND Unlicense",
                "ISC",
                "JSON",
                "Apache-2.0 AND BSD-3-Clause AND CDDL-1.0 AND CDDL-1.1 AND EPL-1.0 AND EPL-2.0 AND (GPL-2.0-only WITH Classpath-exception-2.0) AND MIT"
            ],
            "copyrights": [
                "(c) 2024 made with",
                "Copyright (c) 2014 The Android Open Source Project",
                "Copyright (c) 2015-2021 the original",
                "Copyright (c) 2017-2024 Narwhal Technologies Inc.",
                "Copyright (c) 2022 Mohammad Ataei",
                "Copyright 2015 the original author or authors",
                "Copyright Apple Inc.",
                "Copyright Google Inc."
            ],
            "file-count": 7854,
            "sha256": "c7ceff9e0d7afc7dc373821fce246deda2f0f7e4b5e7789bd02448f829c64d57",
            "source": "https://github.com/nrwl/nx/archive/refs/tags/19.8.2.zip",
            "status": "restricted"
        }
    ]
}