{
    "license": "MIT",
    "file-count": 62,
    "authority": "https://gitlab.eclipse.org/eclipsefdn/emo-team/iplab/-/issues/1090",
    "scancode-version": "21.3.31",
    "licenses-discovered": [
        "MIT"
    ],
    "id": "npm/npmjs/-/yargs/3.32.0",
    "source": "https://github.com/bcoe/yargs/archive/v3.32.0.zip",
    "status": "approved"
}