{
    "id": "maven/mavencentral/org.codehaus.mojo.versions/versions-api/2.17.1",
    "license": "Apache-2.0",
    "authority": "https://gitlab.eclipse.org/eclipsefdn/emo-team/iplab/-/issues/15948",
    "source": "https://repo1.maven.org/maven2/org/codehaus/mojo/versions/versions-api/2.17.1/versions-api-2.17.1-sources.jar",
    "status": "approved",
    "scans": [
        {
            "date": "August 14, 2024 at 6:03:54 p.m. GMT",
            "authority": "https://gitlab.eclipse.org/eclipsefdn/emo-team/iplab/-/issues/15948",
            "scancode-version": "31.2.1",
            "licenses-discovered": [
                "Apache-2.0"
            ],
            "copyrights": [
                "Copyright MojoHaus and Contributors"
            ],
            "file-count": 10,
            "sha256": "0e7f3387a4fb8aed994a838d5cb83ce3402a5a4f002efd08ec1f26b7a9a69c45",
            "source": "https://repo1.maven.org/maven2/org/codehaus/mojo/versions/versions-api/2.17.1/versions-api-2.17.1-sources.jar",
            "status": "approved"
        }
    ]
}