{
    "id": "npm/npmjs/-/open-collaboration-yjs/0.2.0-next.16e7c68",
    "license": "MIT",
    "authority": "https://gitlab.eclipse.org/eclipsefdn/emo-team/iplab/-/issues/15847",
    "source": "https://registry.yarnpkg.com/open-collaboration-yjs/-/open-collaboration-yjs-0.2.0-next.16e7c68.tgz",
    "status": "approved",
    "scans": [
        {
            "date": "August 13, 2024 at 4:09:09 p.m. GMT",
            "authority": "https://gitlab.eclipse.org/eclipsefdn/emo-team/iplab/-/issues/15847",
            "scancode-version": "31.2.1",
            "licenses-discovered": [
                "MIT"
            ],
            "copyrights": [
                "Copyright 2024 TypeFox GmbH"
            ],
            "file-count": 13,
            "sha256": "58527efb9901d3edea751c0a7959057bcf6ca52f1995d9018c60ca927eac0ae8",
            "source": "https://registry.yarnpkg.com/open-collaboration-yjs/-/open-collaboration-yjs-0.2.0-next.16e7c68.tgz",
            "status": "approved"
        }
    ]
}