{
    "id": "npm/npmjs/-/source-map-js/1.2.0",
    "license": "BSD-3-Clause",
    "authority": "https://gitlab.eclipse.org/eclipsefdn/emo-team/iplab/-/issues/15272",
    "source": "https://github.com/7rulnik/source-map-js/archive/refs/tags/v1.2.0.zip",
    "status": "approved",
    "scans": [
        {
            "date": "March 22, 2024 at 2:56:20 a.m. GMT",
            "authority": "https://gitlab.eclipse.org/eclipsefdn/emo-team/iplab/-/issues/13911",
            "scancode-version": "31.2.1",
            "licenses-discovered": [
                "BSD-3-Clause"
            ],
            "copyrights": [
                "Copyright (c) 2009-2011, Mozilla Foundation and contributors",
                "Copyright 2009-2011 Mozilla Foundation and contributors",
                "Copyright 2011 Mozilla Foundation and contributors",
                "Copyright 2011 The Closure Compiler Authors",
                "Copyright 2012 Mozilla Foundation and contributors",
                "Copyright 2014 Mozilla Foundation and contributors"
            ],
            "file-count": 54,
            "sha256": "96ea218954388bfd76d68ea32fe312c41d87aa94af54867f5a7d5c2458804aab",
            "source": "https://github.com/7rulnik/source-map-js/archive/refs/tags/v1.2.0.zip",
            "status": "approved"
        },
        {
            "date": "June 14, 2024 at 4:24:31 p.m. GMT",
            "authority": "https://gitlab.eclipse.org/eclipsefdn/emo-team/iplab/-/issues/15271",
            "scancode-version": "31.2.1",
            "licenses-discovered": [
                "BSD-3-Clause"
            ],
            "copyrights": [
                "Copyright (c) 2009-2011, Mozilla Foundation and contributors",
                "Copyright 2009-2011 Mozilla Foundation and contributors",
                "Copyright 2011 Mozilla Foundation and contributors",
                "Copyright 2011 The Closure Compiler Authors",
                "Copyright 2012 Mozilla Foundation and contributors",
                "Copyright 2014 Mozilla Foundation and contributors"
            ],
            "file-count": 54,
            "sha256": "96ea218954388bfd76d68ea32fe312c41d87aa94af54867f5a7d5c2458804aab",
            "source": "https://github.com/7rulnik/source-map-js/archive/refs/tags/v1.2.0.zip",
            "status": "approved"
        },
        {
            "date": "June 14, 2024 at 4:27:59 p.m. GMT",
            "authority": "https://gitlab.eclipse.org/eclipsefdn/emo-team/iplab/-/issues/15272",
            "scancode-version": "31.2.1",
            "licenses-discovered": [
                "BSD-3-Clause"
            ],
            "copyrights": [
                "Copyright (c) 2009-2011, Mozilla Foundation and contributors",
                "Copyright 2009-2011 Mozilla Foundation and contributors",
                "Copyright 2011 Mozilla Foundation and contributors",
                "Copyright 2011 The Closure Compiler Authors",
                "Copyright 2012 Mozilla Foundation and contributors",
                "Copyright 2014 Mozilla Foundation and contributors"
            ],
            "file-count": 54,
            "sha256": "96ea218954388bfd76d68ea32fe312c41d87aa94af54867f5a7d5c2458804aab",
            "source": "https://github.com/7rulnik/source-map-js/archive/refs/tags/v1.2.0.zip",
            "status": "approved"
        }
    ]
}