{
    "id": "maven/mavencentral/androidx.drawerlayout/drawerlayout/1.0.0",
    "license": "Apache-2.0",
    "authority": "https://gitlab.eclipse.org/eclipsefdn/emo-team/iplab/-/issues/10378",
    "source": "https://dl.google.com/android/maven2/androidx/drawerlayout/drawerlayout/1.0.0/drawerlayout-1.0.0-sources.jar",
    "status": "approved",
    "scans": [
        {
            "date": "September 11, 2023 at 9:50:13 p.m. GMT",
            "authority": "https://gitlab.eclipse.org/eclipsefdn/emo-team/iplab/-/issues/10378",
            "scancode-version": "31.2.1",
            "licenses-discovered": [
                "Apache-2.0"
            ],
            "copyrights": [
                "Copyright 2018 The Android Open Source Project"
            ],
            "file-count": 2,
            "sha256": "3702e90acc99c16d192eada8467aea9595d1c3fff3e2155ffe66e5f31e334513",
            "source": "https://dl.google.com/android/maven2/androidx/drawerlayout/drawerlayout/1.0.0/drawerlayout-1.0.0-sources.jar",
            "status": "approved"
        }
    ]
}