{
    "id": "maven/mavencentral/com.azure.resourcemanager/azure-resourcemanager-keyvault/2.29.0",
    "license": "MIT",
    "authority": "https://gitlab.eclipse.org/eclipsefdn/emo-team/iplab/-/issues/10030",
    "source": "https://repo.maven.apache.org/maven2/com/azure/resourcemanager/azure-resourcemanager-keyvault/2.29.0/azure-resourcemanager-keyvault-2.29.0-sources.jar",
    "status": "approved",
    "scans": [
        {
            "date": "August 11, 2023 at 3:47:48 p.m. GMT",
            "authority": "https://gitlab.eclipse.org/eclipsefdn/emo-team/iplab/-/issues/10030",
            "scancode-version": "31.2.1",
            "licenses-discovered": [
                "MIT"
            ],
            "copyrights": [
                "(c) 2008 VeriSign, Inc.",
                "Copyright (c) Microsoft Corporation"
            ],
            "file-count": 141,
            "sha256": "be67a2be4d1e4e7c1b204483e107f7398fdc430b72e263e370775992358e33f0",
            "source": "https://repo.maven.apache.org/maven2/com/azure/resourcemanager/azure-resourcemanager-keyvault/2.29.0/azure-resourcemanager-keyvault-2.29.0-sources.jar",
            "status": "approved"
        }
    ]
}