{
    "license": "Apache-2.0",
    "file-count": 6,
    "authority": "https://gitlab.eclipse.org/eclipsefdn/emo-team/iplab/-/issues/990",
    "scancode-version": "21.3.31",
    "licenses-discovered": [
        "AGPL-3.0-or-later",
        "Apache-2.0",
        "BSD-2-Clause",
        "BSD-3-Clause",
        "BSD-4-Clause",
        "EPL-1.0",
        "GPL-1.0-only",
        "GPL-1.0-or-later",
        "GPL-2.0-only",
        "GPL-3.0-or-later",
        "LGPL-2.1-or-later",
        "GPL-3.0-only",
        "AGPL-3.0-only",
        "GPL-2.0-or-later",
        "LGPL-2.0-only",
        "LGPL-2.0-or-later",
        "LGPL-3.0-only",
        "MIT"
    ],
    "id": "npm/npmjs/-/spdx-correct/3.1.1",
    "source": "https://github.com/jslicense/spdx-correct.js/archive/v3.1.1.zip",
    "status": "approved"
}
