{
    "id": "maven/mavencentral/org.apache.tomcat/tomcat-util-scan/9.0.80",
    "license": "Apache-2.0",
    "authority": "https://gitlab.eclipse.org/eclipsefdn/emo-team/iplab/-/issues/12788",
    "source": "https://repo1.maven.org/maven2/org/apache/tomcat/tomcat-util-scan/9.0.80/tomcat-util-scan-9.0.80-sources.jar",
    "status": "approved",
    "scans": [
        {
            "date": "January 16, 2024 at 8:20:23 p.m. GMT",
            "authority": "https://gitlab.eclipse.org/eclipsefdn/emo-team/iplab/-/issues/12788",
            "scancode-version": "31.2.1",
            "licenses-discovered": [
                "Apache-2.0"
            ],
            "copyrights": [
            ],
            "file-count": 121,
            "sha256": "6cc834a8627fac1148a114ffc50cea93e2c2861270d6019993518dab63df2365",
            "source": "https://repo1.maven.org/maven2/org/apache/tomcat/tomcat-util-scan/9.0.80/tomcat-util-scan-9.0.80-sources.jar",
            "status": "approved"
        }
    ]
}