{
    "id": "p2/orbit/p2.eclipse.plugin/com.sun.jna/5.16.0.v20241222-1200",
    "license": "Apache-2.0 AND LGPL-2.1-or-later",
    "authority": "https://gitlab.eclipse.org/eclipsefdn/emo-team/iplab/-/issues/18008",
    "source": "https://repo1.maven.org/maven2/net/java/dev/jna/jna/5.16.0/jna-5.16.0-sources.jar",
    "status": "approved",
    "scans": [
        {
            "date": "December 22, 2024 at 4:10:21 p.m. GMT",
            "authority": "https://gitlab.eclipse.org/eclipsefdn/emo-team/iplab/-/issues/18008",
            "scancode-version": "31.2.1",
            "licenses-discovered": [
                "Apache-2.0 AND LGPL-2.1-or-later"
            ],
            "copyrights": [
                "Copyright (c) 2007 Timothy Wall",
                "Copyright (c) 2007 Wayne Meissner",
                "Copyright (c) 2007-2008 Timothy Wall",
                "Copyright (c) 2007-2012 Timothy Wall",
                "Copyright (c) 2007-2013 Timothy Wall",
                "Copyright (c) 2007-2015 Timothy Wall",
                "Copyright (c) 2009 Timothy Wall",
                "Copyright (c) 2011 Timothy Wall",
                "Copyright (c) 2012 Timothy Wall",
                "Copyright (c) 2017 Matthias Blasing",
                "Copyright (c) 2018 Matthias Blasing",
                "Copyright (c) 2019 Matthias Blasing",
                "Copyright (c) 2021, Matthias Blasing",
                "Copyright (c) 2022 Carlos Ballesteros",
                "Copyright 2007 Timothy Wall"
            ],
            "file-count": 70,
            "sha256": "1e8dd4205deab6eb9d6045ad9e69a8754fc21029d56ede1dcd9f22a5e06571a7",
            "source": "https://repo1.maven.org/maven2/net/java/dev/jna/jna/5.16.0/jna-5.16.0-sources.jar",
            "status": "approved"
        }
    ]
}