{
    "id": "maven/mavencentral/lpg.runtime/java/2.0.17-v201004271640",
    "license": "EPL-1.0",
    "authority": "https://gitlab.eclipse.org/eclipsefdn/emo-team/iplab/-/issues/10137",
    "source": "https://repo.maven.apache.org/maven2/lpg/runtime/java/2.0.17-v201004271640/java-2.0.17-v201004271640-sources.jar",
    "status": "approved",
    "scans": [
        {
            "date": "August 22, 2023 at 6:37:12 a.m. GMT",
            "authority": "https://gitlab.eclipse.org/eclipsefdn/emo-team/iplab/-/issues/10136",
            "scancode-version": "31.2.1",
            "licenses-discovered": [
                "EPL-1.0"
            ],
            "copyrights": [
                "Copyright (c) 2009 Open Canarias S.L. and others"
            ],
            "file-count": 59,
            "sha256": "bd1fa774f2be4d3cd5bf2052877987c26dc95a52f6f0d0d186c3f1abd16e365a",
            "source": "https://repo.maven.apache.org/maven2/lpg/runtime/java/2.0.17-v201004271640/java-2.0.17-v201004271640-sources.jar",
            "status": "approved"
        },
        {
            "date": "August 22, 2023 at 7:08:03 a.m. GMT",
            "authority": "https://gitlab.eclipse.org/eclipsefdn/emo-team/iplab/-/issues/10137",
            "scancode-version": "31.2.1",
            "licenses-discovered": [
                "EPL-1.0"
            ],
            "copyrights": [
                "Copyright (c) 2009 Open Canarias S.L. and others"
            ],
            "file-count": 59,
            "sha256": "bd1fa774f2be4d3cd5bf2052877987c26dc95a52f6f0d0d186c3f1abd16e365a",
            "source": "https://repo.maven.apache.org/maven2/lpg/runtime/java/2.0.17-v201004271640/java-2.0.17-v201004271640-sources.jar",
            "status": "approved"
        }
    ]
}