{
    "id": "npm/npmjs/@emotion/react/11.13.0",
    "license": "MIT AND (BSD-2-Clause AND MIT)",
    "authority": "https://gitlab.eclipse.org/eclipsefdn/emo-team/iplab/-/issues/15965",
    "source": "https://github.com/emotion-js/emotion/archive/refs/tags/@emotion/css@11.13.0.zip",
    "status": "approved",
    "scans": [
        {
            "date": "August 20, 2024 at 7:02:00 p.m. GMT",
            "authority": "https://gitlab.eclipse.org/eclipsefdn/emo-team/iplab/-/issues/15965",
            "scancode-version": "31.2.1",
            "licenses-discovered": [
                "MIT",
                "BSD-2-Clause AND MIT"
            ],
            "copyrights": [
                "Copyright (c) 2014-present, Jon Schlinkert",
                "Copyright (c) 2015-present, Jon Schlinkert",
                "Copyright (c) 2017 Paul Armstrong https://github.com/paularmstrong/react-component-benchmark",
                "Copyright (c) Emotion team and other contributors",
                "Copyright 2011-2021 The Bootstrap Authors",
                "Copyright 2011-2021 Twitter, Inc.",
                "Copyright 2022 Fonticons, Inc."
            ],
            "file-count": 810,
            "sha256": "03ef9200d6c3ce3ad3430b463ffb8ae5eea549883857daef3c401d6ea6c1b5e9",
            "source": "https://github.com/emotion-js/emotion/archive/refs/tags/@emotion/css@11.13.0.zip",
            "status": "approved"
        }
    ]
}