{
    "id": "p2/orbit/p2.eclipse.plugin/org.eclipse.pde.ds.core/1.2.0.v20200813-0526",
    "license": "EPL-1.0 AND EPL-2.0 AND EPL-2.0",
    "licenses-discovered": [
        "EPL-1.0 AND EPL-2.0",
        "EPL-2.0"
    ],
    "copyrights": [
        "(c) 2008 VeriSign, Inc.",
        "Copyright (c) 2008 IBM Corporation and others",
        "Copyright (c) 2008, 2009 IBM Corporation and others",
        "Copyright (c) 2008, 2013 EclipseSource Corporation and others",
        "Copyright (c) 2008, 2013 IBM Corporation and others",
        "Copyright (c) 2008, 2015 Code",
        "Copyright (c) 2008, 2015 IBM Corporation and others",
        "Copyright (c) 2008, 2018 IBM Corporation and others"
    ],
    "file-count": 36,
    "scancode-version": "31.2.1",
    "authority": "https://gitlab.eclipse.org/eclipsefdn/emo-team/iplab/-/issues/4053",
    "source": "https://search.maven.org/remotecontent?filepath=org/eclipse/pde/org.eclipse.pde.ds.core/1.2.0/org.eclipse.pde.ds.core-1.2.0-sources.jar",
    "status": "approved"
}