{
    "id": "npm/npmjs/@nrwl/cli/15.4.5",
    "license": "MIT",
    "authority": "https://gitlab.eclipse.org/eclipsefdn/emo-team/iplab/-/issues/6235",
    "source": "https://registry.npmjs.org/@nrwl/cli/-/cli-15.4.5.tgz",
    "status": "approved",
    "scans": [
        {
            "date": "January 10, 2023 at 8:01:59 p.m. GMT",
            "authority": "https://gitlab.eclipse.org/eclipsefdn/emo-team/iplab/-/issues/6235",
            "scancode-version": "31.2.1",
            "licenses-discovered": [
                "MIT"
            ],
            "copyrights": [
                "Copyright (c) 2017-2022 Narwhal Technologies Inc."
            ],
            "file-count": 9,
            "sha256": "9db7661475d939e4daedbd42c2823b0caac55923268bf9b59f2b142e78f358db",
            "source": "https://registry.npmjs.org/@nrwl/cli/-/cli-15.4.5.tgz",
            "status": "approved"
        }
    ]
}