{
    "id": "project/ecd.theia/chromium/ffmpeg/b9f01c3c54576330b2cf8918c54d5ee5be8faefe",
    "license": "LGPL-2.1-or-later AND MIT AND BSD-3-Clause AND IJG",
    "authority": "https://gitlab.eclipse.org/eclipsefdn/emo-team/iplab/-/issues/7507",
    "source": "https://gitlab.eclipse.org/eclipsefdn/emo-team/iplab/uploads/9d6a99835e3c319bb3b688fcf7f026e6/ffmpeg-for-electron-22.3.2.tar.gz",
    "status": "approved",
    "scans": [
        {
            "date": "March 23, 2023 at 12:18:22 p.m. GMT",
            "authority": "https://gitlab.eclipse.org/eclipsefdn/emo-team/iplab/-/issues/7507",
            "scancode-version": "31.2.1",
            "licenses-discovered": [
                "GPL-2.0-only",
                "GPL-3.0-only",
                "LGPL-2.1-only",
                "LGPL-3.0-only",
                "Apache-2.0 AND BSD-3-Clause AND GPL-2.0-only AND GPL-3.0-only AND IJG AND ISC AND LGPL-2.1-only AND LGPL-3.0-only AND LGPL-3.0-or-later AND LicenseRef-scancode-other-permissive AND MIT",
                "BSD-3-Clause",
                "Apache-2.0 AND GPL-2.0-only AND GPL-3.0-only AND IJG AND LGPL-2.1-or-later AND LGPL-3.0-only AND LGPL-3.0-or-later AND LicenseRef-scancode-other-permissive AND MIT",
                "GPL-1.0-or-later AND LGPL-2.0-or-later",
                "LGPL-2.1-or-later",
                "BSD-3-Clause AND LGPL-2.1-or-later",
                "IJG",
                "MIT"
            ],
            "copyrights": [
                "(c) 1997-99 by H. Dietz and R. Fisher Converted",
                "Copyright (c) 1989, 1991 Free Software Foundation, Inc.",
                "Copyright (c) 1991, 1999 Free Software Foundation, Inc.",
                "Copyright (c) 1996, 1997 Theodore Ts'o",
                "Copyright (c) 1999 Intel Corporation",
                "Copyright (c) 2000 Fabrice Bellard",
                "Copyright (c) 2000 Michel Lespinasse <walken@zoy.org>",
                "Copyright (c) 2000, 2001 Fabrice Bellard",
                "Copyright (c) 2000, 2001, 2002 Fabrice Bellard",
                "Copyright (c) 2000,2001 Fabrice Bellard",
                "Copyright (c) 2000-2001 Peter Gubanov <peter@elecard.net.ru>",
                "Copyright (c) 2000-2003 Fabrice Bellard",
                "Copyright (c) 2001 FFmpeg project",
                "Copyright (c) 2001 Fabrice Bellard",
                "Copyright (c) 2001 Juan J. Sierralta P",
                "Copyright (c) 2001 Lionel Ulmer",
                "Copyright (c) 2001 Lionel Ulmer lionel.ulmer@free.fr",
                "Copyright (c) 2001 Michael Niedermayer <michaelni@gmx.at>",
                "Copyright (c) 2001 Peter Ross <pross@xvid.org>",
                "Copyright (c) 2001, 2002 Fabrice Bellard",
                "Copyright (c) 2001, 2002 Michael Niedermayer <michaelni@gmx.at>",
                "Copyright (c) 2001, 2002, 2003 Fabrice Bellard",
                "Copyright (c) 2002 Fabrice Bellard",
                "Copyright (c) 2002 Francois Revol <revol@free.fr>",
                "Copyright (c) 2002 Frederic dilb Boulay",
                "Copyright (c) 2002 Michael Niedermayer",
                "Copyright (c) 2002-2004 Michael Niedermayer <michaelni@gmx.at>",
                "Copyright (c) 2002-2006 Michael Niedermayer <michaelni@gmx.at>",
                "Copyright (c) 2002-2010 Michael Niedermayer <michaelni@gmx.at>",
                "Copyright (c) 2003 Alex Beregszaszi",
                "Copyright (c) 2003 Fabrice Bellard",
                "Copyright (c) 2003 Michael Niedermayer",
                "Copyright (c) 2003 Michael Niedermayer <michaelni@gmx.at>",
                "Copyright (c) 2003 Michel Bardiaux",
                "Copyright (c) 2003 Pascal Massimino <skal@planet-d.net>",
                "Copyright (c) 2003 Roman Shaposhnik",
                "Copyright (c) 2003-2004 The FFmpeg project",
                "Copyright (c) 2003-2005 by Christopher R. Hertel (crh@ubiqx.mn.org)",
                "Copyright (c) 2003-2008 The FFmpeg Project",
                "Copyright (c) 2003-2008 x264 project",
                "Copyright (c) 2003-2010 Michael Niedermayer <michaelni@gmx.at>",
                "Copyright (c) 2003-2012 Michael Niedermayer <michaelni@gmx.at>",
                "Copyright (c) 2003-2013 Michael Niedermayer",
                "Copyright (c) 2004 AGAWA Koji",
                "Copyright (c) 2004 Denes Balatoni",
                "Copyright (c) 2004 Michael Niedermayer",
                "Copyright (c) 2004 Michael Niedermayer <michaelni@gmx.at>",
                "Copyright (c) 2004 Roman Shaposhnik",
                "Copyright (c) 2004 The FFmpeg project",
                "Copyright (c) 2004-2005 Michael Niedermayer, Loren Merritt",
                "Copyright (c) 2005 Alex Beregszaszi",
                "Copyright (c) 2005 Matthieu CASTET",
                "Copyright (c) 2005 Matthieu CASTET, Alex",
                "Copyright (c) 2005 Michael Ahlberg, MAY",
                "Copyright (c) 2005 Michael Ahlberg, Mans Rullgard",
                "Copyright (c) 2005 Michael Niedermayer <michaelni@gmx.at>",
                "Copyright (c) 2005 Zoltan Hidvegi",
                "Copyright (c) 2005-2006 Oded Shimon",
                "Copyright (c) 2005-2010 x264 project",
                "Copyright (c) 2005-2011 x264 project",
                "Copyright (c) 2005-2012 Michael Niedermayer <michaelni@gmx.at>",
                "Copyright (c) 2005-2018 x264 project",
                "Copyright (c) 2006 Baptiste Coudurier <baptiste.coudurier@free.fr>",
                "Copyright (c) 2006 Daniel Maas <dmaas@maasdigital.com>",
                "Copyright (c) 2006 Loren Merritt <lorenm@u.washington.edu>",
                "Copyright (c) 2006 Mans Rullgard <mans@mansr.com>",
                "Copyright (c) 2006 Michael Niedermayer (michaelni@gmx.at)",
                "Copyright (c) 2006 Michael Niedermayer <michaelni@gmx.at>",
                "Copyright (c) 2006 Oded Shimon <ods15@ods15.dyndns.org>",
                "Copyright (c) 2006 Reimar Doeffinger",
                "Copyright (c) 2006 Roman Shaposhnik",
                "Copyright (c) 2006 Ryan Martell. (rdm4@martellventures.com)",
                "Copyright (c) 2006 Smartjog",
                "Copyright (c) 2006-2007 Maxim Gavrilov",
                "Copyright (c) 2006-2007 Robert Swain",
                "Copyright (c) 2007 Benjamin Zores <ben@geexbox.org>",
                "Copyright (c) 2007 Free Software Foundation, Inc. <http://fsf.org/>",
                "Copyright (c) 2007 Mans Rullgard",
                "Copyright (c) 2007 Mans Rullgard <mans@mansr.com>",
                "Copyright (c) 2007 Marco Gerards <marco@gnu.org>",
                "Copyright (c) 2007 Michael Niedermayer <michaelni@gmx.at>",
                "Copyright (c) 2007 Reynaldo H. Verdejo Pinochet",
                "Copyright (c) 2007 Siarhei Siamashka <ssvb@users.sourceforge.net>",
                "Copyright (c) 2007 The FFmpeg Project",
                "Copyright (c) 2008 Alexander Strange (astrange@ithinksw.com)",
                "Copyright (c) 2008 Baptiste Coudurier <baptiste.coudurier@free.fr>",
                "Copyright (c) 2008 Loren Merritt",
                "Copyright (c) 2008 Mans Rullgard <mans@mansr.com>",
                "Copyright (c) 2008 Michael Niedermayer",
                "Copyright (c) 2008 Siarhei Siamashka <ssvb@users.sourceforge.net>",
                "Copyright (c) 2008 Vladimir Voroshilov",
                "Copyright (c) 2008-2009 Robert Swain",
                "Copyright (c) 2008-2010 Paul Kendall <paul@kcbbs.gen.nz>",
                "Copyright (c) 2008-2013 Alex Converse <alex.converse@gmail.com>",
                "Copyright (c) 2009 Alex Converse",
                "Copyright (c) 2009 Alex Converse <alex.converse@gmail.com>",
                "Copyright (c) 2009 Baptiste Coudurier",
                "Copyright (c) 2009 Baptiste Coudurier <baptiste.coudurier@gmail.com>",
                "Copyright (c) 2009 Colin McQuillan",
                "Copyright (c) 2009 Daniel Verkamp",
                "Copyright (c) 2009 David Conrad",
                "Copyright (c) 2009 David Conrad <lessen42@gmail.com>",
                "Copyright (c) 2009 Fiona Glaser",
                "Copyright (c) 2009 James Darnley",
                "Copyright (c) 2009 Justin Ruggles",
                "Copyright (c) 2009 Konstantin Shishkov",
                "Copyright (c) 2009 Mans Rullgard <mans@mansr.com>",
                "Copyright (c) 2009 Michael Niedermayer <michaelni@gmx.at>",
                "Copyright (c) 2009 Naotoshi Nojiri",
                "Copyright (c) 2009 Peter Ross <pross@xvid.org>",
                "Copyright (c) 2009-2010 Alex Converse <alex.converse@gmail.com>",
                "Copyright (c) 2010 Alex Converse <alex.converse@gmail.com>",
                "Copyright (c) 2010 David Conrad",
                "Copyright (c) 2010 Eli Friedman <eli.friedman@gmail.com>",
                "Copyright (c) 2010 Fiona Glaser",
                "Copyright (c) 2010 Fiona Glaser <fiona@x264.com>",
                "Copyright (c) 2010 Google Inc.",
                "Copyright (c) 2010 Holger Lubitz",
                "Copyright (c) 2010 Janne Grunau <janne-libav@jannau.net>",
                "Copyright (c) 2010 Loren Merritt",
                "Copyright (c) 2010 Mans Rullgard",
                "Copyright (c) 2010 Mans Rullgard <mans@mansr.com>",
                "Copyright (c) 2010 Marcelo Galvao Povoa",
                "Copyright (c) 2010 Michael Chinen",
                "Copyright (c) 2010 Reimar Doffinger <Reimar.Doeffinger@gmx.de>",
                "Copyright (c) 2010 Rob Clark <rob@ti.com>",
                "Copyright (c) 2010 Ronald S. Bultje",
                "Copyright (c) 2010 Ronald S. Bultje <rsbultje@gmail.com>",
                "Copyright (c) 2010 Vitor Sessak",
                "Copyright (c) 2011 Daniel Kang",
                "Copyright (c) 2011 Jordi Ortiz",
                "Copyright (c) 2011 Justin Ruggles",
                "Copyright (c) 2011 Mans Rullgard",
                "Copyright (c) 2011 Mans Rullgard <mans@mansr.com>",
                "Copyright (c) 2011 Ronald S. Bultje <rsbultje@gmail.com>",
                "Copyright (c) 2011 Vitor Sessak",
                "Copyright (c) 2011 x264 project",
                "Copyright (c) 2011-2012 Smartjog",
                "Copyright (c) 2011-2013 Michael Niedermayer (michaelni@gmx.at)",
                "Copyright (c) 2012 Andrew D'Addesio",
                "Copyright (c) 2012 Christophe Gisquet <christophe.gisquet@gmail.com>",
                "Copyright (c) 2012 Daniel Kang",
                "Copyright (c) 2012 Justin Ruggles",
                "Copyright (c) 2012 MIPS Technologies, Inc., California",
                "Copyright (c) 2012 Mans Rullgard",
                "Copyright (c) 2012 Mans Rullgard <mans@mansr.com>",
                "Copyright (c) 2012 Nicolas George",
                "Copyright (c) 2012 Ronald S. Bultje",
                "Copyright (c) 2012 Ronald S. Bultje <rsbultje@gmail.com>",
                "Copyright (c) 2013 Clement Boesch",
                "Copyright (c) 2013 Daniel Kang",
                "Copyright (c) 2013 Diego Biurrun <diego@biurrun.de>",
                "Copyright (c) 2013 James Almer",
                "Copyright (c) 2013 Loren Merritt",
                "Copyright (c) 2013 RISC OS Open Ltd",
                "Copyright (c) 2013 Ronald S. Bultje",
                "Copyright (c) 2013 Thilo Borgmann",
                "Copyright (c) 2013 Vittorio Giovara <vittorio.giovara@gmail.com>",
                "Copyright (c) 2013-2014 Mozilla Corporation",
                "Copyright (c) 2014 James Almer",
                "Copyright (c) 2014 James Yu <james.yu@linaro.org>",
                "Copyright (c) 2014 Janne Grunau <janne-libav@jannau.net>",
                "Copyright (c) 2014 Loren Merritt",
                "Copyright (c) 2014 Michael Niedermayer <michaelni@gmx.at>",
                "Copyright (c) 2014 Nicolas George",
                "Copyright (c) 2014 Peter Ross",
                "Copyright (c) 2014 Supraja Meedinti",
                "Copyright (c) 2014 Tim Walker <tdskywalker@gmail.com>",
                "Copyright (c) 2014 Vittorio Giovara <vittorio.giovara@gmail.com>",
                "Copyright (c) 2015 Christophe Gisquet",
                "Copyright (c) 2015 Eran Kornblau",
                "Copyright (c) 2015 James Almer",
                "Copyright (c) 2015 Kevin Wheatley <kevin.j.wheatley@gmail.com>",
                "Copyright (c) 2015 Mats Peterson",
                "Copyright (c) 2015 Supraja Meedinti",
                "Copyright (c) 2015 Vesselin Bontchev",
                "Copyright (c) 2015-2016 Matthieu Bouron",
                "Copyright (c) 2016 Matthieu Bouron",
                "Copyright (c) 2016 Neil Birkbeck <neil.birkbeck@gmail.com>",
                "Copyright (c) 2016 Reimar Doffinger <Reimar.Doeffinger@gmx.de>",
                "Copyright (c) 2016 Ronald S. Bultje <rsbultje@gmail.com>",
                "Copyright (c) 2016 Rostislav Pehlivanov <atomnuker@gmail.com>",
                "Copyright (c) 2016 Vittorio Giovara <vittorio.giovara@gmail.com>",
                "Copyright (c) 2017 Matthieu Bouron <matthieu.bouron@gmail.com>",
                "Copyright (c) 2017 Rostislav Pehlivanov <atomnuker@gmail.com>",
                "Copyright (c) 2018 Mohammad Izadi",
                "Copyright (c) 2019 Peter Ross",
                "Copyright (c) 2020 Jun Zhao <barryjzhao@tencent.com>",
                "Copyright (c) 2020 Martin Storsjo",
                "Copyright (c) 2020 Vacing Fang <vacingfang@tencent.com>",
                "Copyright (c) 2021 Limin Wang",
                "Copyright (c) 2021 Niklas Haas <ffmpeg@haasn.xyz>",
                "Copyright (c) 2021 quietvoid",
                "Copyright (c) 2022 Ben Avison <bavison@riscosopen.org>",
                "Copyright (c) 2022 Jonathan Swinney <jswinney@amazon.com>",
                "Copyright (c) 2022 Pierre-Anthony Lemieux <pal@palemieux.com> Zane van Iperen <zane@zanevaniperen.com>",
                "Copyright (c) Lynne",
                "Copyright 2006 Loren Merritt",
                "Copyright 2016 Anton Khirnov",
                "Copyright 2016 James Almer",
                "Copyright 2022 The Chromium Authors",
                "copyright (c) 1991, 1992, Thomas G. Lane",
                "copyright (c) 1994-1996, Thomas G. Lane",
                "copyright (c) 2001 Fabrice Bellard",
                "copyright (c) 2002 Fabrice Bellard",
                "copyright (c) 2002 Francois Revol",
                "copyright (c) 2005 Denes Balatoni",
                "copyright (c) 2006 Michael Niedermayer <michaelni@gmx.at>",
                "copyright (c) 2007 Michael Niedermayer <michaelni@gmx.at>",
                "copyright (c) 2009 Michael Niedermayer",
                "copyright (c) 2015 Steve Lhomme",
                "copyrighted by the Free Software Foundation"
            ],
            "file-count": 493,
            "sha256": "e9b5b99cf4b93e85ab2e6939d9d7046c6019a5ff694781f6bcb369bdb0e7bee7",
            "source": "https://gitlab.eclipse.org/eclipsefdn/emo-team/iplab/uploads/9d6a99835e3c319bb3b688fcf7f026e6/ffmpeg-for-electron-22.3.2.tar.gz",
            "status": "restricted"
        }
    ]
}
