{
    "id": "npm/npmjs/-/crypto-js/4.1.1",
    "license": "MIT AND BSD-2-Clause",
    "authority": "https://gitlab.eclipse.org/eclipsefdn/emo-team/iplab/-/issues/6630",
    "source": "https://registry.yarnpkg.com/crypto-js/-/crypto-js-4.1.1.tgz",
    "status": "approved",
    "scans": [
        {
            "date": "January 25, 2023 at 1:47:53 p.m. GMT",
            "authority": "https://gitlab.eclipse.org/eclipsefdn/emo-team/iplab/-/issues/6630",
            "scancode-version": "31.2.1",
            "licenses-discovered": [
                "MIT",
                "BSD-2-Clause"
            ],
            "copyrights": [
                "(c) 2012 by Cedric Mesnil",
                "Copyright (c) 2009-2013 Jeff Mott",
                "Copyright (c) 2013-2016 Evan Vosberg"
            ],
            "file-count": 55,
            "sha256": "5d2c25d13c85b4687f39a4546e2295fe58d549a5b6b3c802327864f61d588f99",
            "source": "https://registry.yarnpkg.com/crypto-js/-/crypto-js-4.1.1.tgz",
            "status": "approved"
        }
    ]
}