{
    "id": "maven/mavencentral/com.fasterxml.jackson.core/jackson-databind/2.18.0",
    "license": "Apache-2.0",
    "authority": "https://gitlab.eclipse.org/eclipsefdn/emo-team/iplab/-/issues/16372",
    "source": "https://repo1.maven.org/maven2/com/fasterxml/jackson/core/jackson-databind/2.18.0/jackson-databind-2.18.0-sources.jar",
    "status": "approved",
    "scans": [
        {
            "date": "September 27, 2024, 6:14:58 a.m. GMT",
            "authority": "https://gitlab.eclipse.org/eclipsefdn/emo-team/iplab/-/issues/16372",
            "scancode-version": "31.2.1",
            "licenses-discovered": [
                "Apache-2.0"
            ],
            "copyrights": [
                "Copyright 2010 Google Inc.",
                "Copyright 2011 Google Inc."
            ],
            "file-count": 484,
            "sha256": "0531788c8193e81e40e16ff7c16401d7c5cb629ed493bb13d091d980bc425123",
            "source": "https://repo1.maven.org/maven2/com/fasterxml/jackson/core/jackson-databind/2.18.0/jackson-databind-2.18.0-sources.jar",
            "status": "approved"
        }
    ]
}