{
    "id": "npm/npmjs/@octokit/endpoint/7.0.2",
    "license": "MIT AND BSD-3-Clause",
    "licenses-discovered": [
        "MIT",
        "BSD-3-Clause"
    ],
    "copyrights": [
        "Copyright (c) Bram Stein",
        "Copyright (c) Octokit"
    ],
    "file-count": 35,
    "scancode-version": "30.1.0",
    "authority": "https://gitlab.eclipse.org/eclipsefdn/emo-team/iplab/-/issues/3752",
    "source": "https://registry.npmjs.org/@octokit/endpoint/-/endpoint-7.0.2.tgz",
    "status": "approved"
}