{
    "id": "git/github/golang/lint/910be7a94367",
    "license": "BSD-3-Clause",
    "authority": "https://gitlab.eclipse.org/eclipsefdn/emo-team/iplab/-/issues/5412",
    "source": "https://github.com/golang/lint/archive/910be7a94367.zip",
    "status": "approved",
    "scans": [
        {
            "date": "December 8, 2022 at 9:41:04 p.m. GMT",
            "authority": "https://gitlab.eclipse.org/eclipsefdn/emo-team/iplab/-/issues/5412",
            "scancode-version": "31.2.1",
            "licenses-discovered": [
                "BSD-3-Clause"
            ],
            "copyrights": [
                "Copyright (c) 2013 The Go Authors",
                "Copyright (c) 2018 The Go Authors",
                "Copyright 2013 The Go Authors"
            ],
            "file-count": 45,
            "sha256": "87d46c7c3ea2c2b5bd726c7885bb9c6fe963331387087e2e299088c327ad829c",
            "source": "https://github.com/golang/lint/archive/910be7a94367.zip",
            "status": "approved"
        }
    ]
}