{
    "id": "maven/mavencentral/org.apache.activemq/apache-artemis/2.38.0",
    "license": "Apache-2.0 AND AND (BSD-2-Clause OR CC0-1.0) AND BSD-3-Clause AND EDL-1.0 AND EPL-2.0 AND MIT AND OFL-1.1 AND LicenseRef-Public-domain",
    "authority": "https://gitlab.eclipse.org/eclipsefdn/emo-team/iplab/-/issues/17315",
    "source": "https://repo.maven.apache.org/maven2/org/apache/activemq/apache-artemis/2.38.0/apache-artemis-2.38.0-source-release.zip",
    "status": "approved",
    "scans": [
        {
            "date": "November 19, 2024, 5:49:38 p.m. GMT",
            "authority": "https://gitlab.eclipse.org/eclipsefdn/emo-team/iplab/-/issues/17315",
            "scancode-version": "31.2.1",
            "licenses-discovered": [
                "Apache-2.0",
                "Apache-2.0 AND MIT AND OFL-1.1",
                "Apache-2.0 AND EPL-2.0 AND MIT",
                "Apache-2.0 AND BSD-2-Clause AND BSD-3-Clause AND EPL-2.0 AND MIT",
                "BSD-3-Clause",
                "EPL-2.0",
                "MIT",
                "BSD-2-Clause AND CC0-1.0",
                "CC0-1.0 AND MIT",
                "BSD-3-Clause AND MIT",
                "Apache-2.0 AND MIT",
                "Apache-2.0 AND BSD-2-Clause AND BSD-3-Clause AND EPL-1.0 AND EPL-2.0 AND MIT AND PostgreSQL",
                "Apache-2.0 AND EPL-2.0",
                "MIT AND OFL-1.1",
                "OFL-1.0 AND OFL-1.1"
            ],
            "copyrights": [
                "Copyright (c) 2002-2018, the original author or authors",
                "Copyright (c) 2004, John Gruber http://daringfireball.net",
                "Copyright (c) 2004-2013 QOS.ch",
                "Copyright (c) 2007, Eclipse Foundation, Inc.",
                "Copyright (c) 2007-2018 Einar Lielmanis, Liam Newman, and contributors",
                "Copyright (c) 2008-2021, SpryMedia Ltd.",
                "Copyright (c) 2010-2021 Google LLC. http://angular.io/license",
                "Copyright (c) 2011-2018 The Bootstrap Authors",
                "Copyright (c) 2011-2018 Twitter, Inc.",
                "Copyright (c) 2011-2018, Christopher Jeffrey (https://github.com/chjj/)",
                "Copyright (c) 2012 Jonny Reeves, http://jonnyreeves.co.uk",
                "Copyright (c) 2012 Michelle Tilley",
                "Copyright (c) 2012, 2013, 2014, 2015, 2016 Gil Tene",
                "Copyright (c) 2012-2014 Chris Pettitt",
                "Copyright (c) 2012-2017 the AngularUI Team, https://github.com/organizations/angular-ui/teams/291112",
                "Copyright (c) 2013 Components",
                "Copyright (c) 2013 Masayuki Tanaka",
                "Copyright (c) 2013 Mike Grabski",
                "Copyright (c) 2014 Marcel Juenemann <marcel@juenemann.cc>",
                "Copyright (c) 2014 Matt Warren",
                "Copyright (c) 2014 Michael Barker",
                "Copyright (c) 2014 uupaa.js@gmail.com",
                "Copyright (c) 2014-2016 Google Inc.",
                "Copyright (c) 2015-present, Facebook, Inc.",
                "Copyright (c) 2016 Angular",
                "Copyright (c) 2017 by Marijn Haverbeke <marijnh@gmail.com> and others",
                "Copyright (c) 2018+, MarkedJS (https://github.com/markedjs/)",
                "Copyright (c) 2019 Red Hat, Inc.",
                "Copyright (c) 2021 Jacob",
                "Copyright (c) 2023 Fonticons, Inc. (https://fontawesome.com)",
                "Copyright (c) Louis Lin <louis.lin.87@gmail.com> (l-lin.github.io)",
                "Copyright 2010-2020 Mike Bostock",
                "Copyright 2011 Glenn Maynard",
                "Copyright 2016 Ognyan Bankov",
                "Copyright 2023 Fonticons, Inc.",
                "Copyright Dave Gandy 2016",
                "Copyright JS Foundation and other contributors <https://js.foundation/>",
                "Copyright OpenJS Foundation and other contributors, https://openjsf.org",
                "copyright Jeremy Ashkenas, DocumentCloud and Investigative Reporters & Editors <http://underscorejs.org/>"
            ],
            "file-count": 5577,
            "sha256": "53c832e039de21c31b38d698fa913672bd25fa35176a1b9cf997997e2e2d9b02",
            "source": "https://repo.maven.apache.org/maven2/org/apache/activemq/apache-artemis/2.38.0/apache-artemis-2.38.0-source-release.zip",
            "status": "restricted"
        }
    ]
}