{
    "id": "maven/mavencentral/com.google.cloud/libraries-bom/26.49.0",
    "license": "Apache-2.0",
    "authority": "https://gitlab.eclipse.org/eclipsefdn/emo-team/iplab/-/issues/16756",
    "source": "https://repo1.maven.org/maven2/com/google/cloud/libraries-bom/26.49.0/libraries-bom-26.49.0.pom",
    "status": "approved",
    "scans": [
        {
            "date": "October 17, 2024, 3:46:06 a.m. GMT",
            "authority": "https://gitlab.eclipse.org/eclipsefdn/emo-team/iplab/-/issues/16756",
            "scancode-version": "31.2.1",
            "licenses-discovered": [
            ],
            "copyrights": [
            ],
            "file-count": 1,
            "sha256": "59ef6d4e32b09819d8a1dda70a9b47f74410182431a7afd7f341cd60fce7817a",
            "source": "https://repo1.maven.org/maven2/com/google/cloud/libraries-bom/26.49.0/libraries-bom-26.49.0.pom",
            "status": "restricted"
        }
    ]
}