{
    "license": "MIT",
    "file-count": 44,
    "authority": "https://gitlab.eclipse.org/eclipsefdn/emo-team/iplab/-/issues/1092",
    "scancode-version": "21.3.31",
    "licenses-discovered": [
        "MIT"
    ],
    "id": "npm/npmjs/-/command-line-args/5.0.2",
    "source": "https://github.com/75lb/command-line-args/archive/v5.0.2.zip",
    "status": "approved"
}