{
    "id": "maven/mavencentral/com.zaxxer/SparseBitSet/1.3",
    "license": "Apache-2.0",
    "authority": "https://gitlab.eclipse.org/eclipsefdn/emo-team/iplab/-/issues/10726",
    "source": "https://repo.maven.apache.org/maven2/com/zaxxer/SparseBitSet/1.3/SparseBitSet-1.3-sources.jar",
    "status": "approved",
    "scans": [
        {
            "date": "September 29, 2023 at 7:05:02 p.m. GMT",
            "authority": "https://gitlab.eclipse.org/eclipsefdn/emo-team/iplab/-/issues/10726",
            "scancode-version": "31.2.1",
            "licenses-discovered": [
            ],
            "copyrights": [
            ],
            "file-count": 2,
            "sha256": "36c10ff58efbd4a3cf8b98043ff2637cc167cef4e3d016f06825d40c91e8eb3a",
            "source": "https://repo.maven.apache.org/maven2/com/zaxxer/SparseBitSet/1.3/SparseBitSet-1.3-sources.jar",
            "status": "restricted"
        }
    ]
}
