{
    "id": "maven/mavencentral/com.yahoo.elide/elide-datastore-multiplex/7.1.2",
    "license": "Apache-2.0",
    "authority": "https://gitlab.eclipse.org/eclipsefdn/emo-team/iplab/-/issues/17464",
    "source": "https://repo1.maven.org/maven2/com/yahoo/elide/elide-datastore-multiplex/7.1.2/elide-datastore-multiplex-7.1.2-sources.jar",
    "status": "approved",
    "scans": [
        {
            "date": "November 26, 2024 at 10:24:35 p.m. GMT",
            "authority": "https://gitlab.eclipse.org/eclipsefdn/emo-team/iplab/-/issues/17464",
            "scancode-version": "31.2.1",
            "licenses-discovered": [
                "Apache-2.0"
            ],
            "copyrights": [
                "Copyright 2015, Yahoo Inc.",
                "Copyright 2016, Yahoo Inc."
            ],
            "file-count": 9,
            "sha256": "a2014a177f5116a4497735a427e0dc5fbc7ca0f7c3757bd234af112ec5b2eaac",
            "source": "https://repo1.maven.org/maven2/com/yahoo/elide/elide-datastore-multiplex/7.1.2/elide-datastore-multiplex-7.1.2-sources.jar",
            "status": "approved"
        }
    ]
}