{
    "id": "go/golang/github.com%2Fgo-openapi/spec/v0.20.9",
    "license": "Apache-2.0 AND (Apache-2.0 AND CC-BY-4.0) AND MIT AND CC-BY-4.0",
    "authority": "https://gitlab.eclipse.org/eclipsefdn/emo-team/iplab/-/issues/11997",
    "source": "https://proxy.golang.org/github.com%2Fgo-openapi/spec/@v/v0.20.9.zip",
    "status": "approved",
    "scans": [
        {
            "date": "December 14, 2023 at 6:43:45 p.m. GMT",
            "authority": "https://gitlab.eclipse.org/eclipsefdn/emo-team/iplab/-/issues/11997",
            "scancode-version": "31.2.1",
            "licenses-discovered": [
                "Apache-2.0",
                "Apache-2.0 AND CC-BY-4.0",
                "MIT",
                "CC-BY-4.0"
            ],
            "copyrights": [
                "Copyright (c) 2004, 2006 The Linux Foundation and its contributors",
                "Copyright 2015 go-swagger",
                "Copyright 2017 go-swagger"
            ],
            "file-count": 194,
            "sha256": "06c843a4617b262b06f232c6fa380e732dea80cf77b9a80a09c0d1c83a0a8665",
            "source": "https://proxy.golang.org/github.com%2Fgo-openapi/spec/@v/v0.20.9.zip",
            "status": "approved"
        }
    ]
}