{
    "license": "Apache-2.0 AND (EPL-2.0 OR GPL-2.0-only WITH Classpath-exception-2.0) and LGPL-2.1-only",
    "file-count": 47,
    "authority": "https://gitlab.eclipse.org/eclipsefdn/emo-team/iplab/-/issues/1781",
    "scancode-version": "30.1.0",
    "licenses-discovered": [
        "Apache-2.0 AND CDDL-1.0 AND EPL-2.0 AND (GPL-2.0-only WITH Classpath-exception-2.0) AND LGPL-2.1-only",
        "Apache-2.0",
        "EPL-2.0 AND (GPL-2.0-only WITH Classpath-exception-2.0)",
        "Apache-2.0 AND EPL-2.0 AND (GPL-2.0-only WITH Classpath-exception-2.0) AND LGPL-2.1-only",
        "Apache-2.0 AND Classpath-exception-2.0 AND EPL-2.0",
        "EPL-2.0 AND (GPL-2.0-only WITH Classpath-exception-2.0) AND LicenseRef-scancode-generic-export-compliance",
        "LGPL-2.1-or-later"
    ],
    "id": "maven/mavencentral/org.jboss.spec.javax.el/jboss-el-api_3.0_spec/2.0.0.Final",
    "source": "https://search.maven.org/remotecontent?filepath=org/jboss/spec/javax/el/jboss-el-api_3.0_spec/2.0.0.Final/jboss-el-api_3.0_spec-2.0.0.Final-sources.jar",
    "status": "approved"
}
