{
    "id": "maven/mavencentral/com.sun.messaging.mq/imqjmx/4.6-b01",
    "license": "(CDDL-1.1 AND GPL-2.0-only WITH Classpath-exception-2.0)",
    "authority": "https://gitlab.eclipse.org/eclipsefdn/emo-team/iplab/-/issues/5291",
    "source": "https://search.maven.org/remotecontent?filepath=com/sun/messaging/mq/imqjmx/4.6-b01/imqjmx-4.6-b01.jar",
    "status": "approved",
    "scans": [
        {
            "date": "December 2, 2022 at 4:08:22 p.m. GMT",
            "authority": "https://gitlab.eclipse.org/eclipsefdn/emo-team/iplab/-/issues/5291",
            "scancode-version": "31.2.1",
            "licenses-discovered": [
                "CDDL-1.1 AND (GPL-2.0-only WITH Classpath-exception-2.0)"
            ],
            "copyrights": [
                "(c) 2011, Oracle and/or its affiliates",
                "Copyright (c) 2000-2010 Oracle and/or its affiliates",
                "Copyright (c) 2000-2011 Oracle and/or its affiliates",
                "Copyright (c) 2011 imq.product.copyright.long",
                "Copyright (c) 2011, Oracle and/or its affiliates"
            ],
            "file-count": 55,
            "sha256": "562e56080473b52d90564d1521b6068ca5297cd94f59ebcf2cad0e22c23d5b95",
            "source": "https://search.maven.org/remotecontent?filepath=com/sun/messaging/mq/imqjmx/4.6-b01/imqjmx-4.6-b01.jar",
            "status": "restricted"
        }
    ]
}
