{
    "id": "maven/mavencentral/org.bytedeco/artoolkitplus/2.3.1-1.5.8",
    "license": "GPL-2.0-or-later AND GPL-3.0-or-later AND (Apache-2.0 AND (GPL-2.0-or-later WITH Classpath-exception-2.0) AND GPL-3.0-only)",
    "authority": "https://gitlab.eclipse.org/eclipsefdn/emo-team/iplab/-/issues/6855",
    "source": "https://search.maven.org/remotecontent?filepath=org/bytedeco/artoolkitplus/2.3.1-1.5.8/artoolkitplus-2.3.1-1.5.8-sources.jar",
    "status": "restricted",
    "scans": [
        {
            "date": "January 27, 2023 at 8:26:32 p.m. GMT",
            "authority": "https://gitlab.eclipse.org/eclipsefdn/emo-team/iplab/-/issues/6855",
            "scancode-version": "31.2.1",
            "licenses-discovered": [
                "GPL-2.0-or-later AND GPL-3.0-or-later",
                "Apache-2.0 AND (GPL-2.0-or-later WITH Classpath-exception-2.0) AND GPL-3.0-only"
            ],
            "copyrights": [
                "Copyright (c) 2010 ARToolkitPlus",
                "Copyright (c) 2013-2020 Samuel Audet"
            ],
            "file-count": 22,
            "sha256": "c58a39b4c677833c316e44abd2095650486fcb972a0b9fa8c9596629ea764c85",
            "source": "https://search.maven.org/remotecontent?filepath=org/bytedeco/artoolkitplus/2.3.1-1.5.8/artoolkitplus-2.3.1-1.5.8-sources.jar",
            "status": "restricted"
        }
    ]
}