{
    "id": "npm/npmjs/-/arraybuffer.prototype.slice/1.0.1",
    "license": "MIT",
    "authority": "https://gitlab.eclipse.org/eclipsefdn/emo-team/iplab/-/issues/9657",
    "source": "https://registry.yarnpkg.com/arraybuffer.prototype.slice/-/arraybuffer.prototype.slice-1.0.1.tgz",
    "status": "approved",
    "scans": [
        {
            "date": "July 19, 2023 at 3:04:17 p.m. GMT",
            "authority": "https://gitlab.eclipse.org/eclipsefdn/emo-team/iplab/-/issues/9657",
            "scancode-version": "31.2.1",
            "licenses-discovered": [
                "MIT"
            ],
            "copyrights": [
                "Copyright (c) 2023 ECMAScript Shims"
            ],
            "file-count": 15,
            "sha256": "618804d6fc4feb8462214afba933ac307c8371f8b0208cd792ac969043c51007",
            "source": "https://registry.yarnpkg.com/arraybuffer.prototype.slice/-/arraybuffer.prototype.slice-1.0.1.tgz",
            "status": "approved"
        }
    ]
}