{
    "id": "npm/npmjs/@docsearch/css/3.3.2",
    "license": "MIT",
    "authority": "https://gitlab.eclipse.org/eclipsefdn/emo-team/iplab/-/issues/6633",
    "source": "https://github.com/algolia/docsearch/archive/v3.3.2.zip",
    "status": "approved",
    "scans": [
        {
            "date": "January 25, 2023 at 12:31:52 p.m. GMT",
            "authority": "https://gitlab.eclipse.org/eclipsefdn/emo-team/iplab/-/issues/6633",
            "scancode-version": "31.2.1",
            "licenses-discovered": [
                "MIT"
            ],
            "copyrights": [
                "(c) Algolia, Inc. and contributors",
                "Copyright (c) 2015-present Algolia, Inc.",
                "copyright DocSearch 2015-now"
            ],
            "file-count": 259,
            "sha256": "11aac9ecf5f6ad7f9aceebd9fe87ea60fb932df7f8fa5370cf806369e8b2e284",
            "source": "https://github.com/algolia/docsearch/archive/v3.3.2.zip",
            "status": "approved"
        }
    ]
}