{
    "id": "maven/mavencentral/org.keycloak/keycloak-admin-client/19.0.3",
    "license": "Apache-2.0",
    "licenses-discovered": [
        "Apache-2.0"
    ],
    "copyrights": [
        "(c) 2016 Red Hat Inc.",
        "Copyright 2016 Red Hat Inc. and/or its affiliates and other contributors as indicated by the author tags",
        "Copyright 2016 Red Hat, Inc. and/or its affiliates and other contributors",
        "Copyright 2016 Red Hat, Inc. and/or its affiliates ~ and other contributors",
        "Copyright 2017 Red Hat, Inc. and/or its affiliates and other contributors",
        "Copyright 2021 Red Hat, Inc. and/or its affiliates and other contributors"
    ],
    "file-count": 76,
    "scancode-version": "31.2.1",
    "authority": "https://gitlab.eclipse.org/eclipsefdn/emo-team/iplab/-/issues/4100",
    "source": "https://search.maven.org/remotecontent?filepath=org/keycloak/keycloak-admin-client/19.0.3/keycloak-admin-client-19.0.3-sources.jar",
    "status": "approved"
}