{
    "id": "git/github/golang/time/555d28b269f0",
    "license": "BSD-3-Clause",
    "authority": "https://gitlab.eclipse.org/eclipsefdn/emo-team/iplab/-/issues/5438",
    "source": "https://github.com/golang/time/archive/555d28b269f0.zip",
    "status": "approved",
    "scans": [
        {
            "date": "December 8, 2022 at 7:20:07 p.m. GMT",
            "authority": "https://gitlab.eclipse.org/eclipsefdn/emo-team/iplab/-/issues/5438",
            "scancode-version": "31.2.1",
            "licenses-discovered": [
                "BSD-3-Clause"
            ],
            "copyrights": [
                "Copyright (c) 2009 The Go Authors",
                "Copyright 2015 The Go Authors"
            ],
            "file-count": 9,
            "sha256": "3943a16d7cde0e4e342952013f951c15403bb6b37c1e4ce7269ab1b551d2c06e",
            "source": "https://github.com/golang/time/archive/555d28b269f0.zip",
            "status": "approved"
        }
    ]
}