{
    "id": "maven/mavencentral/org.apache.maven/apache-maven/3.9.0",
    "license": "Apache-2.0",
    "authority": "https://gitlab.eclipse.org/eclipsefdn/emo-team/iplab/-/issues/7025",
    "source": "https://search.maven.org/remotecontent?filepath=org/apache/maven/apache-maven/3.9.0/apache-maven-3.9.0-src.zip",
    "status": "approved",
    "scans": [
        {
            "date": "February 7, 2023 at 6:06:41 a.m. GMT",
            "authority": "https://gitlab.eclipse.org/eclipsefdn/emo-team/iplab/-/issues/7025",
            "scancode-version": "31.2.1",
            "licenses-discovered": [
                "Apache-2.0",
                "Apache-2.0 AND EPL-1.0",
                "EPL-1.0",
                "MIT",
                "CDDL-1.1 AND (GPL-2.0-only WITH Classpath-exception-2.0)",
                "Apache-2.0 AND EPL-1.0 AND MIT",
                "Apache-2.0 AND BSD-3-Clause AND EPL-1.0",
                "CPL-1.0",
                "LicenseRef-scancode-indiana-extreme",
                "BSD-2-Clause",
                "BSD-3-Clause",
                "Apache-1.1",
                "Apache-2.0 AND LicenseRef-scancode-proprietary-license"
            ],
            "copyrights": [
                "Copyright (c) 1989, 1991 Free Software Foundation, Inc.",
                "Copyright (c) 1999-2003 The Apache Software Foundation",
                "Copyright (c) 2000-2011 INRIA, France Telecom",
                "Copyright (c) 2001-2003, ThoughtWorks, Inc. 651 W Washington Ave. Suite 500 Chicago, IL 60661 USA",
                "Copyright (c) 2002 Extreme! Lab, Indiana University",
                "Copyright (c) 2004-2022 QOS.ch Sarl (Switzerland)",
                "Copyright (c) 2006, Javolution (http://javolution.org)",
                "Copyright 2001-2006 The Codehaus Foundation",
                "Copyright 2005-2006 The Apache Software Foundation",
                "Copyright 2006-2022 Google, Inc.",
                "copyrighted by the Free Software Foundation"
            ],
            "file-count": 3415,
            "sha256": "7581466e19f3de212f046c3bfee36f6621c66a34bf38c8f5617294bc83af4055",
            "source": "https://search.maven.org/remotecontent?filepath=org/apache/maven/apache-maven/3.9.0/apache-maven-3.9.0-src.zip",
            "status": "restricted"
        }
    ]
}
