{
    "id": "npm/npmjs/@npmcli/map-workspaces/3.0.3",
    "license": "ISC",
    "authority": "https://gitlab.eclipse.org/eclipsefdn/emo-team/iplab/-/issues/7603",
    "source": "https://github.com/npm/map-workspaces/archive/v3.0.3.zip",
    "status": "approved",
    "scans": [
        {
            "date": "March 27, 2023 at 4:39:27 p.m. GMT",
            "authority": "https://gitlab.eclipse.org/eclipsefdn/emo-team/iplab/-/issues/7603",
            "scancode-version": "31.2.1",
            "licenses-discovered": [
                "ISC"
            ],
            "copyrights": [
                "Copyright npm, Inc."
            ],
            "file-count": 34,
            "sha256": "44b18d49984300ffa7b29a6a43941a1d86cbb01d6b1bd0097f5351ef708ad66c",
            "source": "https://github.com/npm/map-workspaces/archive/v3.0.3.zip",
            "status": "approved"
        }
    ]
}