{
    "id": "go/golang/k8s.io%2Fklog/v2/v2.100.1",
    "license": "Apache-2.0",
    "authority": "https://gitlab.eclipse.org/eclipsefdn/emo-team/iplab/-/issues/10745",
    "source": "https://proxy.golang.org/k8s.io%2Fklog/v2/@v/v2.100.1.zip",
    "status": "approved",
    "scans": [
        {
            "date": "September 29, 2023 at 6:04:03 p.m. GMT",
            "authority": "https://gitlab.eclipse.org/eclipsefdn/emo-team/iplab/-/issues/10745",
            "scancode-version": "31.2.1",
            "licenses-discovered": [
                "Apache-2.0"
            ],
            "copyrights": [
                "Copyright 2013 Google Inc.",
                "Copyright 2014 The Kubernetes Authors",
                "Copyright 2019 The Kubernetes Authors",
                "Copyright 2020 Intel Coporation",
                "Copyright 2020 The Kubernetes Authors",
                "Copyright 2021 The Kubernetes Authors",
                "Copyright 2022 The Kubernetes Authors",
                "Copyright 2023 The Kubernetes Authors"
            ],
            "file-count": 67,
            "sha256": "753a27de9f28b54d76937797e1a6c9a197c92ff97dd17330d2800b8de2a06241",
            "source": "https://proxy.golang.org/k8s.io%2Fklog/v2/@v/v2.100.1.zip",
            "status": "approved"
        }
    ]
}