{
    "id": "maven/mavencentral/org.junit.jupiter/junit-jupiter-migrationsupport/5.11.0",
    "license": "EPL-2.0",
    "authority": "https://gitlab.eclipse.org/eclipsefdn/emo-team/iplab/-/issues/15931",
    "source": "https://repo1.maven.org/maven2/org/junit/jupiter/junit-jupiter-migrationsupport/5.11.0/junit-jupiter-migrationsupport-5.11.0-sources.jar",
    "status": "approved",
    "scans": [
        {
            "date": "August 14, 2024 at 5:39:04 p.m. GMT",
            "authority": "https://gitlab.eclipse.org/eclipsefdn/emo-team/iplab/-/issues/15931",
            "scancode-version": "31.2.1",
            "licenses-discovered": [
                "EPL-2.0"
            ],
            "copyrights": [
                "Copyright 2015-2021 the original author or authors",
                "Copyright 2015-2024 the original author or authors"
            ],
            "file-count": 25,
            "sha256": "1c59772737aee7802ca35f8e127110614e00adfc07069238a03dbc86d8cd9057",
            "source": "https://repo1.maven.org/maven2/org/junit/jupiter/junit-jupiter-migrationsupport/5.11.0/junit-jupiter-migrationsupport-5.11.0-sources.jar",
            "status": "approved"
        }
    ]
}