{
    "id": "maven/mavencentral/org.testcontainers/testcontainers/1.20.0",
    "license": "MIT",
    "authority": "https://gitlab.eclipse.org/eclipsefdn/emo-team/iplab/-/issues/15747",
    "source": "https://repo1.maven.org/maven2/org/testcontainers/testcontainers/1.20.0/testcontainers-1.20.0-sources.jar",
    "status": "approved",
    "scans": [
        {
            "date": "July 23, 2024 at 9:58:55 a.m. GMT",
            "authority": "https://gitlab.eclipse.org/eclipsefdn/emo-team/iplab/-/issues/15747",
            "scancode-version": "31.2.1",
            "licenses-discovered": [
            ],
            "copyrights": [
            ],
            "file-count": 146,
            "sha256": "0c0085735cd456c19825788ba587c2e9173ced8108b231f6e25df915faf0cc1e",
            "source": "https://repo1.maven.org/maven2/org/testcontainers/testcontainers/1.20.0/testcontainers-1.20.0-sources.jar",
            "status": "restricted"
        }
    ]
}