{
    "license": "Apache-2.0",
    "file-count": 6,
    "authority": "https://gitlab.eclipse.org/eclipsefdn/emo-team/iplab/-/issues/1505",
    "scancode-version": "30.1.0",
    "licenses-discovered": [
        "Apache-2.0"
    ],
    "id": "git/github/google/btree/v1.0.0",
    "source": "https://github.com/google/btree/archive/refs/tags/v1.0.0.zip",
    "status": "approved"
}