{
    "id": "maven/mavencentral/org.apache.lucene/lucene-expressions/8.9.0",
    "license": "Apache-2.0",
    "authority": "https://gitlab.eclipse.org/eclipsefdn/emo-team/iplab/-/issues/6139",
    "source": "https://search.maven.org/remotecontent?filepath=org/apache/lucene/lucene-expressions/8.9.0/lucene-expressions-8.9.0-sources.jar",
    "status": "approved",
    "scans": [
        {
            "date": "January 6, 2023 at 11:26:41 p.m. GMT",
            "authority": "https://gitlab.eclipse.org/eclipsefdn/emo-team/iplab/-/issues/6139",
            "scancode-version": "31.2.1",
            "licenses-discovered": [
                "Apache-2.0"
            ],
            "copyrights": [
            ],
            "file-count": 21,
            "sha256": "abe2e4b020040e60f81b11913dde651daa117af4bcf67a582096a0e2cdb8397f",
            "source": "https://search.maven.org/remotecontent?filepath=org/apache/lucene/lucene-expressions/8.9.0/lucene-expressions-8.9.0-sources.jar",
            "status": "approved"
        }
    ]
}