{
    "id": "maven/mavencentral/io.quarkus/quarkus-credentials/3.17.4",
    "license": "Apache-2.0",
    "authority": "https://gitlab.eclipse.org/eclipsefdn/emo-team/iplab/-/issues/17876",
    "source": "https://repo1.maven.org/maven2/io/quarkus/quarkus-credentials/3.17.4/quarkus-credentials-3.17.4-sources.jar",
    "status": "approved",
    "scans": [
        {
            "date": "December 13, 2024 at 1:23:56 p.m. GMT",
            "authority": "https://gitlab.eclipse.org/eclipsefdn/emo-team/iplab/-/issues/17876",
            "scancode-version": "31.2.1",
            "licenses-discovered": [
            ],
            "copyrights": [
            ],
            "file-count": 6,
            "sha256": "71a9a3f22d1e0a16168c272e4ef8e63a2076d5c0995b451059484879d4e03aec",
            "source": "https://repo1.maven.org/maven2/io/quarkus/quarkus-credentials/3.17.4/quarkus-credentials-3.17.4-sources.jar",
            "status": "restricted"
        }
    ]
}