{
    "id": "maven/mavencentral/com.apicatalog/titanium-json-ld/1.3.2",
    "license": "Apache-2.0",
    "authority": "https://gitlab.eclipse.org/eclipsefdn/emo-team/iplab/-/issues/8912",
    "source": "https://repo.maven.apache.org/maven2/com/apicatalog/titanium-json-ld/1.3.2/titanium-json-ld-1.3.2-sources.jar",
    "status": "approved",
    "scans": [
        {
            "date": "June 14, 2023 at 3:25:12 p.m. GMT",
            "authority": "https://gitlab.eclipse.org/eclipsefdn/emo-team/iplab/-/issues/8912",
            "scancode-version": "31.2.1",
            "licenses-discovered": [
                "Apache-2.0"
            ],
            "copyrights": [
                "Copyright 2020 the original author or authors"
            ],
            "file-count": 142,
            "sha256": "4b40c234b6ac845a1e004b6990e8cce5d5d6bc7570f12d0ce4833654b006c283",
            "source": "https://repo.maven.apache.org/maven2/com/apicatalog/titanium-json-ld/1.3.2/titanium-json-ld-1.3.2-sources.jar",
            "status": "approved"
        }
    ]
}