{
    "id": "npm/npmjs/@typescript-eslint/eslint-plugin/8.12.1",
    "license": "BSD-2-Clause AND MIT AND (BSD-2-Clause AND ISC AND MIT)",
    "authority": "https://gitlab.eclipse.org/eclipsefdn/emo-team/iplab/-/issues/16952",
    "source": "https://github.com/typescript-eslint/typescript-eslint/archive/refs/tags/v8.12.1.zip",
    "status": "approved",
    "scans": [
        {
            "date": "October 29, 2024, 11:24:44 a.m. GMT",
            "authority": "https://gitlab.eclipse.org/eclipsefdn/emo-team/iplab/-/issues/16952",
            "scancode-version": "31.2.1",
            "licenses-discovered": [
                "BSD-2-Clause",
                "MIT",
                "BSD-2-Clause AND ISC AND MIT"
            ],
            "copyrights": [
                "(c) Sindre Sorhus",
                "Copyright (c) 2016 unional",
                "Copyright (c) 2019 typescript-eslint and other contributors",
                "Copyright (c) 2021 typescript-eslint and other contributors",
                "Copyright (c) 2023 typescript-eslint and other contributors",
                "Copyright (c) Facebook, Inc. and its affiliates",
                "Copyright JS Foundation and other contributors, https://js.foundation",
                "Copyright Jeremy Ashkenas, DocumentCloud and Investigative Reporters & Editors",
                "Copyright Joyent, Inc. and other Node contributors",
                "Copyright OpenJS Foundation and other contributors <https://openjsf.org/>",
                "Pp (c) Ac",
                "Tv (c) Gn"
            ],
            "file-count": 7756,
            "sha256": "fc4657add3b199392555c6ff6be6ec44506ba0e4a75e6460a60766e1be235ee3",
            "source": "https://github.com/typescript-eslint/typescript-eslint/archive/refs/tags/v8.12.1.zip",
            "status": "approved"
        }
    ]
}