{
    "license": "ISC AND MIT",
    "file-count": 4,
    "authority": "https://gitlab.eclipse.org/eclipsefdn/emo-team/iplab/-/issues/1274",
    "scancode-version": "21.3.31",
    "licenses-discovered": [
        "MIT",
        "ISC"
    ],
    "id": "npm/npmjs/webassemblyjs/helper-fsm/1.8.5",
    "source": "https://registry.yarnpkg.com/@webassemblyjs/helper-fsm/-/helper-fsm-1.8.5.tgz",
    "status": "approved"
}