{
    "id": "maven/mavencentral/org.apache.maven.surefire/surefire-logger-api/3.1.0",
    "license": "Apache-2.0",
    "authority": "https://gitlab.eclipse.org/eclipsefdn/emo-team/iplab/-/issues/8377",
    "source": "https://search.maven.org/remotecontent?filepath=org/apache/maven/surefire/surefire-logger-api/3.1.0/surefire-logger-api-3.1.0-sources.jar",
    "status": "approved",
    "scans": [
        {
            "date": "May 9, 2023 at 5:58:01 a.m. GMT",
            "authority": "https://gitlab.eclipse.org/eclipsefdn/emo-team/iplab/-/issues/8377",
            "scancode-version": "31.2.1",
            "licenses-discovered": [
                "Apache-2.0"
            ],
            "copyrights": [
            ],
            "file-count": 10,
            "sha256": "da2f6f00b516f788f386480b91d53562361a9aa9af55dd931f7ca33c296543a0",
            "source": "https://search.maven.org/remotecontent?filepath=org/apache/maven/surefire/surefire-logger-api/3.1.0/surefire-logger-api-3.1.0-sources.jar",
            "status": "approved"
        }
    ]
}