{
    "id": "nuget/nuget/-/Serilog.Settings.Configuration/7.0.0",
    "license": "Apache-2.0",
    "authority": "https://gitlab.eclipse.org/eclipsefdn/emo-team/iplab/-/issues/10069",
    "source": "https://github.com/serilog/serilog-settings-configuration/archive/refs/tags/v7.0.0.zip",
    "status": "approved",
    "scans": [
        {
            "date": "August 17, 2023 at 3:50:41 a.m. GMT",
            "authority": "https://gitlab.eclipse.org/eclipsefdn/emo-team/iplab/-/issues/10069",
            "scancode-version": "31.2.1",
            "licenses-discovered": [
                "Apache-2.0"
            ],
            "copyrights": [
                "Copyright 2013-2016 Serilog"
            ],
            "file-count": 86,
            "sha256": "2af455623b0e9a9e20ec606def2e3804bfbfb2b1f0d0b62b4679f727a82c5fc7",
            "source": "https://github.com/serilog/serilog-settings-configuration/archive/refs/tags/v7.0.0.zip",
            "status": "approved"
        }
    ]
}