{
    "id": "maven/mavencentral/org.eclipse.neoscada.utils/org.eclipse.scada.utils/0.4.0",
    "license": "EPL-1.0",
    "authority": "https://gitlab.eclipse.org/eclipsefdn/emo-team/iplab/-/issues/7895",
    "source": "https://search.maven.org/remotecontent?filepath=org/eclipse/neoscada/utils/org.eclipse.scada.utils/0.4.0/org.eclipse.scada.utils-0.4.0-sources.jar",
    "status": "approved",
    "scans": [
        {
            "date": "April 17, 2023 at 10:31:45 a.m. GMT",
            "authority": "https://gitlab.eclipse.org/eclipsefdn/emo-team/iplab/-/issues/7895",
            "scancode-version": "31.2.1",
            "licenses-discovered": [
                "EPL-1.0"
            ],
            "copyrights": [
                "Copyright (c) 2006, 2010 TH4 SYSTEMS GmbH and others",
                "Copyright (c) 2006, 2011 TH4 SYSTEMS GmbH and others",
                "Copyright (c) 2006, 2012 TH4 SYSTEMS GmbH and others",
                "Copyright (c) 2006, 2013 TH4 SYSTEMS GmbH and others",
                "Copyright (c) 2006, 2014 TH4 SYSTEMS GmbH and others",
                "Copyright (c) 2006, 2015 TH4 SYSTEMS GmbH and others",
                "Copyright (c) 2006, 2016 TH4 SYSTEMS GmbH and others",
                "Copyright (c) 2006, 2017 TH4 SYSTEMS GmbH and others",
                "Copyright (c) 2011, 2012 TH4 SYSTEMS GmbH and others",
                "Copyright (c) 2013 IBH SYSTEMS GmbH and others",
                "Copyright (c) 2013 Jens Reimann and others",
                "Copyright (c) 2013, 2014 Jens Reimann and others",
                "Copyright (c) 2014 IBH SYSTEMS GmbH and others",
                "Copyright (c) 2014, 2016 IBH SYSTEMS GmbH and others",
                "Copyright (c) 2015 IBH SYSTEMS GmbH and others"
            ],
            "file-count": 67,
            "sha256": "1f563aa4a560a2f2b3e1d62bcc26d65ad1e1e152f493db47dde21eeff50b63b0",
            "source": "https://search.maven.org/remotecontent?filepath=org/eclipse/neoscada/utils/org.eclipse.scada.utils/0.4.0/org.eclipse.scada.utils-0.4.0-sources.jar",
            "status": "approved"
        }
    ]
}