{
    "id": "maven/mavencentral/org.flowable/flowable-dmn-model/6.8.0",
    "license": "Apache-2.0",
    "authority": "https://gitlab.eclipse.org/eclipsefdn/emo-team/iplab/-/issues/6452",
    "source": "https://search.maven.org/remotecontent?filepath=org/flowable/flowable-dmn-model/6.8.0/flowable-dmn-model-6.8.0-sources.jar",
    "status": "approved",
    "scans": [
        {
            "date": "January 23, 2023 at 8:10:31 p.m. GMT",
            "authority": "https://gitlab.eclipse.org/eclipsefdn/emo-team/iplab/-/issues/6452",
            "scancode-version": "31.2.1",
            "licenses-discovered": [
                "Apache-2.0"
            ],
            "copyrights": [
            ],
            "file-count": 37,
            "sha256": "6cd2fab93871db37f39f2049d9b0f338c93bd1fb04405e8638e00b7b6c1a739f",
            "source": "https://search.maven.org/remotecontent?filepath=org/flowable/flowable-dmn-model/6.8.0/flowable-dmn-model-6.8.0-sources.jar",
            "status": "approved"
        }
    ]
}