{
    "id": "crate/cratesio/-/jemalloc-sys/0.5.4+5.3.0-patched",
    "license": "(Apache-2.0 OR MIT) AND MIT AND (FSFAP AND FSFUL) AND (BSD-2-Clause-Views AND BSD-3-Clause) AND (GPL-3.0-or-later WITH LicenseRef-autoconf-exception) AND NTP AND BSD-3-Clause AND FSFAP",
    "authority": "https://gitlab.eclipse.org/eclipsefdn/emo-team/iplab/-/issues/13815",
    "source": "https://crates.io/api/v1/crates/jemalloc-sys/0.5.4+5.3.0-patched/download",
    "status": "approved",
    "scans": [
        {
            "date": "March 17, 2024 at 2:40:27 p.m. GMT",
            "authority": "https://gitlab.eclipse.org/eclipsefdn/emo-team/iplab/-/issues/13815",
            "scancode-version": "31.2.1",
            "licenses-discovered": [
                "Apache-2.0 AND MIT",
                "Apache-2.0",
                "MIT",
                "FSFAP AND FSFUL",
                "BSD-2-Clause-Views AND BSD-3-Clause AND LicenseRef-scancode-free-unknown",
                "GPL-3.0-or-later AND LicenseRef-scancode-autoconf-simple-exception AND LicenseRef-scancode-free-unknown",
                "NTP",
                "BSD-3-Clause",
                "FSFAP"
            ],
            "copyrights": [
                "Copyright (c) 1992-1996, 1998-2012 Free Software Foundation, Inc.",
                "Copyright (c) 1998-2007, Google Inc.",
                "Copyright (c) 2002-present Jason Evans <jasone@canonware.com>",
                "Copyright (c) 2006, 2007 Mutsuo Saito, Makoto Matsumoto and Hiroshima University",
                "Copyright (c) 2006,2007 Mutsuo Saito, Makoto Matsumoto and Hiroshima University",
                "Copyright (c) 2006-2008 Alexander Chemeris",
                "Copyright (c) 2007 Mutsuo Saito, Makoto Matsumoto and Hiroshima University",
                "Copyright (c) 2007-2012 Mozilla Foundation",
                "Copyright (c) 2008 Benjamin Kosnik <bkoz@redhat.com>",
                "Copyright (c) 2009-present Facebook, Inc.",
                "Copyright (c) 2010-2012 Austin Appleby",
                "Copyright (c) 2012 Free Software Foundation, Inc.",
                "Copyright (c) 2012 Zack Weinberg <zackw@panix.com>",
                "Copyright (c) 2013 Roy Stogner <roystgnr@ices.utexas.edu>",
                "Copyright (c) 2014 Alex Crichton",
                "Copyright (c) 2014, 2015 Google Inc.",
                "Copyright (c) 2015 Moritz Klammler <moritz@klammler.eu>",
                "Copyright (c) 2015 Paul Norman <penorman@mac.com>",
                "Copyright (c) 2016, 2018 Krzesimir Nowak <qdlacz@gmail.com>",
                "Copyright (c) 2019 Enji Cooper <yaneurabeya@gmail.com>",
                "Copyright 1991 by the Massachusetts Institute of Technology",
                "Copyright 1992-2021 Free Software Foundation, Inc.",
                "Copyright 1998-2007 Google Inc.",
                "Copyright 2009-2010 Andrea Leofreddi <a.leofreddi@itcharm.com>",
                "Copyright 2015 The Rust Project"
            ],
            "file-count": 479,
            "sha256": "ac6c1946e1cea1788cbfde01c993b52a10e2da07f4bac608228d1bed20bfebf2",
            "source": "https://crates.io/api/v1/crates/jemalloc-sys/0.5.4+5.3.0-patched/download",
            "status": "restricted"
        }
    ]
}
