{
    "id": "pypi/pypi/-/pytest/8.3.4",
    "license": "MIT AND (JSON AND MIT)",
    "authority": "https://gitlab.eclipse.org/eclipsefdn/emo-team/iplab/-/issues/19870",
    "source": "https://files.pythonhosted.org/packages/05/35/30e0d83068951d90a01852cb1cef56e5d8a09d20c7f511634cc2f7e0372a/pytest-8.3.4.tar.gz",
    "status": "restricted",
    "scans": [
        {
            "date": "March 4, 2025 at 9:38:39 a.m. GMT",
            "authority": "https://gitlab.eclipse.org/eclipsefdn/emo-team/iplab/-/issues/19870",
            "scancode-version": "31.2.1",
            "licenses-discovered": [
                "MIT",
                "JSON AND MIT"
            ],
            "copyrights": [
                "Copyright (c) 2004 Holger Krekel and others",
                "Copyright (c) 2014, Gregory Boissinot",
                "Copyright Holger Krekel and others, 2004",
                "copyright 2015, holger krekel and pytest-dev team"
            ],
            "file-count": 601,
            "sha256": "965370d062bce11e73868e0335abac31b4d3de0e82f4007408d242b4f8610761",
            "source": "https://files.pythonhosted.org/packages/05/35/30e0d83068951d90a01852cb1cef56e5d8a09d20c7f511634cc2f7e0372a/pytest-8.3.4.tar.gz",
            "status": "restricted"
        }
    ]
}