{
    "id": "npm/npmjs/@stylistic/eslint-plugin/2.12.1",
    "license": "MIT",
    "authority": "https://gitlab.eclipse.org/eclipsefdn/emo-team/iplab/-/issues/17834",
    "source": "https://github.com/eslint-stylistic/eslint-stylistic/archive/refs/tags/v2.12.1.zip",
    "status": "approved",
    "scans": [
        {
            "date": "December 13, 2024 at 8:29:13 a.m. GMT",
            "authority": "https://gitlab.eclipse.org/eclipsefdn/emo-team/iplab/-/issues/17834",
            "scancode-version": "31.2.1",
            "licenses-discovered": [
                "MIT"
            ],
            "copyrights": [
                "(c) 2023-PRESENT ESLint Stylistic",
                "(c) OpenJS Foundation and other contributors, <www.openjsf.org>",
                "Copyright (c) 2014 Yannick Croissant",
                "Copyright (c) 2014 by Vitaly Puzrin",
                "Copyright (c) 2019 typescript-eslint and other contributors",
                "Copyright (c) 2023-PRESENT ESLint Stylistic",
                "Copyright (c) 2023-PRESENT eslint-stylistic and other contributors",
                "Copyright OpenJS Foundation and other contributors, <www.openjsf.org>",
                "Copyright OpenJS Foundation and other contributors, www.openjsf.org",
                "copyright 2015 Gyandeep Singh",
                "copyright 2015 Vitaly Puzrin"
            ],
            "file-count": 888,
            "sha256": "1a3037007f2836fc1ca640d3a4162fb023465b8076b789e94cf77262123c5e1b",
            "source": "https://github.com/eslint-stylistic/eslint-stylistic/archive/refs/tags/v2.12.1.zip",
            "status": "approved"
        }
    ]
}