{
    "id": "npm/npmjs/@mui/icons-material/5.15.4",
    "license": "MIT AND CC-BY-3.0",
    "authority": "https://gitlab.eclipse.org/eclipsefdn/emo-team/iplab/-/issues/13171",
    "source": "https://github.com/mui/material-ui/archive/refs/tags/v5.15.4.zip",
    "status": "approved",
    "scans": [
        {
            "date": "February 7, 2024 at 10:41:03 p.m. GMT",
            "authority": "https://gitlab.eclipse.org/eclipsefdn/emo-team/iplab/-/issues/13171",
            "scancode-version": "31.2.1",
            "licenses-discovered": [
                "MIT",
                "LicenseRef-scancode-free-unknown",
                "LGPL-2.0-or-later AND MIT",
                "LicenseRef-scancode-commercial-license",
                "OFL-1.1",
                "CC-BY-3.0"
            ],
            "copyrights": [
                "(c) Your company",
                "Copyright (c) 2014 Call-Em-All",
                "Copyright (c) 2019 Kristoffer K.",
                "Copyright (c) color inherit https://mui.com/",
                "Copyright 2017-2021 Indian Type Foundry",
                "Copyright 2018 IBM Corp.",
                "Copyright 2020"
            ],
            "file-count": 42894,
            "sha256": "cf12c3587196a6e10b589c8148fa27604382fc6c4eb135503ac90bc89f356472",
            "source": "https://github.com/mui/material-ui/archive/refs/tags/v5.15.4.zip",
            "status": "restricted"
        }
    ]
}
