{
    "license": "Apache-2.0",
    "file-count": 1477,
    "authority": "https://gitlab.eclipse.org/eclipsefdn/emo-team/iplab/-/issues/1651",
    "scancode-version": "30.1.0",
    "licenses-discovered": [
        "Apache-2.0",
        "LicenseRef-scancode-proprietary-license"
    ],
    "id": "maven/mavencentral/org.jooq/jooq/3.14.11",
    "source": "https://search.maven.org/remotecontent?filepath=org/jooq/jooq/3.14.11/jooq-3.14.11-sources.jar",
    "status": "approved"
}
