{
    "id": "maven/mavencentral/org.apache.hbase/hbase-common/2.5.2",
    "license": "Apache-2.0 AND BSD-3-Clause AND LicenseRef-scancode-public-domain-disclaimer",
    "authority": "https://gitlab.eclipse.org/eclipsefdn/emo-team/iplab/-/issues/6519",
    "source": "https://search.maven.org/remotecontent?filepath=org/apache/hbase/hbase-common/2.5.2/hbase-common-2.5.2-sources.jar",
    "status": "approved",
    "scans": [
        {
            "date": "January 24, 2023 at 12:34:26 a.m. GMT",
            "authority": "https://gitlab.eclipse.org/eclipsefdn/emo-team/iplab/-/issues/6519",
            "scancode-version": "31.2.1",
            "licenses-discovered": [
                "Apache-2.0",
                "Apache-2.0 AND BSD-3-Clause",
                "Apache-2.0 AND LicenseRef-scancode-public-domain-disclaimer"
            ],
            "copyrights": [
                "Copyright 2008 Google Inc."
            ],
            "file-count": 282,
            "sha256": "ab57f406797bbfedf3d44193f7513270ffe0851b0031e4823d715d476aaaab97",
            "source": "https://search.maven.org/remotecontent?filepath=org/apache/hbase/hbase-common/2.5.2/hbase-common-2.5.2-sources.jar",
            "status": "restricted"
        }
    ]
}
