{
    "id": "maven/mavencentral/org.apache.xmlgraphics/batik-rasterizer/1.17",
    "license": "Apache-2.0",
    "authority": "https://gitlab.eclipse.org/eclipsefdn/emo-team/iplab/-/issues/10145",
    "source": "https://repo.maven.apache.org/maven2/org/apache/xmlgraphics/batik-rasterizer/1.17/batik-rasterizer-1.17-sources.jar",
    "status": "approved",
    "scans": [
        {
            "date": "August 22, 2023 at 8:57:06 a.m. GMT",
            "authority": "https://gitlab.eclipse.org/eclipsefdn/emo-team/iplab/-/issues/10145",
            "scancode-version": "31.2.1",
            "licenses-discovered": [
                "Apache-2.0"
            ],
            "copyrights": [
            ],
            "file-count": 4,
            "sha256": "9125931db1f3fd6f1f6ff7a79545fde095c1e06e48c08adf5024eecfa9088875",
            "source": "https://repo.maven.apache.org/maven2/org/apache/xmlgraphics/batik-rasterizer/1.17/batik-rasterizer-1.17-sources.jar",
            "status": "approved"
        }
    ]
}