{
    "id": "npm/npmjs/-/cx-portal-shared-components/0.5.1",
    "license": "Apache-2.0 AND MIT AND OFL-1.1",
    "licenses-discovered": [
        "Apache-2.0",
        "MIT",
        "OFL-1.1"
    ],
    "copyrights": [
        "(c) Sindre Sorhus",
        "Copyright (c) BMW Group AG",
        "Copyright (c) Contributors",
        "Copyright (c) Evgeny Poberezkin",
        "Copyright (c) Facebook, Inc.",
        "Copyright (c) Facebook, Inc. and its affiliates",
        "Copyright (c) Jed Watson",
        "Copyright Jeremy Ashkenas, DocumentCloud and Investigative Reporters & Editors",
        "Copyright The LibreFranklin Project",
        "Copyright jQuery Foundation and other contributors <https://jquery.org/>",
        "copyright Nijikokun <nijikokun@gmail.com>"
    ],
    "file-count": 301,
    "scancode-version": "30.1.0",
    "authority": "https://gitlab.eclipse.org/eclipsefdn/emo-team/iplab/-/issues/3483",
    "source": "https://registry.npmjs.org/cx-portal-shared-components/-/cx-portal-shared-components-0.5.1.tgz",
    "status": "approved"
}