{
    "id": "go/golang/google.golang.org/api/v0.56.0",
    "license": "BSD-3-Clause AND Apache-2.0 AND MIT",
    "authority": "https://gitlab.eclipse.org/eclipsefdn/emo-team/iplab/-/issues/12541",
    "source": "https://proxy.golang.org/google.golang.org/api/@v/v0.56.0.zip",
    "status": "approved",
    "scans": [
        {
            "date": "December 26, 2023 at 2:48:49 a.m. GMT",
            "authority": "https://gitlab.eclipse.org/eclipsefdn/emo-team/iplab/-/issues/12541",
            "scancode-version": "31.2.1",
            "licenses-discovered": [
                "LicenseRef-scancode-proprietary-license",
                "BSD-3-Clause",
                "Apache-2.0",
                "LicenseRef-scancode-unknown",
                "BSD-3-Clause AND LicenseRef-scancode-unknown",
                "BSD-3-Clause AND JSON",
                "LicenseRef-scancode-other-copyleft AND LicenseRef-scancode-proprietary-license",
                "BSD-3-Clause AND LicenseRef-scancode-other-copyleft AND LicenseRef-scancode-proprietary-license",
                "BSD-3-Clause AND LicenseRef-scancode-proprietary-license",
                "CC-BY-3.0 AND CC-BY-4.0",
                "BSD-3-Clause AND CC-BY-3.0 AND CC-BY-4.0 AND JSON"
            ],
            "copyrights": [
                "Copyright (c) 2011 Google Inc.",
                "Copyright (c) 2013 Joshua Tacoma",
                "Copyright 2011 Google LLC.",
                "Copyright 2012 Google LLC.",
                "Copyright 2013 Google LLC.",
                "Copyright 2013 Joshua Tacoma",
                "Copyright 2014 The Go Authors",
                "Copyright 2015 Google LLC",
                "Copyright 2015 Google LLC.",
                "Copyright 2015 The Go Authors",
                "Copyright 2016 Google LLC",
                "Copyright 2016 Google LLC.",
                "Copyright 2016 The Go Authors",
                "Copyright 2017 Google LLC.",
                "Copyright 2017 The Go Authors",
                "Copyright 2018 Google LLC",
                "Copyright 2018 Google LLC.",
                "Copyright 2019 Google LLC.",
                "Copyright 2020 Google LLC",
                "Copyright 2020 Google LLC.",
                "Copyright 2020 The Go Authors",
                "Copyright 2021 Google LLC.",
                "Copyright 2021 The Go Authors",
                "Copyright Google LLC.",
                "Copyright YEAR Google LLC.",
                "Copyright d d d d (Google LLC The Go Authors)( .)"
            ],
            "file-count": 1103,
            "sha256": "f843faaa80dafa15e8fc9e758be5f9a54429cdb9b609edfa8a2483de150a016c",
            "source": "https://proxy.golang.org/google.golang.org/api/@v/v0.56.0.zip",
            "status": "restricted"
        }
    ]
}
