{
    "id": "project/ee4j.glassfish/eclipse-ee4j/docker-library-glassfish/ac49a8c1870a5cd381eed85496b01e777937b2a9",
    "license": "EPL-2.0 OR GPL-2.0-only WITH Classpath-exception-2.0",
    "authority": "https://gitlab.eclipse.org/eclipsefdn/emo-team/iplab/-/issues/8568",
    "source": "https://github.com/OmniFish-EE/docker-library-glassfish/archive/ac49a8c1870a5cd381eed85496b01e777937b2a9.zip",
    "status": "approved",
    "scans": [
        {
            "date": "May 26, 2023 at 4:18:36 p.m. GMT",
            "authority": "https://gitlab.eclipse.org/eclipsefdn/emo-team/iplab/-/issues/8568",
            "scancode-version": "31.2.1",
            "licenses-discovered": [
                "EPL-2.0",
                "EPL-2.0 AND (GPL-2.0-only WITH Classpath-exception-2.0)"
            ],
            "copyrights": [
                "Copyright (c) 2023 Eclipse Foundation and/or its affiliates"
            ],
            "file-count": 26,
            "sha256": "722288d293ba3653fba7883293fb515a820eafdafeb2383bad27d600ca50b73d",
            "source": "https://github.com/OmniFish-EE/docker-library-glassfish/archive/ac49a8c1870a5cd381eed85496b01e777937b2a9.zip",
            "status": "restricted"
        }
    ]
}
