{
    "id": "npm/npmjs/@types/archiver/5.3.3",
    "license": "MIT",
    "authority": "https://gitlab.eclipse.org/eclipsefdn/emo-team/iplab/-/issues/10849",
    "source": "https://registry.yarnpkg.com/@types/archiver/-/archiver-5.3.3.tgz",
    "status": "approved",
    "scans": [
        {
            "date": "October 3, 2023 at 1:56:04 p.m. GMT",
            "authority": "https://gitlab.eclipse.org/eclipsefdn/emo-team/iplab/-/issues/10849",
            "scancode-version": "31.2.1",
            "licenses-discovered": [
                "MIT"
            ],
            "copyrights": [
                "Copyright (c) Microsoft Corporation"
            ],
            "file-count": 4,
            "sha256": "4a6c704e4571f2452f9f1e6462f81ec01b0a3ebf3eb5b83f7461a4fd72c2be2a",
            "source": "https://registry.yarnpkg.com/@types/archiver/-/archiver-5.3.3.tgz",
            "status": "approved"
        }
    ]
}