{
    "id": "maven/mavencentral/info.picocli/picocli-codegen/4.7.5",
    "license": "Apache-2.0",
    "authority": "https://gitlab.eclipse.org/eclipsefdn/emo-team/iplab/-/issues/10355",
    "source": "https://repo.maven.apache.org/maven2/info/picocli/picocli-codegen/4.7.5/picocli-codegen-4.7.5-sources.jar",
    "status": "approved",
    "scans": [
        {
            "date": "September 8, 2023 at 10:06:31 a.m. GMT",
            "authority": "https://gitlab.eclipse.org/eclipsefdn/emo-team/iplab/-/issues/10355",
            "scancode-version": "31.2.1",
            "licenses-discovered": [
            ],
            "copyrights": [
            ],
            "file-count": 36,
            "sha256": "06f01d9774d03a053a3105f35d5d85b8d638d17e43f3b7a0baab9823eea02088",
            "source": "https://repo.maven.apache.org/maven2/info/picocli/picocli-codegen/4.7.5/picocli-codegen-4.7.5-sources.jar",
            "status": "restricted"
        }
    ]
}
