{
    "id": "maven/mavencentral/commons-codec/commons-codec/1.18.0",
    "license": "Apache-2.0 AND (Apache-2.0 AND BSD-3-Clause)",
    "authority": "https://gitlab.eclipse.org/eclipsefdn/emo-team/iplab/-/issues/19214",
    "source": "https://repo1.maven.org/maven2/commons-codec/commons-codec/1.18.0/commons-codec-1.18.0-sources.jar",
    "status": "approved",
    "scans": [
        {
            "date": "January 28, 2025 at 5:53:20 a.m. GMT",
            "authority": "https://gitlab.eclipse.org/eclipsefdn/emo-team/iplab/-/issues/19214",
            "scancode-version": "31.2.1",
            "licenses-discovered": [
                "Apache-2.0",
                "Apache-2.0 AND BSD-3-Clause"
            ],
            "copyrights": [
                "Copyright (c) 2004-2006 Intel Corporation"
            ],
            "file-count": 212,
            "sha256": "6c50e3dd81284139baddf94b3d0f78d25135eea0853f6495267196cdcf5949e3",
            "source": "https://repo1.maven.org/maven2/commons-codec/commons-codec/1.18.0/commons-codec-1.18.0-sources.jar",
            "status": "approved"
        }
    ]
}