{
    "license": "MIT",
    "file-count": 4,
    "authority": "https://gitlab.eclipse.org/eclipsefdn/emo-team/iplab/-/issues/957",
    "scancode-version": "21.3.31",
    "licenses-discovered": [
        "MIT"
    ],
    "id": "npm/npmjs/babel/plugin-transform-typeof-symbol/7.14.5",
    "source": "https://registry.yarnpkg.com/@babel/plugin-transform-typeof-symbol/-/plugin-transform-typeof-symbol-7.14.5.tgz",
    "status": "approved"
}