{
    "id": "maven/mavencentral/xml-apis/xml-apis/1.0.b2",
    "license": "Apache-2.0 and SAX-PD",
    "licenses-discovered": [
        "LicenseRef-scancode-sun-prop-non-commercial",
        "LicenseRef-scancode-iso-8879",
        "LicenseRef-scancode-public-domain-disclaimer",
        "SAX-PD",
        "Classpath-exception-2.0 AND LicenseRef-scancode-public-domain-disclaimer"
    ],
    "file-count": 177,
    "scancode-version": "30.1.0",
    "authority": "https://gitlab.eclipse.org/eclipsefdn/emo-team/iplab/-/issues/2532",
    "source": "https://search.maven.org/remotecontent?filepath=xml-apis/xml-apis/1.0.b2/xml-apis-1.0.b2-sources.jar",
    "status": "approved"
}
