{
    "id": "maven/mavencentral/org.graalvm.js/js/20.3.13",
    "license": "UPL-1.0 AND (LicenseRef-scancode-sunpro AND UPL-1.0) AND (GPL-2.0-only WITH Classpath-exception-2.0 AND UPL-1.0) AND (BSD-3-Clause AND UPL-1.0) AND (LicenseRef-scancode-x11-lucent AND MPL-2.0)",
    "authority": "https://gitlab.eclipse.org/eclipsefdn/emo-team/iplab/-/issues/13792",
    "source": "https://repo1.maven.org/maven2/org/graalvm/js/js/20.3.13/js-20.3.13-sources.jar",
    "status": "restricted",
    "scans": [
        {
            "date": "March 16, 2024 at 3:49:43 a.m. GMT",
            "authority": "https://gitlab.eclipse.org/eclipsefdn/emo-team/iplab/-/issues/13792",
            "scancode-version": "31.2.1",
            "licenses-discovered": [
                "UPL-1.0",
                "LicenseRef-scancode-sunpro AND UPL-1.0",
                "GPL-2.0-only WITH Classpath-exception-2.0 AND UPL-1.0",
                "BSD-3-Clause AND UPL-1.0",
                "LicenseRef-scancode-x11-lucent AND MPL-2.0"
            ],
            "copyrights": [
                "Copyright (c) 1991, 2000, 2001 by Lucent Technologies",
                "Copyright (c) 1993 by Sun Microsystems, Inc.",
                "Copyright (c) 1995, 2006, Oracle and/or its affiliates",
                "Copyright (c) 1998, 2006, 2015, Oracle and/or its affiliates",
                "Copyright (c) 2010, 2018, Oracle and/or its affiliates",
                "Copyright (c) 2010, 2019, Oracle and/or its affiliates",
                "Copyright (c) 2010, 2020, Oracle and/or its affiliates",
                "Copyright (c) 2010, 2022, Oracle and/or its affiliates",
                "Copyright (c) 2014, 2018, Oracle and/or its affiliates",
                "Copyright (c) 2014, 2020, Oracle and/or its affiliates",
                "Copyright (c) 2015, 2018, Oracle and/or its affiliates",
                "Copyright (c) 2015, 2020, Oracle and/or its affiliates",
                "Copyright (c) 2016, 2018, Oracle and/or its affiliates",
                "Copyright (c) 2018, 2018, Oracle and/or its affiliates",
                "Copyright (c) 2018, 2019, Oracle and/or its affiliates",
                "Copyright (c) 2018, 2020, Oracle and/or its affiliates",
                "Copyright (c) 2018, 2021, Oracle and/or its affiliates",
                "Copyright (c) 2018, 2022, Oracle and/or its affiliates",
                "Copyright (c) 2019, 2019, Oracle and/or its affiliates",
                "Copyright (c) 2019, 2020, Oracle and/or its affiliates",
                "Copyright (c) 2019, 2021, Oracle and/or its affiliates",
                "Copyright (c) 2019, Oracle and/or its affiliates",
                "Copyright (c) 2020, 2020, Oracle and/or its affiliates",
                "Copyright (c) 2020, 2022, Oracle and/or its affiliates",
                "Copyright 2010 the V8 project authors",
                "Copyright 2011 the V8 project authors"
            ],
            "file-count": 1274,
            "sha256": "35904fc1c56d25c205437ebecbdb198e4ef6f4290bcc748065a3c7bfa79e8cf1",
            "source": "https://repo1.maven.org/maven2/org/graalvm/js/js/20.3.13/js-20.3.13-sources.jar",
            "status": "restricted"
        }
    ]
}