{
    "id": "npm/npmjs/-/engine.io-parser/5.0.5",
    "license": "MIT",
    "authority": "https://gitlab.eclipse.org/eclipsefdn/emo-team/iplab/-/issues/6249",
    "source": "https://registry.yarnpkg.com/engine.io-parser/-/engine.io-parser-5.0.5.tgz",
    "status": "approved",
    "scans": [
        {
            "date": "January 9, 2023 at 7:55:30 p.m. GMT",
            "authority": "https://gitlab.eclipse.org/eclipsefdn/emo-team/iplab/-/issues/6249",
            "scancode-version": "31.2.1",
            "licenses-discovered": [
                "MIT"
            ],
            "copyrights": [
                "Copyright (c) 2016 Guillermo Rauch"
            ],
            "file-count": 26,
            "sha256": "fbfa9ae2093853129d9a4c100945acdbd3c4baaab04cc11d7193e72d65664183",
            "source": "https://registry.yarnpkg.com/engine.io-parser/-/engine.io-parser-5.0.5.tgz",
            "status": "approved"
        }
    ]
}