{
    "id": "npm/npmjs/@types/node/8.9.4",
    "license": "MIT",
    "licenses-discovered": [
        "MIT"
    ],
    "copyrights": [
        "Copyright (c) Microsoft Corporation"
    ],
    "file-count": 5,
    "scancode-version": "30.1.0",
    "authority": "https://gitlab.eclipse.org/eclipsefdn/emo-team/iplab/-/issues/2918",
    "source": "https://registry.npmjs.org/@types/node/-/node-8.9.4.tgz",
    "status": "approved"
}