{
    "id": "npm/npmjs/@typescript-eslint/eslint-plugin/6.20.0",
    "license": "BSD-2-Clause AND (BSD-2-Clause AND ISC AND MIT) AND MIT",
    "authority": "https://gitlab.eclipse.org/eclipsefdn/emo-team/iplab/-/issues/13030",
    "source": "https://github.com/typescript-eslint/typescript-eslint/archive/refs/tags/v6.20.0.zip",
    "status": "approved",
    "scans": [
        {
            "date": "January 31, 2024 at 7:55:57 a.m. GMT",
            "authority": "https://gitlab.eclipse.org/eclipsefdn/emo-team/iplab/-/issues/13030",
            "scancode-version": "31.2.1",
            "licenses-discovered": [
                "BSD-2-Clause",
                "BSD-2-Clause AND ISC AND MIT",
                "MIT"
            ],
            "copyrights": [
                "Copyright (c) 2016 unional",
                "Copyright (c) 2019 typescript-eslint and other contributors",
                "Copyright (c) 2021 typescript-eslint and other contributors",
                "Copyright (c) 2023 typescript-eslint and other contributors",
                "Copyright JS Foundation and other contributors, https://js.foundation",
                "Copyright Joyent, Inc. and other Node contributors"
            ],
            "file-count": 6885,
            "sha256": "47207b7a4098f287246404c81e25bda863a9b3bf1f34a69154aa2b05c8f7a2c7",
            "source": "https://github.com/typescript-eslint/typescript-eslint/archive/refs/tags/v6.20.0.zip",
            "status": "approved"
        }
    ]
}