{
    "id": "go/golang/google.golang.org/genproto/v0.0.0-20190819201941-24fa4b261c55",
    "license": "Apache-2.0",
    "authority": "https://gitlab.eclipse.org/eclipsefdn/emo-team/iplab/-/issues/5838",
    "source": "https://proxy.golang.org/google.golang.org/genproto/@v/v0.0.0-20190819201941-24fa4b261c55.zip",
    "status": "approved",
    "scans": [
        {
            "date": "December 14, 2022 at 7:26:45 a.m. GMT",
            "authority": "https://gitlab.eclipse.org/eclipsefdn/emo-team/iplab/-/issues/5838",
            "scancode-version": "31.2.1",
            "licenses-discovered": [
                "Apache-2.0",
                "LicenseRef-scancode-proprietary-license"
            ],
            "copyrights": [
                "Copyright 2016 Google Inc.",
                "Copyright 2018 Google Inc.",
                "Copyright 2019 Google LLC"
            ],
            "file-count": 1590,
            "sha256": "5c9553dc489088d74b494857a6f7aad4db33c168bb818345234d2e62b77561a7",
            "source": "https://proxy.golang.org/google.golang.org/genproto/@v/v0.0.0-20190819201941-24fa4b261c55.zip",
            "status": "restricted"
        }
    ]
}
