{
    "id": "maven/mavencentral/org.keycloak/keycloak-spring-security-adapter/22.0.4",
    "license": "Apache-2.0",
    "authority": "https://gitlab.eclipse.org/eclipsefdn/emo-team/iplab/-/issues/11304",
    "source": "https://repo.maven.apache.org/maven2/org/keycloak/keycloak-spring-security-adapter/22.0.4/keycloak-spring-security-adapter-22.0.4-sources.jar",
    "status": "approved",
    "scans": [
        {
            "date": "October 26, 2023 at 7:47:59 p.m. GMT",
            "authority": "https://gitlab.eclipse.org/eclipsefdn/emo-team/iplab/-/issues/11304",
            "scancode-version": "31.2.1",
            "licenses-discovered": [
                "Apache-2.0"
            ],
            "copyrights": [
                "Copyright 2016 Red Hat, Inc. and/or its affiliates and other contributors",
                "Copyright 2016 Red Hat, Inc. and/or its affiliates ~ and other contributors",
                "Copyright 2017 Red Hat, Inc. and/or its affiliates and other contributors",
                "Copyright 2018 Red Hat, Inc. and/or its affiliates and other contributors"
            ],
            "file-count": 46,
            "sha256": "91d95d326f36b3b2d49e4414c65436cb895f918c46f37454d10867e1ca11d49a",
            "source": "https://repo.maven.apache.org/maven2/org/keycloak/keycloak-spring-security-adapter/22.0.4/keycloak-spring-security-adapter-22.0.4-sources.jar",
            "status": "approved"
        }
    ]
}