{
    "id": "npm/npmjs/-/eslint-plugin-n/17.1.0",
    "license": "MIT",
    "authority": "https://gitlab.eclipse.org/eclipsefdn/emo-team/iplab/-/issues/14257",
    "source": "https://github.com/eslint-community/eslint-plugin-n/archive/refs/tags/v17.1.0.zip",
    "status": "approved",
    "scans": [
        {
            "date": "April 10, 2024 at 11:35:52 a.m. GMT",
            "authority": "https://gitlab.eclipse.org/eclipsefdn/emo-team/iplab/-/issues/14257",
            "scancode-version": "31.2.1",
            "licenses-discovered": [
                "MIT"
            ],
            "copyrights": [
                "Copyright (c) 2015 Toru Nagashima",
                "copyright 2016 Toru Nagashima"
            ],
            "file-count": 378,
            "sha256": "9612fa9df8cab26a0f0ec95f2d21b46fb90445293dab90c101f677861ed5c184",
            "source": "https://github.com/eslint-community/eslint-plugin-n/archive/refs/tags/v17.1.0.zip",
            "status": "approved"
        }
    ]
}