{
    "id": "npm/npmjs/@vue/language-service/1.8.3",
    "license": "MIT",
    "authority": "https://gitlab.eclipse.org/eclipsefdn/emo-team/iplab/-/issues/9202",
    "source": "https://registry.npmjs.org/@vue/language-service/-/language-service-1.8.3.tgz",
    "status": "approved",
    "scans": [
        {
            "date": "June 28, 2023 at 1:03:15 p.m. GMT",
            "authority": "https://gitlab.eclipse.org/eclipsefdn/emo-team/iplab/-/issues/9202",
            "scancode-version": "31.2.1",
            "licenses-discovered": [
                "MIT"
            ],
            "copyrights": [
                "Copyright (c) 2021-present Johnson Chu"
            ],
            "file-count": 45,
            "sha256": "1baaaddb78bb022ba48cdfaeb54050e921b44342feb202f478c350db28f4b316",
            "source": "https://registry.npmjs.org/@vue/language-service/-/language-service-1.8.3.tgz",
            "status": "approved"
        }
    ]
}