{
    "id": "p2/orbit/p2.eclipse.plugin/org.eclipse.emf.ecore/2.28.0.v20220817-1401",
    "license": "EPL-2.0",
    "licenses-discovered": [
        "Apache-1.1 AND Apache-2.0 AND EPL-2.0 AND SHL-0.51",
        "EPL-2.0",
        "CPL-1.0 AND EPL-1.0",
        "Apache-1.1 AND EPL-2.0",
        "Apache-2.0 AND EPL-2.0"
    ],
    "copyrights": [
        "(c) 2008 VeriSign, Inc.",
        "Copyright (c) 1999-2004 The Apache Software Foundation",
        "Copyright (c) 2002-2004 IBM Corporation and others",
        "Copyright (c) 2002-2006 IBM Corporation and others",
        "Copyright (c) 2002-2007 IBM Corporation and others",
        "Copyright (c) 2002-2009 IBM Corporation and others",
        "Copyright (c) 2002-2012 IBM Corporation and others",
        "Copyright (c) 2002-2013 IBM Corporation and others",
        "Copyright (c) 2002-2014 IBM Corporation, CEA, and others",
        "Copyright (c) 2002-2014 IBM Corporation, itemis AG, CEA, and others",
        "Copyright (c) 2003-2004 IBM Corporation and others",
        "Copyright (c) 2003-2005 IBM Corporation and others",
        "Copyright (c) 2003-2006 IBM Corporation and others",
        "Copyright (c) 2003-2007 IBM Corporation and others",
        "Copyright (c) 2003-2009 IBM Corporation and others",
        "Copyright (c) 2004-2006 IBM Corporation and others",
        "Copyright (c) 2004-2007 IBM Corporation and others",
        "Copyright (c) 2004-2009 IBM Corporation and others",
        "Copyright (c) 2005-2006 IBM Corporation and others",
        "Copyright (c) 2005-2007 IBM Corporation and others",
        "Copyright (c) 2005-2019 IBM Corporation, CEA, and others",
        "Copyright (c) 2006 IBM Corporation and others",
        "Copyright (c) 2006-2007 IBM Corporation and others",
        "Copyright (c) 2006-2012 IBM Corporation and others",
        "Copyright (c) 2006-2013 IBM Corporation and others",
        "Copyright (c) 2007 IBM Corporation and others",
        "Copyright (c) 2007-2010 IBM Corporation and others",
        "Copyright (c) 2007-2012 IBM Corporation and others",
        "Copyright (c) 2008 IBM Corporation and others",
        "Copyright (c) 2008-2009 IBM Corporation and others",
        "Copyright (c) 2008-2009 Zeligsoft Inc. and others",
        "Copyright (c) 2009 Ed Merks and others",
        "Copyright (c) 2009 Kenn Hussey and others",
        "Copyright (c) 2009 TIBCO Software Inc. and others",
        "Copyright (c) 2010 Kenn Hussey and others",
        "Copyright (c) 2011 Hallvard Traetteberg and others",
        "Copyright (c) 2017 Eclipse",
        "Copyright (c) 2018 Eclipse",
        "Copyright 1999-2010 The Apache Software Foundation",
        "at iClick, Inc., software copyright (c) 1999",
        "copyright (c) 1999, IBM Corporation., http://www.ibm.com",
        "copyright (c) 1999, International Business Machines, Inc., http://www.apache.org",
        "copyright (c) 1999, Sun Microsystems., http://www.sun.com",
        "copyright (c) 1999-2003, International Business Machines, Inc., http://www.apache.org"
    ],
    "file-count": 193,
    "scancode-version": "31.2.1",
    "authority": "https://gitlab.eclipse.org/eclipsefdn/emo-team/iplab/-/issues/3881",
    "source": "https://search.maven.org/remotecontent?filepath=org/eclipse/emf/org.eclipse.emf.ecore/2.28.0/org.eclipse.emf.ecore-2.28.0-sources.jar",
    "status": "approved"
}
