{
    "id": "maven/mavencentral/io.fabric8/openshift-model-machineconfig/6.13.5",
    "license": "Apache-2.0",
    "authority": "https://gitlab.eclipse.org/eclipsefdn/emo-team/iplab/-/issues/19377",
    "source": "https://repo1.maven.org/maven2/io/fabric8/openshift-model-machineconfig/6.13.5/openshift-model-machineconfig-6.13.5-sources.jar",
    "status": "approved",
    "scans": [
        {
            "date": "February 11, 2025 at 1:32:54 p.m. GMT",
            "authority": "https://gitlab.eclipse.org/eclipsefdn/emo-team/iplab/-/issues/19377",
            "scancode-version": "31.2.1",
            "licenses-discovered": [
                "Apache-2.0"
            ],
            "copyrights": [
                "Copyright (c) 2015 Red Hat, Inc."
            ],
            "file-count": 95,
            "sha256": "1d42ec0ca296ba87e784acd80977c1e80a8957ea9b63c548ccd43a8ab5bbf40b",
            "source": "https://repo1.maven.org/maven2/io/fabric8/openshift-model-machineconfig/6.13.5/openshift-model-machineconfig-6.13.5-sources.jar",
            "status": "approved"
        }
    ]
}