{
    "id": "maven/mavencentral/org.geotools/gt-epsg-wkt/32.1",
    "license": "LGPL-2.1-only",
    "authority": "https://gitlab.eclipse.org/eclipsefdn/emo-team/iplab/-/issues/17446",
    "source": "https://repo.osgeo.org/repository/geotools-releases/org/geotools/gt-epsg-wkt/32.1/gt-epsg-wkt-32.1-sources.jar",
    "status": "approved",
    "scans": [
        {
            "date": "November 26, 2024 at 6:25:55 p.m. GMT",
            "authority": "https://gitlab.eclipse.org/eclipsefdn/emo-team/iplab/-/issues/17446",
            "scancode-version": "31.2.1",
            "licenses-discovered": [
                "LGPL-2.1-only"
            ],
            "copyrights": [
                "(c) 2004-2008, Open Source Geospatial Foundation"
            ],
            "file-count": 6,
            "sha256": "78d6beac7767ffbad1ce5c637dcd5236964e0028d931e8b4a137a619b45402eb",
            "source": "https://repo.osgeo.org/repository/geotools-releases/org/geotools/gt-epsg-wkt/32.1/gt-epsg-wkt-32.1-sources.jar",
            "status": "approved"
        }
    ]
}