{
    "id": "maven/mavencentral/software.amazon.awssdk/http-auth-aws/2.29.1",
    "license": "Apache-2.0",
    "authority": "https://gitlab.eclipse.org/eclipsefdn/emo-team/iplab/-/issues/17001",
    "source": "https://repo1.maven.org/maven2/software/amazon/awssdk/http-auth-aws/2.29.1/http-auth-aws-2.29.1-sources.jar",
    "status": "approved",
    "scans": [
        {
            "date": "November 1, 2024, 3:41:13 a.m. GMT",
            "authority": "https://gitlab.eclipse.org/eclipsefdn/emo-team/iplab/-/issues/17001",
            "scancode-version": "31.2.1",
            "licenses-discovered": [
                "Apache-2.0"
            ],
            "copyrights": [
                "Copyright Amazon.com, Inc. or its affiliates"
            ],
            "file-count": 68,
            "sha256": "ad9c110aadf57c09a18493087d8c9e935c4a64d629bf4442512da5f1cffecb64",
            "source": "https://repo1.maven.org/maven2/software/amazon/awssdk/http-auth-aws/2.29.1/http-auth-aws-2.29.1-sources.jar",
            "status": "approved"
        }
    ]
}