{
    "id": "maven/mavencentral/org.apache.poi/poi-ooxml-lite/5.4.0",
    "license": "Apache-2.0 AND MIT AND Apache-2.0 AND W3C-19980720",
    "authority": "https://gitlab.eclipse.org/eclipsefdn/emo-team/iplab/-/issues/18529",
    "source": "https://repo1.maven.org/maven2/org/apache/poi/poi-ooxml-lite/5.4.0/poi-ooxml-lite-5.4.0-sources.jar",
    "status": "approved",
    "scans": [
        {
            "date": "January 9, 2025 at 11:27:30 a.m. GMT",
            "authority": "https://gitlab.eclipse.org/eclipsefdn/emo-team/iplab/-/issues/18529",
            "scancode-version": "31.2.1",
            "licenses-discovered": [
                "Apache-2.0 AND MIT",
                "Apache-2.0",
                "W3C-19980720"
            ],
            "copyrights": [
                "Copyright (c) 2000-2002 Microsoft Corporation",
                "Copyright (c) 2002-2023 EPFL",
                "Copyright (c) 2011-2023 Lightbend, Inc.",
                "Copyright (c) 2015 Inbot",
                "Copyright (c) 2015-2021 the original",
                "Copyright (c) Microsoft Corporation",
                "Copyright 2001 The Internet Society and W3C (Massachusetts Institute of Technology, Institut National de Recherche en Informatique et en Automatique, Keio University)"
            ],
            "file-count": 14723,
            "sha256": "0cbd90a42b3996a5aa12810bb554cddcfa40fa23db5c7d4c070a4c17637f5770",
            "source": "https://repo1.maven.org/maven2/org/apache/poi/poi-ooxml-lite/5.4.0/poi-ooxml-lite-5.4.0-sources.jar",
            "status": "approved"
        }
    ]
}