{
    "id": "git/github/ghodss/yaml/v1.0.0",
    "license": "BSD-3-Clause AND (BSD-3-Clause AND MIT)",
    "authority": "https://gitlab.eclipse.org/eclipsefdn/emo-team/iplab/-/issues/5168",
    "source": "https://github.com/ghodss/yaml/archive/refs/tags/v1.0.0.zip",
    "status": "approved",
    "scans": [
        {
            "date": "November 25, 2022 at 6:47:24 a.m. GMT",
            "authority": "https://gitlab.eclipse.org/eclipsefdn/emo-team/iplab/-/issues/5168",
            "scancode-version": "31.2.1",
            "licenses-discovered": [
                "BSD-3-Clause",
                "BSD-3-Clause AND MIT"
            ],
            "copyrights": [
                "Copyright (c) 2012 The Go Authors",
                "Copyright (c) 2014 Sam Ghods",
                "Copyright 2013 The Go Authors"
            ],
            "file-count": 6,
            "sha256": "13b1657c4c2164634e8ed2b7f425ff59a17c1c6b135d70d4adf68195fd3a810d",
            "source": "https://github.com/ghodss/yaml/archive/refs/tags/v1.0.0.zip",
            "status": "approved"
        }
    ]
}