{
    "id": "maven/mavencentral/com.fasterxml.jackson.jaxrs/jackson-jaxrs-base/2.15.3",
    "license": "Apache-2.0",
    "authority": "https://gitlab.eclipse.org/eclipsefdn/emo-team/iplab/-/issues/11061",
    "source": "https://repo.maven.apache.org/maven2/com/fasterxml/jackson/jaxrs/jackson-jaxrs-base/2.15.0-rc1/jackson-jaxrs-base-2.15.0-rc1-sources.jar",
    "status": "approved",
    "scans": [
        {
            "date": "October 13, 2023 at 8:02:44 a.m. GMT",
            "authority": "https://gitlab.eclipse.org/eclipsefdn/emo-team/iplab/-/issues/11061",
            "scancode-version": "31.2.1",
            "licenses-discovered": [
                "Apache-2.0"
            ],
            "copyrights": [
            ],
            "file-count": 22,
            "sha256": "dafcb10e80e686c899bb12e292721818d6fa3c855452bf5e794857e66b57c5de",
            "source": "https://repo.maven.apache.org/maven2/com/fasterxml/jackson/jaxrs/jackson-jaxrs-base/2.15.0-rc1/jackson-jaxrs-base-2.15.0-rc1-sources.jar",
            "status": "approved"
        }
    ]
}