{
    "id": "npm/npmjs/-/http-parser-js/0.5.6",
    "license": "MIT",
    "licenses-discovered": [
        "MIT"
    ],
    "copyrights": [
        "Copyright (c) Tim Caswell (https://github.com/creationix) and other contributors",
        "Copyright Joyent, Inc. and other Node contributors"
    ],
    "file-count": 5,
    "scancode-version": "30.1.0",
    "authority": "https://gitlab.eclipse.org/eclipsefdn/emo-team/iplab/-/issues/15223",
    "source": "https://registry.yarnpkg.com/http-parser-js/-/http-parser-js-0.5.6.tgz",
    "status": "approved",
    "scans": [
        {
            "date": "June 14, 2024 at 10:44:18 a.m. GMT",
            "authority": "https://gitlab.eclipse.org/eclipsefdn/emo-team/iplab/-/issues/15223",
            "scancode-version": "31.2.1",
            "licenses-discovered": [
                "MIT"
            ],
            "copyrights": [
                "Copyright (c) 2015 Tim Caswell (https://github.com/creationix) and other contributors",
                "Copyright Joyent, Inc. and other Node contributors",
                "Copyright Node.js contributors",
                "Copyright io.js contributors"
            ],
            "file-count": 5,
            "sha256": "ed766187dedc433f940bf2432b0f5efbe864c51e0bfbbe1b8d03d9fba31e382c",
            "source": "https://registry.yarnpkg.com/http-parser-js/-/http-parser-js-0.5.6.tgz",
            "status": "approved"
        }
    ]
}