{
    "id": "maven/mavencentral/org.keycloak/keycloak-spring-security-adapter/21.0.0",
    "license": "Apache-2.0",
    "authority": "https://gitlab.eclipse.org/eclipsefdn/emo-team/iplab/-/issues/7294",
    "source": "https://search.maven.org/remotecontent?filepath=org/keycloak/keycloak-spring-security-adapter/21.0.0/keycloak-spring-security-adapter-21.0.0-sources.jar",
    "status": "approved",
    "scans": [
        {
            "date": "March 1, 2023 at 3:23:13 p.m. GMT",
            "authority": "https://gitlab.eclipse.org/eclipsefdn/emo-team/iplab/-/issues/7294",
            "scancode-version": "31.2.1",
            "licenses-discovered": [
                "Apache-2.0"
            ],
            "copyrights": [
                "Copyright 2016 Red Hat, Inc. and/or its affiliates and other contributors",
                "Copyright 2016 Red Hat, Inc. and/or its affiliates ~ and other contributors",
                "Copyright 2017 Red Hat, Inc. and/or its affiliates and other contributors",
                "Copyright 2018 Red Hat, Inc. and/or its affiliates and other contributors"
            ],
            "file-count": 46,
            "sha256": "5a6358ba15993f335083ae2bce3060911d2ed70ceaa4cd2d55c1bb949955b16a",
            "source": "https://search.maven.org/remotecontent?filepath=org/keycloak/keycloak-spring-security-adapter/21.0.0/keycloak-spring-security-adapter-21.0.0-sources.jar",
            "status": "approved"
        }
    ]
}