{
    "id": "npm/npmjs/-/unzipper/0.10.11",
    "license": "MIT",
    "licenses-discovered": [
        "MIT"
    ],
    "copyrights": [
        "(c) Ziggy Jonsson (ziggy.jonsson.nyc@gmail.com)",
        "Copyright (c) 2012 - 2013 Near Infinity Corporation"
    ],
    "file-count": 19,
    "scancode-version": "31.2.1",
    "authority": "https://gitlab.eclipse.org/eclipsefdn/emo-team/iplab/-/issues/4337",
    "source": "https://registry.npmjs.org/unzipper/-/unzipper-0.10.11.tgz",
    "status": "approved"
}