{
    "id": "go/golang/golang.org%2Fx/crypto/v0.25.0",
    "license": "BSD-3-Clause AND (BSD-3-Clause AND OpenSSL) AND (BSD-3-Clause AND MIT)",
    "authority": "https://gitlab.eclipse.org/eclipsefdn/emo-team/iplab/-/issues/15883",
    "source": "https://proxy.golang.org/golang.org%2Fx/crypto/@v/v0.25.0.zip",
    "status": "approved",
    "scans": [
        {
            "date": "August 14, 2024 at 1:53:03 p.m. GMT",
            "authority": "https://gitlab.eclipse.org/eclipsefdn/emo-team/iplab/-/issues/15883",
            "scancode-version": "31.2.1",
            "licenses-discovered": [
                "BSD-3-Clause",
                "BSD-3-Clause AND OpenSSL",
                "BSD-3-Clause AND MIT"
            ],
            "copyrights": [
                "Copyright (c) 2009 The Go Authors",
                "Copyright 2009 The Go Authors",
                "Copyright 2010 The Go Authors",
                "Copyright 2011 The Go Authors",
                "Copyright 2012 The Go Authors",
                "Copyright 2013 The Go Authors",
                "Copyright 2014 The Go Authors",
                "Copyright 2015 The Go Authors",
                "Copyright 2016 The Go Authors",
                "Copyright 2017 The Go Authors",
                "Copyright 2018 The Go Authors",
                "Copyright 2019 The Go Authors",
                "Copyright 2020 The Go Authors",
                "Copyright 2021 The Go Authors",
                "Copyright 2022 The Go Authors",
                "Copyright 2023 The Go Authors",
                "Copyright 2024 The Go Authors"
            ],
            "file-count": 343,
            "sha256": "5cd21f5fcb21845389eed13ad39186f57c86db70f3cc6cf8a4904633f07d1bdb",
            "source": "https://proxy.golang.org/golang.org%2Fx/crypto/@v/v0.25.0.zip",
            "status": "approved"
        }
    ]
}