{
    "id": "maven/mavencentral/androidx.navigation/navigation-common-ktx/2.7.4",
    "license": "Apache-2.0",
    "authority": "https://gitlab.eclipse.org/eclipsefdn/emo-team/iplab/-/issues/11176",
    "source": "https://dl.google.com/android/maven2/androidx/navigation/navigation-common-ktx/2.7.4/navigation-common-ktx-2.7.4-sources.jar",
    "status": "approved",
    "scans": [
        {
            "date": "October 25, 2023 at 9:34:05 a.m. GMT",
            "authority": "https://gitlab.eclipse.org/eclipsefdn/emo-team/iplab/-/issues/11176",
            "scancode-version": "31.2.1",
            "licenses-discovered": [
            ],
            "copyrights": [
            ],
            "file-count": 1,
            "sha256": "c6deada2fac53b8ea6523dbda77597b128006674616f140f04df23264c6d1aa3",
            "source": "https://dl.google.com/android/maven2/androidx/navigation/navigation-common-ktx/2.7.4/navigation-common-ktx-2.7.4-sources.jar",
            "status": "restricted"
        }
    ]
}
