{
    "id": "maven/mavencentral/io.fabric8/kubernetes-model-batch/6.7.0",
    "license": "Apache-2.0",
    "authority": "https://gitlab.eclipse.org/eclipsefdn/emo-team/iplab/-/issues/8656",
    "source": "https://repo.maven.apache.org/maven2/io/fabric8/kubernetes-model-batch/6.7.0/kubernetes-model-batch-6.7.0-sources.jar",
    "status": "approved",
    "scans": [
        {
            "date": "June 5, 2023 at 5:11:28 p.m. GMT",
            "authority": "https://gitlab.eclipse.org/eclipsefdn/emo-team/iplab/-/issues/8656",
            "scancode-version": "31.2.1",
            "licenses-discovered": [
                "Apache-2.0"
            ],
            "copyrights": [
                "Copyright (c) 2015 Red Hat, Inc."
            ],
            "file-count": 89,
            "sha256": "c0b2ccf475fd08447115e81373050bb638db4d915440fd82ae0fdfb3229702ca",
            "source": "https://repo.maven.apache.org/maven2/io/fabric8/kubernetes-model-batch/6.7.0/kubernetes-model-batch-6.7.0-sources.jar",
            "status": "approved"
        }
    ]
}