{
    "id": "npm/npmjs/@pnpm/ramda/0.28.1",
    "license": "MIT AND CC-BY-NC-3.0",
    "authority": "https://gitlab.eclipse.org/eclipsefdn/emo-team/iplab/-/issues/12770",
    "source": "https://registry.yarnpkg.com/@pnpm/ramda/-/ramda-0.28.1.tgz",
    "status": "approved",
    "scans": [
        {
            "date": "January 12, 2024 at 10:52:39 a.m. GMT",
            "authority": "https://gitlab.eclipse.org/eclipsefdn/emo-team/iplab/-/issues/12770",
            "scancode-version": "31.2.1",
            "licenses-discovered": [
                "MIT",
                "CC-BY-NC-3.0"
            ],
            "copyrights": [
                "(c) 2013-2022 Scott Sauyet, Michael Hurley, and David Chambers Ramda",
                "(c) 2014 J. C. Phillipps",
                "Copyright (c) 2013-2020 Scott Sauyet and Michael Hurley"
            ],
            "file-count": 694,
            "sha256": "10a1987148f2f48916677c22d89fe360329294e1fbee9b5972dfbb21166ad4d1",
            "source": "https://registry.yarnpkg.com/@pnpm/ramda/-/ramda-0.28.1.tgz",
            "status": "restricted"
        }
    ]
}
