{
    "id": "go/golang/k8s.io/client-go/v0.22.5",
    "license": "Apache-2.0 AND BSD-3-Clause",
    "authority": "https://gitlab.eclipse.org/eclipsefdn/emo-team/iplab/-/issues/12389",
    "source": "https://proxy.golang.org/k8s.io/client-go/@v/v0.22.5.zip",
    "status": "approved",
    "scans": [
        {
            "date": "December 21, 2023 at 12:21:00 p.m. GMT",
            "authority": "https://gitlab.eclipse.org/eclipsefdn/emo-team/iplab/-/issues/12389",
            "scancode-version": "31.2.1",
            "licenses-discovered": [
                "Apache-2.0",
                "BSD-3-Clause"
            ],
            "copyrights": [
                "Copyright (c) 2009 The Go Authors",
                "Copyright 2014 The Kubernetes Authors",
                "Copyright 2015 The Kubernetes Authors",
                "Copyright 2016 The Kubernetes Authors",
                "Copyright 2017 The Kubernetes Authors",
                "Copyright 2018 The Kubernetes Authors",
                "Copyright 2019 The Kubernetes Authors",
                "Copyright 2020 The Kubernetes Authors",
                "Copyright 2021 The Kubernetes Authors"
            ],
            "file-count": 1741,
            "sha256": "10255c093a4ebeb2d415a60d5b8ce5d410640374ca47ac24f721ab3028632193",
            "source": "https://proxy.golang.org/k8s.io/client-go/@v/v0.22.5.zip",
            "status": "approved"
        }
    ]
}