{
    "id": "maven/mavencentral/org.hsqldb/hsqldb/2.6.1",
    "license": "BSD-3-Clause",
    "licenses-discovered": [
        "BSD-3-Clause"
    ],
    "file-count": 647,
    "scancode-version": "30.1.0",
    "authority": "https://gitlab.eclipse.org/eclipsefdn/emo-team/iplab/-/issues/2364",
    "source": "https://search.maven.org/remotecontent?filepath=org/hsqldb/hsqldb/2.6.1/hsqldb-2.6.1-sources.jar",
    "status": "approved"
}