{
    "id": "maven/mavencentral/com.vaadin/vaadin-app-layout-flow/24.6.5",
    "license": "Apache-2.0",
    "authority": "https://gitlab.eclipse.org/eclipsefdn/emo-team/iplab/-/issues/19807",
    "source": "https://repo1.maven.org/maven2/com/vaadin/vaadin-app-layout-flow/24.6.5/vaadin-app-layout-flow-24.6.5-sources.jar",
    "status": "approved",
    "scans": [
        {
            "date": "March 1, 2025 at 3:31:26 a.m. GMT",
            "authority": "https://gitlab.eclipse.org/eclipsefdn/emo-team/iplab/-/issues/19807",
            "scancode-version": "31.2.1",
            "licenses-discovered": [
                "Apache-2.0"
            ],
            "copyrights": [
                "Copyright 2000-2024 Vaadin Ltd."
            ],
            "file-count": 5,
            "sha256": "47b4bb2fe259e60c83d65f2ad675f7225b6dbf8da9f09f7a8a8767c5f07716c2",
            "source": "https://repo1.maven.org/maven2/com/vaadin/vaadin-app-layout-flow/24.6.5/vaadin-app-layout-flow-24.6.5-sources.jar",
            "status": "approved"
        }
    ]
}