{
    "id": "maven/mavencentral/org.wildfly/wildfly-ejb-client-bom/27.0.1.Final",
    "license": "Apache-2.0",
    "authority": "https://gitlab.eclipse.org/eclipsefdn/emo-team/iplab/-/issues/19341",
    "source": "https://repo1.maven.org/maven2/org/wildfly/wildfly-ejb-client-bom/27.0.1.Final/wildfly-ejb-client-bom-27.0.1.Final.pom",
    "status": "approved",
    "scans": [
        {
            "date": "February 6, 2025 at 1:09:41 a.m. GMT",
            "authority": "https://gitlab.eclipse.org/eclipsefdn/emo-team/iplab/-/issues/19341",
            "scancode-version": "31.2.1",
            "licenses-discovered": [
                "Apache-2.0"
            ],
            "copyrights": [
            ],
            "file-count": 1,
            "sha256": "4ca1971243899a65c7794d026dcef480ae408f4fc6d531edb63aa93e3dd143e8",
            "source": "https://repo1.maven.org/maven2/org/wildfly/wildfly-ejb-client-bom/27.0.1.Final/wildfly-ejb-client-bom-27.0.1.Final.pom",
            "status": "approved"
        }
    ]
}