{
    "id": "git/github/dgryski/go-farm/6a90982ecee2",
    "license": "MIT",
    "licenses-discovered": [
        "MIT"
    ],
    "copyrights": [
        "Copyright (c) Damian Gryski",
        "Copyright (c) Nicola Asuni - Tecnick.com"
    ],
    "file-count": 16,
    "scancode-version": "30.1.0",
    "authority": "https://gitlab.eclipse.org/eclipsefdn/emo-team/iplab/-/issues/3565",
    "source": "https://github.com/dgryski/go-farm/archive/6a90982ecee2.zip",
    "status": "approved"
}