{
    "id": "crate/cratesio/-/rdkafka/0.37.0",
    "license": "MIT",
    "authority": "https://gitlab.eclipse.org/eclipsefdn/emo-team/iplab/-/issues/19403",
    "source": "https://crates.io/api/v1/crates/rdkafka/0.37.0/download",
    "status": "approved",
    "scans": [
        {
            "date": "February 12, 2025 at 9:38:02 a.m. GMT",
            "authority": "https://gitlab.eclipse.org/eclipsefdn/emo-team/iplab/-/issues/19403",
            "scancode-version": "31.2.1",
            "licenses-discovered": [
                "MIT"
            ],
            "copyrights": [
                "Copyright (c) 2016 Federico Giraud"
            ],
            "file-count": 55,
            "sha256": "14b52c81ac3cac39c9639b95c20452076e74b8d9a71bc6fc4d83407af2ea6fff",
            "source": "https://crates.io/api/v1/crates/rdkafka/0.37.0/download",
            "status": "approved"
        }
    ]
}