{
    "id": "maven/mavencentral/org.apache.sshd/sshd-common/2.12.0",
    "license": "Apache-2.0 AND ISC",
    "authority": "https://gitlab.eclipse.org/eclipsefdn/emo-team/iplab/-/issues/12842",
    "source": "https://repo1.maven.org/maven2/org/apache/sshd/sshd-common/2.12.0/sshd-common-2.12.0-sources.jar",
    "status": "approved",
    "scans": [
        {
            "date": "January 19, 2024 at 5:32:20 p.m. GMT",
            "authority": "https://gitlab.eclipse.org/eclipsefdn/emo-team/iplab/-/issues/12842",
            "scancode-version": "31.2.1",
            "licenses-discovered": [
                "Apache-2.0",
                "ISC"
            ],
            "copyrights": [
                "Copyright (c) 2006 Damien Miller <djm@mindrot.org>"
            ],
            "file-count": 399,
            "sha256": "28839c0a292c2251369ad372788b087312d2bd569b9b03b18a414d9467f50098",
            "source": "https://repo1.maven.org/maven2/org/apache/sshd/sshd-common/2.12.0/sshd-common-2.12.0-sources.jar",
            "status": "approved"
        }
    ]
}