module gitlab.eclipse.org/eclipse/xfsc/tsa/signer

go 1.21.4

toolchain go1.21.7

require (
	github.com/cloudevents/sdk-go/v2 v2.15.2
	github.com/dlclark/regexp2 v1.10.0
	github.com/google/uuid v1.6.0
	github.com/hyperledger/aries-framework-go v0.3.2
	github.com/hyperledger/aries-framework-go/component/kmscrypto v0.0.0-20230427134832-0c9969493bd3
	github.com/hyperledger/aries-framework-go/component/models v0.0.0-20230501135648-a9a7ad029347
	github.com/kelseyhightower/envconfig v1.4.0
	github.com/lestrrat-go/jwx/v2 v2.0.21
	github.com/ohler55/ojg v1.21.0
	github.com/piprate/json-gold v0.5.0
	github.com/prometheus/client_golang v1.16.0
	github.com/stretchr/testify v1.9.0
	gitlab.eclipse.org/eclipse/xfsc/libraries/crypto/engine/core v1.2.0
	gitlab.eclipse.org/eclipse/xfsc/libraries/crypto/jwt v1.0.1
	gitlab.eclipse.org/eclipse/xfsc/libraries/messaging/cloudeventprovider v0.1.4
	gitlab.eclipse.org/eclipse/xfsc/organisational-credential-manager-w-stack/libraries/messaging v1.10.0
	gitlab.eclipse.org/eclipse/xfsc/train/trusted-content-resolver/clients/go v0.0.0-20240202152216-f1a0d50c3e8b
	gitlab.eclipse.org/eclipse/xfsc/tsa/golib v1.3.2
	go.uber.org/zap v1.27.0
	goa.design/goa/v3 v3.12.3
	golang.org/x/exp v0.0.0-20240525044651-4c93da0ed11d
	golang.org/x/sync v0.7.0
	gorm.io/gorm v1.25.11
)

require (
	github.com/Azure/go-amqp v0.17.0 // indirect
	github.com/IBM/sarama v1.43.2 // indirect
	github.com/Shopify/sarama v1.38.1 // indirect
	github.com/VictoriaMetrics/fastcache v1.5.7 // indirect
	github.com/beorn7/perks v1.0.1 // indirect
	github.com/btcsuite/btcd v0.22.0-beta // indirect
	github.com/btcsuite/btcutil v1.0.3-0.20201208143702-a53e38424cce // indirect
	github.com/cespare/xxhash/v2 v2.2.0 // indirect
	github.com/cloudevents/sdk-go/protocol/amqp/v2 v2.15.2 // indirect
	github.com/cloudevents/sdk-go/protocol/kafka_sarama/v2 v2.15.2 // indirect
	github.com/cloudevents/sdk-go/protocol/mqtt_paho/v2 v2.0.0-20240521192830-cbba3fd04ad2 // indirect
	github.com/cloudevents/sdk-go/protocol/nats/v2 v2.15.2 // indirect
	github.com/cloudevents/sdk-go/protocol/nats_jetstream/v2 v2.15.2 // indirect
	github.com/davecgh/go-spew v1.1.2-0.20180830191138-d8f796af33cc // indirect
	github.com/decred/dcrd/dcrec/secp256k1/v4 v4.3.0 // indirect
	github.com/dimfeld/httppath v0.0.0-20170720192232-ee938bf73598 // indirect
	github.com/dimfeld/httptreemux/v5 v5.5.0 // indirect
	github.com/eapache/go-resiliency v1.6.0 // indirect
	github.com/eapache/go-xerial-snappy v0.0.0-20230731223053-c322873962e3 // indirect
	github.com/eapache/queue v1.1.0 // indirect
	github.com/eclipse/paho.golang v0.12.0 // indirect
	github.com/fsnotify/fsnotify v1.7.0 // indirect
	github.com/go-jose/go-jose/v3 v3.0.3 // indirect
	github.com/goccy/go-json v0.10.3 // indirect
	github.com/golang/protobuf v1.5.3 // indirect
	github.com/golang/snappy v0.0.4 // indirect
	github.com/google/tink/go v1.7.0 // indirect
	github.com/gopherjs/gopherjs v1.12.80 // indirect
	github.com/gorilla/websocket v1.5.1 // indirect
	github.com/hashicorp/errwrap v1.1.0 // indirect
	github.com/hashicorp/go-multierror v1.1.1 // indirect
	github.com/hashicorp/go-uuid v1.0.3 // indirect
	github.com/hashicorp/hcl v1.0.0 // indirect
	github.com/hyperledger/aries-framework-go/component/log v0.0.0-20230427134832-0c9969493bd3 // indirect
	github.com/hyperledger/aries-framework-go/spi v0.0.0-20230901120639-e17eddd3ad3e // indirect
	github.com/hyperledger/ursa-wrapper-go v0.3.1 // indirect
	github.com/jcmturner/aescts/v2 v2.0.0 // indirect
	github.com/jcmturner/dnsutils/v2 v2.0.0 // indirect
	github.com/jcmturner/gofork v1.7.6 // indirect
	github.com/jcmturner/gokrb5/v8 v8.4.4 // indirect
	github.com/jcmturner/rpc/v2 v2.0.3 // indirect
	github.com/jinzhu/copier v0.0.0-20190924061706-b57f9002281a // indirect
	github.com/json-iterator/go v1.1.12 // indirect
	github.com/jtolds/gls v4.20.0+incompatible // indirect
	github.com/kilic/bls12-381 v0.1.1-0.20210503002446-7b7597926c69 // indirect
	github.com/klauspost/compress v1.17.8 // indirect
	github.com/lestrrat-go/blackmagic v1.0.2 // indirect
	github.com/lestrrat-go/httpcc v1.0.1 // indirect
	github.com/lestrrat-go/httprc v1.0.5 // indirect
	github.com/lestrrat-go/iter v1.0.2 // indirect
	github.com/lestrrat-go/option v1.0.1 // indirect
	github.com/magiconair/properties v1.8.7 // indirect
	github.com/manveru/faker v0.0.0-20171103152722-9fbc68a78c4d // indirect
	github.com/matttproud/golang_protobuf_extensions v1.0.4 // indirect
	github.com/minio/blake2b-simd v0.0.0-20160723061019-3f5f724cb5b1 // indirect
	github.com/minio/sha256-simd v0.1.1 // indirect
	github.com/mitchellh/mapstructure v1.5.0 // indirect
	github.com/modern-go/concurrent v0.0.0-20180306012644-bacd9c7ef1dd // indirect
	github.com/modern-go/reflect2 v1.0.2 // indirect
	github.com/mr-tron/base58 v1.2.0 // indirect
	github.com/multiformats/go-base32 v0.1.0 // indirect
	github.com/multiformats/go-base36 v0.1.0 // indirect
	github.com/multiformats/go-multibase v0.1.1 // indirect
	github.com/multiformats/go-multihash v0.0.13 // indirect
	github.com/multiformats/go-varint v0.0.5 // indirect
	github.com/nats-io/nats.go v1.35.0 // indirect
	github.com/nats-io/nkeys v0.4.7 // indirect
	github.com/nats-io/nuid v1.0.1 // indirect
	github.com/pelletier/go-toml/v2 v2.2.2 // indirect
	github.com/pierrec/lz4/v4 v4.1.21 // indirect
	github.com/pkg/errors v0.9.1 // indirect
	github.com/pmezard/go-difflib v1.0.1-0.20181226105442-5d4384ee4fb2 // indirect
	github.com/pquerna/cachecontrol v0.1.0 // indirect
	github.com/prometheus/client_model v0.3.0 // indirect
	github.com/prometheus/common v0.42.0 // indirect
	github.com/prometheus/procfs v0.10.1 // indirect
	github.com/rcrowley/go-metrics v0.0.0-20201227073835-cf1acfcdf475 // indirect
	github.com/rogpeppe/go-internal v1.11.0 // indirect
	github.com/sagikazarmark/locafero v0.4.0 // indirect
	github.com/sagikazarmark/slog-shim v0.1.0 // indirect
	github.com/segmentio/asm v1.2.0 // indirect
	github.com/sergi/go-diff v1.3.1 // indirect
	github.com/sirupsen/logrus v1.9.3 // indirect
	github.com/smartystreets/assertions v1.13.0 // indirect
	github.com/sourcegraph/conc v0.3.0 // indirect
	github.com/spaolacci/murmur3 v1.1.0 // indirect
	github.com/spf13/afero v1.11.0 // indirect
	github.com/spf13/cast v1.6.0 // indirect
	github.com/spf13/pflag v1.0.5 // indirect
	github.com/spf13/viper v1.18.2 // indirect
	github.com/subosito/gotenv v1.6.0 // indirect
	github.com/teserakt-io/golang-ed25519 v0.0.0-20210104091850-3888c087a4c8 // indirect
	github.com/xeipuuv/gojsonpointer v0.0.0-20190905194746-02993c407bfb // indirect
	github.com/xeipuuv/gojsonreference v0.0.0-20180127040603-bd5ef7bd5415 // indirect
	github.com/xeipuuv/gojsonschema v1.2.0 // indirect
	github.com/zach-klippenstein/goregen v0.0.0-20160303162051-795b5e3961ea // indirect
	gitlab.eclipse.org/eclipse/xfsc/libraries/ssi/oid4vip v0.1.2 // indirect
	go.uber.org/multierr v1.11.0 // indirect
	golang.org/x/crypto v0.23.0 // indirect
	golang.org/x/mod v0.17.0 // indirect
	golang.org/x/net v0.25.0 // indirect
	golang.org/x/sys v0.20.0 // indirect
	golang.org/x/text v0.15.0 // indirect
	golang.org/x/tools v0.21.0 // indirect
	google.golang.org/protobuf v1.32.0 // indirect
	gopkg.in/ini.v1 v1.67.0 // indirect
	gopkg.in/yaml.v3 v3.0.1 // indirect
)
