{
  "bomFormat": "CycloneDX",
  "specVersion": "1.4",
  "serialNumber": "urn:uuid:07d6f372-f83d-474b-9729-c4d32475aa12",
  "version": 1,
  "metadata": {
    "timestamp": "2024-02-27T11:55:57Z",
    "tools": [
      {
        "vendor": "GitLab",
        "name": "Gemnasium",
        "version": "4.10.6"
      }
    ],
    "authors": [
      {
        "name": "GitLab",
        "email": "support@gitlab.com"
      }
    ],
    "properties": [
      {
        "name": "gitlab:dependency_scanning:input_file",
        "value": "pom.xml"
      },
      {
        "name": "gitlab:dependency_scanning:input_file:path",
        "value": "pom.xml"
      },
      {
        "name": "gitlab:dependency_scanning:package_manager",
        "value": "maven"
      },
      {
        "name": "gitlab:dependency_scanning:package_manager:name",
        "value": "maven"
      },
      {
        "name": "gitlab:meta:schema_version",
        "value": "1"
      }
    ]
  },
  "components": [
    {
      "name": "ch.qos.logback/logback-classic",
      "version": "1.4.14",
      "purl": "pkg:maven/ch.qos.logback/logback-classic@1.4.14",
      "type": "library",
      "bom-ref": "pkg:maven/ch.qos.logback/logback-classic@1.4.14"
    },
    {
      "name": "ch.qos.logback/logback-core",
      "version": "1.4.14",
      "purl": "pkg:maven/ch.qos.logback/logback-core@1.4.14",
      "type": "library",
      "bom-ref": "pkg:maven/ch.qos.logback/logback-core@1.4.14"
    },
    {
      "name": "com.apicatalog/titanium-json-ld",
      "version": "1.3.2",
      "purl": "pkg:maven/com.apicatalog/titanium-json-ld@1.3.2",
      "type": "library",
      "bom-ref": "pkg:maven/com.apicatalog/titanium-json-ld@1.3.2"
    },
    {
      "name": "com.danubetech/key-formats-java",
      "version": "1.12.0",
      "purl": "pkg:maven/com.danubetech/key-formats-java@1.12.0",
      "type": "library",
      "bom-ref": "pkg:maven/com.danubetech/key-formats-java@1.12.0"
    },
    {
      "name": "com.danubetech/verifiable-credentials-java",
      "version": "1.7.0",
      "purl": "pkg:maven/com.danubetech/verifiable-credentials-java@1.7.0",
      "type": "library",
      "bom-ref": "pkg:maven/com.danubetech/verifiable-credentials-java@1.7.0"
    },
    {
      "name": "com.ethlo.time/itu",
      "version": "1.7.0",
      "purl": "pkg:maven/com.ethlo.time/itu@1.7.0",
      "type": "library",
      "bom-ref": "pkg:maven/com.ethlo.time/itu@1.7.0"
    },
    {
      "name": "com.fasterxml.jackson.core/jackson-annotations",
      "version": "2.15.3",
      "purl": "pkg:maven/com.fasterxml.jackson.core/jackson-annotations@2.15.3",
      "type": "library",
      "bom-ref": "pkg:maven/com.fasterxml.jackson.core/jackson-annotations@2.15.3"
    },
    {
      "name": "com.fasterxml.jackson.core/jackson-core",
      "version": "2.15.3",
      "purl": "pkg:maven/com.fasterxml.jackson.core/jackson-core@2.15.3",
      "type": "library",
      "bom-ref": "pkg:maven/com.fasterxml.jackson.core/jackson-core@2.15.3"
    },
    {
      "name": "com.fasterxml.jackson.core/jackson-databind",
      "version": "2.15.3",
      "purl": "pkg:maven/com.fasterxml.jackson.core/jackson-databind@2.15.3",
      "type": "library",
      "bom-ref": "pkg:maven/com.fasterxml.jackson.core/jackson-databind@2.15.3"
    },
    {
      "name": "com.fasterxml.jackson.dataformat/jackson-dataformat-yaml",
      "version": "2.15.3",
      "purl": "pkg:maven/com.fasterxml.jackson.dataformat/jackson-dataformat-yaml@2.15.3",
      "type": "library",
      "bom-ref": "pkg:maven/com.fasterxml.jackson.dataformat/jackson-dataformat-yaml@2.15.3"
    },
    {
      "name": "com.fasterxml.jackson.datatype/jackson-datatype-jdk8",
      "version": "2.15.3",
      "purl": "pkg:maven/com.fasterxml.jackson.datatype/jackson-datatype-jdk8@2.15.3",
      "type": "library",
      "bom-ref": "pkg:maven/com.fasterxml.jackson.datatype/jackson-datatype-jdk8@2.15.3"
    },
    {
      "name": "com.fasterxml.jackson.datatype/jackson-datatype-jsr310",
      "version": "2.15.3",
      "purl": "pkg:maven/com.fasterxml.jackson.datatype/jackson-datatype-jsr310@2.15.3",
      "type": "library",
      "bom-ref": "pkg:maven/com.fasterxml.jackson.datatype/jackson-datatype-jsr310@2.15.3"
    },
    {
      "name": "com.fasterxml.jackson.module/jackson-module-jakarta-xmlbind-annotations",
      "version": "2.16.0",
      "purl": "pkg:maven/com.fasterxml.jackson.module/jackson-module-jakarta-xmlbind-annotations@2.16.0",
      "type": "library",
      "bom-ref": "pkg:maven/com.fasterxml.jackson.module/jackson-module-jakarta-xmlbind-annotations@2.16.0"
    },
    {
      "name": "com.fasterxml.jackson.module/jackson-module-parameter-names",
      "version": "2.15.3",
      "purl": "pkg:maven/com.fasterxml.jackson.module/jackson-module-parameter-names@2.15.3",
      "type": "library",
      "bom-ref": "pkg:maven/com.fasterxml.jackson.module/jackson-module-parameter-names@2.15.3"
    },
    {
      "name": "com.github.ipfs/java-ipfs-http-client",
      "version": "1.4.4",
      "purl": "pkg:maven/com.github.ipfs/java-ipfs-http-client@1.4.4",
      "type": "library",
      "bom-ref": "pkg:maven/com.github.ipfs/java-ipfs-http-client@1.4.4"
    },
    {
      "name": "com.github.ipld/java-cid",
      "version": "v1.3.7",
      "purl": "pkg:maven/com.github.ipld/java-cid@v1.3.7",
      "type": "library",
      "bom-ref": "pkg:maven/com.github.ipld/java-cid@v1.3.7"
    },
    {
      "name": "com.github.multiformats/java-multiaddr",
      "version": "v1.4.12",
      "purl": "pkg:maven/com.github.multiformats/java-multiaddr@v1.4.12",
      "type": "library",
      "bom-ref": "pkg:maven/com.github.multiformats/java-multiaddr@v1.4.12"
    },
    {
      "name": "com.github.multiformats/java-multibase",
      "version": "1.1.1",
      "purl": "pkg:maven/com.github.multiformats/java-multibase@1.1.1",
      "type": "library",
      "bom-ref": "pkg:maven/com.github.multiformats/java-multibase@1.1.1"
    },
    {
      "name": "com.github.multiformats/java-multihash",
      "version": "1.3.4",
      "purl": "pkg:maven/com.github.multiformats/java-multihash@1.3.4",
      "type": "library",
      "bom-ref": "pkg:maven/com.github.multiformats/java-multihash@1.3.4"
    },
    {
      "name": "com.github.peteroupc/numbers",
      "version": "1.8.2",
      "purl": "pkg:maven/com.github.peteroupc/numbers@1.8.2",
      "type": "library",
      "bom-ref": "pkg:maven/com.github.peteroupc/numbers@1.8.2"
    },
    {
      "name": "com.github.stephenc.jcip/jcip-annotations",
      "version": "1.0-1",
      "purl": "pkg:maven/com.github.stephenc.jcip/jcip-annotations@1.0-1",
      "type": "library",
      "bom-ref": "pkg:maven/com.github.stephenc.jcip/jcip-annotations@1.0-1"
    },
    {
      "name": "com.google.code.findbugs/jsr305",
      "version": "3.0.2",
      "purl": "pkg:maven/com.google.code.findbugs/jsr305@3.0.2",
      "type": "library",
      "bom-ref": "pkg:maven/com.google.code.findbugs/jsr305@3.0.2"
    },
    {
      "name": "com.google.code.gson/gson",
      "version": "2.10.1",
      "purl": "pkg:maven/com.google.code.gson/gson@2.10.1",
      "type": "library",
      "bom-ref": "pkg:maven/com.google.code.gson/gson@2.10.1"
    },
    {
      "name": "com.google.errorprone/error_prone_annotations",
      "version": "2.21.1",
      "purl": "pkg:maven/com.google.errorprone/error_prone_annotations@2.21.1",
      "type": "library",
      "bom-ref": "pkg:maven/com.google.errorprone/error_prone_annotations@2.21.1"
    },
    {
      "name": "com.google.guava/failureaccess",
      "version": "1.0.1",
      "purl": "pkg:maven/com.google.guava/failureaccess@1.0.1",
      "type": "library",
      "bom-ref": "pkg:maven/com.google.guava/failureaccess@1.0.1"
    },
    {
      "name": "com.google.guava/guava",
      "version": "32.1.3-jre",
      "purl": "pkg:maven/com.google.guava/guava@32.1.3-jre",
      "type": "library",
      "bom-ref": "pkg:maven/com.google.guava/guava@32.1.3-jre"
    },
    {
      "name": "com.google.guava/listenablefuture",
      "version": "9999.0-empty-to-avoid-conflict-with-guava",
      "purl": "pkg:maven/com.google.guava/listenablefuture@9999.0-empty-to-avoid-conflict-with-guava",
      "type": "library",
      "bom-ref": "pkg:maven/com.google.guava/listenablefuture@9999.0-empty-to-avoid-conflict-with-guava"
    },
    {
      "name": "com.google.j2objc/j2objc-annotations",
      "version": "2.8",
      "purl": "pkg:maven/com.google.j2objc/j2objc-annotations@2.8",
      "type": "library",
      "bom-ref": "pkg:maven/com.google.j2objc/j2objc-annotations@2.8"
    },
    {
      "name": "com.google.protobuf/protobuf-java",
      "version": "3.23.4",
      "purl": "pkg:maven/com.google.protobuf/protobuf-java@3.23.4",
      "type": "library",
      "bom-ref": "pkg:maven/com.google.protobuf/protobuf-java@3.23.4"
    },
    {
      "name": "com.goterl/lazysodium-java",
      "version": "5.1.4",
      "purl": "pkg:maven/com.goterl/lazysodium-java@5.1.4",
      "type": "library",
      "bom-ref": "pkg:maven/com.goterl/lazysodium-java@5.1.4"
    },
    {
      "name": "com.goterl/resource-loader",
      "version": "2.0.2",
      "purl": "pkg:maven/com.goterl/resource-loader@2.0.2",
      "type": "library",
      "bom-ref": "pkg:maven/com.goterl/resource-loader@2.0.2"
    },
    {
      "name": "com.jayway.jsonpath/json-path",
      "version": "2.8.0",
      "purl": "pkg:maven/com.jayway.jsonpath/json-path@2.8.0",
      "type": "library",
      "bom-ref": "pkg:maven/com.jayway.jsonpath/json-path@2.8.0"
    },
    {
      "name": "com.networknt/json-schema-validator",
      "version": "1.0.87",
      "purl": "pkg:maven/com.networknt/json-schema-validator@1.0.87",
      "type": "library",
      "bom-ref": "pkg:maven/com.networknt/json-schema-validator@1.0.87"
    },
    {
      "name": "com.nimbusds/nimbus-jose-jwt",
      "version": "9.37",
      "purl": "pkg:maven/com.nimbusds/nimbus-jose-jwt@9.37",
      "type": "library",
      "bom-ref": "pkg:maven/com.nimbusds/nimbus-jose-jwt@9.37"
    },
    {
      "name": "com.sabnf/apg",
      "version": "1.1.0",
      "purl": "pkg:maven/com.sabnf/apg@1.1.0",
      "type": "library",
      "bom-ref": "pkg:maven/com.sabnf/apg@1.1.0"
    },
    {
      "name": "com.squareup.okhttp3/okhttp",
      "version": "4.12.0",
      "purl": "pkg:maven/com.squareup.okhttp3/okhttp@4.12.0",
      "type": "library",
      "bom-ref": "pkg:maven/com.squareup.okhttp3/okhttp@4.12.0"
    },
    {
      "name": "com.squareup.okio/okio",
      "version": "3.6.0",
      "purl": "pkg:maven/com.squareup.okio/okio@3.6.0",
      "type": "library",
      "bom-ref": "pkg:maven/com.squareup.okio/okio@3.6.0"
    },
    {
      "name": "com.squareup.okio/okio-jvm",
      "version": "3.6.0",
      "purl": "pkg:maven/com.squareup.okio/okio-jvm@3.6.0",
      "type": "library",
      "bom-ref": "pkg:maven/com.squareup.okio/okio-jvm@3.6.0"
    },
    {
      "name": "com.sun.istack/istack-commons-runtime",
      "version": "4.1.2",
      "purl": "pkg:maven/com.sun.istack/istack-commons-runtime@4.1.2",
      "type": "library",
      "bom-ref": "pkg:maven/com.sun.istack/istack-commons-runtime@4.1.2"
    },
    {
      "name": "com.upokecenter/cbor",
      "version": "4.5.2",
      "purl": "pkg:maven/com.upokecenter/cbor@4.5.2",
      "type": "library",
      "bom-ref": "pkg:maven/com.upokecenter/cbor@4.5.2"
    },
    {
      "name": "com.vaadin.external.google/android-json",
      "version": "0.0.20131108.vaadin1",
      "purl": "pkg:maven/com.vaadin.external.google/android-json@0.0.20131108.vaadin1",
      "type": "library",
      "bom-ref": "pkg:maven/com.vaadin.external.google/android-json@0.0.20131108.vaadin1"
    },
    {
      "name": "commons-codec/commons-codec",
      "version": "1.16.0",
      "purl": "pkg:maven/commons-codec/commons-codec@1.16.0",
      "type": "library",
      "bom-ref": "pkg:maven/commons-codec/commons-codec@1.16.0"
    },
    {
      "name": "commons-configuration/commons-configuration",
      "version": "1.10",
      "purl": "pkg:maven/commons-configuration/commons-configuration@1.10",
      "type": "library",
      "bom-ref": "pkg:maven/commons-configuration/commons-configuration@1.10"
    },
    {
      "name": "commons-io/commons-io",
      "version": "2.11.0",
      "purl": "pkg:maven/commons-io/commons-io@2.11.0",
      "type": "library",
      "bom-ref": "pkg:maven/commons-io/commons-io@2.11.0"
    },
    {
      "name": "commons-lang/commons-lang",
      "version": "2.6",
      "purl": "pkg:maven/commons-lang/commons-lang@2.6",
      "type": "library",
      "bom-ref": "pkg:maven/commons-lang/commons-lang@2.6"
    },
    {
      "name": "commons-logging/commons-logging",
      "version": "1.1.1",
      "purl": "pkg:maven/commons-logging/commons-logging@1.1.1",
      "type": "library",
      "bom-ref": "pkg:maven/commons-logging/commons-logging@1.1.1"
    },
    {
      "name": "decentralized-identity/did-common-java",
      "version": "1.11.0",
      "purl": "pkg:maven/decentralized-identity/did-common-java@1.11.0",
      "type": "library",
      "bom-ref": "pkg:maven/decentralized-identity/did-common-java@1.11.0"
    },
    {
      "name": "decentralized-identity/jsonld-common-java",
      "version": "1.8.0",
      "purl": "pkg:maven/decentralized-identity/jsonld-common-java@1.8.0",
      "type": "library",
      "bom-ref": "pkg:maven/decentralized-identity/jsonld-common-java@1.8.0"
    },
    {
      "name": "info.weboftrust/ld-signatures-java",
      "version": "1.6.0",
      "purl": "pkg:maven/info.weboftrust/ld-signatures-java@1.6.0",
      "type": "library",
      "bom-ref": "pkg:maven/info.weboftrust/ld-signatures-java@1.6.0"
    },
    {
      "name": "io.github.erdtman/java-json-canonicalization",
      "version": "1.1",
      "purl": "pkg:maven/io.github.erdtman/java-json-canonicalization@1.1",
      "type": "library",
      "bom-ref": "pkg:maven/io.github.erdtman/java-json-canonicalization@1.1"
    },
    {
      "name": "io.micrometer/micrometer-commons",
      "version": "1.12.2",
      "purl": "pkg:maven/io.micrometer/micrometer-commons@1.12.2",
      "type": "library",
      "bom-ref": "pkg:maven/io.micrometer/micrometer-commons@1.12.2"
    },
    {
      "name": "io.micrometer/micrometer-core",
      "version": "1.12.2",
      "purl": "pkg:maven/io.micrometer/micrometer-core@1.12.2",
      "type": "library",
      "bom-ref": "pkg:maven/io.micrometer/micrometer-core@1.12.2"
    },
    {
      "name": "io.micrometer/micrometer-jakarta9",
      "version": "1.12.2",
      "purl": "pkg:maven/io.micrometer/micrometer-jakarta9@1.12.2",
      "type": "library",
      "bom-ref": "pkg:maven/io.micrometer/micrometer-jakarta9@1.12.2"
    },
    {
      "name": "io.micrometer/micrometer-observation",
      "version": "1.12.2",
      "purl": "pkg:maven/io.micrometer/micrometer-observation@1.12.2",
      "type": "library",
      "bom-ref": "pkg:maven/io.micrometer/micrometer-observation@1.12.2"
    },
    {
      "name": "io.micrometer/micrometer-registry-otlp",
      "version": "1.12.2",
      "purl": "pkg:maven/io.micrometer/micrometer-registry-otlp@1.12.2",
      "type": "library",
      "bom-ref": "pkg:maven/io.micrometer/micrometer-registry-otlp@1.12.2"
    },
    {
      "name": "io.micrometer/micrometer-registry-prometheus",
      "version": "1.12.2",
      "purl": "pkg:maven/io.micrometer/micrometer-registry-prometheus@1.12.2",
      "type": "library",
      "bom-ref": "pkg:maven/io.micrometer/micrometer-registry-prometheus@1.12.2"
    },
    {
      "name": "io.opentelemetry.instrumentation/opentelemetry-instrumentation-api",
      "version": "1.31.0",
      "purl": "pkg:maven/io.opentelemetry.instrumentation/opentelemetry-instrumentation-api@1.31.0",
      "type": "library",
      "bom-ref": "pkg:maven/io.opentelemetry.instrumentation/opentelemetry-instrumentation-api@1.31.0"
    },
    {
      "name": "io.opentelemetry.instrumentation/opentelemetry-instrumentation-api-semconv",
      "version": "1.31.0-alpha",
      "purl": "pkg:maven/io.opentelemetry.instrumentation/opentelemetry-instrumentation-api-semconv@1.31.0-alpha",
      "type": "library",
      "bom-ref": "pkg:maven/io.opentelemetry.instrumentation/opentelemetry-instrumentation-api-semconv@1.31.0-alpha"
    },
    {
      "name": "io.opentelemetry.instrumentation/opentelemetry-logback-appender-1.0",
      "version": "1.31.0-alpha",
      "purl": "pkg:maven/io.opentelemetry.instrumentation/opentelemetry-logback-appender-1.0@1.31.0-alpha",
      "type": "library",
      "bom-ref": "pkg:maven/io.opentelemetry.instrumentation/opentelemetry-logback-appender-1.0@1.31.0-alpha"
    },
    {
      "name": "io.opentelemetry.proto/opentelemetry-proto",
      "version": "1.0.0-alpha",
      "purl": "pkg:maven/io.opentelemetry.proto/opentelemetry-proto@1.0.0-alpha",
      "type": "library",
      "bom-ref": "pkg:maven/io.opentelemetry.proto/opentelemetry-proto@1.0.0-alpha"
    },
    {
      "name": "io.opentelemetry.semconv/opentelemetry-semconv",
      "version": "1.21.0-alpha",
      "purl": "pkg:maven/io.opentelemetry.semconv/opentelemetry-semconv@1.21.0-alpha",
      "type": "library",
      "bom-ref": "pkg:maven/io.opentelemetry.semconv/opentelemetry-semconv@1.21.0-alpha"
    },
    {
      "name": "io.opentelemetry/opentelemetry-api",
      "version": "1.31.0",
      "purl": "pkg:maven/io.opentelemetry/opentelemetry-api@1.31.0",
      "type": "library",
      "bom-ref": "pkg:maven/io.opentelemetry/opentelemetry-api@1.31.0"
    },
    {
      "name": "io.opentelemetry/opentelemetry-context",
      "version": "1.31.0",
      "purl": "pkg:maven/io.opentelemetry/opentelemetry-context@1.31.0",
      "type": "library",
      "bom-ref": "pkg:maven/io.opentelemetry/opentelemetry-context@1.31.0"
    },
    {
      "name": "io.opentelemetry/opentelemetry-exporter-common",
      "version": "1.31.0",
      "purl": "pkg:maven/io.opentelemetry/opentelemetry-exporter-common@1.31.0",
      "type": "library",
      "bom-ref": "pkg:maven/io.opentelemetry/opentelemetry-exporter-common@1.31.0"
    },
    {
      "name": "io.opentelemetry/opentelemetry-exporter-otlp-common",
      "version": "1.31.0",
      "purl": "pkg:maven/io.opentelemetry/opentelemetry-exporter-otlp-common@1.31.0",
      "type": "library",
      "bom-ref": "pkg:maven/io.opentelemetry/opentelemetry-exporter-otlp-common@1.31.0"
    },
    {
      "name": "io.opentelemetry/opentelemetry-extension-incubator",
      "version": "1.31.0-alpha",
      "purl": "pkg:maven/io.opentelemetry/opentelemetry-extension-incubator@1.31.0-alpha",
      "type": "library",
      "bom-ref": "pkg:maven/io.opentelemetry/opentelemetry-extension-incubator@1.31.0-alpha"
    },
    {
      "name": "io.prometheus/simpleclient",
      "version": "0.16.0",
      "purl": "pkg:maven/io.prometheus/simpleclient@0.16.0",
      "type": "library",
      "bom-ref": "pkg:maven/io.prometheus/simpleclient@0.16.0"
    },
    {
      "name": "io.prometheus/simpleclient_common",
      "version": "0.16.0",
      "purl": "pkg:maven/io.prometheus/simpleclient_common@0.16.0",
      "type": "library",
      "bom-ref": "pkg:maven/io.prometheus/simpleclient_common@0.16.0"
    },
    {
      "name": "io.prometheus/simpleclient_tracer_common",
      "version": "0.16.0",
      "purl": "pkg:maven/io.prometheus/simpleclient_tracer_common@0.16.0",
      "type": "library",
      "bom-ref": "pkg:maven/io.prometheus/simpleclient_tracer_common@0.16.0"
    },
    {
      "name": "io.prometheus/simpleclient_tracer_otel",
      "version": "0.16.0",
      "purl": "pkg:maven/io.prometheus/simpleclient_tracer_otel@0.16.0",
      "type": "library",
      "bom-ref": "pkg:maven/io.prometheus/simpleclient_tracer_otel@0.16.0"
    },
    {
      "name": "io.prometheus/simpleclient_tracer_otel_agent",
      "version": "0.16.0",
      "purl": "pkg:maven/io.prometheus/simpleclient_tracer_otel_agent@0.16.0",
      "type": "library",
      "bom-ref": "pkg:maven/io.prometheus/simpleclient_tracer_otel_agent@0.16.0"
    },
    {
      "name": "io.setl/rdf-urdna",
      "version": "1.2",
      "purl": "pkg:maven/io.setl/rdf-urdna@1.2",
      "type": "library",
      "bom-ref": "pkg:maven/io.setl/rdf-urdna@1.2"
    },
    {
      "name": "io.swagger.core.v3/swagger-annotations-jakarta",
      "version": "2.2.19",
      "purl": "pkg:maven/io.swagger.core.v3/swagger-annotations-jakarta@2.2.19",
      "type": "library",
      "bom-ref": "pkg:maven/io.swagger.core.v3/swagger-annotations-jakarta@2.2.19"
    },
    {
      "name": "io.swagger.core.v3/swagger-core-jakarta",
      "version": "2.2.19",
      "purl": "pkg:maven/io.swagger.core.v3/swagger-core-jakarta@2.2.19",
      "type": "library",
      "bom-ref": "pkg:maven/io.swagger.core.v3/swagger-core-jakarta@2.2.19"
    },
    {
      "name": "io.swagger.core.v3/swagger-models-jakarta",
      "version": "2.2.19",
      "purl": "pkg:maven/io.swagger.core.v3/swagger-models-jakarta@2.2.19",
      "type": "library",
      "bom-ref": "pkg:maven/io.swagger.core.v3/swagger-models-jakarta@2.2.19"
    },
    {
      "name": "jakarta.activation/jakarta.activation-api",
      "version": "2.1.2",
      "purl": "pkg:maven/jakarta.activation/jakarta.activation-api@2.1.2",
      "type": "library",
      "bom-ref": "pkg:maven/jakarta.activation/jakarta.activation-api@2.1.2"
    },
    {
      "name": "jakarta.annotation/jakarta.annotation-api",
      "version": "2.1.1",
      "purl": "pkg:maven/jakarta.annotation/jakarta.annotation-api@2.1.1",
      "type": "library",
      "bom-ref": "pkg:maven/jakarta.annotation/jakarta.annotation-api@2.1.1"
    },
    {
      "name": "jakarta.inject/jakarta.inject-api",
      "version": "2.0.1",
      "purl": "pkg:maven/jakarta.inject/jakarta.inject-api@2.0.1",
      "type": "library",
      "bom-ref": "pkg:maven/jakarta.inject/jakarta.inject-api@2.0.1"
    },
    {
      "name": "jakarta.validation/jakarta.validation-api",
      "version": "3.0.2",
      "purl": "pkg:maven/jakarta.validation/jakarta.validation-api@3.0.2",
      "type": "library",
      "bom-ref": "pkg:maven/jakarta.validation/jakarta.validation-api@3.0.2"
    },
    {
      "name": "jakarta.ws.rs/jakarta.ws.rs-api",
      "version": "3.1.0",
      "purl": "pkg:maven/jakarta.ws.rs/jakarta.ws.rs-api@3.1.0",
      "type": "library",
      "bom-ref": "pkg:maven/jakarta.ws.rs/jakarta.ws.rs-api@3.1.0"
    },
    {
      "name": "jakarta.xml.bind/jakarta.xml.bind-api",
      "version": "4.0.1",
      "purl": "pkg:maven/jakarta.xml.bind/jakarta.xml.bind-api@4.0.1",
      "type": "library",
      "bom-ref": "pkg:maven/jakarta.xml.bind/jakarta.xml.bind-api@4.0.1"
    },
    {
      "name": "net.bytebuddy/byte-buddy",
      "version": "1.14.11",
      "purl": "pkg:maven/net.bytebuddy/byte-buddy@1.14.11",
      "type": "library",
      "bom-ref": "pkg:maven/net.bytebuddy/byte-buddy@1.14.11"
    },
    {
      "name": "net.bytebuddy/byte-buddy-agent",
      "version": "1.14.11",
      "purl": "pkg:maven/net.bytebuddy/byte-buddy-agent@1.14.11",
      "type": "library",
      "bom-ref": "pkg:maven/net.bytebuddy/byte-buddy-agent@1.14.11"
    },
    {
      "name": "net.java.dev.jna/jna",
      "version": "5.12.1",
      "purl": "pkg:maven/net.java.dev.jna/jna@5.12.1",
      "type": "library",
      "bom-ref": "pkg:maven/net.java.dev.jna/jna@5.12.1"
    },
    {
      "name": "net.jcip/jcip-annotations",
      "version": "1.0",
      "purl": "pkg:maven/net.jcip/jcip-annotations@1.0",
      "type": "library",
      "bom-ref": "pkg:maven/net.jcip/jcip-annotations@1.0"
    },
    {
      "name": "net.minidev/accessors-smart",
      "version": "2.5.0",
      "purl": "pkg:maven/net.minidev/accessors-smart@2.5.0",
      "type": "library",
      "bom-ref": "pkg:maven/net.minidev/accessors-smart@2.5.0"
    },
    {
      "name": "net.minidev/json-smart",
      "version": "2.5.0",
      "purl": "pkg:maven/net.minidev/json-smart@2.5.0",
      "type": "library",
      "bom-ref": "pkg:maven/net.minidev/json-smart@2.5.0"
    },
    {
      "name": "org.apache.commons/commons-lang3",
      "version": "3.13.0",
      "purl": "pkg:maven/org.apache.commons/commons-lang3@3.13.0",
      "type": "library",
      "bom-ref": "pkg:maven/org.apache.commons/commons-lang3@3.13.0"
    },
    {
      "name": "org.apache.httpcomponents/httpclient",
      "version": "4.5.14",
      "purl": "pkg:maven/org.apache.httpcomponents/httpclient@4.5.14",
      "type": "library",
      "bom-ref": "pkg:maven/org.apache.httpcomponents/httpclient@4.5.14"
    },
    {
      "name": "org.apache.httpcomponents/httpcore",
      "version": "4.4.16",
      "purl": "pkg:maven/org.apache.httpcomponents/httpcore@4.4.16",
      "type": "library",
      "bom-ref": "pkg:maven/org.apache.httpcomponents/httpcore@4.4.16"
    },
    {
      "name": "org.apache.logging.log4j/log4j-api",
      "version": "2.21.1",
      "purl": "pkg:maven/org.apache.logging.log4j/log4j-api@2.21.1",
      "type": "library",
      "bom-ref": "pkg:maven/org.apache.logging.log4j/log4j-api@2.21.1"
    },
    {
      "name": "org.apache.logging.log4j/log4j-to-slf4j",
      "version": "2.21.1",
      "purl": "pkg:maven/org.apache.logging.log4j/log4j-to-slf4j@2.21.1",
      "type": "library",
      "bom-ref": "pkg:maven/org.apache.logging.log4j/log4j-to-slf4j@2.21.1"
    },
    {
      "name": "org.apache.tomcat.embed/tomcat-embed-core",
      "version": "10.1.16",
      "purl": "pkg:maven/org.apache.tomcat.embed/tomcat-embed-core@10.1.16",
      "type": "library",
      "bom-ref": "pkg:maven/org.apache.tomcat.embed/tomcat-embed-core@10.1.16"
    },
    {
      "name": "org.apache.tomcat.embed/tomcat-embed-el",
      "version": "10.1.16",
      "purl": "pkg:maven/org.apache.tomcat.embed/tomcat-embed-el@10.1.16",
      "type": "library",
      "bom-ref": "pkg:maven/org.apache.tomcat.embed/tomcat-embed-el@10.1.16"
    },
    {
      "name": "org.apache.tomcat.embed/tomcat-embed-websocket",
      "version": "10.1.16",
      "purl": "pkg:maven/org.apache.tomcat.embed/tomcat-embed-websocket@10.1.16",
      "type": "library",
      "bom-ref": "pkg:maven/org.apache.tomcat.embed/tomcat-embed-websocket@10.1.16"
    },
    {
      "name": "org.apiguardian/apiguardian-api",
      "version": "1.1.2",
      "purl": "pkg:maven/org.apiguardian/apiguardian-api@1.1.2",
      "type": "library",
      "bom-ref": "pkg:maven/org.apiguardian/apiguardian-api@1.1.2"
    },
    {
      "name": "org.assertj/assertj-core",
      "version": "3.24.2",
      "purl": "pkg:maven/org.assertj/assertj-core@3.24.2",
      "type": "library",
      "bom-ref": "pkg:maven/org.assertj/assertj-core@3.24.2"
    },
    {
      "name": "org.awaitility/awaitility",
      "version": "4.2.0",
      "purl": "pkg:maven/org.awaitility/awaitility@4.2.0",
      "type": "library",
      "bom-ref": "pkg:maven/org.awaitility/awaitility@4.2.0"
    },
    {
      "name": "org.bitcoinj/bitcoinj-core",
      "version": "0.16.2",
      "purl": "pkg:maven/org.bitcoinj/bitcoinj-core@0.16.2",
      "type": "library",
      "bom-ref": "pkg:maven/org.bitcoinj/bitcoinj-core@0.16.2"
    },
    {
      "name": "org.bouncycastle/bcprov-jdk18on",
      "version": "1.76",
      "purl": "pkg:maven/org.bouncycastle/bcprov-jdk18on@1.76",
      "type": "library",
      "bom-ref": "pkg:maven/org.bouncycastle/bcprov-jdk18on@1.76"
    },
    {
      "name": "org.checkerframework/checker-qual",
      "version": "3.37.0",
      "purl": "pkg:maven/org.checkerframework/checker-qual@3.37.0",
      "type": "library",
      "bom-ref": "pkg:maven/org.checkerframework/checker-qual@3.37.0"
    },
    {
      "name": "org.eclipse.angus/angus-activation",
      "version": "2.0.1",
      "purl": "pkg:maven/org.eclipse.angus/angus-activation@2.0.1",
      "type": "library",
      "bom-ref": "pkg:maven/org.eclipse.angus/angus-activation@2.0.1"
    },
    {
      "name": "org.glassfish.hk2/osgi-resource-locator",
      "version": "1.0.3",
      "purl": "pkg:maven/org.glassfish.hk2/osgi-resource-locator@1.0.3",
      "type": "library",
      "bom-ref": "pkg:maven/org.glassfish.hk2/osgi-resource-locator@1.0.3"
    },
    {
      "name": "org.glassfish.jaxb/jaxb-core",
      "version": "4.0.4",
      "purl": "pkg:maven/org.glassfish.jaxb/jaxb-core@4.0.4",
      "type": "library",
      "bom-ref": "pkg:maven/org.glassfish.jaxb/jaxb-core@4.0.4"
    },
    {
      "name": "org.glassfish.jaxb/jaxb-runtime",
      "version": "4.0.4",
      "purl": "pkg:maven/org.glassfish.jaxb/jaxb-runtime@4.0.4",
      "type": "library",
      "bom-ref": "pkg:maven/org.glassfish.jaxb/jaxb-runtime@4.0.4"
    },
    {
      "name": "org.glassfish.jaxb/txw2",
      "version": "4.0.4",
      "purl": "pkg:maven/org.glassfish.jaxb/txw2@4.0.4",
      "type": "library",
      "bom-ref": "pkg:maven/org.glassfish.jaxb/txw2@4.0.4"
    },
    {
      "name": "org.glassfish.jersey.containers/jersey-container-servlet",
      "version": "3.1.5",
      "purl": "pkg:maven/org.glassfish.jersey.containers/jersey-container-servlet@3.1.5",
      "type": "library",
      "bom-ref": "pkg:maven/org.glassfish.jersey.containers/jersey-container-servlet@3.1.5"
    },
    {
      "name": "org.glassfish.jersey.containers/jersey-container-servlet-core",
      "version": "3.1.5",
      "purl": "pkg:maven/org.glassfish.jersey.containers/jersey-container-servlet-core@3.1.5",
      "type": "library",
      "bom-ref": "pkg:maven/org.glassfish.jersey.containers/jersey-container-servlet-core@3.1.5"
    },
    {
      "name": "org.glassfish.jersey.core/jersey-client",
      "version": "3.1.5",
      "purl": "pkg:maven/org.glassfish.jersey.core/jersey-client@3.1.5",
      "type": "library",
      "bom-ref": "pkg:maven/org.glassfish.jersey.core/jersey-client@3.1.5"
    },
    {
      "name": "org.glassfish.jersey.core/jersey-common",
      "version": "3.1.5",
      "purl": "pkg:maven/org.glassfish.jersey.core/jersey-common@3.1.5",
      "type": "library",
      "bom-ref": "pkg:maven/org.glassfish.jersey.core/jersey-common@3.1.5"
    },
    {
      "name": "org.glassfish.jersey.core/jersey-server",
      "version": "3.1.5",
      "purl": "pkg:maven/org.glassfish.jersey.core/jersey-server@3.1.5",
      "type": "library",
      "bom-ref": "pkg:maven/org.glassfish.jersey.core/jersey-server@3.1.5"
    },
    {
      "name": "org.glassfish/jakarta.json",
      "version": "2.0.1",
      "purl": "pkg:maven/org.glassfish/jakarta.json@2.0.1",
      "type": "library",
      "bom-ref": "pkg:maven/org.glassfish/jakarta.json@2.0.1"
    },
    {
      "name": "org.hamcrest/hamcrest",
      "version": "2.2",
      "purl": "pkg:maven/org.hamcrest/hamcrest@2.2",
      "type": "library",
      "bom-ref": "pkg:maven/org.hamcrest/hamcrest@2.2"
    },
    {
      "name": "org.hdrhistogram/HdrHistogram",
      "version": "2.1.12",
      "purl": "pkg:maven/org.hdrhistogram/HdrHistogram@2.1.12",
      "type": "library",
      "bom-ref": "pkg:maven/org.hdrhistogram/HdrHistogram@2.1.12"
    },
    {
      "name": "org.jetbrains.kotlin/kotlin-stdlib",
      "version": "1.9.22",
      "purl": "pkg:maven/org.jetbrains.kotlin/kotlin-stdlib@1.9.22",
      "type": "library",
      "bom-ref": "pkg:maven/org.jetbrains.kotlin/kotlin-stdlib@1.9.22"
    },
    {
      "name": "org.jetbrains.kotlin/kotlin-stdlib-common",
      "version": "1.9.22",
      "purl": "pkg:maven/org.jetbrains.kotlin/kotlin-stdlib-common@1.9.22",
      "type": "library",
      "bom-ref": "pkg:maven/org.jetbrains.kotlin/kotlin-stdlib-common@1.9.22"
    },
    {
      "name": "org.jetbrains.kotlin/kotlin-stdlib-jdk7",
      "version": "1.9.22",
      "purl": "pkg:maven/org.jetbrains.kotlin/kotlin-stdlib-jdk7@1.9.22",
      "type": "library",
      "bom-ref": "pkg:maven/org.jetbrains.kotlin/kotlin-stdlib-jdk7@1.9.22"
    },
    {
      "name": "org.jetbrains.kotlin/kotlin-stdlib-jdk8",
      "version": "1.9.22",
      "purl": "pkg:maven/org.jetbrains.kotlin/kotlin-stdlib-jdk8@1.9.22",
      "type": "library",
      "bom-ref": "pkg:maven/org.jetbrains.kotlin/kotlin-stdlib-jdk8@1.9.22"
    },
    {
      "name": "org.jetbrains/annotations",
      "version": "13.0",
      "purl": "pkg:maven/org.jetbrains/annotations@13.0",
      "type": "library",
      "bom-ref": "pkg:maven/org.jetbrains/annotations@13.0"
    },
    {
      "name": "org.json/json",
      "version": "20231013",
      "purl": "pkg:maven/org.json/json@20231013",
      "type": "library",
      "bom-ref": "pkg:maven/org.json/json@20231013"
    },
    {
      "name": "org.junit.jupiter/junit-jupiter",
      "version": "5.10.1",
      "purl": "pkg:maven/org.junit.jupiter/junit-jupiter@5.10.1",
      "type": "library",
      "bom-ref": "pkg:maven/org.junit.jupiter/junit-jupiter@5.10.1"
    },
    {
      "name": "org.junit.jupiter/junit-jupiter-api",
      "version": "5.10.1",
      "purl": "pkg:maven/org.junit.jupiter/junit-jupiter-api@5.10.1",
      "type": "library",
      "bom-ref": "pkg:maven/org.junit.jupiter/junit-jupiter-api@5.10.1"
    },
    {
      "name": "org.junit.jupiter/junit-jupiter-engine",
      "version": "5.10.1",
      "purl": "pkg:maven/org.junit.jupiter/junit-jupiter-engine@5.10.1",
      "type": "library",
      "bom-ref": "pkg:maven/org.junit.jupiter/junit-jupiter-engine@5.10.1"
    },
    {
      "name": "org.junit.jupiter/junit-jupiter-params",
      "version": "5.10.1",
      "purl": "pkg:maven/org.junit.jupiter/junit-jupiter-params@5.10.1",
      "type": "library",
      "bom-ref": "pkg:maven/org.junit.jupiter/junit-jupiter-params@5.10.1"
    },
    {
      "name": "org.junit.platform/junit-platform-commons",
      "version": "1.10.1",
      "purl": "pkg:maven/org.junit.platform/junit-platform-commons@1.10.1",
      "type": "library",
      "bom-ref": "pkg:maven/org.junit.platform/junit-platform-commons@1.10.1"
    },
    {
      "name": "org.junit.platform/junit-platform-engine",
      "version": "1.10.1",
      "purl": "pkg:maven/org.junit.platform/junit-platform-engine@1.10.1",
      "type": "library",
      "bom-ref": "pkg:maven/org.junit.platform/junit-platform-engine@1.10.1"
    },
    {
      "name": "org.latencyutils/LatencyUtils",
      "version": "2.0.3",
      "purl": "pkg:maven/org.latencyutils/LatencyUtils@2.0.3",
      "type": "library",
      "bom-ref": "pkg:maven/org.latencyutils/LatencyUtils@2.0.3"
    },
    {
      "name": "org.mockito/mockito-core",
      "version": "5.7.0",
      "purl": "pkg:maven/org.mockito/mockito-core@5.7.0",
      "type": "library",
      "bom-ref": "pkg:maven/org.mockito/mockito-core@5.7.0"
    },
    {
      "name": "org.mockito/mockito-junit-jupiter",
      "version": "5.7.0",
      "purl": "pkg:maven/org.mockito/mockito-junit-jupiter@5.7.0",
      "type": "library",
      "bom-ref": "pkg:maven/org.mockito/mockito-junit-jupiter@5.7.0"
    },
    {
      "name": "org.objenesis/objenesis",
      "version": "3.3",
      "purl": "pkg:maven/org.objenesis/objenesis@3.3",
      "type": "library",
      "bom-ref": "pkg:maven/org.objenesis/objenesis@3.3"
    },
    {
      "name": "org.opentest4j/opentest4j",
      "version": "1.3.0",
      "purl": "pkg:maven/org.opentest4j/opentest4j@1.3.0",
      "type": "library",
      "bom-ref": "pkg:maven/org.opentest4j/opentest4j@1.3.0"
    },
    {
      "name": "org.ow2.asm/asm",
      "version": "9.3",
      "purl": "pkg:maven/org.ow2.asm/asm@9.3",
      "type": "library",
      "bom-ref": "pkg:maven/org.ow2.asm/asm@9.3"
    },
    {
      "name": "org.projectlombok/lombok",
      "version": "1.18.30",
      "purl": "pkg:maven/org.projectlombok/lombok@1.18.30",
      "type": "library",
      "bom-ref": "pkg:maven/org.projectlombok/lombok@1.18.30"
    },
    {
      "name": "org.skyscreamer/jsonassert",
      "version": "1.5.1",
      "purl": "pkg:maven/org.skyscreamer/jsonassert@1.5.1",
      "type": "library",
      "bom-ref": "pkg:maven/org.skyscreamer/jsonassert@1.5.1"
    },
    {
      "name": "org.slf4j/jul-to-slf4j",
      "version": "2.0.11",
      "purl": "pkg:maven/org.slf4j/jul-to-slf4j@2.0.11",
      "type": "library",
      "bom-ref": "pkg:maven/org.slf4j/jul-to-slf4j@2.0.11"
    },
    {
      "name": "org.slf4j/slf4j-api",
      "version": "2.0.11",
      "purl": "pkg:maven/org.slf4j/slf4j-api@2.0.11",
      "type": "library",
      "bom-ref": "pkg:maven/org.slf4j/slf4j-api@2.0.11"
    },
    {
      "name": "org.springdoc/springdoc-openapi-starter-common",
      "version": "2.3.0",
      "purl": "pkg:maven/org.springdoc/springdoc-openapi-starter-common@2.3.0",
      "type": "library",
      "bom-ref": "pkg:maven/org.springdoc/springdoc-openapi-starter-common@2.3.0"
    },
    {
      "name": "org.springdoc/springdoc-openapi-starter-webmvc-api",
      "version": "2.3.0",
      "purl": "pkg:maven/org.springdoc/springdoc-openapi-starter-webmvc-api@2.3.0",
      "type": "library",
      "bom-ref": "pkg:maven/org.springdoc/springdoc-openapi-starter-webmvc-api@2.3.0"
    },
    {
      "name": "org.springdoc/springdoc-openapi-starter-webmvc-ui",
      "version": "2.3.0",
      "purl": "pkg:maven/org.springdoc/springdoc-openapi-starter-webmvc-ui@2.3.0",
      "type": "library",
      "bom-ref": "pkg:maven/org.springdoc/springdoc-openapi-starter-webmvc-ui@2.3.0"
    },
    {
      "name": "org.springframework.boot/spring-boot",
      "version": "3.2.2",
      "purl": "pkg:maven/org.springframework.boot/spring-boot@3.2.2",
      "type": "library",
      "bom-ref": "pkg:maven/org.springframework.boot/spring-boot@3.2.2"
    },
    {
      "name": "org.springframework.boot/spring-boot-actuator",
      "version": "3.2.2",
      "purl": "pkg:maven/org.springframework.boot/spring-boot-actuator@3.2.2",
      "type": "library",
      "bom-ref": "pkg:maven/org.springframework.boot/spring-boot-actuator@3.2.2"
    },
    {
      "name": "org.springframework.boot/spring-boot-actuator-autoconfigure",
      "version": "3.2.2",
      "purl": "pkg:maven/org.springframework.boot/spring-boot-actuator-autoconfigure@3.2.2",
      "type": "library",
      "bom-ref": "pkg:maven/org.springframework.boot/spring-boot-actuator-autoconfigure@3.2.2"
    },
    {
      "name": "org.springframework.boot/spring-boot-autoconfigure",
      "version": "3.2.2",
      "purl": "pkg:maven/org.springframework.boot/spring-boot-autoconfigure@3.2.2",
      "type": "library",
      "bom-ref": "pkg:maven/org.springframework.boot/spring-boot-autoconfigure@3.2.2"
    },
    {
      "name": "org.springframework.boot/spring-boot-starter",
      "version": "3.2.2",
      "purl": "pkg:maven/org.springframework.boot/spring-boot-starter@3.2.2",
      "type": "library",
      "bom-ref": "pkg:maven/org.springframework.boot/spring-boot-starter@3.2.2"
    },
    {
      "name": "org.springframework.boot/spring-boot-starter-actuator",
      "version": "3.2.2",
      "purl": "pkg:maven/org.springframework.boot/spring-boot-starter-actuator@3.2.2",
      "type": "library",
      "bom-ref": "pkg:maven/org.springframework.boot/spring-boot-starter-actuator@3.2.2"
    },
    {
      "name": "org.springframework.boot/spring-boot-starter-json",
      "version": "3.2.2",
      "purl": "pkg:maven/org.springframework.boot/spring-boot-starter-json@3.2.2",
      "type": "library",
      "bom-ref": "pkg:maven/org.springframework.boot/spring-boot-starter-json@3.2.2"
    },
    {
      "name": "org.springframework.boot/spring-boot-starter-logging",
      "version": "3.2.2",
      "purl": "pkg:maven/org.springframework.boot/spring-boot-starter-logging@3.2.2",
      "type": "library",
      "bom-ref": "pkg:maven/org.springframework.boot/spring-boot-starter-logging@3.2.2"
    },
    {
      "name": "org.springframework.boot/spring-boot-starter-oauth2-resource-server",
      "version": "3.2.2",
      "purl": "pkg:maven/org.springframework.boot/spring-boot-starter-oauth2-resource-server@3.2.2",
      "type": "library",
      "bom-ref": "pkg:maven/org.springframework.boot/spring-boot-starter-oauth2-resource-server@3.2.2"
    },
    {
      "name": "org.springframework.boot/spring-boot-starter-security",
      "version": "3.2.2",
      "purl": "pkg:maven/org.springframework.boot/spring-boot-starter-security@3.2.2",
      "type": "library",
      "bom-ref": "pkg:maven/org.springframework.boot/spring-boot-starter-security@3.2.2"
    },
    {
      "name": "org.springframework.boot/spring-boot-starter-test",
      "version": "3.2.2",
      "purl": "pkg:maven/org.springframework.boot/spring-boot-starter-test@3.2.2",
      "type": "library",
      "bom-ref": "pkg:maven/org.springframework.boot/spring-boot-starter-test@3.2.2"
    },
    {
      "name": "org.springframework.boot/spring-boot-starter-tomcat",
      "version": "3.2.2",
      "purl": "pkg:maven/org.springframework.boot/spring-boot-starter-tomcat@3.2.2",
      "type": "library",
      "bom-ref": "pkg:maven/org.springframework.boot/spring-boot-starter-tomcat@3.2.2"
    },
    {
      "name": "org.springframework.boot/spring-boot-starter-web",
      "version": "3.2.2",
      "purl": "pkg:maven/org.springframework.boot/spring-boot-starter-web@3.2.2",
      "type": "library",
      "bom-ref": "pkg:maven/org.springframework.boot/spring-boot-starter-web@3.2.2"
    },
    {
      "name": "org.springframework.boot/spring-boot-test",
      "version": "3.2.2",
      "purl": "pkg:maven/org.springframework.boot/spring-boot-test@3.2.2",
      "type": "library",
      "bom-ref": "pkg:maven/org.springframework.boot/spring-boot-test@3.2.2"
    },
    {
      "name": "org.springframework.boot/spring-boot-test-autoconfigure",
      "version": "3.2.2",
      "purl": "pkg:maven/org.springframework.boot/spring-boot-test-autoconfigure@3.2.2",
      "type": "library",
      "bom-ref": "pkg:maven/org.springframework.boot/spring-boot-test-autoconfigure@3.2.2"
    },
    {
      "name": "org.springframework.security/spring-security-config",
      "version": "6.2.1",
      "purl": "pkg:maven/org.springframework.security/spring-security-config@6.2.1",
      "type": "library",
      "bom-ref": "pkg:maven/org.springframework.security/spring-security-config@6.2.1"
    },
    {
      "name": "org.springframework.security/spring-security-core",
      "version": "6.2.1",
      "purl": "pkg:maven/org.springframework.security/spring-security-core@6.2.1",
      "type": "library",
      "bom-ref": "pkg:maven/org.springframework.security/spring-security-core@6.2.1"
    },
    {
      "name": "org.springframework.security/spring-security-crypto",
      "version": "6.2.1",
      "purl": "pkg:maven/org.springframework.security/spring-security-crypto@6.2.1",
      "type": "library",
      "bom-ref": "pkg:maven/org.springframework.security/spring-security-crypto@6.2.1"
    },
    {
      "name": "org.springframework.security/spring-security-oauth2-core",
      "version": "6.2.1",
      "purl": "pkg:maven/org.springframework.security/spring-security-oauth2-core@6.2.1",
      "type": "library",
      "bom-ref": "pkg:maven/org.springframework.security/spring-security-oauth2-core@6.2.1"
    },
    {
      "name": "org.springframework.security/spring-security-oauth2-jose",
      "version": "6.2.1",
      "purl": "pkg:maven/org.springframework.security/spring-security-oauth2-jose@6.2.1",
      "type": "library",
      "bom-ref": "pkg:maven/org.springframework.security/spring-security-oauth2-jose@6.2.1"
    },
    {
      "name": "org.springframework.security/spring-security-oauth2-resource-server",
      "version": "6.2.1",
      "purl": "pkg:maven/org.springframework.security/spring-security-oauth2-resource-server@6.2.1",
      "type": "library",
      "bom-ref": "pkg:maven/org.springframework.security/spring-security-oauth2-resource-server@6.2.1"
    },
    {
      "name": "org.springframework.security/spring-security-test",
      "version": "6.2.1",
      "purl": "pkg:maven/org.springframework.security/spring-security-test@6.2.1",
      "type": "library",
      "bom-ref": "pkg:maven/org.springframework.security/spring-security-test@6.2.1"
    },
    {
      "name": "org.springframework.security/spring-security-web",
      "version": "6.2.1",
      "purl": "pkg:maven/org.springframework.security/spring-security-web@6.2.1",
      "type": "library",
      "bom-ref": "pkg:maven/org.springframework.security/spring-security-web@6.2.1"
    },
    {
      "name": "org.springframework/spring-aop",
      "version": "6.1.3",
      "purl": "pkg:maven/org.springframework/spring-aop@6.1.3",
      "type": "library",
      "bom-ref": "pkg:maven/org.springframework/spring-aop@6.1.3"
    },
    {
      "name": "org.springframework/spring-beans",
      "version": "6.1.3",
      "purl": "pkg:maven/org.springframework/spring-beans@6.1.3",
      "type": "library",
      "bom-ref": "pkg:maven/org.springframework/spring-beans@6.1.3"
    },
    {
      "name": "org.springframework/spring-context",
      "version": "6.1.3",
      "purl": "pkg:maven/org.springframework/spring-context@6.1.3",
      "type": "library",
      "bom-ref": "pkg:maven/org.springframework/spring-context@6.1.3"
    },
    {
      "name": "org.springframework/spring-core",
      "version": "6.1.3",
      "purl": "pkg:maven/org.springframework/spring-core@6.1.3",
      "type": "library",
      "bom-ref": "pkg:maven/org.springframework/spring-core@6.1.3"
    },
    {
      "name": "org.springframework/spring-expression",
      "version": "6.1.3",
      "purl": "pkg:maven/org.springframework/spring-expression@6.1.3",
      "type": "library",
      "bom-ref": "pkg:maven/org.springframework/spring-expression@6.1.3"
    },
    {
      "name": "org.springframework/spring-jcl",
      "version": "6.1.3",
      "purl": "pkg:maven/org.springframework/spring-jcl@6.1.3",
      "type": "library",
      "bom-ref": "pkg:maven/org.springframework/spring-jcl@6.1.3"
    },
    {
      "name": "org.springframework/spring-test",
      "version": "6.1.3",
      "purl": "pkg:maven/org.springframework/spring-test@6.1.3",
      "type": "library",
      "bom-ref": "pkg:maven/org.springframework/spring-test@6.1.3"
    },
    {
      "name": "org.springframework/spring-web",
      "version": "6.1.3",
      "purl": "pkg:maven/org.springframework/spring-web@6.1.3",
      "type": "library",
      "bom-ref": "pkg:maven/org.springframework/spring-web@6.1.3"
    },
    {
      "name": "org.springframework/spring-webmvc",
      "version": "6.1.3",
      "purl": "pkg:maven/org.springframework/spring-webmvc@6.1.3",
      "type": "library",
      "bom-ref": "pkg:maven/org.springframework/spring-webmvc@6.1.3"
    },
    {
      "name": "org.web3j/abi",
      "version": "5.0.0",
      "purl": "pkg:maven/org.web3j/abi@5.0.0",
      "type": "library",
      "bom-ref": "pkg:maven/org.web3j/abi@5.0.0"
    },
    {
      "name": "org.web3j/crypto",
      "version": "5.0.0",
      "purl": "pkg:maven/org.web3j/crypto@5.0.0",
      "type": "library",
      "bom-ref": "pkg:maven/org.web3j/crypto@5.0.0"
    },
    {
      "name": "org.web3j/rlp",
      "version": "5.0.0",
      "purl": "pkg:maven/org.web3j/rlp@5.0.0",
      "type": "library",
      "bom-ref": "pkg:maven/org.web3j/rlp@5.0.0"
    },
    {
      "name": "org.web3j/utils",
      "version": "5.0.0",
      "purl": "pkg:maven/org.web3j/utils@5.0.0",
      "type": "library",
      "bom-ref": "pkg:maven/org.web3j/utils@5.0.0"
    },
    {
      "name": "org.webjars/swagger-ui",
      "version": "5.10.3",
      "purl": "pkg:maven/org.webjars/swagger-ui@5.10.3",
      "type": "library",
      "bom-ref": "pkg:maven/org.webjars/swagger-ui@5.10.3"
    },
    {
      "name": "org.xmlunit/xmlunit-core",
      "version": "2.9.1",
      "purl": "pkg:maven/org.xmlunit/xmlunit-core@2.9.1",
      "type": "library",
      "bom-ref": "pkg:maven/org.xmlunit/xmlunit-core@2.9.1"
    },
    {
      "name": "org.yaml/snakeyaml",
      "version": "2.2",
      "purl": "pkg:maven/org.yaml/snakeyaml@2.2",
      "type": "library",
      "bom-ref": "pkg:maven/org.yaml/snakeyaml@2.2"
    }
  ]
}
