<?xml version="1.0" encoding="UTF-8" standalone="no"?><svg xmlns="http://www.w3.org/2000/svg" xmlns:xlink="http://www.w3.org/1999/xlink" contentScriptType="application/ecmascript" contentStyleType="text/css" height="550px" preserveAspectRatio="none" style="width:789px;height:550px;background:#FFFFFF;" version="1.1" viewBox="0 0 789 550" width="789px" zoomAndPan="magnify"><defs><filter height="300%" id="f1n7fz9q5h6mzg" width="300%" x="-1" y="-1"><feGaussianBlur result="blurOut" stdDeviation="2.0"/><feColorMatrix in="blurOut" result="blurOut2" type="matrix" values="0 0 0 0 0 0 0 0 0 0 0 0 0 0 0 0 0 0 .4 0"/><feOffset dx="4.0" dy="4.0" in="blurOut2" result="blurOut3"/><feBlend in="SourceGraphic" in2="blurOut3" mode="normal"/></filter></defs><g><!--MD5=[de82667d990399a9987c74761bc04612]
cluster 'NotarizationRequestCore' Aggregate--><rect fill="#FFFFFF" filter="url(#f1n7fz9q5h6mzg)" height="531" style="stroke:#000000;stroke-width:1.5;" width="770" x="7" y="7"/><text fill="#000000" font-family="sans-serif" font-size="14" font-weight="bold" lengthAdjust="spacing" textLength="294" x="245" y="21.9951">'NotarizationRequestCore' Aggregate</text><!--MD5=[a39d9b3fe832e147f9a89efdf4c18614]
class NotarizationRequest--><rect codeLine="5" fill="#FEFECE" filter="url(#f1n7fz9q5h6mzg)" height="207.5938" id="NotarizationRequest" style="stroke:#A80036;stroke-width:1.5;" width="233" x="528.5" y="42"/><ellipse cx="577.25" cy="60.9688" fill="#FFFAB8" rx="11" ry="11" style="stroke:#A80036;stroke-width:1.0;"/><path d="M577.3594,56.3125 L576.2031,61.3906 L578.5313,61.3906 L577.3594,56.3125 Z M575.875,54.0781 L578.8594,54.0781 L582.2188,66.4688 L579.7656,66.4688 L579,63.4063 L575.7188,63.4063 L574.9688,66.4688 L572.5313,66.4688 L575.875,54.0781 Z " fill="#000000"/><text fill="#000000" font-family="sans-serif" font-size="12" font-style="italic" lengthAdjust="spacing" textLength="113" x="604.75" y="58.1387">«Aggregate Root»</text><text fill="#000000" font-family="sans-serif" font-size="12" lengthAdjust="spacing" textLength="127" x="597.75" y="72.1074">NotarizationRequest</text><line style="stroke:#A80036;stroke-width:1.5;" x1="529.5" x2="760.5" y1="79.9375" y2="79.9375"/><text fill="#000000" font-family="sans-serif" font-size="11" lengthAdjust="spacing" textLength="41" x="534.5" y="94.1479">UUID id</text><text fill="#000000" font-family="sans-serif" font-size="11" lengthAdjust="spacing" textLength="55" x="534.5" y="106.9526">String did</text><text fill="#000000" font-family="sans-serif" font-size="11" lengthAdjust="spacing" textLength="161" x="534.5" y="119.7573">String requestorInvitationUrl</text><text fill="#000000" font-family="sans-serif" font-size="11" lengthAdjust="spacing" textLength="122" x="534.5" y="132.562">String ssiInvitationUrl</text><text fill="#000000" font-family="sans-serif" font-size="11" lengthAdjust="spacing" textLength="112" x="534.5" y="145.3667">DateTime createdAt</text><text fill="#000000" font-family="sans-serif" font-size="11" lengthAdjust="spacing" textLength="126" x="534.5" y="158.1714">DateTime lastModified</text><text fill="#000000" font-family="sans-serif" font-size="11" lengthAdjust="spacing" textLength="63" x="534.5" y="170.9761">String data</text><text fill="#000000" font-family="sans-serif" font-size="11" lengthAdjust="spacing" textLength="155" x="534.5" y="183.7808">String[0..1] rejectComment</text><text fill="#000000" font-family="sans-serif" font-size="11" lengthAdjust="spacing" textLength="126" x="534.5" y="196.5854">String[0..1] claimedBy</text><text fill="#000000" font-family="sans-serif" font-size="11" lengthAdjust="spacing" textLength="221" x="534.5" y="209.3901">NotarizationRequestState requestState</text><text fill="#000000" font-family="sans-serif" font-size="11" lengthAdjust="spacing" textLength="95" x="534.5" y="222.1948">Session session</text><text fill="#000000" font-family="sans-serif" font-size="11" lengthAdjust="spacing" textLength="162" x="534.5" y="234.9995">List&lt;Document&gt; documents</text><line style="stroke:#A80036;stroke-width:1.5;" x1="529.5" x2="760.5" y1="241.5938" y2="241.5938"/><!--MD5=[2ca1536628238a7dc78c5d90808014f9]
class Session--><rect codeLine="19" fill="#FEFECE" filter="url(#f1n7fz9q5h6mzg)" height="156.375" id="Session" style="stroke:#A80036;stroke-width:1.5;" width="171" x="322.5" y="68"/><ellipse cx="379.25" cy="86.9688" fill="#8FBC8F" rx="11" ry="11" style="stroke:#A80036;stroke-width:1.0;"/><path d="M383.3594,92.9688 L375.6406,92.9688 L375.6406,80.5781 L383.3594,80.5781 L383.3594,82.7344 L378.0938,82.7344 L378.0938,85.4063 L382.8594,85.4063 L382.8594,87.5625 L378.0938,87.5625 L378.0938,90.8125 L383.3594,90.8125 L383.3594,92.9688 Z " fill="#000000"/><text fill="#000000" font-family="sans-serif" font-size="12" font-style="italic" lengthAdjust="spacing" textLength="50" x="399.25" y="84.1387">«Entity»</text><text fill="#000000" font-family="sans-serif" font-size="12" lengthAdjust="spacing" textLength="49" x="399.75" y="98.1074">Session</text><line style="stroke:#A80036;stroke-width:1.5;" x1="323.5" x2="492.5" y1="105.9375" y2="105.9375"/><text fill="#000000" font-family="sans-serif" font-size="11" lengthAdjust="spacing" textLength="48" x="328.5" y="120.1479">String id</text><text fill="#000000" font-family="sans-serif" font-size="11" lengthAdjust="spacing" textLength="112" x="328.5" y="132.9526">String accessToken</text><text fill="#000000" font-family="sans-serif" font-size="11" lengthAdjust="spacing" textLength="84" x="328.5" y="145.7573">String profileId</text><text fill="#000000" font-family="sans-serif" font-size="11" lengthAdjust="spacing" textLength="113" x="328.5" y="158.562">String identityToken</text><text fill="#000000" font-family="sans-serif" font-size="11" lengthAdjust="spacing" textLength="136" x="328.5" y="171.3667">boolean manualRelease</text><text fill="#000000" font-family="sans-serif" font-size="11" lengthAdjust="spacing" textLength="159" x="328.5" y="184.1714">String manualReleaseToken</text><text fill="#000000" font-family="sans-serif" font-size="11" lengthAdjust="spacing" textLength="112" x="328.5" y="196.9761">DateTime createdAt</text><text fill="#000000" font-family="sans-serif" font-size="11" lengthAdjust="spacing" textLength="126" x="328.5" y="209.7808">DateTime lastModified</text><line style="stroke:#A80036;stroke-width:1.5;" x1="323.5" x2="492.5" y1="216.375" y2="216.375"/><!--MD5=[59b530d44ae785dc18db921986a9c15c]
class Document--><rect codeLine="29" fill="#FEFECE" filter="url(#f1n7fz9q5h6mzg)" height="194.7891" id="Document" style="stroke:#A80036;stroke-width:1.5;" width="149" x="612.5" y="327"/><ellipse cx="651.35" cy="345.9688" fill="#8FBC8F" rx="11" ry="11" style="stroke:#A80036;stroke-width:1.0;"/><path d="M655.4594,351.9688 L647.7406,351.9688 L647.7406,339.5781 L655.4594,339.5781 L655.4594,341.7344 L650.1938,341.7344 L650.1938,344.4063 L654.9594,344.4063 L654.9594,346.5625 L650.1938,346.5625 L650.1938,349.8125 L655.4594,349.8125 L655.4594,351.9688 Z " fill="#000000"/><text fill="#000000" font-family="sans-serif" font-size="12" font-style="italic" lengthAdjust="spacing" textLength="50" x="677.65" y="343.1387">«Entity»</text><text fill="#000000" font-family="sans-serif" font-size="12" lengthAdjust="spacing" textLength="64" x="670.65" y="357.1074">Document</text><line style="stroke:#A80036;stroke-width:1.5;" x1="613.5" x2="760.5" y1="364.9375" y2="364.9375"/><text fill="#000000" font-family="sans-serif" font-size="11" lengthAdjust="spacing" textLength="41" x="618.5" y="379.1479">UUID id</text><text fill="#000000" font-family="sans-serif" font-size="11" lengthAdjust="spacing" textLength="101" x="618.5" y="391.9526">ByteArray content</text><text fill="#000000" font-family="sans-serif" font-size="11" lengthAdjust="spacing" textLength="59" x="618.5" y="404.7573">String title</text><text fill="#000000" font-family="sans-serif" font-size="11" lengthAdjust="spacing" textLength="132" x="618.5" y="417.562">String shortDescription</text><text fill="#000000" font-family="sans-serif" font-size="11" lengthAdjust="spacing" textLength="126" x="618.5" y="430.3667">String longDescription</text><text fill="#000000" font-family="sans-serif" font-size="11" lengthAdjust="spacing" textLength="94" x="618.5" y="443.1714">String mimetype</text><text fill="#000000" font-family="sans-serif" font-size="11" lengthAdjust="spacing" textLength="93" x="618.5" y="455.9761">String extension</text><text fill="#000000" font-family="sans-serif" font-size="11" lengthAdjust="spacing" textLength="137" x="618.5" y="468.7808">String verificationReport</text><text fill="#000000" font-family="sans-serif" font-size="11" lengthAdjust="spacing" textLength="66" x="618.5" y="481.5854">String hash</text><text fill="#000000" font-family="sans-serif" font-size="11" lengthAdjust="spacing" textLength="112" x="618.5" y="494.3901">DateTime createdAt</text><text fill="#000000" font-family="sans-serif" font-size="11" lengthAdjust="spacing" textLength="126" x="618.5" y="507.1948">DateTime lastModified</text><line style="stroke:#A80036;stroke-width:1.5;" x1="613.5" x2="760.5" y1="513.7891" y2="513.7891"/><!--MD5=[48ebacafe8307cb15fa3b3324baf7b87]
class NotarizationRequestView--><rect codeLine="42" fill="#FEFECE" filter="url(#f1n7fz9q5h6mzg)" height="169.1797" id="NotarizationRequestView" style="stroke:#A80036;stroke-width:1.5;" width="233" x="54.5" y="61.5"/><ellipse cx="90.2" cy="80.4688" fill="#8FBC8F" rx="11" ry="11" style="stroke:#A80036;stroke-width:1.0;"/><path d="M90.3094,84.9219 L92.4969,74.5781 L94.9656,74.5781 L92.0125,86.9688 L88.6219,86.9688 L85.6688,74.5781 L88.1375,74.5781 L90.3094,84.9219 Z " fill="#000000"/><text fill="#000000" font-family="sans-serif" font-size="12" font-style="italic" lengthAdjust="spacing" textLength="92" x="140.3" y="77.6387">«Value Object»</text><text fill="#000000" font-family="sans-serif" font-size="12" lengthAdjust="spacing" textLength="155" x="108.8" y="91.6074">NotarizationRequestView</text><line style="stroke:#A80036;stroke-width:1.5;" x1="55.5" x2="286.5" y1="99.4375" y2="99.4375"/><text fill="#000000" font-family="sans-serif" font-size="11" lengthAdjust="spacing" textLength="41" x="60.5" y="113.6479">UUID id</text><text fill="#000000" font-family="sans-serif" font-size="11" lengthAdjust="spacing" textLength="84" x="60.5" y="126.4526">String profileId</text><text fill="#000000" font-family="sans-serif" font-size="11" lengthAdjust="spacing" textLength="112" x="60.5" y="139.2573">DateTime createdAt</text><text fill="#000000" font-family="sans-serif" font-size="11" lengthAdjust="spacing" textLength="126" x="60.5" y="152.062">DateTime lastModified</text><text fill="#000000" font-family="sans-serif" font-size="11" lengthAdjust="spacing" textLength="82" x="60.5" y="164.8667">JsonNode data</text><text fill="#000000" font-family="sans-serif" font-size="11" lengthAdjust="spacing" textLength="125" x="60.5" y="177.6714">String rejectComment</text><text fill="#000000" font-family="sans-serif" font-size="11" lengthAdjust="spacing" textLength="221" x="60.5" y="190.4761">NotarizationRequestState requestState</text><text fill="#000000" font-family="sans-serif" font-size="11" lengthAdjust="spacing" textLength="143" x="60.5" y="203.2808">DistributedIdentity holder</text><text fill="#000000" font-family="sans-serif" font-size="11" lengthAdjust="spacing" textLength="187" x="60.5" y="216.0854">Set&lt;DocumentView&gt; documents</text><line style="stroke:#A80036;stroke-width:1.5;" x1="55.5" x2="286.5" y1="222.6797" y2="222.6797"/><!--MD5=[66b05a70f37d0aa008c938bb6fb05e0b]
class DistributedIdentity--><rect codeLine="53" fill="#FEFECE" filter="url(#f1n7fz9q5h6mzg)" height="66.7422" id="DistributedIdentity" style="stroke:#A80036;stroke-width:1.5;" width="147" x="202.5" y="391"/><ellipse cx="217.5" cy="409.9688" fill="#8FBC8F" rx="11" ry="11" style="stroke:#A80036;stroke-width:1.0;"/><path d="M217.6094,414.4219 L219.7969,404.0781 L222.2656,404.0781 L219.3125,416.4688 L215.9219,416.4688 L212.9688,404.0781 L215.4375,404.0781 L217.6094,414.4219 Z " fill="#000000"/><text fill="#000000" font-family="sans-serif" font-size="12" font-style="italic" lengthAdjust="spacing" textLength="92" x="243" y="407.1387">«Value Object»</text><text fill="#000000" font-family="sans-serif" font-size="12" lengthAdjust="spacing" textLength="115" x="231.5" y="421.1074">DistributedIdentity</text><line style="stroke:#A80036;stroke-width:1.5;" x1="203.5" x2="348.5" y1="428.9375" y2="428.9375"/><text fill="#000000" font-family="sans-serif" font-size="11" lengthAdjust="spacing" textLength="68" x="208.5" y="443.1479">String value</text><line style="stroke:#A80036;stroke-width:1.5;" x1="203.5" x2="348.5" y1="449.7422" y2="449.7422"/><!--MD5=[505352c63e70a3053c10c2a299eddb6f]
class DocumentView--><rect codeLine="56" fill="#FEFECE" filter="url(#f1n7fz9q5h6mzg)" height="130.7656" id="DocumentView" style="stroke:#A80036;stroke-width:1.5;" width="144" x="23" y="359"/><ellipse cx="47" cy="377.9688" fill="#8FBC8F" rx="11" ry="11" style="stroke:#A80036;stroke-width:1.0;"/><path d="M47.1094,382.4219 L49.2969,372.0781 L51.7656,372.0781 L48.8125,384.4688 L45.4219,384.4688 L42.4688,372.0781 L44.9375,372.0781 L47.1094,382.4219 Z " fill="#000000"/><text fill="#000000" font-family="sans-serif" font-size="12" font-style="italic" lengthAdjust="spacing" textLength="92" x="63" y="375.1387">«Value Object»</text><text fill="#000000" font-family="sans-serif" font-size="12" lengthAdjust="spacing" textLength="92" x="63" y="389.1074">DocumentView</text><line style="stroke:#A80036;stroke-width:1.5;" x1="24" x2="166" y1="396.9375" y2="396.9375"/><text fill="#000000" font-family="sans-serif" font-size="11" lengthAdjust="spacing" textLength="41" x="29" y="411.1479">UUID id</text><text fill="#000000" font-family="sans-serif" font-size="11" lengthAdjust="spacing" textLength="59" x="29" y="423.9526">String title</text><text fill="#000000" font-family="sans-serif" font-size="11" lengthAdjust="spacing" textLength="132" x="29" y="436.7573">String shortDescription</text><text fill="#000000" font-family="sans-serif" font-size="11" lengthAdjust="spacing" textLength="126" x="29" y="449.562">String longDescription</text><text fill="#000000" font-family="sans-serif" font-size="11" lengthAdjust="spacing" textLength="94" x="29" y="462.3667">String mimetype</text><text fill="#000000" font-family="sans-serif" font-size="11" lengthAdjust="spacing" textLength="93" x="29" y="475.1714">String extension</text><line style="stroke:#A80036;stroke-width:1.5;" x1="24" x2="166" y1="481.7656" y2="481.7656"/><!--MD5=[89c930e34f87102fde83d6062d3b2e38]
class NotarizationRequestState--><rect codeLine="64" fill="#FEFECE" filter="url(#f1n7fz9q5h6mzg)" height="176.0469" id="NotarizationRequestState" style="stroke:#A80036;stroke-width:1.5;" width="193" x="384.5" y="336.5"/><ellipse cx="399.5" cy="352.5" fill="#EB937F" rx="11" ry="11" style="stroke:#A80036;stroke-width:1.0;"/><path d="M403.6094,358.5 L395.8906,358.5 L395.8906,346.1094 L403.6094,346.1094 L403.6094,348.2656 L398.3438,348.2656 L398.3438,350.9375 L403.1094,350.9375 L403.1094,353.0938 L398.3438,353.0938 L398.3438,356.3438 L403.6094,356.3438 L403.6094,358.5 Z " fill="#000000"/><text fill="#000000" font-family="sans-serif" font-size="12" lengthAdjust="spacing" textLength="161" x="413.5" y="356.6543">NotarizationRequestState</text><line style="stroke:#A80036;stroke-width:1.5;" x1="385.5" x2="576.5" y1="368.5" y2="368.5"/><text fill="#000000" font-family="sans-serif" font-size="11" lengthAdjust="spacing" textLength="51" x="390.5" y="382.7104">CREATED</text><text fill="#000000" font-family="sans-serif" font-size="11" lengthAdjust="spacing" textLength="78" x="390.5" y="395.5151">SUBMITTABLE</text><text fill="#000000" font-family="sans-serif" font-size="11" lengthAdjust="spacing" textLength="53" x="390.5" y="408.3198">EDITABLE</text><text fill="#000000" font-family="sans-serif" font-size="11" lengthAdjust="spacing" textLength="110" x="390.5" y="421.1245">READY_FOR_REVIEW</text><text fill="#000000" font-family="sans-serif" font-size="11" lengthAdjust="spacing" textLength="117" x="390.5" y="433.9292">WORK_IN_PROGRESS</text><text fill="#000000" font-family="sans-serif" font-size="11" lengthAdjust="spacing" textLength="59" x="390.5" y="446.7339">ACCEPTED</text><text fill="#000000" font-family="sans-serif" font-size="11" lengthAdjust="spacing" textLength="75" x="390.5" y="459.5386">PENDING_DID</text><text fill="#000000" font-family="sans-serif" font-size="11" lengthAdjust="spacing" textLength="180" x="390.5" y="472.3433">PENDING_REQUESTOR_RELEASE</text><text fill="#000000" font-family="sans-serif" font-size="11" lengthAdjust="spacing" textLength="42" x="390.5" y="485.1479">ISSUED</text><text fill="#000000" font-family="sans-serif" font-size="11" lengthAdjust="spacing" textLength="70" x="390.5" y="497.9526">TERMINATED</text><line style="stroke:#A80036;stroke-width:1.5;" x1="385.5" x2="576.5" y1="504.5469" y2="504.5469"/><!--MD5=[e536aaa4866ef2f9c79004fa0727c897]
link NotarizationRequest to NotarizationRequestState--><path codeLine="77" d="M583.7,250.35 C567.87,277.03 550.95,305.57 535.5,331.62 " fill="none" id="NotarizationRequest-to-NotarizationRequestState" style="stroke:#A80036;stroke-width:1.0;"/><polygon fill="#A80036" points="532.83,336.11,540.8682,330.419,535.3857,331.8125,533.9922,326.33,532.83,336.11" style="stroke:#A80036;stroke-width:1.0;"/><text fill="#000000" font-family="sans-serif" font-size="13" lengthAdjust="spacing" textLength="84" x="564" y="293.0669">requestState</text><!--MD5=[05e07d6d8d2f365d609744882a69f120]
reverse link NotarizationRequest to Document--><path codeLine="78" d="M662.68,263.37 C665.88,284.45 669.19,306.23 672.29,326.68 " fill="none" id="NotarizationRequest-backto-Document" style="stroke:#A80036;stroke-width:1.0;"/><polygon fill="#FFFFFF" points="660.7,250.35,657.6485,256.8836,662.5059,262.2133,665.5574,255.6797,660.7,250.35" style="stroke:#A80036;stroke-width:1.0;"/><text fill="#000000" font-family="sans-serif" font-size="13" lengthAdjust="spacing" textLength="72" x="668" y="293.0669">documents</text><!--MD5=[3a0d4a0733bedfaf870579385392414a]
link NotarizationRequestView to NotarizationRequestState--><path codeLine="79" d="M264.85,230.71 C301.3,263.22 343.13,300.53 380.21,333.61 " fill="none" id="NotarizationRequestView-to-NotarizationRequestState" style="stroke:#A80036;stroke-width:1.0;"/><polygon fill="#A80036" points="384.25,337.2,380.1999,328.2224,380.5201,333.8702,374.8723,334.1903,384.25,337.2" style="stroke:#A80036;stroke-width:1.0;"/><text fill="#000000" font-family="sans-serif" font-size="13" lengthAdjust="spacing" textLength="84" x="336" y="293.0669">requestState</text><!--MD5=[289a87ab2cdd04f832dd3badd15249a1]
link NotarizationRequestView to DistributedIdentity--><path codeLine="80" d="M202.79,230.71 C222.45,282.49 246.73,346.42 261.79,386.08 " fill="none" id="NotarizationRequestView-to-DistributedIdentity" style="stroke:#A80036;stroke-width:1.0;"/><polygon fill="#A80036" points="263.58,390.8,264.129,380.9665,261.8072,386.1248,256.6488,383.803,263.58,390.8" style="stroke:#A80036;stroke-width:1.0;"/><text fill="#000000" font-family="sans-serif" font-size="13" lengthAdjust="spacing" textLength="40" x="227" y="293.0669">holder</text><!--MD5=[19353fe26542905a72a4db6e6f093cd7]
reverse link NotarizationRequestView to DocumentView--><path codeLine="81" d="M137.86,243.38 C134.01,255.65 130.29,268.08 127,280 C119.93,305.59 113.33,334.07 107.97,358.87 " fill="none" id="NotarizationRequestView-backto-DocumentView" style="stroke:#A80036;stroke-width:1.0;"/><polygon fill="#FFFFFF" points="141.9,230.68,136.2684,235.1839,138.2599,242.1146,143.8915,237.6107,141.9,230.68" style="stroke:#A80036;stroke-width:1.0;"/><text fill="#000000" font-family="sans-serif" font-size="13" lengthAdjust="spacing" textLength="72" x="128" y="293.0669">documents</text><!--MD5=[41c78cc533a6fd86fae607af5e175062]
@startuml

skinparam componentStyle uml2

package "'NotarizationRequestCore' Aggregate" <<Rectangle>> {
	class NotarizationRequest <<(A,#fffab8) Aggregate Root>> {
		UUID id
		String did
		String requestorInvitationUrl
		String ssiInvitationUrl
		DateTime createdAt
		DateTime lastModified
		String data
		String[0..1] rejectComment
		String[0..1] claimedBy
		NotarizationRequestState requestState
		Session session
		List<Document> documents
	}
	class Session <<(E,DarkSeaGreen) Entity>> {
		String id
		String accessToken
		String profileId
		String identityToken
		boolean manualRelease
		String manualReleaseToken
		DateTime createdAt
		DateTime lastModified
	}
	class Document <<(E,DarkSeaGreen) Entity>> {
		UUID id
		ByteArray content
		String title
		String shortDescription
		String longDescription
		String mimetype
		String extension
		String verificationReport
		String hash
		DateTime createdAt
		DateTime lastModified
	}
	class NotarizationRequestView <<(V,DarkSeaGreen) Value Object>> {
		UUID id
		String profileId
		DateTime createdAt
		DateTime lastModified
		JsonNode data
		String rejectComment
		NotarizationRequestState requestState
		DistributedIdentity holder
		Set<DocumentView> documents
	}
	class DistributedIdentity <<(V,DarkSeaGreen) Value Object>> {
		String value
	}
	class DocumentView <<(V,DarkSeaGreen) Value Object>> {
		UUID id
		String title
		String shortDescription
		String longDescription
		String mimetype
		String extension
	}
	enum NotarizationRequestState {
		CREATED
		SUBMITTABLE
		EDITABLE
		READY_FOR_REVIEW
		WORK_IN_PROGRESS
		ACCEPTED
		PENDING_DID
		PENDING_REQUESTOR_RELEASE
		ISSUED
		TERMINATED
	}
}
NotarizationRequest - -> NotarizationRequestState : requestState
NotarizationRequest o- - Document : documents
NotarizationRequestView - -> NotarizationRequestState : requestState
NotarizationRequestView - -> DistributedIdentity : holder
NotarizationRequestView o- - DocumentView : documents


@enduml

PlantUML version 1.2022.0(Tue Jan 11 17:16:42 CET 2022)
(GPL source distribution)
Java Runtime: OpenJDK Runtime Environment
JVM: OpenJDK 64-Bit Server VM
Default Encoding: UTF-8
Language: en
Country: US
--></g></svg>