module gitlab.eclipse.org/eclipse/xfsc/libraries/crypto/engine/plugins/local-provider

go 1.21.4

toolchain go1.21.7

require (
	gitlab.eclipse.org/eclipse/xfsc/libraries/crypto/engine/core v1.2.0
	gitlab.eclipse.org/eclipse/xfsc/libraries/crypto/engine/test v1.0.0
)

require (
	github.com/decred/dcrd/dcrec/secp256k1/v4 v4.3.0 // indirect
	github.com/goccy/go-json v0.10.3 // indirect
	github.com/lestrrat-go/blackmagic v1.0.2 // indirect
	github.com/lestrrat-go/httpcc v1.0.1 // indirect
	github.com/lestrrat-go/httprc v1.0.5 // indirect
	github.com/lestrrat-go/iter v1.0.2 // indirect
	github.com/lestrrat-go/jwx/v2 v2.0.21 // indirect
	github.com/lestrrat-go/option v1.0.1 // indirect
	github.com/segmentio/asm v1.2.0 // indirect
	golang.org/x/crypto v0.23.0 // indirect
	golang.org/x/sys v0.20.0 // indirect
)
