

Some reminders of procedures and significances of names: 

= = = = = = = = = = = = = = = = = = = = = = = =


Callisto: 

The scripts should generate to 'testUpdates'. 
safe to use -clean

Once ready, rename to 'stagedUpdates' for Ovarall Callisto 
scripts to pickup. Leave 'stagedUpdates' around, in case need 
to be re-generated. 




= = = = = = = = = = = = = = = = = = = = = = = =


Europa

scripts generate to 'declaredUpdates'

once ready, merge into 'milestones' for Europa

= = = = = = = = = = = = = = = = = = = = = = = =

Europa Enabling Features


