{
    "scopeName": "source.asn1",
    "name": "ASN1",
    "foldingStartMarker": "\\{\\s*$",
    "foldingStopMarker": "\\}",
    "patterns": [
        {
            "include": "#comments"
        },
        {
            "include": "#numbers"
        },
		{
			"include": "#keywords"
		},
		{
			"include": "#strings"
		}
	],
    "repository": {
        "escapechars": {
            "patterns": [{
                "name": "constant.character.escape.asn1",
                "match": "\\\\[rvn]"
            }]
        },
        "strings": {
            "patterns": [
                {
                    "name": "string.stringliteral.asn1",
                    "begin": "'",
                    "end": "'[BHO]",
                    "patterns": [
                        {
                            "name": "string.stringliteral.digit.asn1",
                            "match": "[0-9a-fA-F]+"
                        },
                        {
                            "name": "string.stringliteral.whitescpece.asn1",
                            "match": "([ \\t\\v\\f\\r]|[\\\\][\\n])+"
                        }
                    ]
                },
                {
                    "name": "string.quoted.double.asn1",
                    "begin": "\"",
                    "end": "\"",
                    "patterns": [
                        {
                            "name": "constant.character.escape.asn1",
                            "match": "\\\"\\\""
                        },
                        {
                            "include": "#escapechars"
                        }
                    ],
                    "applyEndPatternLast": 1
                }
            ]
        },
        "comments": {
			"patterns": [
				{
					"name": "comment.block.asn1",
					"begin": "\\/\\*",
					"end": "\\*\\/"
				},
				{
					"name": "comment.line.asn1",
					"match": "--.*$"
				}
			]
		},
        "numbers": {
            "patterns": [
                {
                    "name": "constant.numeric.float.asn1",
                    "match": "-?[0-9]+\\.[0-9]+(E-?[0-9]+)?"
                },
                {
                    "name": "constant.numeric.integer.asn1",
                    "match": "\\b\\d+\\b"
                }
            ]
        },
        "keywords": {
            "patterns": [
                {
                    "name": "support.compare-type.asn1",
                    "match": "\\b(OPTIONAL|DEFAULT|MANAGED|MODULE-TYPE|MODULE_IDENTITY|MODULE-COMPLIANCE|OBJECT-TYPE|OBJECT-IDENTITY|OBJECT-COMPLIANCE|MODE|CONFIRMED|CONDITIONAL|SUBORDINATE|SUPERIOR|CLASS|TEXTUAL-CONVENTION)\\b"
                },
                {
                    "name": "constant.language.specialfloat.asn1",
                    "match": "-?\\b(INF|MINUS-INFINITY|NaN|NOT-A-NUMBER|PLUS-INFINITY)\\b"
                },
                {
                    "name": "constant.language.boolean.asn1",
                    "match": "\\b(TRUE|FALSE)\\b"
                },
                {
                    "name": "constant.language.other.asn1",
                    "match": "\\b(NULL)\\b"
                },
                {
                    "name": "support.variable.asn1",
                    "match": "\\b(ObjectDescriptor|GeneralizedTime|UTCTime)\\b"
                },
                {
                    "name": "support.status-type.asn1",
                    "match": "\\b(current|deprecated|mandatory|obsolete)\\b"
                },
                {
                    "name": "support.access-type.asn1",
                    "match": "\\b(accessible-for-notify|not-accessible|read-create|read-only|read-write)\\b"
                },
                {
                    "name": "keyword.basic.asn1",
                    "match": "\\b(ABSENT|ABSTRACT-SYNTAX|ALL|BY|CHOICE|COMPONENT|COMPONENTS|CONSTRAINED|CONTAINING|DEFINITIONS|DURATION|EMBEDDED|ENCODED|ENCODING-CONTROL|END|ENUMERATED|EXCEPT|EXPORTS|EXTENSIBILITY|EXTERNAL|FROM|IDENTIFIER|IMPLIED|IMPORTS|INCLUDES|INSTANCE|INSTRUCTIONS|INTERSECTION|MAX|MIN|OBJECT|OBJECTS|OCTET|OF|OID-IRI|PATTERN|PDV|PRESENT|RELATIVE-OID|RELATIVE-OID-IRI|SEQUENCE|SET|SETTINGS|SIZE|STRING|SYNTAX|TYPE-IDENTIFIER|UNION|UNIQUE|WITH|IF|DERIVED|INFORMATION|ACTION|REPLY|ANY|NAMED|CHARACTERIZED|BEHAVIOUR|REGISTERED|AS|IDENTIFIED|BEGIN|UNITS|MIN-ACCESS|MAX-ACCESS|MINACCESS|MAXACCESS|REVISION|STATUS|DESCRIPTION|DistinguishedName|OBJECT-TYPE|MODULE|INDEX|AUGMENTS)\\b"
                },
                {
                    "name": "keyword.verb.asn1",
                    "match": "\\b(ACTIONS|ADD|GET|NOTIFICATIONS|REPLACE|REMOVE)\\b"
                },
                {
                    "name": "keyword.tag.asn1",
                    "match": "\\b(APPLICATION|AUTOMATIC|EXPLICIT|IMPLICIT|PRIVATE|TAGS|UNIVERSAL)\\b"
                },
                {
                    "name": "storage.type.asn1",
                    "match": "\\b(BIT|BITS|BMPString|BOOLEAN|CHARACTER|DATE|DATE-TIME|INTEGER|InterfaceIndex|IANAifType|CMIP-Attribute|REAL|PACKAGE|PACKAGES|IpAddress|PhysAddress|NetworkAddress|TimeStamp|TimeTicks|TruthValue|RowStatus|DisplayString|GeneralString|GraphicString|IA5String|NumericString|PrintableString|SnmpAdminAtring|TeletexString|UTF8String|VideotexString|VisibleString|ISO646String|T61String|UniversalString|Unsigned32|Integer32|Gauge|Gauge32|Counter|Counter32|Counter64|TIME|TIME-OF-DAY)\\b"
                },
                {
                    "name": "storage.modifier.asn1",
                    "match": "\\b(ATTRIBUTE|ATTRIBUTES|DEFINED|ELEMENTS|EQUALITY|GROUP|GROUPS|MANDATORY-GROUP|MANDATORY-GROUPS|ORDERING|SUBSTRINGS)\\b"
                },
                {
                    "name": "keyword.operator",
                    "match": "::=|\\+|-|\\.\\.|\\.\\.\\.|\\||\\^"
                }
            ]
        }
    }
}