<!DOCTYPE TITAN_GUI_project_file>
<Project TITAN_version="1.8.pl4" >
    <General>
        <Project_Name>SDD</Project_Name>
        <Executable_Path>bin/SDD</Executable_Path>
        <Working_Dir>bin</Working_Dir>
        <Build_Host>alpha</Build_Host>
        <Execution_Mode>Parallel</Execution_Mode>
        <Code_Splitting_Mode>None</Code_Splitting_Mode>
        <ScriptFile_AfterMake>lksctp107_script</ScriptFile_AfterMake>
        <Log_Format>yes</Log_Format>
        <Update_Symlinks>yes</Update_Symlinks>
        <Create_Absolute_Symlinks>no</Create_Absolute_Symlinks>
        <Update_Makefile>yes</Update_Makefile>
        <Localhost_Execute>yes</Localhost_Execute>
        <Execute_Command>rsh %host &quot;cd %project_working_dir ; &quot;%executable&quot; %localhost %mctr_port&quot;</Execute_Command>
        <Execute_Hosts>alfa, beta, gamma</Execute_Hosts>
        <UnUsed_List></UnUsed_List>
    </General>
    <Modules>
        <Module>../src/SCTP_Daemon_Dynamic_Interface_Definitions.ttcn</Module>
        <Module>../src/SCTP_Daemon_Dynamic.ttcn</Module>
        <Module>../src/SCTP_Daemon_Dynamic_Types.ttcn</Module>
        <Module>../src/SCTP_Daemon_Dynamic_IPL4_CtrlFunct.ttcn</Module>
        <Module>SCTP_Daemon_Dynamic_with_DiameterAutoReplies.ttcn</Module>
    </Modules>
    <Other_Sources>
        <Other_Source>../src/SCTP_Daemon_Dynamic_IPL4_CtrlFuncDef.cc</Other_Source>
    </Other_Sources>
    <Configs>
        <Config>SCTP_Daemon_Dynamic.cfg</Config>
    </Configs>
    <Test_Cases>
        <Test_Case>SCTP_Daemon_Dynamic.control</Test_Case>
        <Test_Case>SCTP_Daemon_Dynamic.tc_SDD</Test_Case>
        <Test_Case>SCTP_Daemon_Dynamic_with_DiameterAutoReplies.control</Test_Case>
        <Test_Case>SCTP_Daemon_Dynamic_with_DiameterAutoReplies.tc_SDD_with_DiameterAutoReplies</Test_Case>
    </Test_Cases>
    <File_Group name="MainFileGroup" >
        <File_Groups>
            <File_Group name="IPL4" >
                <File path="../../../TestPorts/IPL4asp_CNL113531/src/IPL4asp_discovery.cc" />
                <File path="../../../TestPorts/IPL4asp_CNL113531/src/IPL4asp_Functions.ttcn" />
                <File path="../../../TestPorts/IPL4asp_CNL113531/src/IPL4asp_PortType.ttcn" />
                <File path="../../../TestPorts/IPL4asp_CNL113531/src/IPL4asp_protocol_L234.hh" />
                <File path="../../../TestPorts/IPL4asp_CNL113531/src/IPL4asp_PT.cc" />
                <File path="../../../TestPorts/IPL4asp_CNL113531/src/IPL4asp_PT.hh" />
                <File path="../../../TestPorts/IPL4asp_CNL113531/src/IPL4asp_Types.ttcn" />
            </File_Group>
            <File_Group name="TCC" >
                <File path="../../../Libraries/TCCUsefulFunctions_CNL113472/src/TCCInterface.cc" />
                <File path="../../../Libraries/TCCUsefulFunctions_CNL113472/src/TCCInterface_Functions.ttcn" />
                <File path="../../../Libraries/TCCUsefulFunctions_CNL113472/src/TCCInterface_ip.h" />
            </File_Group>
            <File_Group name="Common" >
                <File path="../../../TestPorts/Common_Components/Abstract_Socket_CNL113384/src/Abstract_Socket.cc" />
                <File path="../../../TestPorts/Common_Components/Abstract_Socket_CNL113384/src/Abstract_Socket.hh" />
                <File path="../../../TestPorts/Common_Components/Socket_API_CNL113686/src/Socket_API_Definitions.ttcn" />
            </File_Group>
        </File_Groups>
    </File_Group>
</Project>
