{
    "users": {
        "admin": [
            "admin", 
            "tsaas-user"
        ], 
        "ekistam": [
            "users", 
            "tsaas-user"
        ], 
        "ethjgi": [
            "users"
        ], 
        "eistnav": [
            "users", 
            "tsaas-user"
        ], 
        "ednigbo": [
            "users"
        ]
    }, 
    "groups": [
        "admin", 
        "users", 
        "tsaas-user"
    ]
}