{
    "ViewmodelEditors": [
        {
            "pos": {
                "top": 409,
                "left": 269
            },
            "visible": false,
            "openNodes": [
                [
                    1
                ]
            ]
        },
        {
            "pos": {
                "top": 439,
                "left": 280
            },
            "visible": false,
            "openNodes": [
                [
                    1
                ]
            ]
        },
        {
            "pos": {
                "top": 1166,
                "left": 322
            },
            "visible": false,
            "openNodes": [
                [
                    1
                ],
                [
                    2
                ]
            ]
        },
        {
            "pos": {
                "top": 71,
                "left": 290
            },
            "visible": false
        },
        {
            "pos": {
                "top": 1118,
                "left": 328
            },
            "visible": false
        },
        {
            "pos": {
                "top": 149,
                "left": 293
            },
            "visible": false,
            "openNodes": [
                [
                    1
                ],
                [
                    2
                ]
            ]
        },
        {
            "pos": {
                "top": 104,
                "left": 293
            },
            "visible": false,
            "openNodes": [
                [
                    1
                ]
            ]
        },
        {
            "pos": {
                "top": 384,
                "left": 290
            },
            "visible": false,
            "openNodes": [
                [
                    1
                ]
            ]
        },
        {
            "pos": {
                "top": 67,
                "left": 533
            },
            "visible": false
        },
        {
            "pos": {
                "top": 223,
                "left": 284
            },
            "visible": false,
            "openNodes": [
                [
                    1
                ]
            ]
        },
        {
            "pos": {
                "top": 42,
                "left": 290
            },
            "visible": false,
            "openNodes": [
                [
                    1
                ]
            ]
        },
        {
            "pos": {
                "top": 253,
                "left": 289
            },
            "visible": false,
            "openNodes": [
                [
                    1
                ]
            ]
        },
        {
            "pos": {
                "top": 192,
                "left": 291
            },
            "visible": false,
            "openNodes": [
                [
                    1
                ],
                [
                    2
                ]
            ]
        },
        {
            "pos": {
                "top": 0,
                "left": 301
            },
            "visible": false,
            "openNodes": [
                [
                    1
                ]
            ]
        },
        {
            "pos": {
                "top": 1249,
                "left": 333
            },
            "visible": false,
            "openNodes": [
                [
                    1
                ]
            ]
        },
        {
            "pos": {
                "top": 509,
                "left": 296
            },
            "visible": false,
            "openNodes": [
                [
                    1
                ],
                [
                    2
                ]
            ]
        },
        {
            "pos": {
                "top": 542,
                "left": 288
            },
            "visible": false,
            "openNodes": [
                [
                    1
                ],
                [
                    2
                ]
            ]
        },
        {
            "pos": {
                "top": 720,
                "left": 305
            },
            "visible": false,
            "openNodes": [
                [
                    1
                ]
            ]
        },
        {
            "pos": {
                "top": 696,
                "left": 291
            },
            "visible": false,
            "openNodes": [
                [
                    1
                ]
            ]
        },
        {
            "pos": {
                "top": 625,
                "left": 296
            },
            "visible": false,
            "openNodes": [
                [
                    1
                ]
            ]
        },
        {
            "pos": {
                "top": 648,
                "left": 301
            },
            "visible": false,
            "openNodes": [
                [
                    1
                ]
            ]
        },
        {
            "pos": {
                "top": 743,
                "left": 304
            },
            "visible": false,
            "openNodes": [
                [
                    1
                ]
            ]
        },
        {
            "pos": {
                "top": 939,
                "left": 299
            },
            "visible": false,
            "openNodes": [
                [
                    1
                ]
            ]
        },
        {
            "pos": {
                "top": 359,
                "left": 266
            },
            "visible": false,
            "openNodes": [
                [
                    1
                ]
            ]
        },
        {
            "pos": {
                "top": 992,
                "left": 303
            },
            "visible": false,
            "openNodes": [
                [
                    1
                ]
            ]
        },
        {
            "pos": {
                "top": 791,
                "left": 302
            },
            "visible": false,
            "openNodes": [
                [
                    1
                ]
            ]
        },
        {
            "pos": {
                "top": 840,
                "left": 305
            },
            "visible": false,
            "openNodes": [
                [
                    1
                ]
            ]
        },
        {
            "pos": {
                "top": 894,
                "left": 298
            },
            "visible": false,
            "openNodes": [
                [
                    1
                ]
            ]
        },
        {
            "pos": {
                "top": 289,
                "left": 276
            },
            "visible": false,
            "openNodes": [
                [
                    1
                ]
            ]
        },
        {
            "pos": {
                "top": 338,
                "left": 277
            },
            "visible": false,
            "openNodes": [
                [
                    1
                ]
            ]
        },
        {
            "pos": {
                "top": 316,
                "left": 275
            },
            "visible": false,
            "openNodes": [
                [
                    1
                ]
            ]
        },
        {
            "pos": {
                "top": 1076,
                "left": 288
            },
            "visible": false,
            "openNodes": [
                [
                    1
                ]
            ]
        },
        {
            "pos": {
                "top": 1044,
                "left": 289
            },
            "visible": false,
            "openNodes": [
                [
                    1
                ]
            ]
        }
    ],
    "ViewEditors": [
        {
            "pos": {
                "top": 410,
                "left": 565
            },
            "visible": false,
            "openNodes": [
                [
                    0
                ]
            ]
        },
        {
            "pos": {
                "top": 466,
                "left": 703
            },
            "visible": false,
            "openNodes": [
                [
                    2
                ]
            ]
        },
        {
            "pos": {
                "top": 438,
                "left": 567
            },
            "visible": false,
            "openNodes": [
                [
                    0
                ]
            ]
        },
        {
            "pos": {
                "top": 1166,
                "left": 537
            },
            "visible": false,
            "openNodes": [
                [
                    0
                ]
            ]
        },
        {
            "pos": {
                "top": 147,
                "left": 516
            },
            "visible": false,
            "openNodes": [
                [
                    0
                ]
            ]
        },
        {
            "pos": {
                "top": 96,
                "left": 526
            },
            "visible": false,
            "openNodes": [
                [
                    0
                ]
            ]
        },
        {
            "pos": {
                "top": 66,
                "left": 804
            },
            "visible": false,
            "openNodes": [
                [
                    0
                ],
                [
                    2
                ]
            ]
        },
        {
            "pos": {
                "top": 385,
                "left": 563
            },
            "visible": false,
            "openNodes": [
                [
                    0
                ]
            ]
        },
        {
            "pos": {
                "top": 160,
                "left": 879
            },
            "visible": false,
            "openNodes": [
                [
                    2
                ]
            ]
        },
        {
            "pos": {
                "top": 222,
                "left": 540
            },
            "visible": false,
            "openNodes": [
                [
                    0
                ]
            ]
        },
        {
            "pos": {
                "top": 124,
                "left": 788
            },
            "visible": false,
            "openNodes": [
                [
                    2
                ]
            ]
        },
        {
            "pos": {
                "top": 43,
                "left": 559
            },
            "visible": false,
            "openNodes": [
                [
                    0
                ]
            ]
        },
        {
            "pos": {
                "top": 19,
                "left": 558
            },
            "visible": false
        },
        {
            "pos": {
                "top": 15,
                "left": 804
            },
            "visible": false,
            "openNodes": [
                [
                    0
                ],
                [
                    2
                ]
            ]
        },
        {
            "pos": {
                "top": 253,
                "left": 513
            },
            "visible": false,
            "openNodes": [
                [
                    0
                ]
            ]
        },
        {
            "pos": {
                "top": 171,
                "left": 721
            },
            "visible": false,
            "openNodes": [
                [
                    2
                ]
            ]
        },
        {
            "pos": {
                "top": 191,
                "left": 532
            },
            "visible": false,
            "openNodes": [
                [
                    0
                ]
            ]
        },
        {
            "pos": {
                "top": 0,
                "left": 1018
            },
            "visible": false,
            "openNodes": [
                [
                    0
                ],
                [
                    2
                ]
            ]
        },
        {
            "pos": {
                "top": 44,
                "left": 946
            },
            "visible": false,
            "openNodes": [
                [
                    2
                ]
            ]
        },
        {
            "pos": {
                "top": 1198,
                "left": 775
            },
            "visible": false,
            "openNodes": [
                [
                    0
                ],
                [
                    2
                ]
            ]
        },
        {
            "pos": {
                "top": 1248,
                "left": 589
            },
            "visible": false,
            "openNodes": [
                [
                    0
                ]
            ]
        },
        {
            "pos": {
                "top": 511,
                "left": 518
            },
            "visible": false,
            "openNodes": [
                [
                    0
                ]
            ]
        },
        {
            "pos": {
                "top": 542,
                "left": 521
            },
            "visible": false,
            "openNodes": [
                [
                    0
                ]
            ]
        },
        {
            "pos": {
                "top": 718,
                "left": 521
            },
            "visible": false,
            "openNodes": [
                [
                    0
                ]
            ]
        },
        {
            "pos": {
                "top": 364,
                "left": 818
            },
            "visible": false,
            "openNodes": [
                [
                    0
                ],
                [
                    2
                ]
            ]
        },
        {
            "pos": {
                "top": 491,
                "left": 702
            },
            "visible": false,
            "openNodes": [
                [
                    2
                ]
            ]
        },
        {
            "pos": {
                "top": 695,
                "left": 518
            },
            "visible": false,
            "openNodes": [
                [
                    0
                ]
            ]
        },
        {
            "pos": {
                "top": 675,
                "left": 604
            },
            "visible": false,
            "openNodes": [
                [
                    2
                ]
            ]
        },
        {
            "pos": {
                "top": 625,
                "left": 518
            },
            "visible": false,
            "openNodes": [
                [
                    0
                ]
            ]
        },
        {
            "pos": {
                "top": 602,
                "left": 600
            },
            "visible": false,
            "openNodes": [
                [
                    2
                ]
            ]
        },
        {
            "pos": {
                "top": 649,
                "left": 518
            },
            "visible": false,
            "openNodes": [
                [
                    0
                ]
            ]
        },
        {
            "pos": {
                "top": 549,
                "left": 704
            },
            "visible": false,
            "openNodes": [
                [
                    2
                ]
            ]
        },
        {
            "pos": {
                "top": 741,
                "left": 519
            },
            "visible": false,
            "openNodes": [
                [
                    0
                ]
            ]
        },
        {
            "pos": {
                "top": 938,
                "left": 528
            },
            "visible": false,
            "openNodes": [
                [
                    0
                ]
            ]
        },
        {
            "pos": {
                "top": 707,
                "left": 700
            },
            "visible": false,
            "openNodes": [
                [
                    2
                ]
            ]
        },
        {
            "pos": {
                "top": 995,
                "left": 528
            },
            "visible": false,
            "openNodes": [
                [
                    0
                ]
            ]
        },
        {
            "pos": {
                "top": 791,
                "left": 520
            },
            "visible": false,
            "openNodes": [
                [
                    0
                ]
            ]
        },
        {
            "pos": {
                "top": 840,
                "left": 525
            },
            "visible": false,
            "openNodes": [
                [
                    0
                ]
            ]
        },
        {
            "pos": {
                "top": 892,
                "left": 529
            },
            "visible": false,
            "openNodes": [
                [
                    0
                ]
            ]
        },
        {
            "pos": {
                "top": 289,
                "left": 545
            },
            "visible": false,
            "openNodes": [
                [
                    0
                ]
            ]
        },
        {
            "pos": {
                "top": 339,
                "left": 528
            },
            "visible": false,
            "openNodes": [
                [
                    0
                ]
            ]
        },
        {
            "pos": {
                "top": 315,
                "left": 538
            },
            "visible": false,
            "openNodes": [
                [
                    0
                ]
            ]
        },
        {
            "pos": {
                "top": 1078,
                "left": 528
            },
            "visible": false,
            "openNodes": [
                [
                    0
                ]
            ]
        },
        {
            "pos": {
                "top": 1046,
                "left": 525
            },
            "visible": false,
            "openNodes": [
                [
                    0
                ]
            ]
        }
    ],
    "Imports": [],
    "HtmlEditor": {
        "pos": {
            "top": 62,
            "left": 1178
        },
        "visible": true
    },
    "RequestEditor": {
        "openRequests": [
            [
                0
            ],
            [
                0,
                0
            ],
            [
                0,
                0,
                1
            ],
            [
                0,
                0,
                1,
                0
            ],
            [
                0,
                0,
                2
            ],
            [
                0,
                0,
                2,
                0
            ],
            [
                0,
                0,
                9
            ],
            [
                0,
                0,
                9,
                3
            ],
            [
                0,
                0,
                9,
                4
            ],
            [
                0,
                0,
                9,
                5
            ],
            [
                0,
                0,
                9,
                6
            ],
            [
                0,
                0,
                9,
                7
            ],
            [
                0,
                0,
                9,
                8
            ],
            [
                0,
                0,
                9,
                9
            ],
            [
                0,
                0,
                9,
                10
            ],
            [
                0,
                0,
                9,
                11
            ],
            [
                0,
                0,
                9,
                12
            ],
            [
                0,
                1
            ],
            [
                0,
                1,
                2
            ],
            [
                0,
                1,
                2,
                0
            ],
            [
                0,
                1,
                2,
                0,
                0
            ],
            [
                0,
                2
            ]
        ]
    }
}