<?xml version="1.0" encoding="UTF-8" standalone="no"?>
<!-- Generator: Adobe Illustrator 19.0.0, SVG Export Plug-In . SVG Version: 6.00 Build 0)  -->

<svg
   xmlns:dc="http://purl.org/dc/elements/1.1/"
   xmlns:cc="http://creativecommons.org/ns#"
   xmlns:rdf="http://www.w3.org/1999/02/22-rdf-syntax-ns#"
   xmlns:svg="http://www.w3.org/2000/svg"
   xmlns="http://www.w3.org/2000/svg"
   xmlns:sodipodi="http://sodipodi.sourceforge.net/DTD/sodipodi-0.dtd"
   xmlns:inkscape="http://www.inkscape.org/namespaces/inkscape"
   version="1.1"
   id="Capa_1"
   x="0px"
   y="0px"
   viewBox="0 0 299.99999 299.99999"
   xml:space="preserve"
   inkscape:version="0.91 r13725"
   sodipodi:docname="Parameter.svg"
   width="300"
   height="300"><metadata
     id="metadata109"><rdf:RDF><cc:Work
         rdf:about=""><dc:format>image/svg+xml</dc:format><dc:type
           rdf:resource="http://purl.org/dc/dcmitype/StillImage" /><dc:title></dc:title></cc:Work></rdf:RDF></metadata><defs
     id="defs107" /><sodipodi:namedview
     pagecolor="#ffffff"
     bordercolor="#666666"
     borderopacity="1"
     objecttolerance="10"
     gridtolerance="10"
     guidetolerance="10"
     inkscape:pageopacity="0"
     inkscape:pageshadow="2"
     inkscape:window-width="1481"
     inkscape:window-height="929"
     id="namedview105"
     showgrid="false"
     inkscape:zoom="0.46093569"
     inkscape:cx="-253.8315"
     inkscape:cy="258.17051"
     inkscape:window-x="72"
     inkscape:window-y="0"
     inkscape:window-maximized="0"
     inkscape:current-layer="Capa_1"
     inkscape:showpageshadow="false" /><g
     id="g45"
     transform="matrix(0,2.5390471,-1,0,482.161,-997.9921)"><g
       id="g47"><path
         inkscape:connector-curvature="0"
         d="m 502,422.161 -97,0 c -5.523,0 -10,4.478 -10,10 0,5.522 4.477,10 10,10 l 97,0 c 5.523,0 10,-4.478 10,-10 0,-5.523 -4.477,-10 -10,-10 z"
         id="path49" /></g></g><g
     id="g75"
     transform="matrix(0,1,-1,0,541.0015,-322.83951)" /><g
     id="g77"
     transform="matrix(0,1,-1,0,541.0015,-322.83951)" /><g
     id="g79"
     transform="matrix(0,1,-1,0,541.0015,-322.83951)" /><g
     id="g81"
     transform="matrix(0,1,-1,0,541.0015,-322.83951)" /><g
     id="g83"
     transform="matrix(0,1,-1,0,541.0015,-322.83951)" /><g
     id="g85"
     transform="matrix(0,1,-1,0,541.0015,-322.83951)" /><g
     id="g87"
     transform="matrix(0,1,-1,0,541.0015,-322.83951)" /><g
     id="g89"
     transform="matrix(0,1,-1,0,541.0015,-322.83951)" /><g
     id="g91"
     transform="matrix(0,1,-1,0,541.0015,-322.83951)" /><g
     id="g93"
     transform="matrix(0,1,-1,0,541.0015,-322.83951)" /><g
     id="g95"
     transform="matrix(0,1,-1,0,541.0015,-322.83951)" /><g
     id="g97"
     transform="matrix(0,1,-1,0,541.0015,-322.83951)" /><g
     id="g99"
     transform="matrix(0,1,-1,0,541.0015,-322.83951)" /><g
     id="g101"
     transform="matrix(0,1,-1,0,541.0015,-322.83951)" /><g
     id="g103"
     transform="matrix(0,1,-1,0,541.0015,-322.83951)" /><g
     id="g33-4"
     transform="matrix(0,1,-1,0,633.92451,-327.08901)"><g
       id="g35-8" /></g><g
     id="g33-0"
     transform="matrix(0,1,-1,0,734.26351,-330.58101)"><g
       id="g35-2" /></g><g
     id="g45-5"
     transform="matrix(0,1,-1,0,734.26351,-330.58101)"><g
       id="g47-1" /></g><circle
     style="fill:#ffffff;fill-opacity:1;stroke:#000000;stroke-width:14.84617615;stroke-linecap:round;stroke-linejoin:round;stroke-miterlimit:4;stroke-dasharray:none;stroke-dashoffset:0.45120001;stroke-opacity:1"
     id="path4384"
     cx="50"
     cy="135.68549"
     r="37.576912" /><g
     id="g45-0"
     transform="matrix(0,2.5390471,-1,0,582.161,-997.9921)"><g
       id="g47-6"><path
         inkscape:connector-curvature="0"
         d="m 502,422.161 -97,0 c -5.523,0 -10,4.478 -10,10 0,5.522 4.477,10 10,10 l 97,0 c 5.523,0 10,-4.478 10,-10 0,-5.523 -4.477,-10 -10,-10 z"
         id="path49-4" /></g></g><g
     id="g45-6"
     transform="matrix(0,2.5390471,-1,0,682.161,-997.9921)"><g
       id="g47-2"><path
         inkscape:connector-curvature="0"
         d="m 502,422.161 -97,0 c -5.523,0 -10,4.478 -10,10 0,5.522 4.477,10 10,10 l 97,0 c 5.523,0 10,-4.478 10,-10 0,-5.523 -4.477,-10 -10,-10 z"
         id="path49-5" /></g></g><circle
     style="fill:#ffffff;fill-opacity:1;stroke:#000000;stroke-width:14.84617615;stroke-linecap:round;stroke-linejoin:round;stroke-miterlimit:4;stroke-dasharray:none;stroke-dashoffset:0.45120001;stroke-opacity:1"
     id="path4384-8"
     cx="150"
     cy="205.71924"
     r="37.576912" /><circle
     style="fill:#ffffff;fill-opacity:1;stroke:#000000;stroke-width:14.84617615;stroke-linecap:round;stroke-linejoin:round;stroke-miterlimit:4;stroke-dasharray:none;stroke-dashoffset:0.45120001;stroke-opacity:1"
     id="path4384-6"
     cx="250"
     cy="83.719238"
     r="37.576912" /></svg>