<?xml version="1.0" encoding="UTF-8" standalone="no"?>
<!-- Created with Inkscape (http://www.inkscape.org/) -->

<svg
   xmlns:dc="http://purl.org/dc/elements/1.1/"
   xmlns:cc="http://creativecommons.org/ns#"
   xmlns:rdf="http://www.w3.org/1999/02/22-rdf-syntax-ns#"
   xmlns:svg="http://www.w3.org/2000/svg"
   xmlns="http://www.w3.org/2000/svg"
   xmlns:sodipodi="http://sodipodi.sourceforge.net/DTD/sodipodi-0.dtd"
   xmlns:inkscape="http://www.inkscape.org/namespaces/inkscape"
   width="297mm"
   height="210mm"
   viewBox="0 0 297 210"
   version="1.1"
   id="svg820"
   inkscape:version="0.92.3 (2405546, 2018-03-11)"
   sodipodi:docname="fallback_pl.svg">
  <defs
     id="defs814" />
  <sodipodi:namedview
     id="base"
     pagecolor="#ffffff"
     bordercolor="#666666"
     borderopacity="1.0"
     inkscape:pageopacity="0.0"
     inkscape:pageshadow="2"
     inkscape:zoom="0.7"
     inkscape:cx="527.94001"
     inkscape:cy="386.28437"
     inkscape:document-units="mm"
     inkscape:current-layer="layer1"
     showgrid="true"
     inkscape:window-width="1541"
     inkscape:window-height="929"
     inkscape:window-x="67"
     inkscape:window-y="27"
     inkscape:window-maximized="1">
    <inkscape:grid
       type="xygrid"
       id="grid1365" />
  </sodipodi:namedview>
  <metadata
     id="metadata817">
    <rdf:RDF>
      <cc:Work
         rdf:about="">
        <dc:format>image/svg+xml</dc:format>
        <dc:type
           rdf:resource="http://purl.org/dc/dcmitype/StillImage" />
        <dc:title></dc:title>
      </cc:Work>
    </rdf:RDF>
  </metadata>
  <g
     inkscape:label="Layer 1"
     inkscape:groupmode="layer"
     id="layer1"
     transform="translate(0,-87)">
    <g
       id="g1421"
       inkscape:export-xdpi="2.6707559"
       inkscape:export-ydpi="2.6707559">
      <rect
         y="104.13415"
         x="63.629986"
         height="148.16667"
         width="148.16667"
         id="rect1367"
         style="fill:#ffffff;stroke:#2c5aa0;stroke-width:4;stroke-miterlimit:4;stroke-dasharray:none" />
      <text
         id="text1390"
         y="246.29257"
         x="88.851532"
         style="font-style:normal;font-weight:normal;font-size:10.58333302px;line-height:1.25;font-family:sans-serif;letter-spacing:0px;word-spacing:0px;fill:#afc6e9;fill-opacity:1;stroke:#2c5aa0;stroke-width:4;stroke-miterlimit:4;stroke-dasharray:none"
         xml:space="preserve"><tspan
           style="font-size:183.44444275px;fill:#afc6e9;stroke:#2c5aa0;stroke-width:4;stroke-miterlimit:4;stroke-dasharray:none"
           y="246.29257"
           x="88.851532"
           id="tspan1388"
           sodipodi:role="line">?</tspan></text>
    </g>
  </g>
</svg>
