<?xml version="1.0" encoding="UTF-8" standalone="no"?>
<svg
   viewBox="0 -256 70 70"
   id="svg3037"
   version="1.1"
   inkscape:version="1.2.2 (732a01da63, 2022-12-09, custom)"
   width="70"
   height="70"
   sodipodi:docname="retry_pl.svg"
   inkscape:export-filename="retry.png"
   inkscape:export-xdpi="96"
   inkscape:export-ydpi="96"
   xmlns:inkscape="http://www.inkscape.org/namespaces/inkscape"
   xmlns:sodipodi="http://sodipodi.sourceforge.net/DTD/sodipodi-0.dtd"
   xmlns="http://www.w3.org/2000/svg"
   xmlns:svg="http://www.w3.org/2000/svg"
   xmlns:rdf="http://www.w3.org/1999/02/22-rdf-syntax-ns#"
   xmlns:cc="http://creativecommons.org/ns#"
   xmlns:dc="http://purl.org/dc/elements/1.1/">
  <metadata
     id="metadata3047">
    <rdf:RDF>
      <cc:Work
         rdf:about="">
        <dc:format>image/svg+xml</dc:format>
        <dc:type
           rdf:resource="http://purl.org/dc/dcmitype/StillImage" />
      </cc:Work>
    </rdf:RDF>
  </metadata>
  <defs
     id="defs3045" />
  <sodipodi:namedview
     pagecolor="#ffffff"
     bordercolor="#666666"
     borderopacity="1"
     objecttolerance="10"
     gridtolerance="10"
     guidetolerance="10"
     inkscape:pageopacity="0"
     inkscape:pageshadow="2"
     inkscape:window-width="1528"
     inkscape:window-height="836"
     id="namedview3043"
     showgrid="false"
     inkscape:zoom="5.9599001"
     inkscape:cx="23.825903"
     inkscape:cy="31.963623"
     inkscape:window-x="72"
     inkscape:window-y="27"
     inkscape:window-maximized="1"
     inkscape:current-layer="svg3037"
     inkscape:showpageshadow="0"
     inkscape:pagecheckerboard="0"
     inkscape:deskcolor="#d1d1d1" />
  <path
     d="m 68.97656,-249.12476 v 19.77301 q 0,1.14754 -0.83859,1.98613 -0.83859,0.83859 -1.98613,0.83859 H 46.37883 q -1.85372,0 -2.60404,-1.76545 -0.75031,-1.72131 0.61791,-3.0454 l 6.0908,-6.09079 q -6.53216,-6.04666 -15.40353,-6.04666 -4.59017,0 -8.76104,1.78752 -4.17087,1.78751 -7.21627,4.83291 -3.04539,3.0454 -4.83291,7.21627 -1.78751,4.17087 -1.78751,8.76103 0,4.59016 1.78751,8.76103 1.78752,4.17087 4.83291,7.21627 3.0454,3.0454 7.21627,4.83291 4.17087,1.78752 8.76104,1.78752 7.45901,0 13.4174,-4.39155 5.95838,-4.39155 8.16519,-11.54161 0.30896,-1.01514 1.32409,-1.01514 h 8.7831 q 0.70618,0 1.10341,0.52964 0.44136,0.57377 0.30895,1.19167 -1.72131,7.72384 -6.51009,13.7705 -4.78878,6.04665 -11.74023,9.40101 -6.95145,3.35435 -14.85182,3.35435 -6.88525,0 -13.15259,-2.69231 -6.26734,-2.69231 -10.81337,-7.23834 -4.5460207,-4.54603 -7.2383307,-10.81336 -2.69231,-6.26734 -2.69231,-13.15259 0,-6.88525 2.69231,-13.15259 2.69231,-6.26733 7.2383307,-10.81336 4.54603,-4.54603 10.81337,-7.23834 6.26734,-2.69231 13.15259,-2.69231 6.48801,0 12.55674,2.44956 6.06873,2.44956 10.7913,6.90732 l 5.73771,-5.69357 q 1.27994,-1.36822 3.08953,-0.61791 1.72131,0.75032 1.72131,2.60404 z"
     id="path3041"
     inkscape:connector-curvature="0"
     style="fill:#afc6e9;stroke:#d40000;stroke-width:3.5;stroke-dasharray:none"
     inkscape:export-filename="x.png"
     inkscape:export-xdpi="21.544834"
     inkscape:export-ydpi="21.544834" />
</svg>
