%YAML 1.1
%TAG !u! tag:unity3d.com,2011:
--- !u!114 &11400000
MonoBehaviour:
  m_ObjectHideFlags: 0
  m_CorrespondingSourceObject: {fileID: 0}
  m_PrefabInstance: {fileID: 0}
  m_PrefabAsset: {fileID: 0}
  m_GameObject: {fileID: 0}
  m_Enabled: 1
  m_EditorHideFlags: 0
  m_Script: {fileID: 11500000, guid: bbb281ee3bf0b054c82ac2347e9e782c, type: 3}
  m_Name: Vehicles
  m_EditorClassIdentifier: 
  m_GroupName: Vehicles
  m_Data:
    m_SerializedData: []
  m_GUID: f16306c84b44a534e97d0df69cc3d545
  m_SerializeEntries:
  - m_GUID: e09267554958fff408304b4a25fa3474
    m_Address: car_ncap
    m_ReadOnly: 0
    m_SerializedLabels:
    - Vehicle
  - m_GUID: eb6307319af8ba54b9855df4a3016792
    m_Address: pedestrian_adult_ncap
    m_ReadOnly: 0
    m_SerializedLabels:
    - Vehicle
  - m_GUID: 5bd9aa258e5fdc740ae31e45f47346ca
    m_Address: pedestrian_child_ncap
    m_ReadOnly: 0
    m_SerializedLabels:
    - Vehicle
  - m_GUID: 4a36b181c2088414880d1baec8465006
    m_Address: pedestrian_dummy
    m_ReadOnly: 0
    m_SerializedLabels:
    - Vehicle
  - m_GUID: 0485d8d0ce6f2c940bcd4dae9813e58b
    m_Address: bicycle_ncap
    m_ReadOnly: 0
    m_SerializedLabels:
    - Vehicle
  - m_GUID: 0d89c3b6d7f52514d9989680a44f9a14
    m_Address: perceived_vehicle
    m_ReadOnly: 0
    m_SerializedLabels:
    - Vehicle
  - m_GUID: 16b8de6ba79b1424a9a5b15b03f9fde9
    m_Address: truck_lorry
    m_ReadOnly: 0
    m_SerializedLabels:
    - Vehicle
  - m_GUID: e7a9bc92e1c68cc42af9fb8d156f88de
    m_Address: car_oldtimer
    m_ReadOnly: 0
    m_SerializedLabels:
    - Vehicle
  m_ReadOnly: 0
  m_Settings: {fileID: 11400000, guid: 6d36276be65f4d64ba4a13e235a40cbc, type: 2}
  m_SchemaSet:
    m_Schemas:
    - {fileID: 11400000, guid: 2b556de387cbb664391cfd30137b95a0, type: 2}
    - {fileID: 11400000, guid: 92fe7ebaf3ca9d6439a16602966b5075, type: 2}
