@startuml Logging
set namespaceSeparator ::

enum mantle_api::LogLevel {
  kTrace
  kDebug
  kInfo
  kWarning
  kError
  kCritical
}

interface mantle_api::ILogger {
  + {abstract} LogLevel GetCurrentLogLevel() const
  + {abstract} void Log(LogLevel level, std::string_view message)
  ..
  + void Trace(std::string_view message)
  + void Debug(std::string_view message)
  + void Info(std::string_view message)
  + void Warning(std::string_view message)
  + void Error(std::string_view message)
  + void Critical(std::string_view message)
}

package Environment <<Frame>> #LightCyan {

class EnvironmentImpl {
  - mantle_api::ILogger logger_
}

}

package Scenario <<Frame>> #LightGreen {

class ScenarioEngineImpl {
  - mantle_api::ILogger logger_
}

}

package Simulator <<Frame>> #LightCoral {

class LoggerImpl implements mantle_api::ILogger {
  + mantle_api::LogLevel GetCurrentLogLevel() const
  + void Log(mantle_api::LogLevel level, std::string_view message)
}

class SimulatorImpl {
  - mantle_api::ILogger logger_
}

}

mantle_api::ILogger .right. mantle_api::LogLevel
EnvironmentImpl o-- mantle_api::ILogger
ScenarioEngineImpl o-- mantle_api::ILogger
SimulatorImpl *-- mantle_api::ILogger

@enduml
