<?xml version="1.0" encoding="UTF-8" standalone="no"?>
<svg
   xmlns:dc="http://purl.org/dc/elements/1.1/"
   xmlns:cc="http://creativecommons.org/ns#"
   xmlns:rdf="http://www.w3.org/1999/02/22-rdf-syntax-ns#"
   xmlns:svg="http://www.w3.org/2000/svg"
   xmlns="http://www.w3.org/2000/svg"
   id="svg8"
   version="1.1"
   viewBox="0 0 10 10"
   height="10mm"
   width="10mm">
  <defs
     id="defs2" />
  <metadata
     id="metadata5">
    <rdf:RDF>
      <cc:Work
         rdf:about="">
        <dc:format>image/svg+xml</dc:format>
        <dc:type
           rdf:resource="http://purl.org/dc/dcmitype/StillImage" />
        <dc:title></dc:title>
      </cc:Work>
    </rdf:RDF>
  </metadata>
  <g
     transform="translate(0,-287)"
     id="layer1">
    <g
       transform="translate(-19.82831,259.35891)"
       id="g4533">
      <g
         id="g4527">
        <circle
           r="5"
           style="fill:#0080c0;fill-opacity:1;stroke-width:0.26458332"
           cy="32.641087"
           cx="24.82831"
           id="path3713" />
      </g>
      <text
         xml:space="preserve"
         style="font-style:normal;font-weight:normal;font-size:10.58333302px;line-height:1.25;font-family:sans-serif;letter-spacing:0px;word-spacing:0px;fill:#ffffff;fill-opacity:1;stroke:none;stroke-width:0.26458332"
         x="22.631325"
         y="35.5704"
         id="text4522"><tspan
           id="tspan4520"
           x="22.631325"
           y="35.5704"
           style="font-size:8.46666622px;fill:#ffffff;fill-opacity:1;stroke-width:0.26458332">?</tspan></text>
    </g>
  </g>
</svg>
