SDO_X1;SDO_Y1;G3E_FID;PLZ;ORT;ORTSTEIL;STRASSE;HAUS_NR;GRUPPE;;;;;;;;
472794,384;5549942,184;11432010;77777;Testort3;Testortsteil3;Gräfenhäuser Str.;87;ND Zone (AN);;;;;;;;
472794,434;5542317,784;11415317;66666;Testort3;Testortsteil4;Am Lämmchesberg;4;ND Zone (AN);;;;;;;;
472794,574;5545673,824;11419604;33333;Testort3;Testortsteil3;Am Kaiserschlag;116;ND Zone (AN);;;;;;;;
472794,634;5556970,884;11445341;44444;Testort4;Testortsteil1;Goethestr.;47;reduz. ND Zone (AN);;;;;;;;
472794,724;5557445,174;11438903;44444;Testort4;Testortsteil1;Brühlstr.;1;reduz. ND Zone (AN);;;;;;;;
472795,144;5557292,584;11438159;44444;Testort4;Testortsteil1;Bahnstr.;7;reduz. ND Zone (AN);;;;;;;;
472795,454;5542028,254;11415072;66666;Testort3;Testortsteil4;Pfungstädter Str.;88;ND Zone (AN);;;;;;;;
472795,584;5547204,994;11421638;33333;Testort3;Testortsteil3;Philipp-Röth-Weg;44;ND Zone (AN);;;;;;;;
472795,794;5555799,734;11445135;55555;Testort3;Testortsteil5;Am Hessenwald;1;ND Zone (AN);;;;;;;;
472795,894;5547204,154;11421637;33333;Testort3;Testortsteil3;Philipp-Röth-Weg;46;ND Zone (AN);;;;;;;;
472794,994;5557538,784;11438958;44444;Testort4;Testortsteil1;Egelsbacher Str.;13;reduz. ND Zone (AN);;;;;;;;
472796,184;5557618,944;86949216;44444;Testort4;Testortsteil1;Egelsbacher Str.;22;reduz. ND Zone (AN);;;;;;;;
472796,204;5542245,374;11415258;66666;Testort3;Testortsteil4;Von-der-Au-Str.;5;ND Zone (AN);;;;;;;;
472796,274;5557706,704;94693385;44444;Testort4;Testortsteil1;In den Leimenäckern;38;reduz. ND Zone (AN);;;;;;;;
472796,504;5545925,484;11419687;33333;Testort3;Testortsteil3;Am Pelz;77a;ND Zone (AN);;;;;;;;
472796,864;5545799,614;11419627;33333;Testort3;Testortsteil3;Fröbaweg;3;ND Zone (AN);;;;;;;;
