[
  {
    "name": "Betriebstagebuch local 4200",
    "cols": 1,
    "rows": 1,
    "color": "#ffffff",
    "link": "http://localhost:4200/",
    "pictureLink": "https://www.openkonsequenz.de/medien/cache/main_image/m_logbuch_2443636.jpg",
    "requiredRole": "elogbook-access"

  },
  {
    "name": "Betriebstagebuch local 8080",
    "cols": 1,
    "rows": 1,
    "color": "#ffffff",
    "link": "http://localhost:8080/elogbookFE",
    "pictureLink": "https://www.openkonsequenz.de/medien/cache/main_image/m_logbuch_2443636.jpg",
    "requiredRole": "elogbook-access"

  },
  {
    "name": "Bereitschaftsplanung",
    "cols": 1,
    "rows": 1,
    "color": "#ffffff",
    "link": "https://www.openkonsequenz.de/anwender/11-geplante-projekte/94-bereitschaftsplan",
    "pictureLink": "https://www.openkonsequenz.de/medien/cache/main_image/l_bereitschaftsplan_57882047.jpg",
    "requiredRole": "planning-access"
  },
  {
    "name": "Einspeisemanagement",
    "cols": 1,
    "rows": 1,
    "color": "#ffffff",
    "link": "https://www.openkonsequenz.de/anwender/11-geplante-projekte/20-eisman",
    "pictureLink": "https://www.openkonsequenz.de/medien/cache/main_image/l_ok_module6.jpg",
    "requiredRole": "feedin-management-access"
  },
  {
    "name": "Geplante Maßnahmen",
    "cols": 1,
    "rows": 1,
    "color": "#ffffff",
    "link": "http://localhost:4220/",
    "pictureLink": "https://www.openkonsequenz.de//components/com_flexicontent/librairies/phpthumb/phpThumb.php?src=/medien/cache/main_image/l_ok_module5.jpg",
    "requiredRole": "planned-policies-access"
  },
  {
    "name": "Kontaktstammdaten",
    "cols": 1,
    "rows": 1,
    "color": "#ffffff",
    "link": "http://entdockergss:4222",
    "pictureLink": "assets/img/kontaktstammdaten_kachel.jpg",
    "requiredRole": "kon-access"
  },
  {
    "name": "Kontaktstammdaten local 8080",
    "cols": 1,
    "rows": 1,
    "color": "#ffffff",
    "link": "http://localhost:8080/contactdatabase",
    "pictureLink": "assets/img/kontaktstammdaten_kachel.jpg",
    "requiredRole": "kon-access"
  },
  {
    "name": "Kontaktstammdaten local 4200",
    "cols": 1,
    "rows": 1,
    "color": "#ffffff",
    "link": "http://localhost:4200",
    "pictureLink": "assets/img/kontaktstammdaten_kachel.jpg",
    "requiredRole": "kon-access"
  }
]
