{
  "realm": "elogbook",
  "auth-server-url": "http://entjava002:8080/auth",
  "ssl-required": "external",
  "resource": "elogbook-backend",
  "public-client": true,
  "enable-cors": true,
  "use-resource-role-mappings": true
}