[
  {
    "name": "Betriebstagebuch",
    "cols": 1,
    "rows": 1,
    "color": "#ffffff",
    "link": "http://entdockergss:8085/elogbookFE",
    "pictureLink": "https://www.openkonsequenz.de/medien/cache/main_image/m_logbuch_2443636.jpg",
    "requiredRole": "elogbook-access"

  },
  {
    "name": "Betriebstagebuch (Web)",
    "cols": 1,
    "rows": 1,
    "color": "#ffffff",
    "link": "http://87.128.212.254:8880/elogbookFE",
    "pictureLink": "https://www.openkonsequenz.de/medien/cache/main_image/m_logbuch_2443636.jpg",
    "requiredRole": "elogbook-access"

  },  
  {
    "name": "Bereitschaftsplanung",
    "cols": 1,
    "rows": 1,
    "color": "#ffffff",
    "link": "plannedGridMeasures",
    "pictureLink": "https://www.openkonsequenz.de/medien/cache/main_image/l_bereitschaftsplan_57882047.jpg",
    "requiredRole": "planning-access"
  },
  {
    "name": "Einspeisemanagement",
    "cols": 1,
    "rows": 1,
    "color": "#ffffff",
    "link": "https://www.openkonsequenz.de/anwender/11-geplante-projekte/20-eisman",
    "pictureLink": "https://www.openkonsequenz.de/medien/cache/main_image/l_ok_module6.jpg",
    "requiredRole": "feedin-management-access"
  },
  {
    "name": "Geplante Maßnahmen",
    "cols": 1,
    "rows": 1,
    "color": "#ffffff",
    "link": "http://172.18.22.160:8880/plannedGridMeasures",
    "pictureLink": "https://www.openkonsequenz.de//components/com_flexicontent/librairies/phpthumb/phpThumb.php?src=/medien/cache/main_image/l_ok_module5.jpg",
    "requiredRole": "planned-policies-access"
  },
  {
    "name": "Geplante Maßnahmen (Web)",
    "cols": 1,
    "rows": 1,
    "color": "#ffffff",
    "link": "http://87.128.212.254:8880/plannedGridMeasures",
    "pictureLink": "https://www.openkonsequenz.de//components/com_flexicontent/librairies/phpthumb/phpThumb.php?src=/medien/cache/main_image/l_ok_module5.jpg",
    "requiredRole": "planned-policies-access"
  },
  {
    "name": "Kontaktstammdaten",
    "cols": 1,
    "rows": 1,
    "color": "#ffffff",
    "link": "http://entdockergss:4222",
    "pictureLink": "assets/img/kontaktstammdaten_kachel.jpg",
    "requiredRole": "kon-access"
  },
  {
    "name": "Kontaktstammdaten Feature Branch",
    "cols": 1,
    "rows": 1,
    "color": "#ffffff",
    "link": "http://entdockergss:4224",
    "pictureLink": "assets/img/kontaktstammdaten_kachel.jpg",
    "requiredRole": "kon-access"
  },
  {
    "name": "SIT DEV",
    "cols": 1,
    "rows": 1,
    "color": "#ffffff",
    "link": "http://entdockergss:4223",
    "pictureLink": "assets/img/stoerungsinformation_kachel.jpg",
    "requiredRole": "grid-failure-access"
  },
  {
    "name": "SIT Feature Branch - A",
    "cols": 1,
    "rows": 1,
    "color": "#ffffff",
    "link": "http://entdockergss:4225",
    "pictureLink": "assets/img/stoerungsinformation_kachel.jpg",
    "requiredRole": "grid-failure-access"
  },
  {
    "name": "SIT Feature Branch - B",
    "cols": 1,
    "rows": 1,
    "color": "#ffffff",
    "link": "http://entdockergss:4229",
    "pictureLink": "assets/img/stoerungsinformation_kachel.jpg",
    "requiredRole": "grid-failure-access"
  },
  {
    "name": "SIT Feature Backend",
    "cols": 1,
    "rows": 1,
    "color": "#ffffff",
    "link": "http://entdockergss:4226",
    "pictureLink": "assets/img/stoerungsinformation_kachel.jpg",
    "requiredRole": "grid-failure-access"
  },
  {
    "name": "SIT Localhost",
    "cols": 1,
    "rows": 1,
    "color": "#ffffff",
    "link": "http://localhost:4200",
    "pictureLink": "assets/img/stoerungsinformation_kachel.jpg",
    "requiredRole": "grid-failure-access"
  }
]
