"pfile_fk","array_agg","rf_shortname","upload_fk","upload_filename"
"53080","{""2021-03-20 16:32:05.81736+00""}","MIT","40","xkeyboard-config?ver=2.28-r0"
"53080","{""2021-03-20 16:32:05.816636+00""}","scancode-public-domain","40","xkeyboard-config?ver=2.28-r0"
"53080","{""2021-03-18 23:52:53.6188+00""}","scancode-public-domain","44","wayland?ver=1.18.0-r0"
"53080","{""2021-03-18 23:52:53.619469+00""}","X11","44","wayland?ver=1.18.0-r0"
"53080","{""2021-03-19 00:05:19.096067+00""}","scancode-public-domain","46","util-linux?ver=2.35.1-r0"
"53080","{""2021-03-19 00:05:19.096736+00""}","X11","46","util-linux?ver=2.35.1-r0"
"53080","{""2021-03-19 00:21:59.319541+00""}","scancode-public-domain","51","shadow?ver=4.8.1-r0"
"53080","{""2021-03-19 00:21:59.320215+00""}","X11","51","shadow?ver=4.8.1-r0"
"53080","{""2021-03-19 00:44:43.121556+00""}","scancode-public-domain","57","python3?ver=3.8.2-r0"
"53080","{""2021-03-19 00:44:43.122335+00""}","X11","57","python3?ver=3.8.2-r0"
"53080","{""2021-03-20 17:22:34.52098+00""}","MIT","60","pixman?ver=0.38.4-r0"
"53080","{""2021-03-20 17:22:34.520299+00""}","scancode-public-domain","60","pixman?ver=0.38.4-r0"
"53080","{""2021-03-19 01:37:41.58946+00""}","scancode-public-domain","70","nfs-utils?ver=2.4.3-r0"
"53080","{""2021-03-19 01:37:41.590151+00""}","X11","70","nfs-utils?ver=2.4.3-r0"
"53080","{""2021-03-19 02:25:33.119084+00""}","scancode-public-domain","79","libxml2?ver=2.9.10-r0"
"53080","{""2021-03-19 02:25:33.119779+00""}","X11","79","libxml2?ver=2.9.10-r0"
"53080","{""2021-03-20 17:06:13.285252+00""}","MIT","81","libx11-compose-data?ver=1.6.8-r0"
"53080","{""2021-03-20 17:06:13.284565+00""}","scancode-public-domain","81","libx11-compose-data?ver=1.6.8-r0"
"53080","{""2021-03-19 02:46:49.111935+00""}","scancode-public-domain","84","libtirpc?ver=1.2.6-r0"
"53080","{""2021-03-19 02:46:49.112653+00""}","X11","84","libtirpc?ver=1.2.6-r0"
"53080","{""2021-03-19 02:54:53.181336+00""}","scancode-public-domain","87","libpng?ver=1.6.37-r0"
"53080","{""2021-03-19 02:54:53.182067+00""}","X11","87","libpng?ver=1.6.37-r0"
"53080","{""2021-03-19 02:57:55.853008+00""}","scancode-public-domain","88","libpcre?ver=8.44-r0"
"53080","{""2021-03-19 02:57:55.853683+00""}","X11","88","libpcre?ver=8.44-r0"
"53080","{""2021-03-20 17:04:23.414399+00""}","MIT","89","libpciaccess?ver=0.16-r0"
"53080","{""2021-03-20 17:04:23.413721+00""}","scancode-public-domain","89","libpciaccess?ver=0.16-r0"
"53080","{""2021-03-19 03:05:48.084206+00""}","scancode-public-domain","91","libnl?ver=3.5.0-r0"
"53080","{""2021-03-19 03:05:48.084903+00""}","X11","91","libnl?ver=3.5.0-r0"
"53080","{""2021-03-27 18:20:03.451047+00"",""2021-03-27 18:20:03.451845+00""}","GPL-3.0-or-later","97","libidn2?ver=2.3.0-r0"
"53080","{""2021-03-19 03:22:09.812794+00""}","scancode-public-domain","97","libidn2?ver=2.3.0-r0"
"53080","{""2021-03-19 03:22:09.813517+00""}","X11","97","libidn2?ver=2.3.0-r0"
"53080","{""2021-03-19 03:32:09.918144+00""}","scancode-public-domain","100","libffi?ver=3.3-r0"
"53080","{""2021-03-19 03:32:09.91885+00""}","X11","100","libffi?ver=3.3-r0"
"53080","{""2021-03-19 03:34:52.3662+00""}","scancode-public-domain","101","libevdev?ver=1.8.0-r0"
"53080","{""2021-03-19 03:34:52.366914+00"",""2021-03-27 18:15:40.691618+00"",""2021-03-27 18:15:40.690898+00""}","X11","101","libevdev?ver=1.8.0-r0"
"53080","{""2021-03-19 04:04:09.267232+00""}","scancode-public-domain","112","kbd?ver=2.2.0-r0"
"53080","{""2021-03-19 04:04:09.267938+00""}","X11","112","kbd?ver=2.2.0-r0"
"53080","{""2021-03-27 18:09:58.002307+00"",""2021-03-27 18:09:58.00321+00""}","MIT","119","harfbuzz?ver=2.6.4-r0"
"53080","{""2021-03-19 04:23:57.716285+00""}","scancode-public-domain","119","harfbuzz?ver=2.6.4-r0"
"53080","{""2021-03-19 04:23:57.71696+00""}","X11","119","harfbuzz?ver=2.6.4-r0"
"53080","{""2021-03-20 17:03:04.221269+00""}","MIT","120","gtk+3?ver=3.24.14-r0"
"53080","{""2021-03-20 17:03:04.220594+00""}","scancode-public-domain","120","gtk+3?ver=3.24.14-r0"
"53080","{""2021-03-27 18:03:43.258311+00"",""2021-03-27 18:03:43.259048+00""}","LGPL-2.1-or-later","128","fribidi?ver=1.0.9-r0"
"53080","{""2021-03-19 05:40:28.106473+00""}","scancode-public-domain","128","fribidi?ver=1.0.9-r0"
"53080","{""2021-03-19 05:40:28.107198+00""}","X11","128","fribidi?ver=1.0.9-r0"
"53080","{""2021-03-19 05:50:44.7118+00""}","scancode-public-domain","130","fontconfig?ver=2.13.1-r0"
"53080","{""2021-03-19 05:50:44.712481+00""}","X11","130","fontconfig?ver=2.13.1-r0"
"53080","{""2021-03-19 05:56:09.143342+00""}","scancode-public-domain","132","expat?ver=2.2.9-r0"
"53080","{""2021-03-19 05:56:09.144059+00""}","X11","132","expat?ver=2.2.9-r0"
"53080","{""2021-03-19 06:02:21.361903+00""}","scancode-public-domain","133","elfutils?ver=0.178-r0"
"53080","{""2021-03-19 06:02:21.362664+00""}","X11","133","elfutils?ver=0.178-r0"
"53080","{""2021-03-27 18:01:02.947819+00"",""2021-03-27 18:01:02.949198+00""}","AFL-2.1","140","dbus?ver=1.12.16-r0"
"53080","{""2021-03-27 18:01:02.948511+00""}","Dual-license","140","dbus?ver=1.12.16-r0"
"53080","{""2021-03-27 18:01:02.94989+00"",""2021-03-27 18:01:02.947052+00""}","GPL-2.0-or-later","140","dbus?ver=1.12.16-r0"
"53080","{""2021-03-19 06:31:21.229+00""}","scancode-public-domain","140","dbus?ver=1.12.16-r0"
"53080","{""2021-03-19 06:31:21.229726+00""}","X11","140","dbus?ver=1.12.16-r0"
"53080","{""2021-03-27 17:59:52.881161+00"",""2021-03-27 17:59:52.880397+00""}","curl","142","curl?ver=7.69.1-r0"
"53080","{""2021-03-19 06:59:02.499796+00""}","scancode-public-domain","142","curl?ver=7.69.1-r0"
"53080","{""2021-03-19 06:59:02.500503+00""}","X11","142","curl?ver=7.69.1-r0"
"53080","{""2021-03-19 07:33:10.273588+00""}","scancode-public-domain","149","bluez5?ver=5.55-r0"
"53080","{""2021-03-19 07:33:10.274277+00""}","X11","149","bluez5?ver=5.55-r0"
"53080","{""2021-03-27 17:55:15.418962+00"",""2021-03-27 17:55:15.418232+00""}","GPL-2.0-only","156","alsa-utils?ver=1.2.1-r0"
"53080","{""2021-03-19 08:01:00.6086+00""}","scancode-public-domain","156","alsa-utils?ver=1.2.1-r0"
"53080","{""2021-03-19 08:01:00.609307+00""}","X11","156","alsa-utils?ver=1.2.1-r0"
"53080","{""2021-03-27 17:54:58.47648+00"",""2021-03-27 17:54:58.475738+00""}","LPGL-2.1-or-later","158","alsa-lib?ver=1.2.1.2-r0"
"53080","{""2021-03-19 08:05:42.750721+00""}","scancode-public-domain","158","alsa-lib?ver=1.2.1.2-r0"
"53080","{""2021-03-19 08:05:42.751359+00""}","X11","158","alsa-lib?ver=1.2.1.2-r0"
"53080","{""2021-03-19 08:12:44.162927+00""}","scancode-public-domain","159","adwaita-icon-theme?ver=3.34.3-r0"
"53080","{""2021-03-19 08:12:44.163584+00""}","X11","159","adwaita-icon-theme?ver=3.34.3-r0"
"53080","{""2021-03-30 03:04:40.894205+00"",""2021-03-30 03:04:40.894969+00""}","LPGL-2.1-or-later","220","alsa-lib-1.2.1.2-r0"
"53080","{""2021-03-30 03:08:35.890926+00"",""2021-03-30 03:08:35.890213+00""}","GPL-2.0-only","222","alsa-utils-1.2.1-r0"
"53080","{""2021-03-30 05:27:13.823869+00"",""2021-03-30 05:27:13.823075+00""}","ISC","242","cronie-1.5.5-r0"
"53080","{""2021-03-30 05:29:23.312775+00"",""2021-03-30 05:29:23.313462+00""}","curl","243","curl-7.69.1-r0"
"53080","{""2021-03-30 05:35:25.2523+00"",""2021-03-30 05:35:25.25373+00""}","AFL-2.1","245","dbus-1.12.16-r0"
"53080","{""2021-03-30 05:35:25.253027+00""}","Dual-license","245","dbus-1.12.16-r0"
"53080","{""2021-03-30 05:35:25.251558+00"",""2021-03-30 05:35:25.254402+00""}","GPL-2.0-or-later","245","dbus-1.12.16-r0"
"53080","{""2021-03-30 06:00:52.657381+00""}","scancode-public-domain","253","elfutils-0.178-r0"
"53080","{""2021-03-30 06:00:52.656519+00""}","X11","253","elfutils-0.178-r0"
"53080","{""2021-03-30 06:02:55.840966+00""}","scancode-public-domain","254","expat-2.2.9-r0"
"53080","{""2021-03-30 06:02:55.840291+00""}","X11","254","expat-2.2.9-r0"
"53080","{""2021-03-30 06:08:49.642089+00""}","scancode-public-domain","257","fontconfig-2.13.1-r0"
"53080","{""2021-03-30 06:08:49.641342+00""}","X11","257","fontconfig-2.13.1-r0"
"53080","{""2021-04-05 09:21:09.255386+00""}","scancode-public-domain","291","xserver-xorg@1.20.8-r0-535409c0"
"53080","{""2021-04-05 09:21:09.254676+00""}","X11","291","xserver-xorg@1.20.8-r0-535409c0"
"53080","{""2021-04-05 09:25:19.771428+00""}","scancode-public-domain","293","libxcb@1.13.1-r0-11760577"
"53080","{""2021-04-05 09:25:19.770696+00""}","X11","293","libxcb@1.13.1-r0-11760577"
"53080","{""2021-04-05 09:29:44.431899+00""}","scancode-public-domain","295","adwaita-icon-theme@3.34.3-r0-348fdd10"
"53080","{""2021-04-05 09:29:44.431196+00""}","X11","295","adwaita-icon-theme@3.34.3-r0-348fdd10"
"53080","{""2021-04-05 09:45:46.560258+00""}","scancode-public-domain","299","elfutils@0.178-r0-34724cbc"
"53080","{""2021-04-05 09:45:46.559515+00""}","X11","299","elfutils@0.178-r0-34724cbc"
"53080","{""2021-04-05 09:51:50.279912+00"",""2021-04-05 09:51:50.280604+00""}","curl","302","curl@7.69.1-r0-5a80bbfd"
"53080","{""2021-04-05 09:54:06.936677+00""}","scancode-public-domain","303","libx11@1.6.9-r0-752e5822"
"53080","{""2021-04-05 09:54:06.935978+00""}","X11","303","libx11@1.6.9-r0-752e5822"
"53080","{""2021-04-05 09:58:00.46796+00""}","scancode-public-domain","305","expat@2.2.9-r0-ab4a1677"
"53080","{""2021-04-05 09:58:00.467254+00""}","X11","305","expat@2.2.9-r0-ab4a1677"
"53080","{""2021-04-05 10:03:52.57577+00""}","scancode-public-domain","308","libffi@3.3-r0-aba988d5"
"53080","{""2021-04-05 10:03:52.574985+00""}","X11","308","libffi@3.3-r0-aba988d5"
"53080","{""2021-04-05 13:29:23.837406+00""}","scancode-public-domain","335","libpciaccess@0.16-r0-5b284561"
"53080","{""2021-04-05 13:29:23.836541+00""}","X11","335","libpciaccess@0.16-r0-5b284561"
"53080","{""2021-04-05 14:24:51.950293+00"",""2021-04-05 14:24:51.951354+00""}","GPL-3.0-or-later","339","libidn2@2.3.0-r0-7ef87e61"
"53080","{""2021-04-05 16:19:45.788341+00"",""2021-04-05 16:19:45.789035+00""}","GPL-2.0-only","347","alsa-utils@1.2.1-r0-ad72568e"
"53080","{""2021-04-05 16:26:00.084722+00""}","scancode-public-domain","349","libnl@3.5.0-r0-dd4dab1b"
"53080","{""2021-04-05 16:26:00.083998+00""}","X11","349","libnl@3.5.0-r0-dd4dab1b"
"53080","{""2021-04-05 16:32:10.075684+00"",""2021-04-05 16:32:10.074816+00""}","GPL-2.0-only","352","logrotate@3.15.1-r0-a6faf6ab"
"53080","{""2021-04-05 17:22:52.46465+00"",""2021-04-05 17:22:52.463957+00""}","LGPL-2.1-or-later","363","fribidi@1.0.9-r0-828407f1"
"53080","{""2021-04-05 17:39:06.451282+00""}","scancode-public-domain","368","python3@3.8.2-r0-99e0da82"
"53080","{""2021-04-05 17:39:06.450504+00""}","X11","368","python3@3.8.2-r0-99e0da82"
"53080","{""2021-04-05 17:44:04.083238+00""}","scancode-public-domain","370","libpng@1.6.37-r0-55ae605d"
"53080","{""2021-04-05 17:44:04.082485+00""}","X11","370","libpng@1.6.37-r0-55ae605d"
"53080","{""2021-04-05 18:34:15.649615+00""}","scancode-public-domain","381","nfs-utils@2.4.3-r0-7b92bd83"
"53080","{""2021-04-05 18:34:15.64892+00""}","X11","381","nfs-utils@2.4.3-r0-7b92bd83"
"53080","{""2021-04-05 18:55:00.511837+00"",""2021-04-05 18:55:00.512615+00""}","GPL-2.0-or-later","388","util-linux@2.35.1-r0-daca375c"
"53080","{""2021-04-05 19:08:03.141316+00""}","scancode-public-domain","391","coreutils@8.31-r0-6efab1e2"
"53080","{""2021-04-05 19:08:03.140616+00""}","X11","391","coreutils@8.31-r0-6efab1e2"
"53080","{""2021-04-05 19:10:00.900281+00""}","scancode-public-domain","392","libpcre@8.44-r0-6f031818"
"53080","{""2021-04-05 19:10:00.899578+00""}","X11","392","libpcre@8.44-r0-6f031818"
"53080","{""2021-04-05 19:30:48.398604+00""}","scancode-public-domain","395","pixman@0.38.4-r0-3ac2db01"
"53080","{""2021-04-05 19:30:48.397822+00""}","X11","395","pixman@0.38.4-r0-3ac2db01"
"53080","{""2021-04-05 19:59:53.438921+00""}","scancode-public-domain","405","shadow@4.8.1-r0-5f9257ff"
"53080","{""2021-04-05 19:59:53.438188+00""}","X11","405","shadow@4.8.1-r0-5f9257ff"
"53080","{""2021-04-05 20:08:28.126425+00"",""2021-04-05 20:08:28.127309+00""}","MIT-1","406","libxml2@2.9.10-r0-7deadce9"
"53080","{""2021-04-05 23:40:19.522911+00""}","scancode-public-domain","423","xf86-input-libinput@0.29.0-r0-a4548f3b"
"53080","{""2021-04-05 23:40:19.522128+00""}","X11","423","xf86-input-libinput@0.29.0-r0-a4548f3b"
"53080","{""2021-04-05 23:54:54.361654+00""}","scancode-public-domain","430","libxi@1.7.10-r0-d56a149f"
"53080","{""2021-04-05 23:54:54.360899+00""}","X11","430","libxi@1.7.10-r0-d56a149f"
"53080","{""2021-04-06 00:10:28.30862+00""}","scancode-public-domain","433","wayland@1.18.0-r0-541fdab1"
"53080","{""2021-04-06 00:10:28.307745+00""}","X11","433","wayland@1.18.0-r0-541fdab1"
"53080","{""2021-04-06 00:20:29.201199+00"",""2021-04-06 00:20:29.200478+00""}","LPGL-2.1-or-later","435","alsa-lib@1.2.1.2-r0-6e6c86f4"
"53080","{""2021-04-06 00:26:45.428851+00""}","scancode-public-domain","438","kbd@2.2.0-r0-0de842bd"
"53080","{""2021-04-06 00:26:45.428109+00""}","X11","438","kbd@2.2.0-r0-0de842bd"
"53080","{""2021-04-06 00:38:57.077469+00""}","scancode-public-domain","444","fontconfig@2.13.1-r0-69cbef37"
"53080","{""2021-04-06 00:38:57.076756+00""}","X11","444","fontconfig@2.13.1-r0-69cbef37"
"53080","{""2021-04-06 00:48:41.399324+00""}","scancode-public-domain","449","libtirpc@1.2.6-r0-16e41b6a"
"53080","{""2021-04-06 00:48:41.398598+00""}","X11","449","libtirpc@1.2.6-r0-16e41b6a"
"53080","{""2021-04-06 00:50:37.372246+00"",""2021-04-06 00:50:37.37147+00""}","ISC","450","cronie@1.5.5-r0-0c105cd2"
"53080","{""2021-04-06 00:52:44.005601+00""}","scancode-public-domain","451","libcap-ng@0.7.10-r0-823656e0"
"53080","{""2021-04-06 00:52:44.004899+00""}","X11","451","libcap-ng@0.7.10-r0-823656e0"
"53080","{""2021-04-06 00:56:12.244624+00"",""2021-04-06 00:56:12.24377+00""}","GPL-3.0-or-later","452","gzip@1.10-r0-2a5a7763"
"53080","{""2021-04-06 01:18:15.867861+00"",""2021-04-06 01:18:15.868745+00""}","LGPL-2.0-or-later","453","gtk+3@3.24.14-r0-4c49a9aa"
"53080","{""2021-04-06 01:56:45.853414+00"",""2021-04-06 01:56:45.854208+00""}","X11","460","libevdev@1.8.0-r0-60347c97"
"53080","{""2021-04-06 01:58:43.067517+00""}","scancode-public-domain","461","xkeyboard-config@2.28-r0-47692209"
"53080","{""2021-04-06 01:58:43.06682+00""}","X11","461","xkeyboard-config@2.28-r0-47692209"
"53080","{""2021-04-06 02:06:52.291669+00""}","scancode-public-domain","465","bluez5@5.55-r0-764e496b"
"53080","{""2021-04-06 02:06:52.29097+00""}","X11","465","bluez5@5.55-r0-764e496b"
"53080","{""2021-04-06 02:59:29.203791+00""}","scancode-public-domain","475","tar@1.32-r0-0a19b484"
"53080","{""2021-04-06 02:59:29.203044+00""}","X11","475","tar@1.32-r0-0a19b484"
"53080","{""2021-04-06 03:06:34.191135+00""}","scancode-public-domain","478","libpcre2@10.34-r0-322b89a6"
"53080","{""2021-04-06 03:06:34.190425+00""}","X11","478","libpcre2@10.34-r0-322b89a6"
"53080","{""2021-04-06 03:08:30.516819+00""}","scancode-public-domain","479","xkbcomp@1.4.3-r0-2b0ec7f2"
"53080","{""2021-04-06 03:08:30.516119+00""}","X11","479","xkbcomp@1.4.3-r0-2b0ec7f2"
"53080","{""2021-04-06 03:10:46.528863+00"",""2021-04-06 03:10:46.52817+00""}","MIT","480","harfbuzz@2.6.4-r0-ee6269a7"
"53080","{""2021-04-06 03:16:48.186978+00"",""2021-04-06 03:16:48.188342+00""}","AFL-2.1","483","dbus@1.12.16-r0-38a0da79"
"53080","{""2021-04-06 03:16:48.187684+00""}","Dual-license","483","dbus@1.12.16-r0-38a0da79"
"53080","{""2021-04-06 03:16:48.189004+00"",""2021-04-06 03:16:48.186238+00""}","GPL-2.0-or-later","483","dbus@1.12.16-r0-38a0da79"
"53080","{""2021-04-06 03:23:43.590669+00"",""2021-04-06 03:23:43.589763+00"",""2021-04-06 03:21:28.071313+00"",""2021-04-06 03:21:28.070422+00""}","GPL-3.0-or-later","484","gawk@5.0.1-r0-2be6e0f2"
"53080","{""2021-07-11 15:08:51.093267+00""}","scancode-public-domain","526","libpcre@8.44-r0-5135e3b4"
"53080","{""2021-07-11 15:08:51.092478+00""}","X11","526","libpcre@8.44-r0-5135e3b4"
"53080","{""2021-07-11 15:21:33.488882+00""}","scancode-public-domain","531","python3@3.8.2-r0-783eccc4"
"53080","{""2021-07-11 15:21:33.488182+00""}","X11","531","python3@3.8.2-r0-783eccc4"
"53080","{""2021-07-11 17:40:35.157246+00""}","scancode-public-domain","538","libevdev@1.8.0-r0-bb9b3265"
"53080","{""2021-07-11 17:40:35.156373+00"",""2021-07-11 17:40:35.158007+00""}","X11","538","libevdev@1.8.0-r0-bb9b3265"
"53080","{""2021-07-11 23:14:15.748597+00""}","LPGL-2.1-or-later","544","alsa-lib@1.2.1.2-r0-c619629c"
"53080","{""2021-07-11 23:14:15.747878+00""}","scancode-public-domain","544","alsa-lib@1.2.1.2-r0-c619629c"
"53080","{""2021-07-11 23:14:15.74702+00""}","X11","544","alsa-lib@1.2.1.2-r0-c619629c"
"53080","{""2021-07-11 23:50:16.870806+00""}","curl","553","curl@7.69.1-r0-5d67b352"
"53080","{""2021-07-11 23:50:16.87015+00""}","scancode-public-domain","553","curl@7.69.1-r0-5d67b352"
"53080","{""2021-07-11 23:50:16.869492+00""}","X11","553","curl@7.69.1-r0-5d67b352"
"53080","{""2021-07-12 00:35:38.805355+00""}","scancode-public-domain","560","bluez5@5.55-r0-72e49ea1"
"53080","{""2021-07-12 00:35:38.804621+00""}","X11","560","bluez5@5.55-r0-72e49ea1"
"53080","{""2021-07-12 10:11:44.951576+00""}","scancode-public-domain","568","libpcre@8.44-r0-5135e3b4"
"53080","{""2021-07-12 10:11:44.950766+00""}","X11","568","libpcre@8.44-r0-5135e3b4"
"53080","{""2021-07-12 10:39:18.614885+00""}","scancode-public-domain","574","python3@3.8.2-r0-783eccc4"
"53080","{""2021-07-12 10:39:18.614198+00""}","X11","574","python3@3.8.2-r0-783eccc4"
"53080","{""2021-07-13 02:59:57.155097+00""}","scancode-public-domain","585","libevdev@1.8.0-r0-bb9b3265"
"53080","{""2021-07-13 02:59:57.15442+00"",""2021-07-13 02:59:57.155788+00""}","X11","585","libevdev@1.8.0-r0-bb9b3265"
"53080","{""2021-07-13 04:32:48.377312+00""}","LPGL-2.1-or-later","593","alsa-lib@1.2.1.2-r0-c619629c"
"53080","{""2021-07-13 04:32:48.376656+00""}","scancode-public-domain","593","alsa-lib@1.2.1.2-r0-c619629c"
"53080","{""2021-07-13 04:32:48.375982+00""}","X11","593","alsa-lib@1.2.1.2-r0-c619629c"
"53080","{""2021-07-13 06:13:08.010017+00""}","curl","604","curl@7.69.1-r0-5d67b352"
"53080","{""2021-07-13 06:13:08.009365+00""}","scancode-public-domain","604","curl@7.69.1-r0-5d67b352"
"53080","{""2021-07-13 06:13:08.008692+00""}","X11","604","curl@7.69.1-r0-5d67b352"
"53080","{""2021-07-13 08:17:12.800169+00""}","scancode-public-domain","613","bluez5@5.55-r0-72e49ea1"
"53080","{""2021-07-13 08:17:12.799445+00""}","X11","613","bluez5@5.55-r0-72e49ea1"
