<?xml version="1.0" encoding="utf-8"?>
<!-- Generator: Adobe Illustrator 25.2.1, SVG Export Plug-In . SVG Version: 6.00 Build 0)  -->
<svg version="1.1" xmlns="http://www.w3.org/2000/svg" xmlns:xlink="http://www.w3.org/1999/xlink" x="0px" y="0px"
	 viewBox="0 0 118.38 118.38" style="enable-background:new 0 0 118.38 118.38;" xml:space="preserve">
<style type="text/css">
	.st0{fill:#38BBD9;}
	.st1{fill:#120F23;}
	.st2{fill:#D24893;}
	.st3{fill:#FFED51;}
	.st4{fill:#533B8E;}
	.st5{clip-path:url(#SVGID_2_);}
	.st6{fill:#9290A0;}
	.st7{opacity:0.24;fill:#FFFFFF;}
	.st8{clip-path:url(#SVGID_4_);}
	.st9{fill:#EDEDED;}
	.st10{opacity:0.39;clip-path:url(#SVGID_6_);fill:#120F23;}
	.st11{opacity:0.25;}
	.st12{clip-path:url(#SVGID_8_);}
	.st13{opacity:0.39;clip-path:url(#SVGID_10_);fill:#120F23;}
	.st14{fill:url(#SVGID_11_);}
	.st15{clip-path:url(#SVGID_13_);}
	.st16{clip-path:url(#SVGID_15_);}
	.st17{opacity:0.39;fill:#120F23;}
	.st18{clip-path:url(#SVGID_17_);}
	.st19{fill:url(#SVGID_18_);}
	.st20{clip-path:url(#SVGID_20_);}
	.st21{clip-path:url(#SVGID_22_);}
	.st22{opacity:0.35;fill:#FFFFFF;}
	.st23{fill:#65529E;}
	.st24{opacity:0.39;}
	.st25{opacity:0.35;}
	.st26{fill:#FFFFFF;}
	.st27{clip-path:url(#SVGID_24_);}
	.st28{fill:url(#SVGID_25_);}
	.st29{clip-path:url(#SVGID_27_);}
	.st30{clip-path:url(#SVGID_29_);}
	.st31{clip-path:url(#SVGID_31_);}
	.st32{fill:url(#SVGID_32_);}
	.st33{clip-path:url(#SVGID_34_);}
	.st34{opacity:0.39;clip-path:url(#SVGID_36_);fill:#120F23;}
	.st35{clip-path:url(#SVGID_38_);}
	.st36{opacity:0.39;clip-path:url(#SVGID_40_);fill:#120F23;}
	.st37{clip-path:url(#SVGID_42_);}
	.st38{clip-path:url(#SVGID_44_);}
	.st39{clip-path:url(#SVGID_44_);fill:#EDEDED;}
	.st40{clip-path:url(#SVGID_46_);}
	.st41{clip-path:url(#SVGID_46_);fill:#EDEDED;}
	.st42{clip-path:url(#SVGID_48_);}
	.st43{fill:#CC9B72;}
	.st44{opacity:0.15;fill:#FFFFFF;}
	.st45{opacity:0.05;fill:#FFFFFF;}
	.st46{opacity:0.3;fill:#120F23;}
	.st47{opacity:0.15;}
	.st48{clip-path:url(#SVGID_54_);}
	.st49{fill:#3A2872;}
	.st50{opacity:0.2;}
	.st51{clip-path:url(#SVGID_56_);}
	.st52{clip-path:url(#SVGID_58_);}
	.st53{fill:#AF7B54;}
	.st54{fill:#A52D74;}
	.st55{fill:#FFC952;}
	.st56{opacity:0.24;}
	.st57{clip-path:url(#SVGID_60_);}
	.st58{clip-path:url(#SVGID_62_);}
	.st59{clip-path:url(#SVGID_64_);}
	.st60{clip-path:url(#SVGID_66_);}
	.st61{fill:#A50F68;}
	.st62{clip-path:url(#SVGID_68_);}
	.st63{clip-path:url(#SVGID_70_);}
	.st64{fill:#D65BA4;}
	.st65{clip-path:url(#SVGID_72_);}
	.st66{fill:none;stroke:#533B8E;stroke-width:4;stroke-linecap:round;stroke-linejoin:round;stroke-miterlimit:10;}
	.st67{fill:none;stroke:#251751;stroke-width:4;stroke-linecap:round;stroke-linejoin:round;stroke-miterlimit:10;}
	.st68{clip-path:url(#SVGID_74_);}
	.st69{fill:none;stroke:#AF7B54;stroke-width:1.1467;stroke-linecap:round;stroke-miterlimit:10;}
	.st70{fill:#FFC552;}
	.st71{clip-path:url(#SVGID_76_);}
	.st72{clip-path:url(#SVGID_78_);}
	.st73{clip-path:url(#SVGID_80_);}
	.st74{opacity:0.39;clip-path:url(#SVGID_82_);fill:#120F23;}
	.st75{clip-path:url(#SVGID_84_);}
	.st76{opacity:0.39;clip-path:url(#SVGID_86_);fill:#120F23;}
	.st77{fill:url(#SVGID_87_);}
	.st78{clip-path:url(#SVGID_89_);}
	.st79{clip-path:url(#SVGID_91_);}
	.st80{clip-path:url(#SVGID_93_);}
	.st81{fill:url(#SVGID_94_);}
	.st82{clip-path:url(#SVGID_96_);}
	.st83{clip-path:url(#SVGID_98_);}
	.st84{clip-path:url(#SVGID_100_);}
	.st85{fill:url(#SVGID_101_);}
	.st86{clip-path:url(#SVGID_103_);}
	.st87{clip-path:url(#SVGID_105_);}
	.st88{clip-path:url(#SVGID_107_);}
	.st89{fill:url(#SVGID_108_);}
	.st90{clip-path:url(#SVGID_110_);}
	.st91{opacity:0.39;clip-path:url(#SVGID_112_);fill:#120F23;}
	.st92{clip-path:url(#SVGID_114_);}
	.st93{opacity:0.39;clip-path:url(#SVGID_116_);fill:#120F23;}
	.st94{clip-path:url(#SVGID_118_);}
	.st95{clip-path:url(#SVGID_120_);}
	.st96{clip-path:url(#SVGID_120_);fill:#EDEDED;}
	.st97{clip-path:url(#SVGID_122_);}
	.st98{clip-path:url(#SVGID_122_);fill:#EDEDED;}
	.st99{clip-path:url(#SVGID_124_);}
	.st100{opacity:0.4;fill:#F6F6F6;}
	.st101{opacity:0.49;fill:#FFFFFF;}
	.st102{opacity:0.1;fill:#120F23;}
	.st103{opacity:0.5;fill:#120F23;}
	.st104{clip-path:url(#SVGID_130_);}
	.st105{clip-path:url(#SVGID_132_);}
	.st106{clip-path:url(#SVGID_134_);}
	.st107{clip-path:url(#SVGID_136_);}
	.st108{clip-path:url(#SVGID_138_);}
	.st109{clip-path:url(#SVGID_140_);}
	.st110{clip-path:url(#SVGID_142_);}
	.st111{clip-path:url(#SVGID_144_);}
	.st112{clip-path:url(#SVGID_146_);}
	.st113{clip-path:url(#SVGID_148_);}
	.st114{fill:#251751;}
	.st115{clip-path:url(#SVGID_150_);}
	.st116{clip-path:url(#SVGID_152_);}
</style>
<g id="Bg">
</g>
<g id="Layer_1">
	<path class="st1" d="M95.67,118.38H22.71C10.17,118.38,0,108.21,0,95.67V22.71C0,10.17,10.17,0,22.71,0h72.95
		c12.54,0,22.71,10.17,22.71,22.71v72.95C118.38,108.21,108.21,118.38,95.67,118.38z"/>
	<g>
		<defs>
			<path id="SVGID_71_" d="M95.67,118.38H22.71C10.17,118.38,0,108.21,0,95.67V22.71C0,10.17,10.17,0,22.71,0h72.95
				c12.54,0,22.71,10.17,22.71,22.71v72.95C118.38,108.21,108.21,118.38,95.67,118.38z"/>
		</defs>
		<clipPath id="SVGID_2_">
			<use xlink:href="#SVGID_71_"  style="overflow:visible;"/>
		</clipPath>
		<g class="st5">
			<g>
				<path class="st0" d="M73.49,106.56H45.24c-2.77,0-5.02-2.25-5.02-5.02V48.66c0-2.77,2.25-5.02,5.02-5.02h28.25
					c2.77,0,5.02,2.25,5.02,5.02v52.88C78.5,104.31,76.26,106.56,73.49,106.56z"/>
				<path class="st3" d="M73.88,106.56H44.84c-2.55,0-4.62-2.07-4.62-4.62V57.78c0-2.55,2.07-4.62,4.62-4.62h29.04
					c2.55,0,4.62,2.07,4.62,4.62v44.16C78.5,104.49,76.43,106.56,73.88,106.56z"/>
				<g>
					<polyline class="st66" points="67.59,47.93 67.59,29.92 74.72,37.05 					"/>
					<line class="st67" x1="74.72" y1="37.05" x2="74.72" y2="37.05"/>
				</g>
				<g>
					<defs>
						<path id="SVGID_73_" d="M73.88,106.56H44.84c-2.55,0-4.62-2.07-4.62-4.62V57.78c0-2.55,2.07-4.62,4.62-4.62h29.04
							c2.55,0,4.62,2.07,4.62,4.62v44.16C78.5,104.49,76.43,106.56,73.88,106.56z"/>
					</defs>
					<clipPath id="SVGID_4_">
						<use xlink:href="#SVGID_73_"  style="overflow:visible;"/>
					</clipPath>
					<g class="st8">
						<path class="st0" d="M75.02,95.07c-7.6,0.88-13.09,7.64-12.47,15.21c9.24-0.86,17.4-5.41,23.01-12.15
							C82.7,95.82,78.96,94.61,75.02,95.07z"/>
						<path class="st1" d="M34.49,91.51c-0.56-4.77-4.23-8.42-8.75-9.16c1.06,5.92,3.64,11.32,7.33,15.76
							C34.22,96.19,34.77,93.9,34.49,91.51z"/>
						<path class="st2" d="M47.11,86.88l-11.48,13.98c4.85,4.68,11.09,7.94,18.03,9.1l8.68-10.58L47.11,86.88z"/>
						<path class="st2" d="M74.9,91.66l14.22,1.29c2.75-4.92,4.33-10.59,4.33-16.63c0-1.96-0.17-3.88-0.49-5.75l-16.01-1.45
							L74.9,91.66z"/>
						<path class="st2" d="M76.65,46.92c-4.34-2.56-9.29-4.19-14.58-4.61l1.51,7.31L76.65,46.92z"/>
						<path class="st1" d="M91.98,66.41c-1.42-4.69-3.83-8.95-6.97-12.55l-0.59,12.19L91.98,66.41z"/>
						<path class="st0" d="M52.81,61.25L41.48,47.22c-9.2,5.65-15.5,15.54-16.21,26.95l4.55,5.64L52.81,61.25z"/>
						
							<ellipse transform="matrix(0.3827 -0.9239 0.9239 0.3827 -33.8822 101.9196)" class="st4" cx="59.33" cy="76.31" rx="13.59" ry="13.59"/>
						
							<ellipse transform="matrix(0.8053 -0.5929 0.5929 0.8053 -19.8767 55.3098)" class="st4" cx="74.27" cy="57.92" rx="7.95" ry="7.95"/>
						<path class="st2" d="M49.25,51.55c-0.38-3.3,1.98-6.29,5.28-6.68c3.3-0.38,6.29,1.98,6.68,5.28s-1.98,6.29-5.28,6.68
							C52.63,57.22,49.64,54.85,49.25,51.55z"/>
						<path class="st4" d="M39.82,87.74c-2.5,0.29-4.77-1.5-5.06-4.01c-0.29-2.5,1.5-4.77,4.01-5.06s4.77,1.5,5.06,4.01
							C44.12,85.18,42.32,87.44,39.82,87.74z"/>
					</g>
				</g>
				<g>
					<path class="st3" d="M63.09,73.62c0.03-0.18,0.05-0.36,0.06-0.54c0.08-2.09-1.65-3.92-3.75-3.94
						c-2.12-0.02-3.84,1.68-3.84,3.79c0,0.25,0.02,0.5,0.07,0.73c0.17,0.88-0.14,1.77-0.67,2.48c-0.83,1.1-1.26,2.52-1.06,4.04
						c0.32,2.47,2.34,4.46,4.82,4.73c3.33,0.37,6.14-2.22,6.14-5.47c0-1.25-0.42-2.41-1.13-3.33C63.19,75.4,62.93,74.51,63.09,73.62
						z"/>
					<line class="st69" x1="59.36" y1="69.89" x2="59.36" y2="67.19"/>
					<path class="st0" d="M62.54,68.11c-1.16,0.97-2.65,0.65-2.65,0.65s0.1-1.64,1.12-2.49c1.12-0.93,2.65-0.65,2.65-0.65
						S63.63,67.2,62.54,68.11z"/>
				</g>
				<g class="st11">
					<path class="st26" d="M52.19,53.15h-7.35c-2.55,0-4.62,2.07-4.62,4.62v7.35L52.19,53.15z"/>
					<path class="st26" d="M40.22,99.76L78.5,61.48v-3.7c0-2.55-2.07-4.62-4.62-4.62h-4.91L40.22,81.9V99.76z"/>
					<polygon class="st26" points="78.5,87.24 78.5,78.25 50.19,106.56 59.19,106.56 					"/>
				</g>
			</g>
			<g class="st11">
				<path class="st70" d="M73.49,106.67H45.24c-2.77,0-5.02,2.25-5.02,5.02v52.88c0,2.77,2.25,5.02,5.02,5.02h28.25
					c2.77,0,5.02-2.25,5.02-5.02v-52.88C78.5,108.91,76.26,106.67,73.49,106.67z"/>
				<path class="st3" d="M73.88,106.67H44.84c-2.55,0-4.62,2.07-4.62,4.62v44.16c0,2.55,2.07,4.62,4.62,4.62h29.04
					c2.55,0,4.62-2.07,4.62-4.62v-44.16C78.5,108.74,76.43,106.67,73.88,106.67z"/>
				<g>
					<defs>
						<path id="SVGID_75_" d="M73.88,106.67H44.84c-2.55,0-4.62,2.07-4.62,4.62v44.16c0,2.55,2.07,4.62,4.62,4.62h29.04
							c2.55,0,4.62-2.07,4.62-4.62v-44.16C78.5,108.74,76.43,106.67,73.88,106.67z"/>
					</defs>
					<clipPath id="SVGID_6_">
						<use xlink:href="#SVGID_75_"  style="overflow:visible;"/>
					</clipPath>
					<g style="clip-path:url(#SVGID_6_);">
						<path class="st0" d="M75.02,118.16c-7.6-0.88-13.09-7.64-12.47-15.21c9.24,0.86,17.4,5.41,23.01,12.15
							C82.7,117.41,78.96,118.62,75.02,118.16z"/>
						<path class="st1" d="M34.49,121.72c-0.56,4.77-4.23,8.42-8.75,9.16c1.06-5.92,3.64-11.32,7.33-15.76
							C34.22,117.04,34.77,119.33,34.49,121.72z"/>
						<path class="st2" d="M47.11,126.35l-11.48-13.98c4.85-4.68,11.09-7.94,18.03-9.1l8.68,10.58L47.11,126.35z"/>
					</g>
				</g>
				<g class="st11">
					<path class="st26" d="M40.22,113.47l38.28,38.28v3.7c0,2.55-2.07,4.62-4.62,4.62h-4.91l-28.74-28.74V113.47z"/>
					<polygon class="st26" points="78.5,125.98 78.5,134.98 50.19,106.67 59.19,106.67 					"/>
				</g>
			</g>
		</g>
	</g>
</g>
<g id="Layer_3">
</g>
</svg>
