grpcio==1.51.3
grpcio-tools==1.51.3
  grpcio==1.51.3
  protobuf==4.22.0
  setuptools==44.0.0
pip==20.0.2
pipdeptree==2.5.0
pkg-resources==0.0.0
protobuf==4.22.0
pydantic==1.10.5
  typing-extensions==4.5.0
setuptools==44.0.0
typing-extensions==4.5.0
wheel==0.34.2
