{
    "cname": "GroundingLLM-pip",
    "version": "1",
    "cid": "5ad502c6-fa96-48fe-8e96-7ff7cbd2853b",
    "solutionId": "20159b2c-2ad6-47ab-8585-78c34df0ed10",
    "ctime": "2024-06-20-05-17-15-074",
    "mtime": "2024-06-20-05-20-39-551",
    "probeIndicator": "false",
    "nodes": [
        {
            "name": "gllmdatabroker1",
            "nodeId": "gllmdatabroker1",
            "nodeSolutionId": "a5596217-7ccb-4caa-8ceb-484ee2f8a951",
            "nodeVersion": "1.0.0",
            "protoUri": "org/acumos/a5596217-7ccb-4caa-8ceb-484ee2f8a951/gllmdatabroker/1.0.0/gllmdatabroker-1.0.0.proto",
            "requirements": [
                {
                    "name": "",
                    "relationship": "",
                    "id": "",
                    "capability": {
                        "id": "GLMMdatabroker",
                        "stream": false,
                        "name": [
                            {
                                "messageName": "UserInputs",
                                "messageargumentList": [
                                    {
                                        "name": "organization_id",
                                        "role": "",
                                        "tag": "1",
                                        "type": "string"
                                    },
                                    {
                                        "name": "api_key",
                                        "role": "",
                                        "tag": "2",
                                        "type": "string"
                                    },
                                    {
                                        "name": "user_query",
                                        "role": "",
                                        "tag": "3",
                                        "type": "string"
                                    },
                                    {
                                        "name": "usecase_data",
                                        "role": "",
                                        "tag": "4",
                                        "type": "string"
                                    }
                                ]
                            }
                        ]
                    },
                    "target": {
                        "name": "",
                        "description": ""
                    },
                    "target_type": "Node"
                },
                {
                    "name": "",
                    "relationship": "",
                    "id": "",
                    "capability": {
                        "id": "mountVolume",
                        "stream": false,
                        "name": [
                            {
                                "messageName": "SharedFolderStatus",
                                "messageargumentList": [
                                    {
                                        "name": "success",
                                        "role": "",
                                        "tag": "1",
                                        "type": "bool"
                                    }
                                ]
                            }
                        ]
                    },
                    "target": {
                        "name": "",
                        "description": ""
                    },
                    "target_type": "Node"
                }
            ],
            "properties": [],
            "capabilities": [
                {
                    "id": "",
                    "name": "",
                    "target": {
                        "name": [
                            {
                                "messageName": "Empty",
                                "messageargumentList": []
                            }
                        ],
                        "stream": false,
                        "id": "GLMMdatabroker"
                    },
                    "target_type": "Capability"
                },
                {
                    "id": "",
                    "name": "",
                    "target": {
                        "name": [
                            {
                                "messageName": "SharedFolderRequest",
                                "messageargumentList": [
                                    {
                                        "name": "path",
                                        "role": "",
                                        "tag": "1",
                                        "type": "string"
                                    }
                                ]
                            }
                        ],
                        "stream": false,
                        "id": "mountVolume"
                    },
                    "target_type": "Capability"
                }
            ],
            "ndata": {
                "px": "168.566650390625",
                "py": "156.1999969482422",
                "fixed": true
            },
            "type": {
                "name": "MLModel"
            }
        },
        {
            "name": "gllmmodel1",
            "nodeId": "gllmmodel1",
            "nodeSolutionId": "81b0fb8e-ad6a-41ea-894d-ed330098765c",
            "nodeVersion": "1.0.0",
            "protoUri": "org/acumos/81b0fb8e-ad6a-41ea-894d-ed330098765c/gllmmodel/1.0.0/gllmmodel-1.0.0.proto",
            "requirements": [
                {
                    "name": "",
                    "relationship": "",
                    "id": "",
                    "capability": {
                        "id": "get_keys_data",
                        "stream": false,
                        "name": [
                            {
                                "messageName": "keysOutput",
                                "messageargumentList": [
                                    {
                                        "name": "note",
                                        "role": "",
                                        "tag": "1",
                                        "type": "string"
                                    }
                                ]
                            }
                        ]
                    },
                    "target": {
                        "name": "",
                        "description": ""
                    },
                    "target_type": "Node"
                },
                {
                    "name": "",
                    "relationship": "",
                    "id": "",
                    "capability": {
                        "id": "get_grounding_model",
                        "stream": false,
                        "name": [
                            {
                                "messageName": "GroundedOutput",
                                "messageargumentList": [
                                    {
                                        "name": "grounded_output",
                                        "role": "",
                                        "tag": "1",
                                        "type": "string"
                                    }
                                ]
                            }
                        ]
                    },
                    "target": {
                        "name": "",
                        "description": ""
                    },
                    "target_type": "Node"
                },
                {
                    "name": "",
                    "relationship": "",
                    "id": "",
                    "capability": {
                        "id": "mountVolume",
                        "stream": false,
                        "name": [
                            {
                                "messageName": "SharedFolderStatus",
                                "messageargumentList": [
                                    {
                                        "name": "success",
                                        "role": "",
                                        "tag": "1",
                                        "type": "bool"
                                    }
                                ]
                            }
                        ]
                    },
                    "target": {
                        "name": "",
                        "description": ""
                    },
                    "target_type": "Node"
                }
            ],
            "properties": [],
            "capabilities": [
                {
                    "id": "",
                    "name": "",
                    "target": {
                        "name": [
                            {
                                "messageName": "UserInputs",
                                "messageargumentList": [
                                    {
                                        "name": "organization_id",
                                        "role": "",
                                        "tag": "1",
                                        "type": "string"
                                    },
                                    {
                                        "name": "api_key",
                                        "role": "",
                                        "tag": "2",
                                        "type": "string"
                                    },
                                    {
                                        "name": "user_query",
                                        "role": "",
                                        "tag": "3",
                                        "type": "string"
                                    },
                                    {
                                        "name": "usecase_data",
                                        "role": "",
                                        "tag": "4",
                                        "type": "string"
                                    }
                                ]
                            }
                        ],
                        "stream": false,
                        "id": "get_keys_data"
                    },
                    "target_type": "Capability"
                },
                {
                    "id": "",
                    "name": "",
                    "target": {
                        "name": [
                            {
                                "messageName": "ResultText",
                                "messageargumentList": [
                                    {
                                        "name": "parsed_output",
                                        "role": "",
                                        "tag": "1",
                                        "type": "string"
                                    },
                                    {
                                        "name": "KGmoduleStatus",
                                        "role": "",
                                        "tag": "2",
                                        "type": "string"
                                    }
                                ]
                            }
                        ],
                        "stream": false,
                        "id": "get_grounding_model"
                    },
                    "target_type": "Capability"
                },
                {
                    "id": "",
                    "name": "",
                    "target": {
                        "name": [
                            {
                                "messageName": "SharedFolderRequest",
                                "messageargumentList": [
                                    {
                                        "name": "path",
                                        "role": "",
                                        "tag": "1",
                                        "type": "string"
                                    }
                                ]
                            }
                        ],
                        "stream": false,
                        "id": "mountVolume"
                    },
                    "target_type": "Capability"
                }
            ],
            "ndata": {
                "px": "611.0664149785998",
                "py": "211.3578041146286",
                "fixed": true
            },
            "type": {
                "name": "MLModel"
            }
        },
        {
            "name": "gllmparser1",
            "nodeId": "gllmparser1",
            "nodeSolutionId": "6e41c13d-8d87-4cbc-80f6-3f169dc8bf2c",
            "nodeVersion": "1.0.0",
            "protoUri": "org/acumos/6e41c13d-8d87-4cbc-80f6-3f169dc8bf2c/gllmparser/1.0.0/gllmparser-1.0.0.proto",
            "requirements": [
                {
                    "name": "",
                    "relationship": "",
                    "id": "",
                    "capability": {
                        "id": "get_parse_model",
                        "stream": false,
                        "name": [
                            {
                                "messageName": "ResultText",
                                "messageargumentList": [
                                    {
                                        "name": "parsed_output",
                                        "role": "",
                                        "tag": "1",
                                        "type": "string"
                                    },
                                    {
                                        "name": "KGmoduleStatus",
                                        "role": "",
                                        "tag": "2",
                                        "type": "string"
                                    }
                                ]
                            }
                        ]
                    },
                    "target": {
                        "name": "",
                        "description": ""
                    },
                    "target_type": "Node"
                },
                {
                    "name": "",
                    "relationship": "",
                    "id": "",
                    "capability": {
                        "id": "mountVolume",
                        "stream": false,
                        "name": [
                            {
                                "messageName": "SharedFolderStatus",
                                "messageargumentList": [
                                    {
                                        "name": "success",
                                        "role": "",
                                        "tag": "1",
                                        "type": "bool"
                                    }
                                ]
                            }
                        ]
                    },
                    "target": {
                        "name": "",
                        "description": ""
                    },
                    "target_type": "Node"
                }
            ],
            "properties": [],
            "capabilities": [
                {
                    "id": "",
                    "name": "",
                    "target": {
                        "name": [
                            {
                                "messageName": "UserInputs",
                                "messageargumentList": [
                                    {
                                        "name": "organization_id",
                                        "role": "",
                                        "tag": "1",
                                        "type": "string"
                                    },
                                    {
                                        "name": "api_key",
                                        "role": "",
                                        "tag": "2",
                                        "type": "string"
                                    },
                                    {
                                        "name": "user_query",
                                        "role": "",
                                        "tag": "3",
                                        "type": "string"
                                    },
                                    {
                                        "name": "usecase_data",
                                        "role": "",
                                        "tag": "4",
                                        "type": "string"
                                    }
                                ]
                            }
                        ],
                        "stream": false,
                        "id": "get_parse_model"
                    },
                    "target_type": "Capability"
                },
                {
                    "id": "",
                    "name": "",
                    "target": {
                        "name": [
                            {
                                "messageName": "SharedFolderRequest",
                                "messageargumentList": [
                                    {
                                        "name": "path",
                                        "role": "",
                                        "tag": "1",
                                        "type": "string"
                                    }
                                ]
                            }
                        ],
                        "stream": false,
                        "id": "mountVolume"
                    },
                    "target_type": "Capability"
                }
            ],
            "ndata": {
                "px": "408.46650273077535",
                "py": "71.19999321207786",
                "fixed": true
            },
            "type": {
                "name": "MLModel"
            }
        },
        {
            "name": "gllmuserdiagonistics1",
            "nodeId": "gllmUserDiagonistics1",
            "nodeSolutionId": "1489b3b0-83dd-4979-9d96-9b8f06d693c3",
            "nodeVersion": "1.0.1",
            "protoUri": "org/acumos/1489b3b0-83dd-4979-9d96-9b8f06d693c3/gllmuserdiagonistics/1.0.1/gllmuserdiagonistics-1.0.1.proto",
            "requirements": [
                {
                    "name": "",
                    "relationship": "",
                    "id": "",
                    "capability": {
                        "id": "GetRatings",
                        "stream": true,
                        "name": [
                            {
                                "messageName": "Rating",
                                "messageargumentList": [
                                    {
                                        "name": "stars",
                                        "role": "",
                                        "tag": "1",
                                        "type": "float"
                                    },
                                    {
                                        "name": "time",
                                        "role": "",
                                        "tag": "2",
                                        "type": "string"
                                    },
                                    {
                                        "name": "feedback",
                                        "role": "",
                                        "tag": "3",
                                        "type": "string"
                                    },
                                    {
                                        "name": "faithfulness",
                                        "role": "",
                                        "tag": "4",
                                        "type": "float"
                                    },
                                    {
                                        "name": "relevancy",
                                        "role": "",
                                        "tag": "5",
                                        "type": "float"
                                    }
                                ]
                            }
                        ]
                    },
                    "target": {
                        "name": "",
                        "description": ""
                    },
                    "target_type": "Node"
                },
                {
                    "name": "",
                    "relationship": "",
                    "id": "",
                    "capability": {
                        "id": "CalculateMetrics",
                        "stream": false,
                        "name": [
                            {
                                "messageName": "CalculatedMetrics",
                                "messageargumentList": [
                                    {
                                        "name": "overall_avg_star_rating",
                                        "role": "",
                                        "tag": "1",
                                        "type": "double"
                                    },
                                    {
                                        "name": "overall_avg_feedback_sentiment_score",
                                        "role": "",
                                        "tag": "2",
                                        "type": "double"
                                    },
                                    {
                                        "name": "overall_avg_faithfulness_score",
                                        "role": "",
                                        "tag": "3",
                                        "type": "double"
                                    },
                                    {
                                        "name": "overall_avg_relevancy_score",
                                        "role": "",
                                        "tag": "4",
                                        "type": "double"
                                    },
                                    {
                                        "name": "type",
                                        "role": "",
                                        "tag": "5",
                                        "type": "string"
                                    },
                                    {
                                        "name": "status_text",
                                        "role": "",
                                        "tag": "6",
                                        "type": "string"
                                    }
                                ]
                            }
                        ]
                    },
                    "target": {
                        "name": "",
                        "description": ""
                    },
                    "target_type": "Node"
                },
                {
                    "name": "",
                    "relationship": "",
                    "id": "",
                    "capability": {
                        "id": "get_metrics_metadata",
                        "stream": false,
                        "name": [
                            {
                                "messageName": "CalculatedMetrics",
                                "messageargumentList": [
                                    {
                                        "name": "overall_avg_star_rating",
                                        "role": "",
                                        "tag": "1",
                                        "type": "double"
                                    },
                                    {
                                        "name": "overall_avg_feedback_sentiment_score",
                                        "role": "",
                                        "tag": "2",
                                        "type": "double"
                                    },
                                    {
                                        "name": "overall_avg_faithfulness_score",
                                        "role": "",
                                        "tag": "3",
                                        "type": "double"
                                    },
                                    {
                                        "name": "overall_avg_relevancy_score",
                                        "role": "",
                                        "tag": "4",
                                        "type": "double"
                                    },
                                    {
                                        "name": "type",
                                        "role": "",
                                        "tag": "5",
                                        "type": "string"
                                    },
                                    {
                                        "name": "status_text",
                                        "role": "",
                                        "tag": "6",
                                        "type": "string"
                                    }
                                ]
                            }
                        ]
                    },
                    "target": {
                        "name": "",
                        "description": ""
                    },
                    "target_type": "Node"
                },
                {
                    "name": "",
                    "relationship": "",
                    "id": "",
                    "capability": {
                        "id": "mountVolume",
                        "stream": false,
                        "name": [
                            {
                                "messageName": "SharedFolderStatus",
                                "messageargumentList": [
                                    {
                                        "name": "success",
                                        "role": "",
                                        "tag": "1",
                                        "type": "bool"
                                    }
                                ]
                            }
                        ]
                    },
                    "target": {
                        "name": "",
                        "description": ""
                    },
                    "target_type": "Node"
                }
            ],
            "properties": [],
            "capabilities": [
                {
                    "id": "",
                    "name": "",
                    "target": {
                        "name": [
                            {
                                "messageName": "Empty",
                                "messageargumentList": []
                            }
                        ],
                        "stream": false,
                        "id": "GetRatings"
                    },
                    "target_type": "Capability"
                },
                {
                    "id": "",
                    "name": "",
                    "target": {
                        "name": [
                            {
                                "messageName": "Empty",
                                "messageargumentList": []
                            }
                        ],
                        "stream": false,
                        "id": "CalculateMetrics"
                    },
                    "target_type": "Capability"
                },
                {
                    "id": "",
                    "name": "",
                    "target": {
                        "name": [
                            {
                                "messageName": "CalculatedMetrics",
                                "messageargumentList": [
                                    {
                                        "name": "overall_avg_star_rating",
                                        "role": "",
                                        "tag": "1",
                                        "type": "double"
                                    },
                                    {
                                        "name": "overall_avg_feedback_sentiment_score",
                                        "role": "",
                                        "tag": "2",
                                        "type": "double"
                                    },
                                    {
                                        "name": "overall_avg_faithfulness_score",
                                        "role": "",
                                        "tag": "3",
                                        "type": "double"
                                    },
                                    {
                                        "name": "overall_avg_relevancy_score",
                                        "role": "",
                                        "tag": "4",
                                        "type": "double"
                                    },
                                    {
                                        "name": "type",
                                        "role": "",
                                        "tag": "5",
                                        "type": "string"
                                    },
                                    {
                                        "name": "status_text",
                                        "role": "",
                                        "tag": "6",
                                        "type": "string"
                                    }
                                ]
                            }
                        ],
                        "stream": false,
                        "id": "get_metrics_metadata"
                    },
                    "target_type": "Capability"
                },
                {
                    "id": "",
                    "name": "",
                    "target": {
                        "name": [
                            {
                                "messageName": "SharedFolderRequest",
                                "messageargumentList": [
                                    {
                                        "name": "path",
                                        "role": "",
                                        "tag": "1",
                                        "type": "string"
                                    }
                                ]
                            }
                        ],
                        "stream": false,
                        "id": "mountVolume"
                    },
                    "target_type": "Capability"
                }
            ],
            "ndata": {
                "px": "630.3401799282942",
                "py": "362.3578027471792",
                "fixed": true
            },
            "type": {
                "name": "MLModel"
            }
        },
        {
            "name": "/data/shared",
            "nodeId": "SharedFolderProvider1",
            "nodeSolutionId": "152894f9-853e-45fc-8879-7bfcb852c7a7",
            "nodeVersion": "1.0.0",
            "protoUri": "org/acumos/152894f9-853e-45fc-8879-7bfcb852c7a7/sharedfolderprovider/1.0.0/sharedfolderprovider-1.0.0.proto",
            "requirements": [
                {
                    "name": "",
                    "relationship": "",
                    "id": "",
                    "capability": {
                        "id": "provideFolder",
                        "stream": false,
                        "name": [
                            {
                                "messageName": "SharedFolderRequest",
                                "messageargumentList": [
                                    {
                                        "name": "path",
                                        "role": "",
                                        "tag": "1",
                                        "type": "string"
                                    }
                                ]
                            }
                        ]
                    },
                    "target": {
                        "name": "",
                        "description": ""
                    },
                    "target_type": "Node"
                }
            ],
            "properties": [],
            "capabilities": [
                {
                    "id": "",
                    "name": "",
                    "target": {
                        "name": [
                            {
                                "messageName": "Empty",
                                "messageargumentList": []
                            }
                        ],
                        "stream": false,
                        "id": "provideFolder"
                    },
                    "target_type": "Capability"
                }
            ],
            "ndata": {
                "fixed": false
            },
            "type": {
                "name": "SharedFolder"
            }
        }
    ],
    "relations": [
        {
            "linkName": "",
            "linkId": "68a836a4-f28a-4999-b2be-b13d3372bd4c",
            "sourceNodeName": "gllmdatabroker1",
            "targetNodeName": "gllmparser1",
            "targetNodeId": "gllmparser1",
            "targetNodeCapability": "get_parse_model+[[{\"role\":\"\",\"tag\":\"1\",\"type\":\"string\"},{\"role\":\"\",\"tag\":\"2\",\"type\":\"string\"},{\"role\":\"\",\"tag\":\"3\",\"type\":\"string\"},{\"role\":\"\",\"tag\":\"4\",\"type\":\"string\"}]]+cap0",
            "sourceNodeId": "gllmdatabroker1",
            "sourceNodeRequirement": "GLMMdatabroker+[[{\"role\":\"\",\"tag\":\"1\",\"type\":\"string\"},{\"role\":\"\",\"tag\":\"2\",\"type\":\"string\"},{\"role\":\"\",\"tag\":\"3\",\"type\":\"string\"},{\"role\":\"\",\"tag\":\"4\",\"type\":\"string\"}]]+req0"
        },
        {
            "linkName": "",
            "linkId": "1cb9205f-cc38-4781-ab36-beaa9408fc83",
            "sourceNodeName": "gllmdatabroker1",
            "targetNodeName": "gllmmodel1",
            "targetNodeId": "gllmmodel1",
            "targetNodeCapability": "get_keys_data+[[{\"role\":\"\",\"tag\":\"1\",\"type\":\"string\"},{\"role\":\"\",\"tag\":\"2\",\"type\":\"string\"},{\"role\":\"\",\"tag\":\"3\",\"type\":\"string\"},{\"role\":\"\",\"tag\":\"4\",\"type\":\"string\"}]]+cap0",
            "sourceNodeId": "gllmdatabroker1",
            "sourceNodeRequirement": "GLMMdatabroker+[[{\"role\":\"\",\"tag\":\"1\",\"type\":\"string\"},{\"role\":\"\",\"tag\":\"2\",\"type\":\"string\"},{\"role\":\"\",\"tag\":\"3\",\"type\":\"string\"},{\"role\":\"\",\"tag\":\"4\",\"type\":\"string\"}]]+req0"
        },
        {
            "linkName": "",
            "linkId": "7acb466e-7520-4043-8e28-c0390e70fbb4",
            "sourceNodeName": "gllmparser1",
            "targetNodeName": "gllmmodel1",
            "targetNodeId": "gllmmodel1",
            "targetNodeCapability": "get_grounding_model+[[{\"role\":\"\",\"tag\":\"1\",\"type\":\"string\"},{\"role\":\"\",\"tag\":\"2\",\"type\":\"string\"}]]+cap1",
            "sourceNodeId": "gllmparser1",
            "sourceNodeRequirement": "get_parse_model+[[{\"role\":\"\",\"tag\":\"1\",\"type\":\"string\"},{\"role\":\"\",\"tag\":\"2\",\"type\":\"string\"}]]+req0"
        },
        {
            "linkName": "",
            "linkId": "cd991578-a2c0-4a57-b3ed-6ee659ce2c32",
            "sourceNodeName": "/data/shared",
            "targetNodeName": "gllmmodel1",
            "targetNodeId": "gllmmodel1",
            "targetNodeCapability": "mountVolume+[[{\"role\":\"\",\"tag\":\"1\",\"type\":\"string\"}]]+cap2",
            "sourceNodeId": "SharedFolderProvider1",
            "sourceNodeRequirement": "provideFolder+[[{\"role\":\"\",\"tag\":\"1\",\"type\":\"string\"}]]+req0"
        },
        {
            "linkName": "",
            "linkId": "9117925a-f3d9-4ce4-ada1-16a8a741274e",
            "sourceNodeName": "SharedFolderProvider1",
            "targetNodeName": "gllmUserDiagonistics1",
            "targetNodeId": "gllmUserDiagonistics1",
            "targetNodeCapability": "mountVolume+[[{\"role\":\"\",\"tag\":\"1\",\"type\":\"string\"}]]+cap3",
            "sourceNodeId": "SharedFolderProvider1",
            "sourceNodeRequirement": "provideFolder+[[{\"role\":\"\",\"tag\":\"1\",\"type\":\"string\"}]]+req0"
        }
    ],
    "validSolution": true,
    "revisionId": "e82adf0d-9049-4cd1-8266-90e67cb16445"
}