{
    "model_name": "readme-gen-module",
    "docker_uri": "cicd.ai4eu-dev.eu:7444/tutorials/graphene_llm_readme_gen/readme_gen_module:v1",
    "category": "PR",
    "documents": [],
    "tags": {
        "modelTypeCode": "PR",
        "toolkitTypeCode": "MN",
        "tags": [
            {
                "tag": "playground"
            },
            {
                "tag": "ready"
            },
            {
                "tag": "data"
            },
            {
                "tag": "broker"
            },
            {
                "tag": "tutorial"
            },
            {
                "tag": "GUI"
            },
            {
                "tag": "hpp"
            },
            {
                "tag": "house"
            },
            {
                "tag": "price"
            },
            {
                "tag": "prediction"
            }
        ]
    },
    "icon_filename": "icon.png",
    "protobuf": "model.proto",
    "license": "license.json",
    "nodeId":"readme-gen-module1",
    "nodeSolutionId":"3d7c3f95-f6c4-44cf-bb4f-283c747c5218"
}