{
    "pipeline_name": "grounding-llm-pipeline",
    "location": "tutorials/grounding-llm-pipeline",
    "models": [
        "gllm-databroker",
        "shared-folder-provider",
        "gllm-model",
        "gllm-parser",
        "gllm-user-diagonistics"
    ],
    "icon_filename": "icon.png",
    "tags": {
        "modelTypeCode": "PR",
        "toolkitTypeCode": "CP",
        "tags": [
            {
                "tag": "playground"
            },
            {
                "tag": "ready"
            },
            {
                "tag": "tutorial"
            },
            {
                "tag": "pipeline"
            },
            {
                "tag": "gllm"
            },
            {
                "tag": "grounding"
            },
            {
                "tag": "llm"
            }
        ]
    },
    "documents": [
    ],
    "add_link_params": [
        {
            "userId": "{self.GRAPHENE_USERID}",
            "cid": "{pipeline.cid}",
            "linkId": "{link_id}",
            "sourceNodeName": "gllm-databroker1",
            "targetNodeName": "gllm-parser1",
            "targetNodeId": "gllm-parser1",
            "targetNodeCapabilityName": "get_parse_model+[[{\"role\":\"\",\"tag\":\"1\",\"type\":\"string\"},{\"role\":\"\",\"tag\":\"2\",\"type\":\"string\"},{\"role\":\"\",\"tag\":\"3\",\"type\":\"string\"},{\"role\":\"\",\"tag\":\"4\",\"type\":\"string\"}]]+cap0",
            "sourceNodeId": "gllm-databroker1",
            "sourceNodeRequirement": "GLMMdatabroker+[[{\"role\":\"\",\"tag\":\"1\",\"type\":\"string\"},{\"role\":\"\",\"tag\":\"2\",\"type\":\"string\"},{\"role\":\"\",\"tag\":\"3\",\"type\":\"string\"},{\"role\":\"\",\"tag\":\"4\",\"type\":\"string\"}]]+req0"
        },
        {
            "userId": "{self.GRAPHENE_USERID}",
            "cid": "{pipeline.cid}",
            "linkId": "{link_id}",
            "sourceNodeName": "gllm-databroker1",
            "targetNodeName": "gllm-model1",
            "targetNodeId": "gllm-model1",
            "targetNodeCapabilityName": "get_keys_data+[[{\"role\":\"\",\"tag\":\"1\",\"type\":\"string\"},{\"role\":\"\",\"tag\":\"2\",\"type\":\"string\"},{\"role\":\"\",\"tag\":\"3\",\"type\":\"string\"},{\"role\":\"\",\"tag\":\"4\",\"type\":\"string\"}]]+cap0",
            "sourceNodeId": "gllm-databroker1",
            "sourceNodeRequirement": "GLMMdatabroker+[[{\"role\":\"\",\"tag\":\"1\",\"type\":\"string\"},{\"role\":\"\",\"tag\":\"2\",\"type\":\"string\"},{\"role\":\"\",\"tag\":\"3\",\"type\":\"string\"},{\"role\":\"\",\"tag\":\"4\",\"type\":\"string\"}]]+req0"
        },
        {
            "userId": "{self.GRAPHENE_USERID}",
            "cid": "{pipeline.cid}",
            "linkId": "{link_id}",
            "sourceNodeName": "gllm-parser1",
            "targetNodeName": "gllm-model1",
            "targetNodeId": "gllm-model1",
            "targetNodeCapabilityName": "get_grounding_model+[[{\"role\":\"\",\"tag\":\"1\",\"type\":\"string\"},{\"role\":\"\",\"tag\":\"2\",\"type\":\"string\"}]]+cap1",
            "sourceNodeId": "gllm-parser1",
            "sourceNodeRequirement": "get_parse_model+[[{\"role\":\"\",\"tag\":\"1\",\"type\":\"string\"},{\"role\":\"\",\"tag\":\"2\",\"type\":\"string\"}]]+req0"
        },
        {
            "userId": "{self.GRAPHENE_USERID}",
            "cid": "{pipeline.cid}",
            "linkId": "{link_id}",
            "sourceNodeName": "shared-folder-provider-16992235121",
            "targetNodeName": "gllm-model1",
            "targetNodeId": "gllm-model1",
            "targetNodeCapabilityName": "mountVolume+[[{\"role\":\"\",\"tag\":\"1\",\"type\":\"string\"}]]+cap2",
            "sourceNodeId": "shared-folder-provider-16992235121",
            "sourceNodeRequirement": "provideFolder+[[{\"role\":\"\",\"tag\":\"1\",\"type\":\"string\"}]]+req0"
        },
        {
            "userId": "{self.GRAPHENE_USERID}",
            "cid": "{pipeline.cid}",
            "linkId": "{link_id}",
            "sourceNodeName": "shared-folder-provider-16992235121",
            "targetNodeName": "gllm-user-diagonistics1",
            "targetNodeId": "gllm-user-diagonistics1",
            "targetNodeCapabilityName": "mountVolume+[[{\"role\":\"\",\"tag\":\"1\",\"type\":\"string\"}]]+cap3",
            "sourceNodeId": "shared-folder-provider-16992235121",
            "sourceNodeRequirement": "provideFolder+[[{\"role\":\"\",\"tag\":\"1\",\"type\":\"string\"}]]+req0"
        }
    ],
    "modify_node_urls": [
        "dsce/dsce/solution/modifyNode?userid={GRAPHENE_USER_ID}&cid={COMP_SOLUTION_ID}&nodeid=shared-folder-provider-16992235121&nodename=/data/shared&ndata={\"fixed\":false}"
    ],
    "add_link_url": "dsce/dsce/solution/addLink"
}