{
    "name": "gllm-model1",
    "nodeId": "gllm-model1",
    "nodeSolutionId": "81b0fb8e-ad6a-41ea-894d-ed330098765c",
    "nodeVersion": "1.0.0",
    "requirements": [
        {
            "name": "",
            "relationship": "",
            "id": "",
            "capability": {
                "id": "get_keys_data",
                "stream": false,
                "name": [
                    {
                        "messageName": "keysOutput",
                        "messageargumentList": [
                            {
                                "name": "note",
                                "role": "",
                                "tag": "1",
                                "type": "string"
                            }
                        ]
                    }
                ]
            },
            "target": {
                "name": "",
                "description": ""
            },
            "target_type": "Node"
        },
        {
            "name": "",
            "relationship": "",
            "id": "",
            "capability": {
                "id": "get_grounding_model",
                "stream": false,
                "name": [
                    {
                        "messageName": "GroundedOutput",
                        "messageargumentList": [
                            {
                                "name": "grounded_output",
                                "role": "",
                                "tag": "1",
                                "type": "string"
                            }
                        ]
                    }
                ]
            },
            "target": {
                "name": "",
                "description": ""
            },
            "target_type": "Node"
        },
        {
            "name": "",
            "relationship": "",
            "id": "",
            "capability": {
                "id": "mountVolume",
                "stream": false,
                "name": [
                    {
                        "messageName": "SharedFolderStatus",
                        "messageargumentList": [
                            {
                                "name": "success",
                                "role": "",
                                "tag": "1",
                                "type": "bool"
                            }
                        ]
                    }
                ]
            },
            "target": {
                "name": "",
                "description": ""
            },
            "target_type": "Node"
        }
    ],
    "properties": [],
    "capabilities": [
        {
            "id": "",
            "name": "",
            "target": {
                "name": [
                    {
                        "messageName": "UserInputs",
                        "messageargumentList": [
                            {
                                "name": "organization_id",
                                "role": "",
                                "tag": "1",
                                "type": "string"
                            },
                            {
                                "name": "api_key",
                                "role": "",
                                "tag": "2",
                                "type": "string"
                            },
                            {
                                "name": "user_query",
                                "role": "",
                                "tag": "3",
                                "type": "string"
                            },
                            {
                                "name": "usecase_data",
                                "role": "",
                                "tag": "4",
                                "type": "string"
                            }
                        ]
                    }
                ],
                "stream": false,
                "id": "get_keys_data"
            },
            "target_type": "Capability"
        },
        {
            "id": "",
            "name": "",
            "target": {
                "name": [
                    {
                        "messageName": "ResultText",
                        "messageargumentList": [
                            {
                                "name": "parsed_output",
                                "role": "",
                                "tag": "1",
                                "type": "string"
                            },
                            {
                                "name": "KGmoduleStatus",
                                "role": "",
                                "tag": "2",
                                "type": "string"
                            }
                        ]
                    }
                ],
                "stream": false,
                "id": "get_grounding_model"
            },
            "target_type": "Capability"
        },
        {
            "id": "",
            "name": "",
            "target": {
                "name": [
                    {
                        "messageName": "SharedFolderRequest",
                        "messageargumentList": [
                            {
                                "name": "path",
                                "role": "",
                                "tag": "1",
                                "type": "string"
                            }
                        ]
                    }
                ],
                "stream": false,
                "id": "mountVolume"
            },
            "target_type": "Capability"
        }
    ],
    "ndata": {
        "px": "611.0664149785998",
        "py": "211.3578041146286",
        "fixed": true
    },
    "type": {
        "name": "MLModel"
    }
}