<?xml version="1.0" encoding="utf-8"  standalone="no"?>
<!DOCTYPE svg PUBLIC "-//W3C//DTD SVG 1.1//EN" 
 "http://www.w3.org/Graphics/SVG/1.1/DTD/svg11.dtd">
<!--
  Copyright (c) 2010, 2022 Contributors to the Eclipse Foundation

  See the NOTICE file(s) distributed with this work for additional
  information regarding copyright ownership.

  This program and the accompanying materials are made available under the terms
  of the MIT License which is available at https://opensource.org/licenses/MIT

  SPDX-License-Identifier: MIT
-->
<svg width="600" height="480" viewBox="0 0 600 480"
 xmlns="http://www.w3.org/2000/svg"
 xmlns:xlink="http://www.w3.org/1999/xlink"
>

<title>gnuplot</title>
<desc>Produced by GNUPLOT 4.4 patchlevel 4 </desc>

<defs>

	<circle id='gpDot' r='0.5' stroke-width='0.5'/>
	<path id='gpPt0' stroke-width='0.222' stroke='currentColor' d='M-1,0 h2 M0,-1 v2'/>
	<path id='gpPt1' stroke-width='0.222' stroke='currentColor' d='M-1,-1 L1,1 M1,-1 L-1,1'/>
	<path id='gpPt2' stroke-width='0.222' stroke='currentColor' d='M-1,0 L1,0 M0,-1 L0,1 M-1,-1 L1,1 M-1,1 L1,-1'/>
	<rect id='gpPt3' stroke-width='0.222' stroke='currentColor' x='-1' y='-1' width='2' height='2'/>
	<rect id='gpPt4' stroke-width='0.222' stroke='currentColor' fill='currentColor' x='-1' y='-1' width='2' height='2'/>
	<circle id='gpPt5' stroke-width='0.222' stroke='currentColor' cx='0' cy='0' r='1'/>
	<use xlink:href='#gpPt5' id='gpPt6' fill='currentColor' stroke='none'/>
	<path id='gpPt7' stroke-width='0.222' stroke='currentColor' d='M0,-1.33 L-1.33,0.67 L1.33,0.67 z'/>
	<use xlink:href='#gpPt7' id='gpPt8' fill='currentColor' stroke='none'/>
	<use xlink:href='#gpPt7' id='gpPt9' stroke='currentColor' transform='rotate(180)'/>
	<use xlink:href='#gpPt9' id='gpPt10' fill='currentColor' stroke='none'/>
	<use xlink:href='#gpPt3' id='gpPt11' stroke='currentColor' transform='rotate(45)'/>
	<use xlink:href='#gpPt11' id='gpPt12' fill='currentColor' stroke='none'/>
</defs>
<g style="fill:none; color:white; stroke:currentColor; stroke-width:1.00; stroke-linecap:butt; stroke-linejoin:miter">
</g>
<g style="fill:none; color:black; stroke:currentColor; stroke-width:1.00; stroke-linecap:butt; stroke-linejoin:miter">
	<path  d='M71.9,422.4 L80.9,422.4 M575.0,422.4 L566.0,422.4 '></path>
	<g transform="translate(63.6,426.9)" style="stroke:none; fill:black; font-family:Arial; font-size:12.00pt; text-anchor:end">
		<text> 0</text>
	</g>
	<path  d='M71.9,381.8 L80.9,381.8 M575.0,381.8 L566.0,381.8 '></path>
	<g transform="translate(63.6,386.3)" style="stroke:none; fill:black; font-family:Arial; font-size:12.00pt; text-anchor:end">
		<text> 0.2</text>
	</g>
	<path  d='M71.9,341.3 L80.9,341.3 M575.0,341.3 L566.0,341.3 '></path>
	<g transform="translate(63.6,345.8)" style="stroke:none; fill:black; font-family:Arial; font-size:12.00pt; text-anchor:end">
		<text> 0.4</text>
	</g>
	<path  d='M71.9,300.7 L80.9,300.7 M575.0,300.7 L566.0,300.7 '></path>
	<g transform="translate(63.6,305.2)" style="stroke:none; fill:black; font-family:Arial; font-size:12.00pt; text-anchor:end">
		<text> 0.6</text>
	</g>
	<path  d='M71.9,260.1 L80.9,260.1 M575.0,260.1 L566.0,260.1 '></path>
	<g transform="translate(63.6,264.6)" style="stroke:none; fill:black; font-family:Arial; font-size:12.00pt; text-anchor:end">
		<text> 0.8</text>
	</g>
	<path  d='M71.9,219.5 L80.9,219.5 M575.0,219.5 L566.0,219.5 '></path>
	<g transform="translate(63.6,224.0)" style="stroke:none; fill:black; font-family:Arial; font-size:12.00pt; text-anchor:end">
		<text> 1</text>
	</g>
	<path  d='M71.9,179.0 L80.9,179.0 M575.0,179.0 L566.0,179.0 '></path>
	<g transform="translate(63.6,183.5)" style="stroke:none; fill:black; font-family:Arial; font-size:12.00pt; text-anchor:end">
		<text> 1.2</text>
	</g>
	<path  d='M71.9,138.4 L80.9,138.4 M575.0,138.4 L566.0,138.4 '></path>
	<g transform="translate(63.6,142.9)" style="stroke:none; fill:black; font-family:Arial; font-size:12.00pt; text-anchor:end">
		<text> 1.4</text>
	</g>
	<path  d='M71.9,97.8 L80.9,97.8 M575.0,97.8 L566.0,97.8 '></path>
	<g transform="translate(63.6,102.3)" style="stroke:none; fill:black; font-family:Arial; font-size:12.00pt; text-anchor:end">
		<text> 1.6</text>
	</g>
	<path  d='M71.9,57.3 L80.9,57.3 M575.0,57.3 L566.0,57.3 '></path>
	<g transform="translate(63.6,61.8)" style="stroke:none; fill:black; font-family:Arial; font-size:12.00pt; text-anchor:end">
		<text> 1.8</text>
	</g>
	<path  d='M71.9,16.7 L80.9,16.7 M575.0,16.7 L566.0,16.7 '></path>
	<g transform="translate(63.6,21.2)" style="stroke:none; fill:black; font-family:Arial; font-size:12.00pt; text-anchor:end">
		<text> 2</text>
	</g>
	<path  d='M71.9,422.4 L71.9,413.4 M71.9,16.7 L71.9,25.7 '></path>
	<g transform="translate(71.9,444.9)" style="stroke:none; fill:black; font-family:Arial; font-size:12.00pt; text-anchor:middle">
		<text> 0</text>
	</g>
	<path  d='M172.5,422.4 L172.5,413.4 M172.5,16.7 L172.5,25.7 '></path>
	<g transform="translate(172.5,444.9)" style="stroke:none; fill:black; font-family:Arial; font-size:12.00pt; text-anchor:middle">
		<text> 1</text>
	</g>
	<path  d='M273.1,422.4 L273.1,413.4 M273.1,16.7 L273.1,25.7 '></path>
	<g transform="translate(273.1,444.9)" style="stroke:none; fill:black; font-family:Arial; font-size:12.00pt; text-anchor:middle">
		<text> 2</text>
	</g>
	<path  d='M373.8,422.4 L373.8,413.4 M373.8,16.7 L373.8,25.7 '></path>
	<g transform="translate(373.8,444.9)" style="stroke:none; fill:black; font-family:Arial; font-size:12.00pt; text-anchor:middle">
		<text> 3</text>
	</g>
	<path  d='M474.4,422.4 L474.4,413.4 M474.4,16.7 L474.4,25.7 '></path>
	<g transform="translate(474.4,444.9)" style="stroke:none; fill:black; font-family:Arial; font-size:12.00pt; text-anchor:middle">
		<text> 4</text>
	</g>
	<path  d='M575.0,422.4 L575.0,413.4 M575.0,16.7 L575.0,25.7 '></path>
	<g transform="translate(575.0,444.9)" style="stroke:none; fill:black; font-family:Arial; font-size:12.00pt; text-anchor:middle">
		<text> 5</text>
	</g>
	<path  d='M71.9,16.7 L71.9,422.4 L575.0,422.4 L575.0,16.7 L71.9,16.7 Z '></path>
	<g transform="translate(17.6,219.6) rotate(270)" style="stroke:none; fill:black; font-family:Arial; font-size:12.00pt; text-anchor:middle">
		<text>exponential(real m)</text>
	</g>
	<g transform="translate(323.4,471.9)" style="stroke:none; fill:black; font-family:Arial; font-size:12.00pt; text-anchor:middle">
		<text>x</text>
	</g>
	<g transform="translate(92.0,122.6)" style="stroke:none; fill:black; font-family:Arial; font-size:12.00pt; text-anchor:start">
		<text>exponential(0.5)</text>
	</g>
	<g transform="translate(162.5,335.6)" style="stroke:none; fill:black; font-family:Arial; font-size:12.00pt; text-anchor:start">
		<text>exponential(1.0)</text>
	</g>
	<g transform="translate(323.5,386.3)" style="stroke:none; fill:black; font-family:Arial; font-size:12.00pt; text-anchor:start">
		<text>exponential(1.5)</text>
	</g>
</g>
	<g id="Plot_1"><title>Plot_1</title>
<g style="fill:none; color:red; stroke:currentColor; stroke-width:1.00; stroke-linecap:butt; stroke-linejoin:miter">
	<path  d='M71.9,16.7 L72.9,24.7 L73.9,32.6 L74.9,40.3 L75.9,47.9 L76.9,55.3 L77.9,62.6 L78.9,69.7 
		L79.9,76.7 L81.0,83.5 L82.0,90.2 L83.0,96.8 L84.0,103.3 L85.0,109.6 L86.0,115.8 L87.0,121.9 
		L88.0,127.8 L89.0,133.6 L90.0,139.4 L91.0,145.0 L92.0,150.5 L93.0,155.8 L94.0,161.1 L95.0,166.3 
		L96.0,171.4 L97.1,176.3 L98.1,181.2 L99.1,186.0 L100.1,190.7 L101.1,195.2 L102.1,199.7 L103.1,204.2 
		L104.1,208.5 L105.1,212.7 L106.1,216.9 L107.1,220.9 L108.1,224.9 L109.1,228.8 L110.1,232.7 L111.1,236.4 
		L112.1,240.1 L113.2,243.7 L114.2,247.3 L115.2,250.7 L116.2,254.1 L117.2,257.5 L118.2,260.7 L119.2,263.9 
		L120.2,267.1 L121.2,270.1 L122.2,273.2 L123.2,276.1 L124.2,279.0 L125.2,281.8 L126.2,284.6 L127.2,287.4 
		L128.2,290.0 L129.3,292.6 L130.3,295.2 L131.3,297.7 L132.3,300.2 L133.3,302.6 L134.3,305.0 L135.3,307.3 
		L136.3,309.6 L137.3,311.8 L138.3,314.0 L139.3,316.2 L140.3,318.3 L141.3,320.3 L142.3,322.4 L143.3,324.3 
		L144.3,326.3 L145.4,328.2 L146.4,330.0 L147.4,331.9 L148.4,333.7 L149.4,335.4 L150.4,337.1 L151.4,338.8 
		L152.4,340.5 L153.4,342.1 L154.4,343.7 L155.4,345.3 L156.4,346.8 L157.4,348.3 L158.4,349.8 L159.4,351.2 
		L160.4,352.6 L161.5,354.0 L162.5,355.3 L163.5,356.7 L164.5,358.0 L165.5,359.2 L166.5,360.5 L167.5,361.7 
		L168.5,362.9 L169.5,364.1 L170.5,365.3 L171.5,366.4 L172.5,367.5 L173.5,368.6 L174.5,369.6 L175.5,370.7 
		L176.5,371.7 L177.6,372.7 L178.6,373.7 L179.6,374.7 L180.6,375.6 L181.6,376.5 L182.6,377.4 L183.6,378.3 
		L184.6,379.2 L185.6,380.1 L186.6,380.9 L187.6,381.7 L188.6,382.5 L189.6,383.3 L190.6,384.1 L191.6,384.9 
		L192.6,385.6 L193.7,386.3 L194.7,387.0 L195.7,387.7 L196.7,388.4 L197.7,389.1 L198.7,389.8 L199.7,390.4 
		L200.7,391.0 L201.7,391.7 L202.7,392.3 L203.7,392.9 L204.7,393.4 L205.7,394.0 L206.7,394.6 L207.7,395.1 
		L208.7,395.7 L209.7,396.2 L210.8,396.7 L211.8,397.2 L212.8,397.7 L213.8,398.2 L214.8,398.7 L215.8,399.2 
		L216.8,399.6 L217.8,400.1 L218.8,400.5 L219.8,401.0 L220.8,401.4 L221.8,401.8 L222.8,402.2 L223.8,402.6 
		L224.8,403.0 L225.8,403.4 L226.9,403.8 L227.9,404.1 L228.9,404.5 L229.9,404.8 L230.9,405.2 L231.9,405.5 
		L232.9,405.9 L233.9,406.2 L234.9,406.5 L235.9,406.8 L236.9,407.1 L237.9,407.4 L238.9,407.7 L239.9,408.0 
		L240.9,408.3 L241.9,408.6 L243.0,408.9 L244.0,409.1 L245.0,409.4 L246.0,409.6 L247.0,409.9 L248.0,410.1 
		L249.0,410.4 L250.0,410.6 L251.0,410.9 L252.0,411.1 L253.0,411.3 L254.0,411.5 L255.0,411.7 L256.0,412.0 
		L257.0,412.2 L258.0,412.4 L259.1,412.6 L260.1,412.8 L261.1,413.0 L262.1,413.1 L263.1,413.3 L264.1,413.5 
		L265.1,413.7 L266.1,413.9 L267.1,414.0 L268.1,414.2 L269.1,414.4 L270.1,414.5 L271.1,414.7 L272.1,414.8 
		L273.1,415.0 L274.1,415.1 L275.2,415.3 L276.2,415.4 L277.2,415.5 L278.2,415.7 L279.2,415.8 L280.2,415.9 
		L281.2,416.1 L282.2,416.2 L283.2,416.3 L284.2,416.4 L285.2,416.6 L286.2,416.7 L287.2,416.8 L288.2,416.9 
		L289.2,417.0 L290.2,417.1 L291.3,417.2 L292.3,417.3 L293.3,417.4 L294.3,417.5 L295.3,417.6 L296.3,417.7 
		L297.3,417.8 L298.3,417.9 L299.3,418.0 L300.3,418.1 L301.3,418.2 L302.3,418.2 L303.3,418.3 L304.3,418.4 
		L305.3,418.5 L306.3,418.6 L307.4,418.6 L308.4,418.7 L309.4,418.8 L310.4,418.9 L311.4,418.9 L312.4,419.0 
		L313.4,419.1 L314.4,419.1 L315.4,419.2 L316.4,419.3 L317.4,419.3 L318.4,419.4 L319.4,419.4 L320.4,419.5 
		L321.4,419.6 L322.4,419.6 L323.5,419.7 L324.5,419.7 L325.5,419.8 L326.5,419.8 L327.5,419.9 L328.5,419.9 
		L329.5,420.0 L330.5,420.0 L331.5,420.1 L332.5,420.1 L333.5,420.2 L334.5,420.2 L335.5,420.2 L336.5,420.3 
		L337.5,420.3 L338.5,420.4 L339.5,420.4 L340.6,420.5 L341.6,420.5 L342.6,420.5 L343.6,420.6 L344.6,420.6 
		L345.6,420.6 L346.6,420.7 L347.6,420.7 L348.6,420.7 L349.6,420.8 L350.6,420.8 L351.6,420.8 L352.6,420.9 
		L353.6,420.9 L354.6,420.9 L355.6,421.0 L356.7,421.0 L357.7,421.0 L358.7,421.0 L359.7,421.1 L360.7,421.1 
		L361.7,421.1 L362.7,421.1 L363.7,421.2 L364.7,421.2 L365.7,421.2 L366.7,421.2 L367.7,421.3 L368.7,421.3 
		L369.7,421.3 L370.7,421.3 L371.7,421.4 L372.8,421.4 L373.8,421.4 L374.8,421.4 L375.8,421.4 L376.8,421.5 
		L377.8,421.5 L378.8,421.5 L379.8,421.5 L380.8,421.5 L381.8,421.5 L382.8,421.6 L383.8,421.6 L384.8,421.6 
		L385.8,421.6 L386.8,421.6 L387.8,421.6 L388.9,421.7 L389.9,421.7 L390.9,421.7 L391.9,421.7 L392.9,421.7 
		L393.9,421.7 L394.9,421.7 L395.9,421.8 L396.9,421.8 L397.9,421.8 L398.9,421.8 L399.9,421.8 L400.9,421.8 
		L401.9,421.8 L402.9,421.8 L403.9,421.8 L405.0,421.9 L406.0,421.9 L407.0,421.9 L408.0,421.9 L409.0,421.9 
		L410.0,421.9 L411.0,421.9 L412.0,421.9 L413.0,421.9 L414.0,421.9 L415.0,422.0 L416.0,422.0 L417.0,422.0 
		L418.0,422.0 L419.0,422.0 L420.0,422.0 L421.1,422.0 L422.1,422.0 L423.1,422.0 L424.1,422.0 L425.1,422.0 
		L426.1,422.0 L427.1,422.1 L428.1,422.1 L429.1,422.1 L430.1,422.1 L431.1,422.1 L432.1,422.1 L433.1,422.1 
		L434.1,422.1 L435.1,422.1 L436.1,422.1 L437.2,422.1 L438.2,422.1 L439.2,422.1 L440.2,422.1 L441.2,422.1 
		L442.2,422.1 L443.2,422.1 L444.2,422.2 L445.2,422.2 L446.2,422.2 L447.2,422.2 L448.2,422.2 L449.2,422.2 
		L450.2,422.2 L451.2,422.2 L452.2,422.2 L453.2,422.2 L454.3,422.2 L455.3,422.2 L456.3,422.2 L457.3,422.2 
		L458.3,422.2 L459.3,422.2 L460.3,422.2 L461.3,422.2 L462.3,422.2 L463.3,422.2 L464.3,422.2 L465.3,422.2 
		L466.3,422.2 L467.3,422.2 L468.3,422.2 L469.3,422.2 L470.4,422.3 L471.4,422.3 L472.4,422.3 L473.4,422.3 
		L474.4,422.3 L475.4,422.3 L476.4,422.3 L477.4,422.3 L478.4,422.3 L479.4,422.3 L480.4,422.3 L481.4,422.3 
		L482.4,422.3 L483.4,422.3 L484.4,422.3 L485.4,422.3 L486.5,422.3 L487.5,422.3 L488.5,422.3 L489.5,422.3 
		L490.5,422.3 L491.5,422.3 L492.5,422.3 L493.5,422.3 L494.5,422.3 L495.5,422.3 L496.5,422.3 L497.5,422.3 
		L498.5,422.3 L499.5,422.3 L500.5,422.3 L501.5,422.3 L502.6,422.3 L503.6,422.3 L504.6,422.3 L505.6,422.3 
		L506.6,422.3 L507.6,422.3 L508.6,422.3 L509.6,422.3 L510.6,422.3 L511.6,422.3 L512.6,422.3 L513.6,422.3 
		L514.6,422.3 L515.6,422.3 L516.6,422.3 L517.6,422.3 L518.7,422.3 L519.7,422.3 L520.7,422.3 L521.7,422.3 
		L522.7,422.3 L523.7,422.3 L524.7,422.3 L525.7,422.4 L526.7,422.4 L527.7,422.4 L528.7,422.4 L529.7,422.4 
		L530.7,422.4 L531.7,422.4 L532.7,422.4 L533.7,422.4 L534.8,422.4 L535.8,422.4 L536.8,422.4 L537.8,422.4 
		L538.8,422.4 L539.8,422.4 L540.8,422.4 L541.8,422.4 L542.8,422.4 L543.8,422.4 L544.8,422.4 L545.8,422.4 
		L546.8,422.4 L547.8,422.4 L548.8,422.4 L549.8,422.4 L550.9,422.4 L551.9,422.4 L552.9,422.4 L553.9,422.4 
		L554.9,422.4 L555.9,422.4 L556.9,422.4 L557.9,422.4 L558.9,422.4 L559.9,422.4 L560.9,422.4 L561.9,422.4 
		L562.9,422.4 L563.9,422.4 L564.9,422.4 L565.9,422.4 L567.0,422.4 L568.0,422.4 L569.0,422.4 L570.0,422.4 
		L571.0,422.4 L572.0,422.4 L573.0,422.4 L574.0,422.4 L575.0,422.4 '></path>
</g>
	</g>
	<g id="Plot_2"><title>Plot_2</title>
<g style="fill:none; color:green; stroke:currentColor; stroke-width:1.00; stroke-linecap:butt; stroke-linejoin:miter">
	<path  d='M71.9,219.5 L72.9,221.6 L73.9,223.6 L74.9,225.5 L75.9,227.5 L76.9,229.4 L77.9,231.4 L78.9,233.3 
		L79.9,235.1 L81.0,237.0 L82.0,238.9 L83.0,240.7 L84.0,242.5 L85.0,244.3 L86.0,246.1 L87.0,247.8 
		L88.0,249.5 L89.0,251.3 L90.0,253.0 L91.0,254.7 L92.0,256.3 L93.0,258.0 L94.0,259.6 L95.0,261.2 
		L96.0,262.8 L97.1,264.4 L98.1,266.0 L99.1,267.5 L100.1,269.1 L101.1,270.6 L102.1,272.1 L103.1,273.6 
		L104.1,275.1 L105.1,276.6 L106.1,278.0 L107.1,279.5 L108.1,280.9 L109.1,282.3 L110.1,283.7 L111.1,285.1 
		L112.1,286.4 L113.2,287.8 L114.2,289.1 L115.2,290.4 L116.2,291.8 L117.2,293.1 L118.2,294.3 L119.2,295.6 
		L120.2,296.9 L121.2,298.1 L122.2,299.4 L123.2,300.6 L124.2,301.8 L125.2,303.0 L126.2,304.2 L127.2,305.4 
		L128.2,306.5 L129.3,307.7 L130.3,308.8 L131.3,310.0 L132.3,311.1 L133.3,312.2 L134.3,313.3 L135.3,314.4 
		L136.3,315.4 L137.3,316.5 L138.3,317.6 L139.3,318.6 L140.3,319.6 L141.3,320.7 L142.3,321.7 L143.3,322.7 
		L144.3,323.7 L145.4,324.6 L146.4,325.6 L147.4,326.6 L148.4,327.5 L149.4,328.5 L150.4,329.4 L151.4,330.3 
		L152.4,331.3 L153.4,332.2 L154.4,333.1 L155.4,333.9 L156.4,334.8 L157.4,335.7 L158.4,336.6 L159.4,337.4 
		L160.4,338.3 L161.5,339.1 L162.5,339.9 L163.5,340.7 L164.5,341.6 L165.5,342.4 L166.5,343.2 L167.5,343.9 
		L168.5,344.7 L169.5,345.5 L170.5,346.3 L171.5,347.0 L172.5,347.8 L173.5,348.5 L174.5,349.3 L175.5,350.0 
		L176.5,350.7 L177.6,351.4 L178.6,352.1 L179.6,352.8 L180.6,353.5 L181.6,354.2 L182.6,354.9 L183.6,355.5 
		L184.6,356.2 L185.6,356.9 L186.6,357.5 L187.6,358.2 L188.6,358.8 L189.6,359.4 L190.6,360.1 L191.6,360.7 
		L192.6,361.3 L193.7,361.9 L194.7,362.5 L195.7,363.1 L196.7,363.7 L197.7,364.3 L198.7,364.9 L199.7,365.4 
		L200.7,366.0 L201.7,366.6 L202.7,367.1 L203.7,367.7 L204.7,368.2 L205.7,368.8 L206.7,369.3 L207.7,369.8 
		L208.7,370.3 L209.7,370.9 L210.8,371.4 L211.8,371.9 L212.8,372.4 L213.8,372.9 L214.8,373.4 L215.8,373.9 
		L216.8,374.3 L217.8,374.8 L218.8,375.3 L219.8,375.8 L220.8,376.2 L221.8,376.7 L222.8,377.1 L223.8,377.6 
		L224.8,378.0 L225.8,378.5 L226.9,378.9 L227.9,379.3 L228.9,379.8 L229.9,380.2 L230.9,380.6 L231.9,381.0 
		L232.9,381.4 L233.9,381.9 L234.9,382.3 L235.9,382.7 L236.9,383.1 L237.9,383.4 L238.9,383.8 L239.9,384.2 
		L240.9,384.6 L241.9,385.0 L243.0,385.3 L244.0,385.7 L245.0,386.1 L246.0,386.4 L247.0,386.8 L248.0,387.1 
		L249.0,387.5 L250.0,387.8 L251.0,388.2 L252.0,388.5 L253.0,388.9 L254.0,389.2 L255.0,389.5 L256.0,389.9 
		L257.0,390.2 L258.0,390.5 L259.1,390.8 L260.1,391.1 L261.1,391.4 L262.1,391.8 L263.1,392.1 L264.1,392.4 
		L265.1,392.7 L266.1,393.0 L267.1,393.2 L268.1,393.5 L269.1,393.8 L270.1,394.1 L271.1,394.4 L272.1,394.7 
		L273.1,394.9 L274.1,395.2 L275.2,395.5 L276.2,395.8 L277.2,396.0 L278.2,396.3 L279.2,396.5 L280.2,396.8 
		L281.2,397.1 L282.2,397.3 L283.2,397.6 L284.2,397.8 L285.2,398.1 L286.2,398.3 L287.2,398.5 L288.2,398.8 
		L289.2,399.0 L290.2,399.2 L291.3,399.5 L292.3,399.7 L293.3,399.9 L294.3,400.1 L295.3,400.4 L296.3,400.6 
		L297.3,400.8 L298.3,401.0 L299.3,401.2 L300.3,401.4 L301.3,401.7 L302.3,401.9 L303.3,402.1 L304.3,402.3 
		L305.3,402.5 L306.3,402.7 L307.4,402.9 L308.4,403.1 L309.4,403.2 L310.4,403.4 L311.4,403.6 L312.4,403.8 
		L313.4,404.0 L314.4,404.2 L315.4,404.4 L316.4,404.5 L317.4,404.7 L318.4,404.9 L319.4,405.1 L320.4,405.2 
		L321.4,405.4 L322.4,405.6 L323.5,405.7 L324.5,405.9 L325.5,406.1 L326.5,406.2 L327.5,406.4 L328.5,406.6 
		L329.5,406.7 L330.5,406.9 L331.5,407.0 L332.5,407.2 L333.5,407.3 L334.5,407.5 L335.5,407.6 L336.5,407.8 
		L337.5,407.9 L338.5,408.1 L339.5,408.2 L340.6,408.4 L341.6,408.5 L342.6,408.6 L343.6,408.8 L344.6,408.9 
		L345.6,409.0 L346.6,409.2 L347.6,409.3 L348.6,409.4 L349.6,409.6 L350.6,409.7 L351.6,409.8 L352.6,409.9 
		L353.6,410.1 L354.6,410.2 L355.6,410.3 L356.7,410.4 L357.7,410.5 L358.7,410.7 L359.7,410.8 L360.7,410.9 
		L361.7,411.0 L362.7,411.1 L363.7,411.2 L364.7,411.3 L365.7,411.5 L366.7,411.6 L367.7,411.7 L368.7,411.8 
		L369.7,411.9 L370.7,412.0 L371.7,412.1 L372.8,412.2 L373.8,412.3 L374.8,412.4 L375.8,412.5 L376.8,412.6 
		L377.8,412.7 L378.8,412.8 L379.8,412.9 L380.8,413.0 L381.8,413.1 L382.8,413.2 L383.8,413.3 L384.8,413.4 
		L385.8,413.4 L386.8,413.5 L387.8,413.6 L388.9,413.7 L389.9,413.8 L390.9,413.9 L391.9,414.0 L392.9,414.0 
		L393.9,414.1 L394.9,414.2 L395.9,414.3 L396.9,414.4 L397.9,414.5 L398.9,414.5 L399.9,414.6 L400.9,414.7 
		L401.9,414.8 L402.9,414.8 L403.9,414.9 L405.0,415.0 L406.0,415.1 L407.0,415.1 L408.0,415.2 L409.0,415.3 
		L410.0,415.4 L411.0,415.4 L412.0,415.5 L413.0,415.6 L414.0,415.6 L415.0,415.7 L416.0,415.8 L417.0,415.8 
		L418.0,415.9 L419.0,416.0 L420.0,416.0 L421.1,416.1 L422.1,416.2 L423.1,416.2 L424.1,416.3 L425.1,416.3 
		L426.1,416.4 L427.1,416.5 L428.1,416.5 L429.1,416.6 L430.1,416.6 L431.1,416.7 L432.1,416.7 L433.1,416.8 
		L434.1,416.9 L435.1,416.9 L436.1,417.0 L437.2,417.0 L438.2,417.1 L439.2,417.1 L440.2,417.2 L441.2,417.2 
		L442.2,417.3 L443.2,417.3 L444.2,417.4 L445.2,417.4 L446.2,417.5 L447.2,417.5 L448.2,417.6 L449.2,417.6 
		L450.2,417.7 L451.2,417.7 L452.2,417.8 L453.2,417.8 L454.3,417.9 L455.3,417.9 L456.3,418.0 L457.3,418.0 
		L458.3,418.0 L459.3,418.1 L460.3,418.1 L461.3,418.2 L462.3,418.2 L463.3,418.3 L464.3,418.3 L465.3,418.3 
		L466.3,418.4 L467.3,418.4 L468.3,418.5 L469.3,418.5 L470.4,418.5 L471.4,418.6 L472.4,418.6 L473.4,418.6 
		L474.4,418.7 L475.4,418.7 L476.4,418.8 L477.4,418.8 L478.4,418.8 L479.4,418.9 L480.4,418.9 L481.4,418.9 
		L482.4,419.0 L483.4,419.0 L484.4,419.0 L485.4,419.1 L486.5,419.1 L487.5,419.1 L488.5,419.2 L489.5,419.2 
		L490.5,419.2 L491.5,419.3 L492.5,419.3 L493.5,419.3 L494.5,419.4 L495.5,419.4 L496.5,419.4 L497.5,419.4 
		L498.5,419.5 L499.5,419.5 L500.5,419.5 L501.5,419.6 L502.6,419.6 L503.6,419.6 L504.6,419.6 L505.6,419.7 
		L506.6,419.7 L507.6,419.7 L508.6,419.8 L509.6,419.8 L510.6,419.8 L511.6,419.8 L512.6,419.9 L513.6,419.9 
		L514.6,419.9 L515.6,419.9 L516.6,420.0 L517.6,420.0 L518.7,420.0 L519.7,420.0 L520.7,420.1 L521.7,420.1 
		L522.7,420.1 L523.7,420.1 L524.7,420.1 L525.7,420.2 L526.7,420.2 L527.7,420.2 L528.7,420.2 L529.7,420.3 
		L530.7,420.3 L531.7,420.3 L532.7,420.3 L533.7,420.3 L534.8,420.4 L535.8,420.4 L536.8,420.4 L537.8,420.4 
		L538.8,420.4 L539.8,420.5 L540.8,420.5 L541.8,420.5 L542.8,420.5 L543.8,420.5 L544.8,420.6 L545.8,420.6 
		L546.8,420.6 L547.8,420.6 L548.8,420.6 L549.8,420.6 L550.9,420.7 L551.9,420.7 L552.9,420.7 L553.9,420.7 
		L554.9,420.7 L555.9,420.7 L556.9,420.8 L557.9,420.8 L558.9,420.8 L559.9,420.8 L560.9,420.8 L561.9,420.8 
		L562.9,420.9 L563.9,420.9 L564.9,420.9 L565.9,420.9 L567.0,420.9 L568.0,420.9 L569.0,420.9 L570.0,421.0 
		L571.0,421.0 L572.0,421.0 L573.0,421.0 L574.0,421.0 L575.0,421.0 '></path>
</g>
	</g>
	<g id="Plot_3"><title>Plot_3</title>
<g style="fill:none; color:blue; stroke:currentColor; stroke-width:1.00; stroke-linecap:butt; stroke-linejoin:miter">
	<path  d='M71.9,287.2 L72.9,288.1 L73.9,289.0 L74.9,289.8 L75.9,290.7 L76.9,291.6 L77.9,292.5 L78.9,293.3 
		L79.9,294.2 L81.0,295.0 L82.0,295.9 L83.0,296.7 L84.0,297.6 L85.0,298.4 L86.0,299.2 L87.0,300.0 
		L88.0,300.8 L89.0,301.7 L90.0,302.5 L91.0,303.3 L92.0,304.0 L93.0,304.8 L94.0,305.6 L95.0,306.4 
		L96.0,307.2 L97.1,307.9 L98.1,308.7 L99.1,309.4 L100.1,310.2 L101.1,310.9 L102.1,311.7 L103.1,312.4 
		L104.1,313.1 L105.1,313.9 L106.1,314.6 L107.1,315.3 L108.1,316.0 L109.1,316.7 L110.1,317.4 L111.1,318.1 
		L112.1,318.8 L113.2,319.5 L114.2,320.2 L115.2,320.9 L116.2,321.5 L117.2,322.2 L118.2,322.9 L119.2,323.5 
		L120.2,324.2 L121.2,324.9 L122.2,325.5 L123.2,326.1 L124.2,326.8 L125.2,327.4 L126.2,328.1 L127.2,328.7 
		L128.2,329.3 L129.3,329.9 L130.3,330.5 L131.3,331.1 L132.3,331.8 L133.3,332.4 L134.3,333.0 L135.3,333.5 
		L136.3,334.1 L137.3,334.7 L138.3,335.3 L139.3,335.9 L140.3,336.5 L141.3,337.0 L142.3,337.6 L143.3,338.2 
		L144.3,338.7 L145.4,339.3 L146.4,339.8 L147.4,340.4 L148.4,340.9 L149.4,341.5 L150.4,342.0 L151.4,342.5 
		L152.4,343.1 L153.4,343.6 L154.4,344.1 L155.4,344.6 L156.4,345.2 L157.4,345.7 L158.4,346.2 L159.4,346.7 
		L160.4,347.2 L161.5,347.7 L162.5,348.2 L163.5,348.7 L164.5,349.2 L165.5,349.7 L166.5,350.1 L167.5,350.6 
		L168.5,351.1 L169.5,351.6 L170.5,352.0 L171.5,352.5 L172.5,353.0 L173.5,353.4 L174.5,353.9 L175.5,354.3 
		L176.5,354.8 L177.6,355.2 L178.6,355.7 L179.6,356.1 L180.6,356.6 L181.6,357.0 L182.6,357.4 L183.6,357.9 
		L184.6,358.3 L185.6,358.7 L186.6,359.2 L187.6,359.6 L188.6,360.0 L189.6,360.4 L190.6,360.8 L191.6,361.2 
		L192.6,361.6 L193.7,362.0 L194.7,362.4 L195.7,362.8 L196.7,363.2 L197.7,363.6 L198.7,364.0 L199.7,364.4 
		L200.7,364.8 L201.7,365.2 L202.7,365.6 L203.7,365.9 L204.7,366.3 L205.7,366.7 L206.7,367.1 L207.7,367.4 
		L208.7,367.8 L209.7,368.1 L210.8,368.5 L211.8,368.9 L212.8,369.2 L213.8,369.6 L214.8,369.9 L215.8,370.3 
		L216.8,370.6 L217.8,371.0 L218.8,371.3 L219.8,371.6 L220.8,372.0 L221.8,372.3 L222.8,372.7 L223.8,373.0 
		L224.8,373.3 L225.8,373.6 L226.9,374.0 L227.9,374.3 L228.9,374.6 L229.9,374.9 L230.9,375.2 L231.9,375.5 
		L232.9,375.9 L233.9,376.2 L234.9,376.5 L235.9,376.8 L236.9,377.1 L237.9,377.4 L238.9,377.7 L239.9,378.0 
		L240.9,378.3 L241.9,378.6 L243.0,378.9 L244.0,379.1 L245.0,379.4 L246.0,379.7 L247.0,380.0 L248.0,380.3 
		L249.0,380.6 L250.0,380.8 L251.0,381.1 L252.0,381.4 L253.0,381.7 L254.0,381.9 L255.0,382.2 L256.0,382.5 
		L257.0,382.7 L258.0,383.0 L259.1,383.3 L260.1,383.5 L261.1,383.8 L262.1,384.0 L263.1,384.3 L264.1,384.5 
		L265.1,384.8 L266.1,385.0 L267.1,385.3 L268.1,385.5 L269.1,385.8 L270.1,386.0 L271.1,386.3 L272.1,386.5 
		L273.1,386.8 L274.1,387.0 L275.2,387.2 L276.2,387.5 L277.2,387.7 L278.2,387.9 L279.2,388.2 L280.2,388.4 
		L281.2,388.6 L282.2,388.8 L283.2,389.1 L284.2,389.3 L285.2,389.5 L286.2,389.7 L287.2,389.9 L288.2,390.1 
		L289.2,390.4 L290.2,390.6 L291.3,390.8 L292.3,391.0 L293.3,391.2 L294.3,391.4 L295.3,391.6 L296.3,391.8 
		L297.3,392.0 L298.3,392.2 L299.3,392.4 L300.3,392.6 L301.3,392.8 L302.3,393.0 L303.3,393.2 L304.3,393.4 
		L305.3,393.6 L306.3,393.8 L307.4,394.0 L308.4,394.2 L309.4,394.4 L310.4,394.5 L311.4,394.7 L312.4,394.9 
		L313.4,395.1 L314.4,395.3 L315.4,395.5 L316.4,395.6 L317.4,395.8 L318.4,396.0 L319.4,396.2 L320.4,396.3 
		L321.4,396.5 L322.4,396.7 L323.5,396.9 L324.5,397.0 L325.5,397.2 L326.5,397.4 L327.5,397.5 L328.5,397.7 
		L329.5,397.9 L330.5,398.0 L331.5,398.2 L332.5,398.3 L333.5,398.5 L334.5,398.7 L335.5,398.8 L336.5,399.0 
		L337.5,399.1 L338.5,399.3 L339.5,399.4 L340.6,399.6 L341.6,399.7 L342.6,399.9 L343.6,400.0 L344.6,400.2 
		L345.6,400.3 L346.6,400.5 L347.6,400.6 L348.6,400.8 L349.6,400.9 L350.6,401.1 L351.6,401.2 L352.6,401.3 
		L353.6,401.5 L354.6,401.6 L355.6,401.8 L356.7,401.9 L357.7,402.0 L358.7,402.2 L359.7,402.3 L360.7,402.4 
		L361.7,402.6 L362.7,402.7 L363.7,402.8 L364.7,403.0 L365.7,403.1 L366.7,403.2 L367.7,403.4 L368.7,403.5 
		L369.7,403.6 L370.7,403.7 L371.7,403.9 L372.8,404.0 L373.8,404.1 L374.8,404.2 L375.8,404.3 L376.8,404.5 
		L377.8,404.6 L378.8,404.7 L379.8,404.8 L380.8,404.9 L381.8,405.0 L382.8,405.2 L383.8,405.3 L384.8,405.4 
		L385.8,405.5 L386.8,405.6 L387.8,405.7 L388.9,405.8 L389.9,405.9 L390.9,406.1 L391.9,406.2 L392.9,406.3 
		L393.9,406.4 L394.9,406.5 L395.9,406.6 L396.9,406.7 L397.9,406.8 L398.9,406.9 L399.9,407.0 L400.9,407.1 
		L401.9,407.2 L402.9,407.3 L403.9,407.4 L405.0,407.5 L406.0,407.6 L407.0,407.7 L408.0,407.8 L409.0,407.9 
		L410.0,408.0 L411.0,408.1 L412.0,408.2 L413.0,408.3 L414.0,408.4 L415.0,408.5 L416.0,408.6 L417.0,408.7 
		L418.0,408.8 L419.0,408.8 L420.0,408.9 L421.1,409.0 L422.1,409.1 L423.1,409.2 L424.1,409.3 L425.1,409.4 
		L426.1,409.5 L427.1,409.5 L428.1,409.6 L429.1,409.7 L430.1,409.8 L431.1,409.9 L432.1,410.0 L433.1,410.0 
		L434.1,410.1 L435.1,410.2 L436.1,410.3 L437.2,410.4 L438.2,410.5 L439.2,410.5 L440.2,410.6 L441.2,410.7 
		L442.2,410.8 L443.2,410.8 L444.2,410.9 L445.2,411.0 L446.2,411.1 L447.2,411.2 L448.2,411.2 L449.2,411.3 
		L450.2,411.4 L451.2,411.4 L452.2,411.5 L453.2,411.6 L454.3,411.7 L455.3,411.7 L456.3,411.8 L457.3,411.9 
		L458.3,411.9 L459.3,412.0 L460.3,412.1 L461.3,412.2 L462.3,412.2 L463.3,412.3 L464.3,412.4 L465.3,412.4 
		L466.3,412.5 L467.3,412.6 L468.3,412.6 L469.3,412.7 L470.4,412.7 L471.4,412.8 L472.4,412.9 L473.4,412.9 
		L474.4,413.0 L475.4,413.1 L476.4,413.1 L477.4,413.2 L478.4,413.3 L479.4,413.3 L480.4,413.4 L481.4,413.4 
		L482.4,413.5 L483.4,413.6 L484.4,413.6 L485.4,413.7 L486.5,413.7 L487.5,413.8 L488.5,413.8 L489.5,413.9 
		L490.5,414.0 L491.5,414.0 L492.5,414.1 L493.5,414.1 L494.5,414.2 L495.5,414.2 L496.5,414.3 L497.5,414.3 
		L498.5,414.4 L499.5,414.4 L500.5,414.5 L501.5,414.6 L502.6,414.6 L503.6,414.7 L504.6,414.7 L505.6,414.8 
		L506.6,414.8 L507.6,414.9 L508.6,414.9 L509.6,415.0 L510.6,415.0 L511.6,415.1 L512.6,415.1 L513.6,415.2 
		L514.6,415.2 L515.6,415.3 L516.6,415.3 L517.6,415.3 L518.7,415.4 L519.7,415.4 L520.7,415.5 L521.7,415.5 
		L522.7,415.6 L523.7,415.6 L524.7,415.7 L525.7,415.7 L526.7,415.8 L527.7,415.8 L528.7,415.8 L529.7,415.9 
		L530.7,415.9 L531.7,416.0 L532.7,416.0 L533.7,416.1 L534.8,416.1 L535.8,416.1 L536.8,416.2 L537.8,416.2 
		L538.8,416.3 L539.8,416.3 L540.8,416.3 L541.8,416.4 L542.8,416.4 L543.8,416.5 L544.8,416.5 L545.8,416.5 
		L546.8,416.6 L547.8,416.6 L548.8,416.7 L549.8,416.7 L550.9,416.7 L551.9,416.8 L552.9,416.8 L553.9,416.9 
		L554.9,416.9 L555.9,416.9 L556.9,417.0 L557.9,417.0 L558.9,417.0 L559.9,417.1 L560.9,417.1 L561.9,417.1 
		L562.9,417.2 L563.9,417.2 L564.9,417.2 L565.9,417.3 L567.0,417.3 L568.0,417.3 L569.0,417.4 L570.0,417.4 
		L571.0,417.4 L572.0,417.5 L573.0,417.5 L574.0,417.5 L575.0,417.6 '></path>
</g>
	</g>
<g style="fill:none; color:black; stroke:currentColor; stroke-width:1.00; stroke-linecap:butt; stroke-linejoin:miter">
	<path  d='M71.9,16.7 L71.9,422.4 L575.0,422.4 L575.0,16.7 L71.9,16.7 Z '></path>
</g>
</svg>

