<?xml version="1.0" encoding="utf-8"  standalone="no"?>
<!DOCTYPE svg PUBLIC "-//W3C//DTD SVG 1.1//EN" 
 "http://www.w3.org/Graphics/SVG/1.1/DTD/svg11.dtd">
<!--
  Copyright (c) 2010, 2022 Contributors to the Eclipse Foundation

  See the NOTICE file(s) distributed with this work for additional
  information regarding copyright ownership.

  This program and the accompanying materials are made available under the terms
  of the MIT License which is available at https://opensource.org/licenses/MIT

  SPDX-License-Identifier: MIT
-->
<svg width="600" height="480" viewBox="0 0 600 480"
 xmlns="http://www.w3.org/2000/svg"
 xmlns:xlink="http://www.w3.org/1999/xlink"
>

<title>gnuplot</title>
<desc>Produced by GNUPLOT 4.4 patchlevel 4 </desc>

<defs>

	<circle id='gpDot' r='0.5' stroke-width='0.5'/>
	<path id='gpPt0' stroke-width='0.222' stroke='currentColor' d='M-1,0 h2 M0,-1 v2'/>
	<path id='gpPt1' stroke-width='0.222' stroke='currentColor' d='M-1,-1 L1,1 M1,-1 L-1,1'/>
	<path id='gpPt2' stroke-width='0.222' stroke='currentColor' d='M-1,0 L1,0 M0,-1 L0,1 M-1,-1 L1,1 M-1,1 L1,-1'/>
	<rect id='gpPt3' stroke-width='0.222' stroke='currentColor' x='-1' y='-1' width='2' height='2'/>
	<rect id='gpPt4' stroke-width='0.222' stroke='currentColor' fill='currentColor' x='-1' y='-1' width='2' height='2'/>
	<circle id='gpPt5' stroke-width='0.222' stroke='currentColor' cx='0' cy='0' r='1'/>
	<use xlink:href='#gpPt5' id='gpPt6' fill='currentColor' stroke='none'/>
	<path id='gpPt7' stroke-width='0.222' stroke='currentColor' d='M0,-1.33 L-1.33,0.67 L1.33,0.67 z'/>
	<use xlink:href='#gpPt7' id='gpPt8' fill='currentColor' stroke='none'/>
	<use xlink:href='#gpPt7' id='gpPt9' stroke='currentColor' transform='rotate(180)'/>
	<use xlink:href='#gpPt9' id='gpPt10' fill='currentColor' stroke='none'/>
	<use xlink:href='#gpPt3' id='gpPt11' stroke='currentColor' transform='rotate(45)'/>
	<use xlink:href='#gpPt11' id='gpPt12' fill='currentColor' stroke='none'/>
</defs>
<g style="fill:none; color:white; stroke:currentColor; stroke-width:1.00; stroke-linecap:butt; stroke-linejoin:miter">
</g>
<g style="fill:none; color:black; stroke:currentColor; stroke-width:1.00; stroke-linecap:butt; stroke-linejoin:miter">
	<path  d='M71.9,422.4 L80.9,422.4 M575.0,422.4 L566.0,422.4 '></path>
	<g transform="translate(63.6,426.9)" style="stroke:none; fill:black; font-family:Arial; font-size:12.00pt; text-anchor:end">
		<text> 0</text>
	</g>
	<path  d='M71.9,377.3 L80.9,377.3 M575.0,377.3 L566.0,377.3 '></path>
	<g transform="translate(63.6,381.8)" style="stroke:none; fill:black; font-family:Arial; font-size:12.00pt; text-anchor:end">
		<text> 0.2</text>
	</g>
	<path  d='M71.9,332.2 L80.9,332.2 M575.0,332.2 L566.0,332.2 '></path>
	<g transform="translate(63.6,336.7)" style="stroke:none; fill:black; font-family:Arial; font-size:12.00pt; text-anchor:end">
		<text> 0.4</text>
	</g>
	<path  d='M71.9,287.2 L80.9,287.2 M575.0,287.2 L566.0,287.2 '></path>
	<g transform="translate(63.6,291.7)" style="stroke:none; fill:black; font-family:Arial; font-size:12.00pt; text-anchor:end">
		<text> 0.6</text>
	</g>
	<path  d='M71.9,242.1 L80.9,242.1 M575.0,242.1 L566.0,242.1 '></path>
	<g transform="translate(63.6,246.6)" style="stroke:none; fill:black; font-family:Arial; font-size:12.00pt; text-anchor:end">
		<text> 0.8</text>
	</g>
	<path  d='M71.9,197.0 L80.9,197.0 M575.0,197.0 L566.0,197.0 '></path>
	<g transform="translate(63.6,201.5)" style="stroke:none; fill:black; font-family:Arial; font-size:12.00pt; text-anchor:end">
		<text> 1</text>
	</g>
	<path  d='M71.9,151.9 L80.9,151.9 M575.0,151.9 L566.0,151.9 '></path>
	<g transform="translate(63.6,156.4)" style="stroke:none; fill:black; font-family:Arial; font-size:12.00pt; text-anchor:end">
		<text> 1.2</text>
	</g>
	<path  d='M71.9,106.9 L80.9,106.9 M575.0,106.9 L566.0,106.9 '></path>
	<g transform="translate(63.6,111.4)" style="stroke:none; fill:black; font-family:Arial; font-size:12.00pt; text-anchor:end">
		<text> 1.4</text>
	</g>
	<path  d='M71.9,61.8 L80.9,61.8 M575.0,61.8 L566.0,61.8 '></path>
	<g transform="translate(63.6,66.3)" style="stroke:none; fill:black; font-family:Arial; font-size:12.00pt; text-anchor:end">
		<text> 1.6</text>
	</g>
	<path  d='M71.9,16.7 L80.9,16.7 M575.0,16.7 L566.0,16.7 '></path>
	<g transform="translate(63.6,21.2)" style="stroke:none; fill:black; font-family:Arial; font-size:12.00pt; text-anchor:end">
		<text> 1.8</text>
	</g>
	<path  d='M71.9,422.4 L71.9,413.4 M71.9,16.7 L71.9,25.7 '></path>
	<g transform="translate(71.9,444.9)" style="stroke:none; fill:black; font-family:Arial; font-size:12.00pt; text-anchor:middle">
		<text> 0</text>
	</g>
	<path  d='M134.8,422.4 L134.8,413.4 M134.8,16.7 L134.8,25.7 '></path>
	<g transform="translate(134.8,444.9)" style="stroke:none; fill:black; font-family:Arial; font-size:12.00pt; text-anchor:middle">
		<text> 0.5</text>
	</g>
	<path  d='M197.7,422.4 L197.7,413.4 M197.7,16.7 L197.7,25.7 '></path>
	<g transform="translate(197.7,444.9)" style="stroke:none; fill:black; font-family:Arial; font-size:12.00pt; text-anchor:middle">
		<text> 1</text>
	</g>
	<path  d='M260.6,422.4 L260.6,413.4 M260.6,16.7 L260.6,25.7 '></path>
	<g transform="translate(260.6,444.9)" style="stroke:none; fill:black; font-family:Arial; font-size:12.00pt; text-anchor:middle">
		<text> 1.5</text>
	</g>
	<path  d='M323.5,422.4 L323.5,413.4 M323.5,16.7 L323.5,25.7 '></path>
	<g transform="translate(323.5,444.9)" style="stroke:none; fill:black; font-family:Arial; font-size:12.00pt; text-anchor:middle">
		<text> 2</text>
	</g>
	<path  d='M386.3,422.4 L386.3,413.4 M386.3,16.7 L386.3,25.7 '></path>
	<g transform="translate(386.3,444.9)" style="stroke:none; fill:black; font-family:Arial; font-size:12.00pt; text-anchor:middle">
		<text> 2.5</text>
	</g>
	<path  d='M449.2,422.4 L449.2,413.4 M449.2,16.7 L449.2,25.7 '></path>
	<g transform="translate(449.2,444.9)" style="stroke:none; fill:black; font-family:Arial; font-size:12.00pt; text-anchor:middle">
		<text> 3</text>
	</g>
	<path  d='M512.1,422.4 L512.1,413.4 M512.1,16.7 L512.1,25.7 '></path>
	<g transform="translate(512.1,444.9)" style="stroke:none; fill:black; font-family:Arial; font-size:12.00pt; text-anchor:middle">
		<text> 3.5</text>
	</g>
	<path  d='M575.0,422.4 L575.0,413.4 M575.0,16.7 L575.0,25.7 '></path>
	<g transform="translate(575.0,444.9)" style="stroke:none; fill:black; font-family:Arial; font-size:12.00pt; text-anchor:middle">
		<text> 4</text>
	</g>
	<path  d='M71.9,16.7 L71.9,422.4 L575.0,422.4 L575.0,16.7 L71.9,16.7 Z '></path>
	<g transform="translate(17.6,219.6) rotate(270)" style="stroke:none; fill:black; font-family:Arial; font-size:12.00pt; text-anchor:middle">
		<text>lognormal(real m, v2)</text>
	</g>
	<g transform="translate(323.4,471.9)" style="stroke:none; fill:black; font-family:Arial; font-size:12.00pt; text-anchor:middle">
		<text>x</text>
	</g>
	<g transform="translate(411.5,388.6)" style="stroke:none; fill:black; font-family:Arial; font-size:12.00pt; text-anchor:start">
		<text>lognormal(0.0, 1.0)</text>
	</g>
	<g transform="translate(285.7,348.0)" style="stroke:none; fill:black; font-family:Arial; font-size:12.00pt; text-anchor:start">
		<text>lognormal(0.0, 0.5)</text>
	</g>
	<g transform="translate(229.1,156.4)" style="stroke:none; fill:black; font-family:Arial; font-size:12.00pt; text-anchor:start">
		<text>lognormal(0.0, 0.25)</text>
	</g>
</g>
	<g id="Plot_1"><title>Plot_1</title>
<g style="fill:none; color:red; stroke:currentColor; stroke-width:1.00; stroke-linecap:butt; stroke-linejoin:miter">
	<path  d='M71.9,422.4 L73.2,422.2 L74.4,420.3 L75.7,416.0 L76.9,409.8 L78.2,402.2 L79.4,393.8 L80.7,385.0 
		L82.0,376.1 L83.2,367.4 L84.5,358.9 L85.7,350.9 L87.0,343.2 L88.3,336.1 L89.5,329.4 L90.8,323.3 
		L92.0,317.6 L93.3,312.4 L94.5,307.6 L95.8,303.2 L97.1,299.3 L98.3,295.7 L99.6,292.5 L100.8,289.6 
		L102.1,287.1 L103.3,284.8 L104.6,282.8 L105.9,281.1 L107.1,279.6 L108.4,278.3 L109.6,277.2 L110.9,276.3 
		L112.1,275.6 L113.4,275.0 L114.7,274.6 L115.9,274.3 L117.2,274.2 L118.4,274.2 L119.7,274.2 L121.0,274.4 
		L122.2,274.7 L123.5,275.0 L124.7,275.4 L126.0,275.9 L127.2,276.5 L128.5,277.1 L129.8,277.8 L131.0,278.5 
		L132.3,279.3 L133.5,280.1 L134.8,281.0 L136.0,281.9 L137.3,282.8 L138.6,283.7 L139.8,284.7 L141.1,285.7 
		L142.3,286.7 L143.6,287.7 L144.8,288.7 L146.1,289.8 L147.4,290.9 L148.6,291.9 L149.9,293.0 L151.1,294.1 
		L152.4,295.2 L153.7,296.3 L154.9,297.4 L156.2,298.5 L157.4,299.6 L158.7,300.8 L159.9,301.9 L161.2,303.0 
		L162.5,304.1 L163.7,305.2 L165.0,306.3 L166.2,307.4 L167.5,308.5 L168.7,309.5 L170.0,310.6 L171.3,311.7 
		L172.5,312.8 L173.8,313.8 L175.0,314.9 L176.3,315.9 L177.6,317.0 L178.8,318.0 L180.1,319.0 L181.3,320.0 
		L182.6,321.1 L183.8,322.1 L185.1,323.0 L186.4,324.0 L187.6,325.0 L188.9,326.0 L190.1,326.9 L191.4,327.9 
		L192.6,328.8 L193.9,329.7 L195.2,330.7 L196.4,331.6 L197.7,332.5 L198.9,333.4 L200.2,334.3 L201.4,335.1 
		L202.7,336.0 L204.0,336.9 L205.2,337.7 L206.5,338.6 L207.7,339.4 L209.0,340.2 L210.3,341.0 L211.5,341.8 
		L212.8,342.6 L214.0,343.4 L215.3,344.2 L216.5,345.0 L217.8,345.7 L219.1,346.5 L220.3,347.2 L221.6,348.0 
		L222.8,348.7 L224.1,349.4 L225.3,350.1 L226.6,350.8 L227.9,351.5 L229.1,352.2 L230.4,352.9 L231.6,353.6 
		L232.9,354.3 L234.1,354.9 L235.4,355.6 L236.7,356.2 L237.9,356.9 L239.2,357.5 L240.4,358.1 L241.7,358.7 
		L243.0,359.3 L244.2,359.9 L245.5,360.5 L246.7,361.1 L248.0,361.7 L249.2,362.3 L250.5,362.9 L251.8,363.4 
		L253.0,364.0 L254.3,364.5 L255.5,365.1 L256.8,365.6 L258.0,366.1 L259.3,366.7 L260.6,367.2 L261.8,367.7 
		L263.1,368.2 L264.3,368.7 L265.6,369.2 L266.9,369.7 L268.1,370.2 L269.4,370.7 L270.6,371.1 L271.9,371.6 
		L273.1,372.1 L274.4,372.5 L275.7,373.0 L276.9,373.4 L278.2,373.9 L279.4,374.3 L280.7,374.8 L281.9,375.2 
		L283.2,375.6 L284.5,376.0 L285.7,376.5 L287.0,376.9 L288.2,377.3 L289.5,377.7 L290.7,378.1 L292.0,378.5 
		L293.3,378.9 L294.5,379.2 L295.8,379.6 L297.0,380.0 L298.3,380.4 L299.6,380.7 L300.8,381.1 L302.1,381.5 
		L303.3,381.8 L304.6,382.2 L305.8,382.5 L307.1,382.9 L308.4,383.2 L309.6,383.6 L310.9,383.9 L312.1,384.2 
		L313.4,384.5 L314.6,384.9 L315.9,385.2 L317.2,385.5 L318.4,385.8 L319.7,386.1 L320.9,386.4 L322.2,386.7 
		L323.5,387.0 L324.7,387.3 L326.0,387.6 L327.2,387.9 L328.5,388.2 L329.7,388.5 L331.0,388.8 L332.3,389.1 
		L333.5,389.3 L334.8,389.6 L336.0,389.9 L337.3,390.2 L338.5,390.4 L339.8,390.7 L341.1,390.9 L342.3,391.2 
		L343.6,391.5 L344.8,391.7 L346.1,392.0 L347.3,392.2 L348.6,392.4 L349.9,392.7 L351.1,392.9 L352.4,393.2 
		L353.6,393.4 L354.9,393.6 L356.2,393.9 L357.4,394.1 L358.7,394.3 L359.9,394.5 L361.2,394.8 L362.4,395.0 
		L363.7,395.2 L365.0,395.4 L366.2,395.6 L367.5,395.8 L368.7,396.0 L370.0,396.3 L371.2,396.5 L372.5,396.7 
		L373.8,396.9 L375.0,397.1 L376.3,397.3 L377.5,397.5 L378.8,397.6 L380.0,397.8 L381.3,398.0 L382.6,398.2 
		L383.8,398.4 L385.1,398.6 L386.3,398.8 L387.6,398.9 L388.9,399.1 L390.1,399.3 L391.4,399.5 L392.6,399.6 
		L393.9,399.8 L395.1,400.0 L396.4,400.2 L397.7,400.3 L398.9,400.5 L400.2,400.7 L401.4,400.8 L402.7,401.0 
		L403.9,401.1 L405.2,401.3 L406.5,401.5 L407.7,401.6 L409.0,401.8 L410.2,401.9 L411.5,402.1 L412.8,402.2 
		L414.0,402.4 L415.3,402.5 L416.5,402.7 L417.8,402.8 L419.0,402.9 L420.3,403.1 L421.6,403.2 L422.8,403.4 
		L424.1,403.5 L425.3,403.6 L426.6,403.8 L427.8,403.9 L429.1,404.0 L430.4,404.2 L431.6,404.3 L432.9,404.4 
		L434.1,404.6 L435.4,404.7 L436.6,404.8 L437.9,404.9 L439.2,405.1 L440.4,405.2 L441.7,405.3 L442.9,405.4 
		L444.2,405.5 L445.5,405.7 L446.7,405.8 L448.0,405.9 L449.2,406.0 L450.5,406.1 L451.7,406.2 L453.0,406.3 
		L454.3,406.5 L455.5,406.6 L456.8,406.7 L458.0,406.8 L459.3,406.9 L460.5,407.0 L461.8,407.1 L463.1,407.2 
		L464.3,407.3 L465.6,407.4 L466.8,407.5 L468.1,407.6 L469.3,407.7 L470.6,407.8 L471.9,407.9 L473.1,408.0 
		L474.4,408.1 L475.6,408.2 L476.9,408.3 L478.2,408.4 L479.4,408.5 L480.7,408.6 L481.9,408.7 L483.2,408.8 
		L484.4,408.9 L485.7,409.0 L487.0,409.0 L488.2,409.1 L489.5,409.2 L490.7,409.3 L492.0,409.4 L493.2,409.5 
		L494.5,409.6 L495.8,409.6 L497.0,409.7 L498.3,409.8 L499.5,409.9 L500.8,410.0 L502.1,410.1 L503.3,410.1 
		L504.6,410.2 L505.8,410.3 L507.1,410.4 L508.3,410.4 L509.6,410.5 L510.9,410.6 L512.1,410.7 L513.4,410.8 
		L514.6,410.8 L515.9,410.9 L517.1,411.0 L518.4,411.0 L519.7,411.1 L520.9,411.2 L522.2,411.3 L523.4,411.3 
		L524.7,411.4 L525.9,411.5 L527.2,411.5 L528.5,411.6 L529.7,411.7 L531.0,411.7 L532.2,411.8 L533.5,411.9 
		L534.8,411.9 L536.0,412.0 L537.3,412.1 L538.5,412.1 L539.8,412.2 L541.0,412.3 L542.3,412.3 L543.6,412.4 
		L544.8,412.5 L546.1,412.5 L547.3,412.6 L548.6,412.6 L549.8,412.7 L551.1,412.8 L552.4,412.8 L553.6,412.9 
		L554.9,412.9 L556.1,413.0 L557.4,413.0 L558.6,413.1 L559.9,413.2 L561.2,413.2 L562.4,413.3 L563.7,413.3 
		L564.9,413.4 L566.2,413.4 L567.5,413.5 L568.7,413.5 L570.0,413.6 L571.2,413.6 L572.5,413.7 L573.7,413.7 
		L575.0,413.8 '></path>
</g>
	</g>
	<g id="Plot_2"><title>Plot_2</title>
<g style="fill:none; color:green; stroke:currentColor; stroke-width:1.00; stroke-linecap:butt; stroke-linejoin:miter">
	<path  d='M71.9,422.4 L73.2,422.4 L74.4,422.4 L75.7,422.4 L76.9,422.4 L78.2,422.4 L79.4,422.4 L80.7,422.4 
		L82.0,422.4 L83.2,422.4 L84.5,422.4 L85.7,422.3 L87.0,422.2 L88.3,422.1 L89.5,421.8 L90.8,421.5 
		L92.0,421.0 L93.3,420.4 L94.5,419.6 L95.8,418.6 L97.1,417.3 L98.3,415.8 L99.6,414.1 L100.8,412.0 
		L102.1,409.6 L103.3,407.0 L104.6,404.0 L105.9,400.8 L107.1,397.3 L108.4,393.5 L109.6,389.4 L110.9,385.1 
		L112.1,380.5 L113.4,375.8 L114.7,370.8 L115.9,365.7 L117.2,360.5 L118.4,355.1 L119.7,349.6 L121.0,344.1 
		L122.2,338.5 L123.5,332.9 L124.7,327.3 L126.0,321.8 L127.2,316.2 L128.5,310.8 L129.8,305.4 L131.0,300.0 
		L132.3,294.8 L133.5,289.8 L134.8,284.8 L136.0,280.0 L137.3,275.4 L138.6,270.9 L139.8,266.6 L141.1,262.4 
		L142.3,258.5 L143.6,254.7 L144.8,251.1 L146.1,247.7 L147.4,244.5 L148.6,241.5 L149.9,238.7 L151.1,236.1 
		L152.4,233.7 L153.7,231.5 L154.9,229.5 L156.2,227.6 L157.4,226.0 L158.7,224.5 L159.9,223.2 L161.2,222.1 
		L162.5,221.1 L163.7,220.3 L165.0,219.7 L166.2,219.2 L167.5,218.9 L168.7,218.7 L170.0,218.6 L171.3,218.7 
		L172.5,218.9 L173.8,219.2 L175.0,219.7 L176.3,220.3 L177.6,220.9 L178.8,221.7 L180.1,222.6 L181.3,223.6 
		L182.6,224.6 L183.8,225.8 L185.1,227.0 L186.4,228.3 L187.6,229.6 L188.9,231.1 L190.1,232.5 L191.4,234.1 
		L192.6,235.7 L193.9,237.3 L195.2,239.0 L196.4,240.8 L197.7,242.6 L198.9,244.4 L200.2,246.2 L201.4,248.1 
		L202.7,250.0 L204.0,251.9 L205.2,253.9 L206.5,255.9 L207.7,257.8 L209.0,259.8 L210.3,261.9 L211.5,263.9 
		L212.8,265.9 L214.0,267.9 L215.3,270.0 L216.5,272.0 L217.8,274.1 L219.1,276.1 L220.3,278.1 L221.6,280.2 
		L222.8,282.2 L224.1,284.2 L225.3,286.2 L226.6,288.2 L227.9,290.2 L229.1,292.2 L230.4,294.1 L231.6,296.1 
		L232.9,298.0 L234.1,299.9 L235.4,301.9 L236.7,303.7 L237.9,305.6 L239.2,307.5 L240.4,309.3 L241.7,311.1 
		L243.0,313.0 L244.2,314.7 L245.5,316.5 L246.7,318.2 L248.0,320.0 L249.2,321.7 L250.5,323.4 L251.8,325.0 
		L253.0,326.7 L254.3,328.3 L255.5,329.9 L256.8,331.5 L258.0,333.0 L259.3,334.6 L260.6,336.1 L261.8,337.6 
		L263.1,339.1 L264.3,340.5 L265.6,342.0 L266.9,343.4 L268.1,344.8 L269.4,346.1 L270.6,347.5 L271.9,348.8 
		L273.1,350.1 L274.4,351.4 L275.7,352.7 L276.9,354.0 L278.2,355.2 L279.4,356.4 L280.7,357.6 L281.9,358.8 
		L283.2,359.9 L284.5,361.0 L285.7,362.2 L287.0,363.3 L288.2,364.3 L289.5,365.4 L290.7,366.4 L292.0,367.5 
		L293.3,368.5 L294.5,369.5 L295.8,370.4 L297.0,371.4 L298.3,372.3 L299.6,373.3 L300.8,374.2 L302.1,375.1 
		L303.3,375.9 L304.6,376.8 L305.8,377.6 L307.1,378.5 L308.4,379.3 L309.6,380.1 L310.9,380.9 L312.1,381.7 
		L313.4,382.4 L314.6,383.2 L315.9,383.9 L317.2,384.6 L318.4,385.3 L319.7,386.0 L320.9,386.7 L322.2,387.3 
		L323.5,388.0 L324.7,388.6 L326.0,389.3 L327.2,389.9 L328.5,390.5 L329.7,391.1 L331.0,391.7 L332.3,392.3 
		L333.5,392.8 L334.8,393.4 L336.0,393.9 L337.3,394.5 L338.5,395.0 L339.8,395.5 L341.1,396.0 L342.3,396.5 
		L343.6,397.0 L344.8,397.4 L346.1,397.9 L347.3,398.4 L348.6,398.8 L349.9,399.3 L351.1,399.7 L352.4,400.1 
		L353.6,400.5 L354.9,400.9 L356.2,401.3 L357.4,401.7 L358.7,402.1 L359.9,402.5 L361.2,402.9 L362.4,403.2 
		L363.7,403.6 L365.0,403.9 L366.2,404.3 L367.5,404.6 L368.7,405.0 L370.0,405.3 L371.2,405.6 L372.5,405.9 
		L373.8,406.2 L375.0,406.5 L376.3,406.8 L377.5,407.1 L378.8,407.4 L380.0,407.7 L381.3,407.9 L382.6,408.2 
		L383.8,408.5 L385.1,408.7 L386.3,409.0 L387.6,409.2 L388.9,409.5 L390.1,409.7 L391.4,409.9 L392.6,410.2 
		L393.9,410.4 L395.1,410.6 L396.4,410.8 L397.7,411.1 L398.9,411.3 L400.2,411.5 L401.4,411.7 L402.7,411.9 
		L403.9,412.1 L405.2,412.2 L406.5,412.4 L407.7,412.6 L409.0,412.8 L410.2,413.0 L411.5,413.1 L412.8,413.3 
		L414.0,413.5 L415.3,413.6 L416.5,413.8 L417.8,414.0 L419.0,414.1 L420.3,414.3 L421.6,414.4 L422.8,414.6 
		L424.1,414.7 L425.3,414.8 L426.6,415.0 L427.8,415.1 L429.1,415.2 L430.4,415.4 L431.6,415.5 L432.9,415.6 
		L434.1,415.7 L435.4,415.9 L436.6,416.0 L437.9,416.1 L439.2,416.2 L440.4,416.3 L441.7,416.4 L442.9,416.5 
		L444.2,416.6 L445.5,416.7 L446.7,416.8 L448.0,416.9 L449.2,417.0 L450.5,417.1 L451.7,417.2 L453.0,417.3 
		L454.3,417.4 L455.5,417.5 L456.8,417.6 L458.0,417.7 L459.3,417.8 L460.5,417.8 L461.8,417.9 L463.1,418.0 
		L464.3,418.1 L465.6,418.1 L466.8,418.2 L468.1,418.3 L469.3,418.4 L470.6,418.4 L471.9,418.5 L473.1,418.6 
		L474.4,418.6 L475.6,418.7 L476.9,418.8 L478.2,418.8 L479.4,418.9 L480.7,419.0 L481.9,419.0 L483.2,419.1 
		L484.4,419.1 L485.7,419.2 L487.0,419.3 L488.2,419.3 L489.5,419.4 L490.7,419.4 L492.0,419.5 L493.2,419.5 
		L494.5,419.6 L495.8,419.6 L497.0,419.7 L498.3,419.7 L499.5,419.8 L500.8,419.8 L502.1,419.8 L503.3,419.9 
		L504.6,419.9 L505.8,420.0 L507.1,420.0 L508.3,420.1 L509.6,420.1 L510.9,420.1 L512.1,420.2 L513.4,420.2 
		L514.6,420.2 L515.9,420.3 L517.1,420.3 L518.4,420.4 L519.7,420.4 L520.9,420.4 L522.2,420.5 L523.4,420.5 
		L524.7,420.5 L525.9,420.6 L527.2,420.6 L528.5,420.6 L529.7,420.6 L531.0,420.7 L532.2,420.7 L533.5,420.7 
		L534.8,420.8 L536.0,420.8 L537.3,420.8 L538.5,420.8 L539.8,420.9 L541.0,420.9 L542.3,420.9 L543.6,420.9 
		L544.8,421.0 L546.1,421.0 L547.3,421.0 L548.6,421.0 L549.8,421.1 L551.1,421.1 L552.4,421.1 L553.6,421.1 
		L554.9,421.1 L556.1,421.2 L557.4,421.2 L558.6,421.2 L559.9,421.2 L561.2,421.2 L562.4,421.3 L563.7,421.3 
		L564.9,421.3 L566.2,421.3 L567.5,421.3 L568.7,421.4 L570.0,421.4 L571.2,421.4 L572.5,421.4 L573.7,421.4 
		L575.0,421.4 '></path>
</g>
	</g>
	<g id="Plot_3"><title>Plot_3</title>
<g style="fill:none; color:blue; stroke:currentColor; stroke-width:1.00; stroke-linecap:butt; stroke-linejoin:miter">
	<path  d='M71.9,422.4 L73.2,422.4 L74.4,422.4 L75.7,422.4 L76.9,422.4 L78.2,422.4 L79.4,422.4 L80.7,422.4 
		L82.0,422.4 L83.2,422.4 L84.5,422.4 L85.7,422.4 L87.0,422.4 L88.3,422.4 L89.5,422.4 L90.8,422.4 
		L92.0,422.4 L93.3,422.4 L94.5,422.4 L95.8,422.4 L97.1,422.4 L98.3,422.4 L99.6,422.4 L100.8,422.4 
		L102.1,422.4 L103.3,422.4 L104.6,422.4 L105.9,422.4 L107.1,422.4 L108.4,422.4 L109.6,422.4 L110.9,422.4 
		L112.1,422.4 L113.4,422.3 L114.7,422.3 L115.9,422.2 L117.2,422.2 L118.4,422.0 L119.7,421.9 L121.0,421.6 
		L122.2,421.3 L123.5,420.9 L124.7,420.3 L126.0,419.6 L127.2,418.7 L128.5,417.5 L129.8,416.1 L131.0,414.4 
		L132.3,412.3 L133.5,409.9 L134.8,407.0 L136.0,403.6 L137.3,399.8 L138.6,395.4 L139.8,390.5 L141.1,384.9 
		L142.3,378.8 L143.6,372.0 L144.8,364.7 L146.1,356.7 L147.4,348.1 L148.6,338.9 L149.9,329.2 L151.1,318.9 
		L152.4,308.2 L153.7,297.0 L154.9,285.5 L156.2,273.6 L157.4,261.5 L158.7,249.1 L159.9,236.7 L161.2,224.2 
		L162.5,211.7 L163.7,199.3 L165.0,187.1 L166.2,175.1 L167.5,163.3 L168.7,152.0 L170.0,141.0 L171.3,130.5 
		L172.5,120.5 L173.8,111.1 L175.0,102.3 L176.3,94.2 L177.6,86.7 L178.8,79.9 L180.1,73.8 L181.3,68.4 
		L182.6,63.8 L183.8,59.9 L185.1,56.7 L186.4,54.3 L187.6,52.6 L188.9,51.6 L190.1,51.3 L191.4,51.7 
		L192.6,52.7 L193.9,54.3 L195.2,56.6 L196.4,59.4 L197.7,62.7 L198.9,66.6 L200.2,70.9 L201.4,75.6 
		L202.7,80.8 L204.0,86.3 L205.2,92.2 L206.5,98.3 L207.7,104.8 L209.0,111.5 L210.3,118.3 L211.5,125.4 
		L212.8,132.6 L214.0,140.0 L215.3,147.4 L216.5,154.9 L217.8,162.4 L219.1,170.0 L220.3,177.6 L221.6,185.1 
		L222.8,192.7 L224.1,200.1 L225.3,207.5 L226.6,214.9 L227.9,222.1 L229.1,229.2 L230.4,236.2 L231.6,243.1 
		L232.9,249.8 L234.1,256.4 L235.4,262.9 L236.7,269.2 L237.9,275.3 L239.2,281.3 L240.4,287.1 L241.7,292.8 
		L243.0,298.3 L244.2,303.6 L245.5,308.7 L246.7,313.7 L248.0,318.5 L249.2,323.2 L250.5,327.7 L251.8,332.0 
		L253.0,336.2 L254.3,340.2 L255.5,344.1 L256.8,347.8 L258.0,351.3 L259.3,354.8 L260.6,358.0 L261.8,361.2 
		L263.1,364.2 L264.3,367.1 L265.6,369.8 L266.9,372.5 L268.1,375.0 L269.4,377.4 L270.6,379.7 L271.9,381.9 
		L273.1,384.0 L274.4,386.0 L275.7,387.9 L276.9,389.7 L278.2,391.4 L279.4,393.1 L280.7,394.6 L281.9,396.1 
		L283.2,397.5 L284.5,398.9 L285.7,400.2 L287.0,401.4 L288.2,402.5 L289.5,403.6 L290.7,404.6 L292.0,405.6 
		L293.3,406.5 L294.5,407.4 L295.8,408.3 L297.0,409.1 L298.3,409.8 L299.6,410.5 L300.8,411.2 L302.1,411.8 
		L303.3,412.4 L304.6,413.0 L305.8,413.5 L307.1,414.0 L308.4,414.5 L309.6,415.0 L310.9,415.4 L312.1,415.8 
		L313.4,416.2 L314.6,416.5 L315.9,416.9 L317.2,417.2 L318.4,417.5 L319.7,417.8 L320.9,418.1 L322.2,418.3 
		L323.5,418.5 L324.7,418.8 L326.0,419.0 L327.2,419.2 L328.5,419.4 L329.7,419.6 L331.0,419.7 L332.3,419.9 
		L333.5,420.0 L334.8,420.2 L336.0,420.3 L337.3,420.4 L338.5,420.5 L339.8,420.7 L341.1,420.8 L342.3,420.9 
		L343.6,421.0 L344.8,421.0 L346.1,421.1 L347.3,421.2 L348.6,421.3 L349.9,421.3 L351.1,421.4 L352.4,421.5 
		L353.6,421.5 L354.9,421.6 L356.2,421.6 L357.4,421.7 L358.7,421.7 L359.9,421.8 L361.2,421.8 L362.4,421.8 
		L363.7,421.9 L365.0,421.9 L366.2,421.9 L367.5,422.0 L368.7,422.0 L370.0,422.0 L371.2,422.0 L372.5,422.1 
		L373.8,422.1 L375.0,422.1 L376.3,422.1 L377.5,422.1 L378.8,422.1 L380.0,422.2 L381.3,422.2 L382.6,422.2 
		L383.8,422.2 L385.1,422.2 L386.3,422.2 L387.6,422.2 L388.9,422.2 L390.1,422.3 L391.4,422.3 L392.6,422.3 
		L393.9,422.3 L395.1,422.3 L396.4,422.3 L397.7,422.3 L398.9,422.3 L400.2,422.3 L401.4,422.3 L402.7,422.3 
		L403.9,422.3 L405.2,422.3 L406.5,422.3 L407.7,422.3 L409.0,422.3 L410.2,422.3 L411.5,422.4 L412.8,422.4 
		L414.0,422.4 L415.3,422.4 L416.5,422.4 L417.8,422.4 L419.0,422.4 L420.3,422.4 L421.6,422.4 L422.8,422.4 
		L424.1,422.4 L425.3,422.4 L426.6,422.4 L427.8,422.4 L429.1,422.4 L430.4,422.4 L431.6,422.4 L432.9,422.4 
		L434.1,422.4 L435.4,422.4 L436.6,422.4 L437.9,422.4 L439.2,422.4 L440.4,422.4 L441.7,422.4 L442.9,422.4 
		L444.2,422.4 L445.5,422.4 L446.7,422.4 L448.0,422.4 L449.2,422.4 L450.5,422.4 L451.7,422.4 L453.0,422.4 
		L454.3,422.4 L455.5,422.4 L456.8,422.4 L458.0,422.4 L459.3,422.4 L460.5,422.4 L461.8,422.4 L463.1,422.4 
		L464.3,422.4 L465.6,422.4 L466.8,422.4 L468.1,422.4 L469.3,422.4 L470.6,422.4 L471.9,422.4 L473.1,422.4 
		L474.4,422.4 L475.6,422.4 L476.9,422.4 L478.2,422.4 L479.4,422.4 L480.7,422.4 L481.9,422.4 L483.2,422.4 
		L484.4,422.4 L485.7,422.4 L487.0,422.4 L488.2,422.4 L489.5,422.4 L490.7,422.4 L492.0,422.4 L493.2,422.4 
		L494.5,422.4 L495.8,422.4 L497.0,422.4 L498.3,422.4 L499.5,422.4 L500.8,422.4 L502.1,422.4 L503.3,422.4 
		L504.6,422.4 L505.8,422.4 L507.1,422.4 L508.3,422.4 L509.6,422.4 L510.9,422.4 L512.1,422.4 L513.4,422.4 
		L514.6,422.4 L515.9,422.4 L517.1,422.4 L518.4,422.4 L519.7,422.4 L520.9,422.4 L522.2,422.4 L523.4,422.4 
		L524.7,422.4 L525.9,422.4 L527.2,422.4 L528.5,422.4 L529.7,422.4 L531.0,422.4 L532.2,422.4 L533.5,422.4 
		L534.8,422.4 L536.0,422.4 L537.3,422.4 L538.5,422.4 L539.8,422.4 L541.0,422.4 L542.3,422.4 L543.6,422.4 
		L544.8,422.4 L546.1,422.4 L547.3,422.4 L548.6,422.4 L549.8,422.4 L551.1,422.4 L552.4,422.4 L553.6,422.4 
		L554.9,422.4 L556.1,422.4 L557.4,422.4 L558.6,422.4 L559.9,422.4 L561.2,422.4 L562.4,422.4 L563.7,422.4 
		L564.9,422.4 L566.2,422.4 L567.5,422.4 L568.7,422.4 L570.0,422.4 L571.2,422.4 L572.5,422.4 L573.7,422.4 
		L575.0,422.4 '></path>
</g>
	</g>
<g style="fill:none; color:black; stroke:currentColor; stroke-width:1.00; stroke-linecap:butt; stroke-linejoin:miter">
	<path  d='M71.9,16.7 L71.9,422.4 L575.0,422.4 L575.0,16.7 L71.9,16.7 Z '></path>
</g>
</svg>

