<?xml version="1.0" encoding="utf-8"  standalone="no"?>
<!DOCTYPE svg PUBLIC "-//W3C//DTD SVG 1.1//EN" 
 "http://www.w3.org/Graphics/SVG/1.1/DTD/svg11.dtd">
<!--
  Copyright (c) 2010, 2025 Contributors to the Eclipse Foundation

  See the NOTICE file(s) distributed with this work for additional
  information regarding copyright ownership.

  This program and the accompanying materials are made available under the terms
  of the MIT License which is available at https://opensource.org/licenses/MIT

  SPDX-License-Identifier: MIT
-->
<svg width="600" height="480" viewBox="0 0 600 480"
 xmlns="http://www.w3.org/2000/svg"
 xmlns:xlink="http://www.w3.org/1999/xlink"
>

<title>gnuplot</title>
<desc>Produced by GNUPLOT 4.4 patchlevel 4 </desc>

<defs>

	<circle id='gpDot' r='0.5' stroke-width='0.5'/>
	<path id='gpPt0' stroke-width='0.222' stroke='currentColor' d='M-1,0 h2 M0,-1 v2'/>
	<path id='gpPt1' stroke-width='0.222' stroke='currentColor' d='M-1,-1 L1,1 M1,-1 L-1,1'/>
	<path id='gpPt2' stroke-width='0.222' stroke='currentColor' d='M-1,0 L1,0 M0,-1 L0,1 M-1,-1 L1,1 M-1,1 L1,-1'/>
	<rect id='gpPt3' stroke-width='0.222' stroke='currentColor' x='-1' y='-1' width='2' height='2'/>
	<rect id='gpPt4' stroke-width='0.222' stroke='currentColor' fill='currentColor' x='-1' y='-1' width='2' height='2'/>
	<circle id='gpPt5' stroke-width='0.222' stroke='currentColor' cx='0' cy='0' r='1'/>
	<use xlink:href='#gpPt5' id='gpPt6' fill='currentColor' stroke='none'/>
	<path id='gpPt7' stroke-width='0.222' stroke='currentColor' d='M0,-1.33 L-1.33,0.67 L1.33,0.67 z'/>
	<use xlink:href='#gpPt7' id='gpPt8' fill='currentColor' stroke='none'/>
	<use xlink:href='#gpPt7' id='gpPt9' stroke='currentColor' transform='rotate(180)'/>
	<use xlink:href='#gpPt9' id='gpPt10' fill='currentColor' stroke='none'/>
	<use xlink:href='#gpPt3' id='gpPt11' stroke='currentColor' transform='rotate(45)'/>
	<use xlink:href='#gpPt11' id='gpPt12' fill='currentColor' stroke='none'/>
</defs>
<g style="fill:none; color:white; stroke:currentColor; stroke-width:1.00; stroke-linecap:butt; stroke-linejoin:miter">
</g>
<g style="fill:none; color:black; stroke:currentColor; stroke-width:1.00; stroke-linecap:butt; stroke-linejoin:miter">
	<path  d='M80.2,422.4 L89.2,422.4 M575.0,422.4 L566.0,422.4 '></path>
	<g transform="translate(71.9,426.9)" style="stroke:none; fill:black; font-family:Arial; font-size:12.00pt; text-anchor:end">
		<text> 0</text>
	</g>
	<path  d='M80.2,381.8 L89.2,381.8 M575.0,381.8 L566.0,381.8 '></path>
	<g transform="translate(71.9,386.3)" style="stroke:none; fill:black; font-family:Arial; font-size:12.00pt; text-anchor:end">
		<text> 0.02</text>
	</g>
	<path  d='M80.2,341.3 L89.2,341.3 M575.0,341.3 L566.0,341.3 '></path>
	<g transform="translate(71.9,345.8)" style="stroke:none; fill:black; font-family:Arial; font-size:12.00pt; text-anchor:end">
		<text> 0.04</text>
	</g>
	<path  d='M80.2,300.7 L89.2,300.7 M575.0,300.7 L566.0,300.7 '></path>
	<g transform="translate(71.9,305.2)" style="stroke:none; fill:black; font-family:Arial; font-size:12.00pt; text-anchor:end">
		<text> 0.06</text>
	</g>
	<path  d='M80.2,260.1 L89.2,260.1 M575.0,260.1 L566.0,260.1 '></path>
	<g transform="translate(71.9,264.6)" style="stroke:none; fill:black; font-family:Arial; font-size:12.00pt; text-anchor:end">
		<text> 0.08</text>
	</g>
	<path  d='M80.2,219.5 L89.2,219.5 M575.0,219.5 L566.0,219.5 '></path>
	<g transform="translate(71.9,224.0)" style="stroke:none; fill:black; font-family:Arial; font-size:12.00pt; text-anchor:end">
		<text> 0.1</text>
	</g>
	<path  d='M80.2,179.0 L89.2,179.0 M575.0,179.0 L566.0,179.0 '></path>
	<g transform="translate(71.9,183.5)" style="stroke:none; fill:black; font-family:Arial; font-size:12.00pt; text-anchor:end">
		<text> 0.12</text>
	</g>
	<path  d='M80.2,138.4 L89.2,138.4 M575.0,138.4 L566.0,138.4 '></path>
	<g transform="translate(71.9,142.9)" style="stroke:none; fill:black; font-family:Arial; font-size:12.00pt; text-anchor:end">
		<text> 0.14</text>
	</g>
	<path  d='M80.2,97.8 L89.2,97.8 M575.0,97.8 L566.0,97.8 '></path>
	<g transform="translate(71.9,102.3)" style="stroke:none; fill:black; font-family:Arial; font-size:12.00pt; text-anchor:end">
		<text> 0.16</text>
	</g>
	<path  d='M80.2,57.3 L89.2,57.3 M575.0,57.3 L566.0,57.3 '></path>
	<g transform="translate(71.9,61.8)" style="stroke:none; fill:black; font-family:Arial; font-size:12.00pt; text-anchor:end">
		<text> 0.18</text>
	</g>
	<path  d='M80.2,16.7 L89.2,16.7 M575.0,16.7 L566.0,16.7 '></path>
	<g transform="translate(71.9,21.2)" style="stroke:none; fill:black; font-family:Arial; font-size:12.00pt; text-anchor:end">
		<text> 0.2</text>
	</g>
	<path  d='M80.2,422.4 L80.2,413.4 M80.2,16.7 L80.2,25.7 '></path>
	<g transform="translate(80.2,444.9)" style="stroke:none; fill:black; font-family:Arial; font-size:12.00pt; text-anchor:middle">
		<text> 0</text>
	</g>
	<path  d='M142.1,422.4 L142.1,413.4 M142.1,16.7 L142.1,25.7 '></path>
	<g transform="translate(142.1,444.9)" style="stroke:none; fill:black; font-family:Arial; font-size:12.00pt; text-anchor:middle">
		<text> 5</text>
	</g>
	<path  d='M203.9,422.4 L203.9,413.4 M203.9,16.7 L203.9,25.7 '></path>
	<g transform="translate(203.9,444.9)" style="stroke:none; fill:black; font-family:Arial; font-size:12.00pt; text-anchor:middle">
		<text> 10</text>
	</g>
	<path  d='M265.8,422.4 L265.8,413.4 M265.8,16.7 L265.8,25.7 '></path>
	<g transform="translate(265.8,444.9)" style="stroke:none; fill:black; font-family:Arial; font-size:12.00pt; text-anchor:middle">
		<text> 15</text>
	</g>
	<path  d='M327.6,422.4 L327.6,413.4 M327.6,16.7 L327.6,25.7 '></path>
	<g transform="translate(327.6,444.9)" style="stroke:none; fill:black; font-family:Arial; font-size:12.00pt; text-anchor:middle">
		<text> 20</text>
	</g>
	<path  d='M389.5,422.4 L389.5,413.4 M389.5,16.7 L389.5,25.7 '></path>
	<g transform="translate(389.5,444.9)" style="stroke:none; fill:black; font-family:Arial; font-size:12.00pt; text-anchor:middle">
		<text> 25</text>
	</g>
	<path  d='M451.3,422.4 L451.3,413.4 M451.3,16.7 L451.3,25.7 '></path>
	<g transform="translate(451.3,444.9)" style="stroke:none; fill:black; font-family:Arial; font-size:12.00pt; text-anchor:middle">
		<text> 30</text>
	</g>
	<path  d='M513.2,422.4 L513.2,413.4 M513.2,16.7 L513.2,25.7 '></path>
	<g transform="translate(513.2,444.9)" style="stroke:none; fill:black; font-family:Arial; font-size:12.00pt; text-anchor:middle">
		<text> 35</text>
	</g>
	<path  d='M575.0,422.4 L575.0,413.4 M575.0,16.7 L575.0,25.7 '></path>
	<g transform="translate(575.0,444.9)" style="stroke:none; fill:black; font-family:Arial; font-size:12.00pt; text-anchor:middle">
		<text> 40</text>
	</g>
	<path  d='M80.2,16.7 L80.2,422.4 L575.0,422.4 L575.0,16.7 L80.2,16.7 Z '></path>
	<g transform="translate(17.6,219.6) rotate(270)" style="stroke:none; fill:black; font-family:Arial; font-size:12.00pt; text-anchor:middle">
		<text>binomial(int n, real p)</text>
	</g>
	<g transform="translate(327.6,471.9)" style="stroke:none; fill:black; font-family:Arial; font-size:12.00pt; text-anchor:middle">
		<text>x</text>
	</g>
	<g transform="translate(104.9,51.6)" style="stroke:none; fill:black; font-family:Arial; font-size:12.00pt; text-anchor:start">
		<text>binomial(20, 0.5)</text>
	</g>
	<g transform="translate(278.1,82.1)" style="stroke:none; fill:black; font-family:Arial; font-size:12.00pt; text-anchor:start">
		<text>binomial(20, 0.7)</text>
	</g>
	<g transform="translate(377.1,244.3)" style="stroke:none; fill:black; font-family:Arial; font-size:12.00pt; text-anchor:start">
		<text>binomial(40, 0.5)</text>
	</g>
</g>
	<g id="Plot_1"><title>Plot_1</title>
<g style="fill:none; color:red; stroke:currentColor; stroke-width:1.00; stroke-linecap:butt; stroke-linejoin:miter">
	<path  d='M80.2,422.4 M92.6,422.4 M104.9,422.4 L104.9,422.0 M117.3,422.4 L117.3,420.2 M129.7,422.4 L129.7,413.0 
		M142.1,422.4 L142.1,392.4 M154.4,422.4 L154.4,347.4 M166.8,422.4 L166.8,272.4 M179.2,422.4 L179.2,178.7 
		M191.5,422.4 L191.5,97.5 M203.9,422.4 L203.9,65.0 M216.3,422.4 L216.3,97.5 M228.6,422.4 L228.6,178.7 
		M241.0,422.4 L241.0,272.4 M253.4,422.4 L253.4,347.4 M265.8,422.4 L265.8,392.4 M278.1,422.4 L278.1,413.0 
		M290.5,422.4 L290.5,420.2 M302.9,422.4 L302.9,422.0 M315.2,422.4 M327.6,422.4 M340.0,422.4 M352.3,422.4 
		M364.7,422.4 M377.1,422.4 M389.5,422.4 M401.8,422.4 M414.2,422.4 M426.6,422.4 M438.9,422.4 M451.3,422.4 
		M463.7,422.4 M476.0,422.4 M488.4,422.4 M500.8,422.4 M513.2,422.4 M525.5,422.4 M537.9,422.4 M550.3,422.4 
		M562.6,422.4 '></path>
</g>
	</g>
	<g id="Plot_2"><title>Plot_2</title>
<g style="fill:none; color:red; stroke:currentColor; stroke-width:1.00; stroke-linecap:butt; stroke-linejoin:miter">
	<use xlink:href='#gpPt0' transform='translate(80.2,422.4) scale(4.50)'/>
	<use xlink:href='#gpPt0' transform='translate(92.6,422.4) scale(4.50)'/>
	<use xlink:href='#gpPt0' transform='translate(104.9,422.0) scale(4.50)'/>
	<use xlink:href='#gpPt0' transform='translate(117.3,420.2) scale(4.50)'/>
	<use xlink:href='#gpPt0' transform='translate(129.7,413.0) scale(4.50)'/>
	<use xlink:href='#gpPt0' transform='translate(142.1,392.4) scale(4.50)'/>
	<use xlink:href='#gpPt0' transform='translate(154.4,347.4) scale(4.50)'/>
	<use xlink:href='#gpPt0' transform='translate(166.8,272.4) scale(4.50)'/>
	<use xlink:href='#gpPt0' transform='translate(179.2,178.7) scale(4.50)'/>
	<use xlink:href='#gpPt0' transform='translate(191.5,97.5) scale(4.50)'/>
	<use xlink:href='#gpPt0' transform='translate(203.9,65.0) scale(4.50)'/>
	<use xlink:href='#gpPt0' transform='translate(216.3,97.5) scale(4.50)'/>
	<use xlink:href='#gpPt0' transform='translate(228.6,178.7) scale(4.50)'/>
	<use xlink:href='#gpPt0' transform='translate(241.0,272.4) scale(4.50)'/>
	<use xlink:href='#gpPt0' transform='translate(253.4,347.4) scale(4.50)'/>
	<use xlink:href='#gpPt0' transform='translate(265.8,392.4) scale(4.50)'/>
	<use xlink:href='#gpPt0' transform='translate(278.1,413.0) scale(4.50)'/>
	<use xlink:href='#gpPt0' transform='translate(290.5,420.2) scale(4.50)'/>
	<use xlink:href='#gpPt0' transform='translate(302.9,422.0) scale(4.50)'/>
	<use xlink:href='#gpPt0' transform='translate(315.2,422.4) scale(4.50)'/>
	<use xlink:href='#gpPt0' transform='translate(327.6,422.4) scale(4.50)'/>
	<use xlink:href='#gpPt0' transform='translate(340.0,422.4) scale(4.50)'/>
	<use xlink:href='#gpPt0' transform='translate(352.3,422.4) scale(4.50)'/>
	<use xlink:href='#gpPt0' transform='translate(364.7,422.4) scale(4.50)'/>
	<use xlink:href='#gpPt0' transform='translate(377.1,422.4) scale(4.50)'/>
	<use xlink:href='#gpPt0' transform='translate(389.5,422.4) scale(4.50)'/>
	<use xlink:href='#gpPt0' transform='translate(401.8,422.4) scale(4.50)'/>
	<use xlink:href='#gpPt0' transform='translate(414.2,422.4) scale(4.50)'/>
	<use xlink:href='#gpPt0' transform='translate(426.6,422.4) scale(4.50)'/>
	<use xlink:href='#gpPt0' transform='translate(438.9,422.4) scale(4.50)'/>
	<use xlink:href='#gpPt0' transform='translate(451.3,422.4) scale(4.50)'/>
	<use xlink:href='#gpPt0' transform='translate(463.7,422.4) scale(4.50)'/>
	<use xlink:href='#gpPt0' transform='translate(476.0,422.4) scale(4.50)'/>
	<use xlink:href='#gpPt0' transform='translate(488.4,422.4) scale(4.50)'/>
	<use xlink:href='#gpPt0' transform='translate(500.8,422.4) scale(4.50)'/>
	<use xlink:href='#gpPt0' transform='translate(513.2,422.4) scale(4.50)'/>
	<use xlink:href='#gpPt0' transform='translate(525.5,422.4) scale(4.50)'/>
	<use xlink:href='#gpPt0' transform='translate(537.9,422.4) scale(4.50)'/>
	<use xlink:href='#gpPt0' transform='translate(550.3,422.4) scale(4.50)'/>
	<use xlink:href='#gpPt0' transform='translate(562.6,422.4) scale(4.50)'/>
</g>
	</g>
	<g id="Plot_3"><title>Plot_3</title>
<g style="fill:none; color:green; stroke:currentColor; stroke-width:1.00; stroke-linecap:butt; stroke-linejoin:miter">
	<path  d='M80.2,422.4 M92.6,422.4 M104.9,422.4 M117.3,422.4 M129.7,422.4 M142.1,422.4 L142.1,422.3 M154.4,422.4 
		L154.4,422.0 M166.8,422.4 L166.8,420.3 M179.2,422.4 L179.2,414.6 M191.5,422.4 L191.5,398.0 M203.9,422.4 
		L203.9,359.9 M216.3,422.4 L216.3,289.8 M228.6,422.4 L228.6,190.3 M241.0,422.4 L241.0,89.2 M253.4,422.4 
		L253.4,33.7 M265.8,422.4 L265.8,59.6 M278.1,422.4 L278.1,157.8 M290.5,422.4 L290.5,277.2 M302.9,422.4 
		L302.9,365.9 M315.2,422.4 L315.2,408.5 M327.6,422.4 L327.6,420.8 M340.0,422.4 M352.3,422.4 M364.7,422.4 
		M377.1,422.4 M389.5,422.4 M401.8,422.4 M414.2,422.4 M426.6,422.4 M438.9,422.4 M451.3,422.4 M463.7,422.4 
		M476.0,422.4 M488.4,422.4 M500.8,422.4 M513.2,422.4 M525.5,422.4 M537.9,422.4 M550.3,422.4 M562.6,422.4 
		'></path>
</g>
	</g>
	<g id="Plot_4"><title>Plot_4</title>
<g style="fill:none; color:green; stroke:currentColor; stroke-width:1.00; stroke-linecap:butt; stroke-linejoin:miter">
	<use xlink:href='#gpPt1' transform='translate(80.2,422.4) scale(4.50)'/>
	<use xlink:href='#gpPt1' transform='translate(92.6,422.4) scale(4.50)'/>
	<use xlink:href='#gpPt1' transform='translate(104.9,422.4) scale(4.50)'/>
	<use xlink:href='#gpPt1' transform='translate(117.3,422.4) scale(4.50)'/>
	<use xlink:href='#gpPt1' transform='translate(129.7,422.4) scale(4.50)'/>
	<use xlink:href='#gpPt1' transform='translate(142.1,422.3) scale(4.50)'/>
	<use xlink:href='#gpPt1' transform='translate(154.4,422.0) scale(4.50)'/>
	<use xlink:href='#gpPt1' transform='translate(166.8,420.3) scale(4.50)'/>
	<use xlink:href='#gpPt1' transform='translate(179.2,414.6) scale(4.50)'/>
	<use xlink:href='#gpPt1' transform='translate(191.5,398.0) scale(4.50)'/>
	<use xlink:href='#gpPt1' transform='translate(203.9,359.9) scale(4.50)'/>
	<use xlink:href='#gpPt1' transform='translate(216.3,289.8) scale(4.50)'/>
	<use xlink:href='#gpPt1' transform='translate(228.6,190.3) scale(4.50)'/>
	<use xlink:href='#gpPt1' transform='translate(241.0,89.2) scale(4.50)'/>
	<use xlink:href='#gpPt1' transform='translate(253.4,33.7) scale(4.50)'/>
	<use xlink:href='#gpPt1' transform='translate(265.8,59.6) scale(4.50)'/>
	<use xlink:href='#gpPt1' transform='translate(278.1,157.8) scale(4.50)'/>
	<use xlink:href='#gpPt1' transform='translate(290.5,277.2) scale(4.50)'/>
	<use xlink:href='#gpPt1' transform='translate(302.9,365.9) scale(4.50)'/>
	<use xlink:href='#gpPt1' transform='translate(315.2,408.5) scale(4.50)'/>
	<use xlink:href='#gpPt1' transform='translate(327.6,420.8) scale(4.50)'/>
	<use xlink:href='#gpPt1' transform='translate(340.0,422.4) scale(4.50)'/>
	<use xlink:href='#gpPt1' transform='translate(352.3,422.4) scale(4.50)'/>
	<use xlink:href='#gpPt1' transform='translate(364.7,422.4) scale(4.50)'/>
	<use xlink:href='#gpPt1' transform='translate(377.1,422.4) scale(4.50)'/>
	<use xlink:href='#gpPt1' transform='translate(389.5,422.4) scale(4.50)'/>
	<use xlink:href='#gpPt1' transform='translate(401.8,422.4) scale(4.50)'/>
	<use xlink:href='#gpPt1' transform='translate(414.2,422.4) scale(4.50)'/>
	<use xlink:href='#gpPt1' transform='translate(426.6,422.4) scale(4.50)'/>
	<use xlink:href='#gpPt1' transform='translate(438.9,422.4) scale(4.50)'/>
	<use xlink:href='#gpPt1' transform='translate(451.3,422.4) scale(4.50)'/>
	<use xlink:href='#gpPt1' transform='translate(463.7,422.4) scale(4.50)'/>
	<use xlink:href='#gpPt1' transform='translate(476.0,422.4) scale(4.50)'/>
	<use xlink:href='#gpPt1' transform='translate(488.4,422.4) scale(4.50)'/>
	<use xlink:href='#gpPt1' transform='translate(500.8,422.4) scale(4.50)'/>
	<use xlink:href='#gpPt1' transform='translate(513.2,422.4) scale(4.50)'/>
	<use xlink:href='#gpPt1' transform='translate(525.5,422.4) scale(4.50)'/>
	<use xlink:href='#gpPt1' transform='translate(537.9,422.4) scale(4.50)'/>
	<use xlink:href='#gpPt1' transform='translate(550.3,422.4) scale(4.50)'/>
	<use xlink:href='#gpPt1' transform='translate(562.6,422.4) scale(4.50)'/>
</g>
	</g>
	<g id="Plot_5"><title>Plot_5</title>
<g style="fill:none; color:blue; stroke:currentColor; stroke-width:1.00; stroke-linecap:butt; stroke-linejoin:miter">
	<path  d='M80.2,422.4 M92.6,422.4 M104.9,422.4 M117.3,422.4 M129.7,422.4 M142.1,422.4 M154.4,422.4 M166.8,422.4 
		M179.2,422.4 L179.2,422.3 M191.5,422.4 L191.5,421.9 M203.9,422.4 L203.9,420.8 M216.3,422.4 L216.3,418.1 
		M228.6,422.4 L228.6,412.1 M241.0,422.4 L241.0,400.2 M253.4,422.4 L253.4,379.6 M265.8,422.4 L265.8,348.2 
		M278.1,422.4 L278.1,306.4 M290.5,422.4 L290.5,258.7 M302.9,422.4 L302.9,213.2 M315.2,422.4 L315.2,180.2 
		M327.6,422.4 L327.6,168.1 M340.0,422.4 L340.0,180.2 M352.3,422.4 L352.3,213.2 M364.7,422.4 L364.7,258.7 
		M377.1,422.4 L377.1,306.4 M389.5,422.4 L389.5,348.2 M401.8,422.4 L401.8,379.6 M414.2,422.4 L414.2,400.2 
		M426.6,422.4 L426.6,412.1 M438.9,422.4 L438.9,418.1 M451.3,422.4 L451.3,420.8 M463.7,422.4 L463.7,421.9 
		M476.0,422.4 L476.0,422.3 M488.4,422.4 M500.8,422.4 M513.2,422.4 M525.5,422.4 M537.9,422.4 M550.3,422.4 
		M562.6,422.4 '></path>
</g>
	</g>
	<g id="Plot_6"><title>Plot_6</title>
<g style="fill:none; color:blue; stroke:currentColor; stroke-width:1.00; stroke-linecap:butt; stroke-linejoin:miter">
	<use xlink:href='#gpPt2' transform='translate(80.2,422.4) scale(4.50)'/>
	<use xlink:href='#gpPt2' transform='translate(92.6,422.4) scale(4.50)'/>
	<use xlink:href='#gpPt2' transform='translate(104.9,422.4) scale(4.50)'/>
	<use xlink:href='#gpPt2' transform='translate(117.3,422.4) scale(4.50)'/>
	<use xlink:href='#gpPt2' transform='translate(129.7,422.4) scale(4.50)'/>
	<use xlink:href='#gpPt2' transform='translate(142.1,422.4) scale(4.50)'/>
	<use xlink:href='#gpPt2' transform='translate(154.4,422.4) scale(4.50)'/>
	<use xlink:href='#gpPt2' transform='translate(166.8,422.4) scale(4.50)'/>
	<use xlink:href='#gpPt2' transform='translate(179.2,422.3) scale(4.50)'/>
	<use xlink:href='#gpPt2' transform='translate(191.5,421.9) scale(4.50)'/>
	<use xlink:href='#gpPt2' transform='translate(203.9,420.8) scale(4.50)'/>
	<use xlink:href='#gpPt2' transform='translate(216.3,418.1) scale(4.50)'/>
	<use xlink:href='#gpPt2' transform='translate(228.6,412.1) scale(4.50)'/>
	<use xlink:href='#gpPt2' transform='translate(241.0,400.2) scale(4.50)'/>
	<use xlink:href='#gpPt2' transform='translate(253.4,379.6) scale(4.50)'/>
	<use xlink:href='#gpPt2' transform='translate(265.8,348.2) scale(4.50)'/>
	<use xlink:href='#gpPt2' transform='translate(278.1,306.4) scale(4.50)'/>
	<use xlink:href='#gpPt2' transform='translate(290.5,258.7) scale(4.50)'/>
	<use xlink:href='#gpPt2' transform='translate(302.9,213.2) scale(4.50)'/>
	<use xlink:href='#gpPt2' transform='translate(315.2,180.2) scale(4.50)'/>
	<use xlink:href='#gpPt2' transform='translate(327.6,168.1) scale(4.50)'/>
	<use xlink:href='#gpPt2' transform='translate(340.0,180.2) scale(4.50)'/>
	<use xlink:href='#gpPt2' transform='translate(352.3,213.2) scale(4.50)'/>
	<use xlink:href='#gpPt2' transform='translate(364.7,258.7) scale(4.50)'/>
	<use xlink:href='#gpPt2' transform='translate(377.1,306.4) scale(4.50)'/>
	<use xlink:href='#gpPt2' transform='translate(389.5,348.2) scale(4.50)'/>
	<use xlink:href='#gpPt2' transform='translate(401.8,379.6) scale(4.50)'/>
	<use xlink:href='#gpPt2' transform='translate(414.2,400.2) scale(4.50)'/>
	<use xlink:href='#gpPt2' transform='translate(426.6,412.1) scale(4.50)'/>
	<use xlink:href='#gpPt2' transform='translate(438.9,418.1) scale(4.50)'/>
	<use xlink:href='#gpPt2' transform='translate(451.3,420.8) scale(4.50)'/>
	<use xlink:href='#gpPt2' transform='translate(463.7,421.9) scale(4.50)'/>
	<use xlink:href='#gpPt2' transform='translate(476.0,422.3) scale(4.50)'/>
	<use xlink:href='#gpPt2' transform='translate(488.4,422.4) scale(4.50)'/>
	<use xlink:href='#gpPt2' transform='translate(500.8,422.4) scale(4.50)'/>
	<use xlink:href='#gpPt2' transform='translate(513.2,422.4) scale(4.50)'/>
	<use xlink:href='#gpPt2' transform='translate(525.5,422.4) scale(4.50)'/>
	<use xlink:href='#gpPt2' transform='translate(537.9,422.4) scale(4.50)'/>
	<use xlink:href='#gpPt2' transform='translate(550.3,422.4) scale(4.50)'/>
	<use xlink:href='#gpPt2' transform='translate(562.6,422.4) scale(4.50)'/>
</g>
	</g>
<g style="fill:none; color:black; stroke:currentColor; stroke-width:1.00; stroke-linecap:butt; stroke-linejoin:miter">
	<path  d='M80.2,16.7 L80.2,422.4 L575.0,422.4 L575.0,16.7 L80.2,16.7 Z '></path>
</g>
</svg>

