<?xml version="1.0" encoding="utf-8"  standalone="no"?>
<!DOCTYPE svg PUBLIC "-//W3C//DTD SVG 1.1//EN" 
 "http://www.w3.org/Graphics/SVG/1.1/DTD/svg11.dtd">
<!--
  Copyright (c) 2010, 2021 Contributors to the Eclipse Foundation

  See the NOTICE file(s) distributed with this work for additional
  information regarding copyright ownership.

  This program and the accompanying materials are made available under the terms
  of the MIT License which is available at https://opensource.org/licenses/MIT

  SPDX-License-Identifier: MIT
-->
<svg width="600" height="480" viewBox="0 0 600 480"
 xmlns="http://www.w3.org/2000/svg"
 xmlns:xlink="http://www.w3.org/1999/xlink"
>

<title>gnuplot</title>
<desc>Produced by GNUPLOT 4.4 patchlevel 4 </desc>

<defs>

	<circle id='gpDot' r='0.5' stroke-width='0.5'/>
	<path id='gpPt0' stroke-width='0.222' stroke='currentColor' d='M-1,0 h2 M0,-1 v2'/>
	<path id='gpPt1' stroke-width='0.222' stroke='currentColor' d='M-1,-1 L1,1 M1,-1 L-1,1'/>
	<path id='gpPt2' stroke-width='0.222' stroke='currentColor' d='M-1,0 L1,0 M0,-1 L0,1 M-1,-1 L1,1 M-1,1 L1,-1'/>
	<rect id='gpPt3' stroke-width='0.222' stroke='currentColor' x='-1' y='-1' width='2' height='2'/>
	<rect id='gpPt4' stroke-width='0.222' stroke='currentColor' fill='currentColor' x='-1' y='-1' width='2' height='2'/>
	<circle id='gpPt5' stroke-width='0.222' stroke='currentColor' cx='0' cy='0' r='1'/>
	<use xlink:href='#gpPt5' id='gpPt6' fill='currentColor' stroke='none'/>
	<path id='gpPt7' stroke-width='0.222' stroke='currentColor' d='M0,-1.33 L-1.33,0.67 L1.33,0.67 z'/>
	<use xlink:href='#gpPt7' id='gpPt8' fill='currentColor' stroke='none'/>
	<use xlink:href='#gpPt7' id='gpPt9' stroke='currentColor' transform='rotate(180)'/>
	<use xlink:href='#gpPt9' id='gpPt10' fill='currentColor' stroke='none'/>
	<use xlink:href='#gpPt3' id='gpPt11' stroke='currentColor' transform='rotate(45)'/>
	<use xlink:href='#gpPt11' id='gpPt12' fill='currentColor' stroke='none'/>
</defs>
<g style="fill:none; color:white; stroke:currentColor; stroke-width:1.00; stroke-linecap:butt; stroke-linejoin:miter">
</g>
<g style="fill:none; color:black; stroke:currentColor; stroke-width:1.00; stroke-linecap:butt; stroke-linejoin:miter">
	<path  d='M71.9,422.4 L80.9,422.4 M575.0,422.4 L566.0,422.4 '></path>
	<g transform="translate(63.6,426.9)" style="stroke:none; fill:black; font-family:Arial; font-size:12.00pt; text-anchor:end">
		<text> 0</text>
	</g>
	<path  d='M71.9,364.4 L80.9,364.4 M575.0,364.4 L566.0,364.4 '></path>
	<g transform="translate(63.6,368.9)" style="stroke:none; fill:black; font-family:Arial; font-size:12.00pt; text-anchor:end">
		<text> 0.5</text>
	</g>
	<path  d='M71.9,306.5 L80.9,306.5 M575.0,306.5 L566.0,306.5 '></path>
	<g transform="translate(63.6,311.0)" style="stroke:none; fill:black; font-family:Arial; font-size:12.00pt; text-anchor:end">
		<text> 1</text>
	</g>
	<path  d='M71.9,248.5 L80.9,248.5 M575.0,248.5 L566.0,248.5 '></path>
	<g transform="translate(63.6,253.0)" style="stroke:none; fill:black; font-family:Arial; font-size:12.00pt; text-anchor:end">
		<text> 1.5</text>
	</g>
	<path  d='M71.9,190.6 L80.9,190.6 M575.0,190.6 L566.0,190.6 '></path>
	<g transform="translate(63.6,195.1)" style="stroke:none; fill:black; font-family:Arial; font-size:12.00pt; text-anchor:end">
		<text> 2</text>
	</g>
	<path  d='M71.9,132.6 L80.9,132.6 M575.0,132.6 L566.0,132.6 '></path>
	<g transform="translate(63.6,137.1)" style="stroke:none; fill:black; font-family:Arial; font-size:12.00pt; text-anchor:end">
		<text> 2.5</text>
	</g>
	<path  d='M71.9,74.7 L80.9,74.7 M575.0,74.7 L566.0,74.7 '></path>
	<g transform="translate(63.6,79.2)" style="stroke:none; fill:black; font-family:Arial; font-size:12.00pt; text-anchor:end">
		<text> 3</text>
	</g>
	<path  d='M71.9,16.7 L80.9,16.7 M575.0,16.7 L566.0,16.7 '></path>
	<g transform="translate(63.6,21.2)" style="stroke:none; fill:black; font-family:Arial; font-size:12.00pt; text-anchor:end">
		<text> 3.5</text>
	</g>
	<path  d='M71.9,422.4 L71.9,413.4 M71.9,16.7 L71.9,25.7 '></path>
	<g transform="translate(71.9,444.9)" style="stroke:none; fill:black; font-family:Arial; font-size:12.00pt; text-anchor:middle">
		<text> 0</text>
	</g>
	<path  d='M122.2,422.4 L122.2,413.4 M122.2,16.7 L122.2,25.7 '></path>
	<g transform="translate(122.2,444.9)" style="stroke:none; fill:black; font-family:Arial; font-size:12.00pt; text-anchor:middle">
		<text> 0.1</text>
	</g>
	<path  d='M172.5,422.4 L172.5,413.4 M172.5,16.7 L172.5,25.7 '></path>
	<g transform="translate(172.5,444.9)" style="stroke:none; fill:black; font-family:Arial; font-size:12.00pt; text-anchor:middle">
		<text> 0.2</text>
	</g>
	<path  d='M222.8,422.4 L222.8,413.4 M222.8,16.7 L222.8,25.7 '></path>
	<g transform="translate(222.8,444.9)" style="stroke:none; fill:black; font-family:Arial; font-size:12.00pt; text-anchor:middle">
		<text> 0.3</text>
	</g>
	<path  d='M273.1,422.4 L273.1,413.4 M273.1,16.7 L273.1,25.7 '></path>
	<g transform="translate(273.1,444.9)" style="stroke:none; fill:black; font-family:Arial; font-size:12.00pt; text-anchor:middle">
		<text> 0.4</text>
	</g>
	<path  d='M323.5,422.4 L323.5,413.4 M323.5,16.7 L323.5,25.7 '></path>
	<g transform="translate(323.5,444.9)" style="stroke:none; fill:black; font-family:Arial; font-size:12.00pt; text-anchor:middle">
		<text> 0.5</text>
	</g>
	<path  d='M373.8,422.4 L373.8,413.4 M373.8,16.7 L373.8,25.7 '></path>
	<g transform="translate(373.8,444.9)" style="stroke:none; fill:black; font-family:Arial; font-size:12.00pt; text-anchor:middle">
		<text> 0.6</text>
	</g>
	<path  d='M424.1,422.4 L424.1,413.4 M424.1,16.7 L424.1,25.7 '></path>
	<g transform="translate(424.1,444.9)" style="stroke:none; fill:black; font-family:Arial; font-size:12.00pt; text-anchor:middle">
		<text> 0.7</text>
	</g>
	<path  d='M474.4,422.4 L474.4,413.4 M474.4,16.7 L474.4,25.7 '></path>
	<g transform="translate(474.4,444.9)" style="stroke:none; fill:black; font-family:Arial; font-size:12.00pt; text-anchor:middle">
		<text> 0.8</text>
	</g>
	<path  d='M524.7,422.4 L524.7,413.4 M524.7,16.7 L524.7,25.7 '></path>
	<g transform="translate(524.7,444.9)" style="stroke:none; fill:black; font-family:Arial; font-size:12.00pt; text-anchor:middle">
		<text> 0.9</text>
	</g>
	<path  d='M575.0,422.4 L575.0,413.4 M575.0,16.7 L575.0,25.7 '></path>
	<g transform="translate(575.0,444.9)" style="stroke:none; fill:black; font-family:Arial; font-size:12.00pt; text-anchor:middle">
		<text> 1</text>
	</g>
	<path  d='M71.9,16.7 L71.9,422.4 L575.0,422.4 L575.0,16.7 L71.9,16.7 Z '></path>
	<g transform="translate(17.6,219.6) rotate(270)" style="stroke:none; fill:black; font-family:Arial; font-size:12.00pt; text-anchor:middle">
		<text>beta(real p, q)</text>
	</g>
	<g transform="translate(323.4,471.9)" style="stroke:none; fill:black; font-family:Arial; font-size:12.00pt; text-anchor:middle">
		<text>x</text>
	</g>
	<g transform="translate(172.5,334.2)" style="stroke:none; fill:black; font-family:Arial; font-size:12.00pt; text-anchor:start">
		<text>beta(0.8, 0.5)</text>
	</g>
	<g transform="translate(147.4,195.1)" style="stroke:none; fill:black; font-family:Arial; font-size:12.00pt; text-anchor:start">
		<text>beta(1.5, 3.0)</text>
	</g>
	<g transform="translate(298.3,241.4)" style="stroke:none; fill:black; font-family:Arial; font-size:12.00pt; text-anchor:start">
		<text>beta(2.0, 2.0)</text>
	</g>
	<g transform="translate(358.7,137.1)" style="stroke:none; fill:black; font-family:Arial; font-size:12.00pt; text-anchor:start">
		<text>beta(5.0, 1.5)</text>
	</g>
</g>
	<g id="Plot_1"><title>Plot_1</title>
<g style="fill:none; color:red; stroke:currentColor; stroke-width:1.00; stroke-linecap:butt; stroke-linejoin:miter">
	<path  d='M76.9,295.1 L82.0,311.0 L87.0,319.2 L92.0,324.5 L97.1,328.2 L102.1,331.1 L107.1,333.4 L112.1,335.3 
		L117.2,336.9 L122.2,338.2 L127.2,339.3 L132.3,340.3 L137.3,341.1 L142.3,341.8 L147.4,342.5 L152.4,343.0 
		L157.4,343.5 L162.5,344.0 L167.5,344.3 L172.5,344.6 L177.6,344.9 L182.6,345.1 L187.6,345.3 L192.6,345.5 
		L197.7,345.6 L202.7,345.7 L207.7,345.7 L212.8,345.8 L217.8,345.8 L222.8,345.7 L227.9,345.7 L232.9,345.6 
		L237.9,345.5 L243.0,345.4 L248.0,345.3 L253.0,345.1 L258.0,344.9 L263.1,344.7 L268.1,344.5 L273.1,344.2 
		L278.2,344.0 L283.2,343.7 L288.2,343.3 L293.3,343.0 L298.3,342.7 L303.3,342.3 L308.4,341.9 L313.4,341.4 
		L318.4,341.0 L323.5,340.5 L328.5,340.0 L333.5,339.5 L338.5,338.9 L343.6,338.3 L348.6,337.7 L353.6,337.1 
		L358.7,336.4 L363.7,335.7 L368.7,334.9 L373.8,334.1 L378.8,333.3 L383.8,332.4 L388.9,331.5 L393.9,330.5 
		L398.9,329.5 L403.9,328.5 L409.0,327.3 L414.0,326.1 L419.0,324.9 L424.1,323.6 L429.1,322.1 L434.1,320.7 
		L439.2,319.1 L444.2,317.4 L449.2,315.6 L454.3,313.7 L459.3,311.6 L464.3,309.4 L469.3,307.1 L474.4,304.5 
		L479.4,301.8 L484.4,298.8 L489.5,295.5 L494.5,291.9 L499.5,287.9 L504.6,283.5 L509.6,278.6 L514.6,273.1 
		L519.7,266.8 L524.7,259.6 L529.7,251.2 L534.8,241.2 L539.8,229.1 L544.8,214.0 L549.8,194.6 L554.9,168.3 
		L559.9,129.6 L564.9,64.5 '></path>
</g>
	</g>
	<g id="Plot_2"><title>Plot_2</title>
<g style="fill:none; color:green; stroke:currentColor; stroke-width:1.00; stroke-linecap:butt; stroke-linejoin:miter">
	<path  d='M71.9,422.4 L82.0,319.1 L92.0,282.2 L102.1,257.8 L112.1,240.3 L122.2,227.6 L132.3,218.3 L142.3,211.9 
		L152.4,207.7 L162.5,205.4 L172.5,204.7 L182.6,205.3 L192.6,207.2 L202.7,210.0 L212.8,213.7 L222.8,218.2 
		L232.9,223.4 L243.0,229.2 L253.0,235.5 L263.1,242.1 L273.1,249.2 L283.2,256.6 L293.3,264.2 L303.3,272.0 
		L313.4,279.9 L323.5,287.9 L333.5,296.0 L343.6,304.1 L353.6,312.2 L363.7,320.2 L373.8,328.1 L383.8,335.9 
		L393.9,343.5 L403.9,351.0 L414.0,358.2 L424.1,365.1 L434.1,371.8 L444.2,378.2 L454.3,384.2 L464.3,389.9 
		L474.4,395.2 L484.4,400.1 L494.5,404.6 L504.6,408.6 L514.6,412.1 L524.7,415.2 L534.8,417.7 L544.8,419.7 
		L554.9,421.2 L564.9,422.1 '></path>
</g>
	</g>
	<g id="Plot_3"><title>Plot_3</title>
<g style="fill:none; color:blue; stroke:currentColor; stroke-width:1.00; stroke-linecap:butt; stroke-linejoin:miter">
	<path  d='M71.9,422.4 L82.0,408.8 L92.0,395.7 L102.1,383.2 L112.1,371.2 L122.2,359.8 L132.3,349.0 L142.3,338.7 
		L152.4,328.9 L162.5,319.7 L172.5,311.1 L182.6,303.1 L192.6,295.5 L202.7,288.6 L212.8,282.2 L222.8,276.3 
		L232.9,271.1 L243.0,266.3 L253.0,262.2 L263.1,258.5 L273.1,255.5 L283.2,253.0 L293.3,251.0 L303.3,249.6 
		L313.4,248.8 L323.5,248.5 L333.5,248.8 L343.6,249.6 L353.6,251.0 L363.7,253.0 L373.8,255.5 L383.8,258.5 
		L393.9,262.2 L403.9,266.3 L414.0,271.1 L424.1,276.3 L434.1,282.2 L444.2,288.6 L454.3,295.5 L464.3,303.1 
		L474.4,311.1 L484.4,319.7 L494.5,328.9 L504.6,338.7 L514.6,349.0 L524.7,359.8 L534.8,371.2 L544.8,383.2 
		L554.9,395.7 L564.9,408.8 '></path>
</g>
	</g>
	<g id="Plot_4"><title>Plot_4</title>
<g style="fill:none; color:cyan; stroke:currentColor; stroke-width:1.00; stroke-linecap:butt; stroke-linejoin:miter">
	<path  d='M71.9,422.4 L82.0,422.4 L92.0,422.4 L102.1,422.4 L112.1,422.3 L122.2,422.3 L132.3,422.1 L142.3,421.8 
		L152.4,421.5 L162.5,420.9 L172.5,420.2 L182.6,419.2 L192.6,417.9 L202.7,416.2 L212.8,414.2 L222.8,411.8 
		L232.9,408.8 L243.0,405.4 L253.0,401.3 L263.1,396.6 L273.1,391.3 L283.2,385.2 L293.3,378.4 L303.3,370.8 
		L313.4,362.3 L323.5,353.1 L333.5,342.9 L343.6,331.9 L353.6,320.1 L363.7,307.3 L373.8,293.8 L383.8,279.5 
		L393.9,264.5 L403.9,248.8 L414.0,232.6 L424.1,216.1 L434.1,199.3 L444.2,182.5 L454.3,166.0 L464.3,150.0 
		L474.4,135.0 L484.4,121.5 L494.5,110.0 L504.6,101.3 L514.6,96.5 L524.7,96.9 L534.8,104.5 L544.8,122.4 
		L554.9,155.9 L564.9,217.7 '></path>
</g>
	</g>
<g style="fill:none; color:black; stroke:currentColor; stroke-width:1.00; stroke-linecap:butt; stroke-linejoin:miter">
	<path  d='M71.9,16.7 L71.9,422.4 L575.0,422.4 L575.0,16.7 L71.9,16.7 Z '></path>
</g>
</svg>

