<?xml version="1.0" encoding="UTF-8" standalone="no"?>
<!-- Created with Inkscape (http://www.inkscape.org/) -->

<!--
  Copyright (c) 2022, 2025 Contributors to the Eclipse Foundation

  See the NOTICE file(s) distributed with this work for additional
  information regarding copyright ownership.

  This program and the accompanying materials are made available under the terms
  of the MIT License which is available at https://opensource.org/licenses/MIT

  SPDX-License-Identifier: MIT
-->

<svg
   inkscape:export-ydpi="96"
   inkscape:export-xdpi="96"
   sodipodi:docname="lock-terneuzen-overview.svg"
   inkscape:version="1.2.1 (9c6d41e410, 2022-07-14)"
   id="svg5"
   version="1.1"
   viewBox="0 0 312.20826 190.50002"
   height="720"
   width="1180"
   xmlns:inkscape="http://www.inkscape.org/namespaces/inkscape"
   xmlns:sodipodi="http://sodipodi.sourceforge.net/DTD/sodipodi-0.dtd"
   xmlns="http://www.w3.org/2000/svg"
   xmlns:svg="http://www.w3.org/2000/svg">
  <sodipodi:namedview
     id="namedview7"
     pagecolor="#ffffff"
     bordercolor="#666666"
     borderopacity="1.0"
     inkscape:pageshadow="2"
     inkscape:pageopacity="0.0"
     inkscape:pagecheckerboard="0"
     inkscape:document-units="px"
     showgrid="false"
     showguides="false"
     inkscape:zoom="1"
     inkscape:cx="577"
     inkscape:cy="358"
     inkscape:window-width="1920"
     inkscape:window-height="1009"
     inkscape:window-x="-8"
     inkscape:window-y="-1"
     inkscape:window-maximized="1"
     inkscape:current-layer="layer1"
     units="px"
     width="793.70081px"
     inkscape:showpageshadow="2"
     inkscape:deskcolor="#d1d1d1" />
  <defs
     id="defs2">
    <marker
       style="overflow:visible"
       id="Arrow1Send"
       refX="0"
       refY="0"
       orient="auto"
       inkscape:stockid="Arrow1Send"
       inkscape:isstock="true"
       viewBox="0 0 4.4434635 2.539122"
       markerWidth="4.4434633"
       markerHeight="2.5391221"
       preserveAspectRatio="xMidYMid">
      <path
         transform="matrix(-0.2,0,0,-0.2,-1.2,0)"
         style="fill:context-stroke;fill-rule:evenodd;stroke:context-stroke;stroke-width:1pt"
         d="M 0,0 5,-5 -12.5,0 5,5 Z"
         id="path958" />
    </marker>
    <marker
       style="overflow:visible"
       id="marker1222"
       refX="0"
       refY="0"
       orient="auto"
       inkscape:stockid="Arrow2Lend"
       inkscape:isstock="true">
      <path
         transform="matrix(-1.1,0,0,-1.1,-1.1,0)"
         d="M 8.7185878,4.0337352 -2.2072895,0.01601326 8.7185884,-4.0017078 c -1.7454984,2.3720609 -1.7354408,5.6174519 -6e-7,8.035443 z"
         style="fill:context-stroke;fill-rule:evenodd;stroke-width:0.625;stroke-linejoin:round"
         id="path1220" />
    </marker>
    <marker
       style="overflow:visible"
       id="marker1212"
       refX="0"
       refY="0"
       orient="auto"
       inkscape:stockid="Arrow2Lend"
       inkscape:isstock="true"
       viewBox="0 0 12.018466 8.8389873"
       markerWidth="12.018466"
       markerHeight="8.8389874"
       preserveAspectRatio="xMidYMid">
      <path
         transform="matrix(-1.1,0,0,-1.1,-1.1,0)"
         d="M 8.7185878,4.0337352 -2.2072895,0.01601326 8.7185884,-4.0017078 c -1.7454984,2.3720609 -1.7354408,5.6174519 -6e-7,8.035443 z"
         style="fill:context-stroke;fill-rule:evenodd;stroke-width:0.625;stroke-linejoin:round"
         id="path964" />
    </marker>
    <marker
       style="overflow:visible"
       id="Arrow2Mend"
       refX="0"
       refY="0"
       orient="auto"
       inkscape:stockid="Arrow2Mend"
       inkscape:isstock="true">
      <path
         transform="scale(-0.6)"
         d="M 8.7185878,4.0337352 -2.2072895,0.01601326 8.7185884,-4.0017078 c -1.7454984,2.3720609 -1.7354408,5.6174519 -6e-7,8.035443 z"
         style="fill:context-stroke;fill-rule:evenodd;stroke-width:0.625;stroke-linejoin:round"
         id="path970" />
    </marker>
    <marker
       style="overflow:visible"
       id="Arrow2Lend"
       refX="0"
       refY="0"
       orient="auto"
       inkscape:stockid="Arrow2Lend"
       inkscape:isstock="true">
      <path
         transform="matrix(-1.1,0,0,-1.1,-1.1,0)"
         d="M 8.7185878,4.0337352 -2.2072895,0.01601326 8.7185884,-4.0017078 c -1.7454984,2.3720609 -1.7354408,5.6174519 -6e-7,8.035443 z"
         style="fill:context-stroke;fill-rule:evenodd;stroke-width:0.625;stroke-linejoin:round"
         id="path39345" />
    </marker>
    <linearGradient
       id="linearGradient8670"
       inkscape:swatch="solid">
      <stop
         style="stop-color:black;stop-opacity:1;"
         offset="0"
         id="stop8668" />
    </linearGradient>
    <linearGradient
       id="linearGradient8620"
       inkscape:swatch="solid">
      <stop
         style="stop-color:#e6e6e6;stop-opacity:1;"
         offset="0"
         id="stop8618" />
    </linearGradient>
  </defs>
  <g
     inkscape:label="Layer 1"
     inkscape:groupmode="layer"
     id="layer1">
    <g
       id="water"
       transform="matrix(1.5104714,0,0,1.6057437,-2.1166665,-80.949728)">
      <rect
         style="fill:#4094ff;fill-opacity:1;stroke:#f1f1f1;stroke-width:0;stroke-linecap:butt;stroke-miterlimit:4;stroke-dasharray:none;stroke-dashoffset:0;stroke-opacity:1"
         id="watersouth"
         width="62.264027"
         height="120"
         x="1.0000024"
         y="50" />
      <rect
         style="fill:#4094ff;fill-opacity:1;stroke:#4094ff;stroke-width:0;stroke-linecap:butt;stroke-miterlimit:4;stroke-dasharray:none;stroke-dashoffset:0;stroke-opacity:1"
         id="waterchamber"
         width="85"
         height="38.045132"
         x="62.5"
         y="91" />
      <rect
         style="fill:#4094ff;fill-opacity:1;stroke:#f1f1f1;stroke-width:0;stroke-linecap:butt;stroke-miterlimit:4;stroke-dasharray:none;stroke-dashoffset:0;stroke-opacity:1"
         id="waternorth"
         width="63.318352"
         height="120"
         x="146.84174"
         y="50" />
    </g>
    <g
       id="terrain"
       transform="matrix(1.5104714,0,0,1.6057437,-2.1166665,-80.949728)">
      <rect
         style="fill:#cccccc;fill-opacity:1;stroke-width:0.264583"
         id="rect1206"
         width="130"
         height="41"
         x="40"
         y="50" />
      <rect
         style="fill:#cccccc;fill-opacity:1;stroke-width:0.264583"
         id="rect1641"
         width="130"
         height="41"
         x="40"
         y="129" />
      <rect
         style="fill:#4094ff;fill-rule:evenodd;stroke-width:0.264583"
         id="culvertSinlet"
         width="7"
         height="2.5"
         x="62"
         y="128"
         ry="0.96615243" />
      <rect
         style="fill:#4094ff;fill-rule:evenodd;stroke-width:0.264583"
         id="culvertNinlet"
         width="7"
         height="2.5"
         x="141"
         y="128"
         ry="0.96615243" />
      <rect
         style="fill:#29b26c;fill-opacity:1;stroke-width:0.264583"
         id="rect2059"
         width="64.999916"
         height="30.000046"
         x="72.5"
         y="56"
         ry="1.0096674" />
      <rect
         style="fill:#29b26c;fill-opacity:1;stroke-width:0.264583"
         id="rect1230"
         width="120"
         height="35"
         x="45"
         y="135" />
    </g>
    <g
       id="Roads">
      <g
         id="roadSE">
        <rect
           style="fill:#4d4d4d;fill-opacity:1;stroke-width:0.4120553919491812"
           id="rect3289"
           width="12.08376"
           height="65.83534"
           x="62.83353999999999"
           y="126.19076"
           ry="1.621260761692" />
        <path
           style="fill:none;stroke:#ffffff;stroke-linecap:butt;stroke-linejoin:miter;stroke-opacity:1;stroke-width:0.7786883358892696"
           d="M 68.8754 129.402 L 68.8754 139.936"
           id="path3291" />
        <path
           style="fill:none;stroke:#ffffff;stroke-linecap:butt;stroke-linejoin:miter;stroke-opacity:1;stroke-width:0.7786883358892696"
           d="M 68.8754 145.46 L 68.8754 155.993"
           id="path3293" />
        <path
           style="fill:none;stroke:#ffffff;stroke-linecap:butt;stroke-linejoin:miter;stroke-opacity:1;stroke-width:0.7786883358892696"
           d="M 68.8754 161.517 L 68.8754 172.051"
           id="path3295" />
        <path
           style="fill:#ffffff;stroke:#ffffff;stroke-width:0.778688;stroke-linecap:butt;stroke-linejoin:miter;stroke-opacity:1"
           d="M 74.9173,192.02637 74.7267,126.20345"
           id="path3297" />
        <path
           style="fill:none;stroke:#ffffff;stroke-linecap:butt;stroke-linejoin:miter;stroke-opacity:1;stroke-width:0.7786883358892696"
           d="M 68.8754 177.574 L 68.8754 188.108"
           id="path3299" />
        <path
           style="fill:#ffffff;stroke:#ffffff;stroke-width:0.778688;stroke-linecap:butt;stroke-linejoin:miter;stroke-opacity:1"
           d="M 62.8335,192.02635 62.6429,126.2255"
           id="path3301" />
      </g>
      <g
         id="roadNE">
        <rect
           style="fill:#4d4d4d;fill-opacity:1;stroke-width:0.4120553919491812"
           id="rect3260"
           width="12.08376"
           height="65.83534"
           x="238.04806"
           y="126.19076"
           ry="1.621260761692" />
        <path
           style="fill:none;stroke:#ffffff;stroke-linecap:butt;stroke-linejoin:miter;stroke-opacity:1;stroke-width:0.7786883358892696"
           d="M 244.09 129.402 L 244.09 139.936"
           id="path3262" />
        <path
           style="fill:none;stroke:#ffffff;stroke-linecap:butt;stroke-linejoin:miter;stroke-opacity:1;stroke-width:0.7786883358892696"
           d="M 244.09 145.46 L 244.09 155.993"
           id="path3264" />
        <path
           style="fill:none;stroke:#ffffff;stroke-linecap:butt;stroke-linejoin:miter;stroke-opacity:1;stroke-width:0.7786883358892696"
           d="M 244.09 161.517 L 244.09 172.051"
           id="path3266" />
        <path
           style="fill:#ffffff;stroke:#ffffff;stroke-width:0.778689;stroke-linecap:butt;stroke-linejoin:miter;stroke-opacity:1"
           d="m 250.132,192.02635 -0.191,-65.80243"
           id="path3268" />
        <path
           style="fill:none;stroke:#ffffff;stroke-linecap:butt;stroke-linejoin:miter;stroke-opacity:1;stroke-width:0.7786883358892696"
           d="M 244.09 177.574 L 244.09 188.108"
           id="path3270" />
        <path
           style="fill:#ffffff;stroke:#ffffff;stroke-width:0.778689;stroke-linecap:butt;stroke-linejoin:miter;stroke-opacity:1"
           d="m 238.048,192.02635 -0.191,-65.80243"
           id="path3272" />
      </g>
      <g
         id="roadSW"
         transform="translate(-0.26458332)">
        <rect
           style="fill:#4d4d4d;fill-opacity:1;stroke-width:0.412055"
           id="rect3244"
           width="12.08376"
           height="65.835342"
           x="63.023861"
           y="-0.6627"
           ry="1.6212608"
           rx="1.6212608" />
        <path
           style="fill:none;stroke:#ffffff;stroke-width:0.778688;stroke-linecap:butt;stroke-linejoin:miter;stroke-opacity:1"
           d="M 69.0657,2.54878 69.0657,13.0823"
           id="path3246" />
        <path
           style="fill:none;stroke:#ffffff;stroke-width:0.778688;stroke-linecap:butt;stroke-linejoin:miter;stroke-opacity:1"
           d="m 69.0657,18.6062 0,10.5335"
           id="path3248" />
        <path
           style="fill:none;stroke:#ffffff;stroke-width:0.778688;stroke-linecap:butt;stroke-linejoin:miter;stroke-opacity:1"
           d="m 69.0657,34.6636 0,10.5335"
           id="path3250" />
        <path
           style="fill:#ffffff;stroke:#ffffff;stroke-width:0.778688;stroke-linecap:butt;stroke-linejoin:miter;stroke-opacity:1"
           d="M 75.1076,65.172888 74.917,-0.40151918"
           id="path3252" />
        <path
           style="fill:none;stroke:#ffffff;stroke-width:0.778688;stroke-linecap:butt;stroke-linejoin:miter;stroke-opacity:1"
           d="m 69.0657,50.721 0,10.5335"
           id="path3254" />
        <path
           style="fill:#ffffff;stroke:#ffffff;stroke-width:0.778688;stroke-linecap:butt;stroke-linejoin:miter;stroke-opacity:1"
           d="M 63.0239,65.172888 62.8332,-0.40152423"
           id="path3256" />
      </g>
      <g
         id="roadNW">
        <rect
           style="fill:#4d4d4d;fill-opacity:1;stroke-width:0.4120553919491812"
           id="rect2165"
           width="12.08376"
           height="65.83534"
           x="238.04806"
           y="-0.6627000000000152"
           ry="1.621260761692" />
        <path
           style="fill:none;stroke:#ffffff;stroke-linecap:butt;stroke-linejoin:miter;stroke-opacity:1;stroke-width:0.7786883358892696"
           d="M 244.09 2.54878 L 244.09 13.0823"
           id="path3036-6" />
        <path
           style="fill:none;stroke:#ffffff;stroke-linecap:butt;stroke-linejoin:miter;stroke-opacity:1;stroke-width:0.7786883358892696"
           d="M 244.09 18.6062 L 244.09 29.1397"
           id="path3036-3" />
        <path
           style="fill:none;stroke:#ffffff;stroke-linecap:butt;stroke-linejoin:miter;stroke-opacity:1;stroke-width:0.7786883358892696"
           d="M 244.09 34.6636 L 244.09 45.1971"
           id="path3036-1" />
        <path
           style="fill:#ffffff;stroke:#ffffff;stroke-width:0.778688;stroke-linecap:butt;stroke-linejoin:miter;stroke-opacity:1"
           d="M 250.132,65.172819 249.941,-0.18096506"
           id="path2460-0" />
        <path
           style="fill:none;stroke:#ffffff;stroke-linecap:butt;stroke-linejoin:miter;stroke-opacity:1;stroke-width:0.7786883358892696"
           d="M 244.09 50.721 L 244.09 61.2545"
           id="path3036" />
        <path
           style="fill:#ffffff;stroke:#ffffff;stroke-width:0.778688;stroke-linecap:butt;stroke-linejoin:miter;stroke-opacity:1"
           d="M 238.048,65.17279 237.857,-0.09274832"
           id="path2460" />
      </g>
    </g>
    <g
       id="Culverts"
       transform="matrix(1.5104714,0,0,1.6057437,-2.1166665,-80.949728)">
      <g
         id="culvertsN">
        <path
           style="fill:#4094ff;fill-opacity:1;stroke-width:0.264583"
           d="m 134.32564,91.647039 5.06686,-4.913315 h 10.13371 l 5.06686,4.913315 h 3.99207 l -7.8306,-7.677054 h -12.28329 l -8.44751,7.776199 z"
           id="culvertNW" />
        <path
           style="fill:#4094ff;fill-opacity:1;stroke-width:0.264583"
           d="m 134.22457,127.85091 5.06686,4.91331 h 10.13371 l 5.06686,-4.91331 h 3.99207 l -7.8306,7.67705 h -12.28329 l -8.44751,-7.7762 z"
           id="culvertNE" />
      </g>
      <g
         id="culvertsS">
        <path
           style="fill:#4094ff;fill-opacity:1;stroke-width:0.264583"
           d="m 55.302126,91.586282 5.06686,-4.913315 h 10.13371 l 5.06686,4.913315 h 3.99207 l -7.8306,-7.677054 h -12.28329 l -8.44751,7.776199 z"
           id="culvertSW" />
        <path
           style="fill:#4094ff;fill-opacity:1;stroke-width:0.264583"
           d="m 55.355224,127.962 5.06686,4.91331 h 10.13371 l 5.06686,-4.91331 h 3.99207 l -7.8306,7.67705 h -12.28329 l -8.44751,-7.7762 z"
           id="culvertSE" />
      </g>
    </g>
    <g
       id="Bridges">
      <g
         id="bridgeS"
         transform="translate(-0.27971508)">
        <g
           id="bridgeSclosed">
          <rect
             style="fill:#4d4d4d;fill-opacity:1;stroke-width:0.3967"
             id="rect3260-9-4"
             width="12.084123"
             height="61.018101"
             x="63.025021"
             y="65.172562"
             ry="1.5026315"
             rx="1.5026315" />
          <path
             style="fill:none;stroke:#ffffff;stroke-width:0.74967;stroke-linecap:butt;stroke-linejoin:miter;stroke-opacity:1"
             d="M 69.0671,68.1491 69.0671,77.9119"
             id="path3262-0-7" />
          <path
             style="fill:none;stroke:#ffffff;stroke-width:0.74967;stroke-linecap:butt;stroke-linejoin:miter;stroke-opacity:1"
             d="M 69.0671,83.0315 69.0671,92.7943"
             id="path3264-7-2" />
          <path
             style="fill:none;stroke:#ffffff;stroke-width:0.74967;stroke-linecap:butt;stroke-linejoin:miter;stroke-opacity:1"
             d="m 69.0671,97.914 0,9.763"
             id="path3266-0-1" />
          <path
             style="fill:#ffffff;stroke:#2d2dff;stroke-width:1.79921;stroke-linecap:butt;stroke-linejoin:miter;stroke-opacity:1"
             d="M 75.1091,126.191 74.9185,66.2732"
             id="path3268-3-2" />
          <path
             style="fill:none;stroke:#ffffff;stroke-width:0.74967;stroke-linecap:butt;stroke-linejoin:miter;stroke-opacity:1"
             d="m 69.0671,112.796 0,9.763"
             id="path3270-2-5" />
          <path
             style="fill:#ffffff;stroke:#2d2dff;stroke-width:1.79921;stroke-linecap:butt;stroke-linejoin:miter;stroke-opacity:1"
             d="M 62.8344,126.191 63.025,66.2732"
             id="path3272-2-6" />
          <path
             style="fill:none;stroke:#2d2dff;stroke-width:1.79921;stroke-linecap:butt;stroke-linejoin:miter;stroke-opacity:1"
             d="M 62.9822,121.03 74.2545,114.451 63.8239,109.222 73.9125,103.675 63.9094,98.1283 73.9125,93.1363 63.9094,87.352 73.827,82.7562 64.0804,76.9718 73.998,72.693 64.3394,67.038"
             id="path10473" />
          <path
             style="fill:#ffffff;stroke:#2d2dff;stroke-width:1.79921;stroke-linecap:butt;stroke-linejoin:miter;stroke-opacity:1"
             d="M 64.3394,67.038 63.3549,66.4452"
             id="path10622" />
        </g>
        <g
           id="bridgeSopen"
           transform="translate(0.08819444)">
          <path
             style="fill:#b3b3b3;fill-opacity:1;stroke:none;stroke-width:0.264583;stroke-linecap:butt;stroke-linejoin:miter;stroke-opacity:1"
             d="m 62.8341,66.2733 1.5475,1.6625 h 9.0568 l 1.4795,-1.6625"
             id="path906-3" />
          <rect
             style="fill:#4d4d4d;stroke-width:0.274824"
             id="rect523-1"
             width="12.08376"
             height="0.80286998"
             x="62.834145"
             y="65.470421"
             ry="1.6212599"
             rx="1.6212599" />
          <path
             style="fill:#b3b3b3;stroke:#aeaeae;stroke-width:0.264583;stroke-linecap:butt;stroke-linejoin:miter;stroke-opacity:1"
             d="M 62.8341,66.2733 H 74.9179"
             id="path1218-3" />
          <path
             style="fill:#ffffff;stroke:#2d2dff;stroke-width:1.86885;stroke-linecap:butt;stroke-linejoin:miter;stroke-opacity:1"
             d="M 62.8341,66.2733 62.9384,55.2515"
             id="path2803-3" />
          <path
             style="fill:#ffffff;stroke:#2d2dff;stroke-width:1.86885;stroke-linecap:butt;stroke-linejoin:miter;stroke-opacity:1"
             d="M 74.9179,66.2733 74.8137,55.2515"
             id="path2803-0-6" />
          <path
             style="fill:#ffffff;stroke:#2d2dff;stroke-width:1.86885;stroke-linecap:butt;stroke-linejoin:miter;stroke-opacity:1"
             d="m 63.532,56.2493 10.6397,0.0604"
             id="path10737" />
        </g>
      </g>
      <g
         id="bridgeN">
        <g
           id="bridgeNclosed">
          <rect
             style="fill:#4d4d4d;fill-opacity:1;stroke-width:0.3966997464373353"
             id="rect3260-9"
             width="12.084122512799999"
             height="61.018102336860004"
             x="238.04842024709498"
             y="65.17255971299998"
             ry="1.5026314904982347" />
          <path
             style="fill:none;stroke:#ffffff;stroke-linecap:butt;stroke-linejoin:miter;stroke-opacity:1;stroke-width:0.7496697566308782"
             d="M 244.09 68.1491 L 244.09 77.9119"
             id="path3262-0" />
          <path
             style="fill:none;stroke:#ffffff;stroke-linecap:butt;stroke-linejoin:miter;stroke-opacity:1;stroke-width:0.7496697566308782"
             d="M 244.09 83.0315 L 244.09 92.7943"
             id="path3264-7" />
          <path
             style="fill:none;stroke:#ffffff;stroke-linecap:butt;stroke-linejoin:miter;stroke-opacity:1;stroke-width:0.7496697566308782"
             d="M 244.09 97.914 L 244.09 107.677"
             id="path3266-0" />
          <path
             style="fill:#ffffff;stroke:#2d2dff;stroke-width:1.7992;stroke-linecap:butt;stroke-linejoin:miter;stroke-opacity:1"
             d="M 250.133,126.19185 249.942,65.212184"
             id="path3268-3" />
          <path
             style="fill:none;stroke:#ffffff;stroke-linecap:butt;stroke-linejoin:miter;stroke-opacity:1;stroke-width:0.7496697566308782"
             d="M 244.09 112.796 L 244.09 122.559"
             id="path3270-2" />
          <path
             style="fill:#ffffff;stroke:#2d2dff;stroke-width:1.79921;stroke-linecap:butt;stroke-linejoin:miter;stroke-opacity:1"
             d="m 237.858,126.19184 0.19,-60.979654"
             id="path3272-2" />
          <path
             style="fill:none;stroke:#2d2dff;stroke-linecap:butt;stroke-linejoin:miter;stroke-opacity:1;stroke-width:1.7992074159141076"
             d="M 239.406 67.9357 L 238.347 67.2619 L 237.881 66.9658"
             id="path9430" />
          <path
             style="fill:none;stroke:#2d2dff;stroke-linecap:butt;stroke-linejoin:miter;stroke-opacity:1;stroke-width:1.7992074159141076"
             d="M 238.048 121.928 L 249.321 115.349 L 238.89 110.119 L 248.979 104.573 L 238.976 99.026 L 248.979 94.034 L 238.976 88.2497 L 248.893 83.6539 L 239.147 77.8695 L 249.064 73.5907 L 239.406 67.9357"
             id="path9314" />
        </g>
        <g
           id="bridgeNopen"
           transform="translate(-0.09354432)">
          <path
             style="fill:#b3b3b3;fill-opacity:1;stroke:none;stroke-width:0.264583;stroke-linecap:butt;stroke-linejoin:miter;stroke-opacity:1"
             d="m 238.048,65.1727 1.547,1.6626 h 9.057 l 1.48,-1.6626"
             id="path906" />
          <rect
             style="fill:#4d4d4d;stroke-width:0.274824"
             id="rect523"
             width="12.08376"
             height="0.80286998"
             x="238.04807"
             y="64.36985"
             ry="1.6212599"
             rx="1.6212599" />
          <path
             style="fill:#b3b3b3;stroke:#aeaeae;stroke-width:0.264583;stroke-linecap:butt;stroke-linejoin:miter;stroke-opacity:1"
             d="m 238.048,65.1727 h 12.084"
             id="path1218" />
          <path
             style="fill:#ffffff;stroke:#2d2dff;stroke-width:1.86885;stroke-linecap:butt;stroke-linejoin:miter;stroke-opacity:1"
             d="M 238.048,65.1727 238.152,54.151"
             id="path2803" />
          <path
             style="fill:#ffffff;stroke:#2d2dff;stroke-width:1.86885;stroke-linecap:butt;stroke-linejoin:miter;stroke-opacity:1"
             d="M 250.132,65.1727 250.028,54.1509"
             id="path2803-0" />
          <path
             style="fill:#ffffff;stroke:#2d2dff;stroke-width:1.86885;stroke-linecap:butt;stroke-linejoin:miter;stroke-opacity:1"
             d="m 238.42,55.1432 h 11.114"
             id="path9974" />
        </g>
      </g>
    </g>
    <g
       id="Gates">
      <g
         id="gateassS">
        <rect
           style="fill:#999999;fill-opacity:1;stroke-width:0.4416274876944"
           id="rect3260-9-8-9-9"
           width="13.594296571200003"
           height="65.835669025"
           x="90.02264847600001"
           y="-0.6623181596999999"
           ry="1.5513994598513634" />
        <rect
           style="fill:#b3b3b3;fill-opacity:1;stroke-width:0.4030806669872586"
           id="rect3260-9-8-8-1"
           width="10.573341777600001"
           height="65.835669025"
           x="91.53312587280001"
           y="-0.6623181596999999"
           ry="1.5513994598513634" />
        <rect
           style="fill:#808080;fill-opacity:1;stroke-width:0.4030806669872586"
           id="gateS"
           width="10.573341777600001"
           height="65.835669025"
           x="91.53312587280001"
           y="-0.6623181596999999"
           ry="1.5513994598513634" />
      </g>
      <g
         id="gateassN">
        <rect
           style="fill:#999999;fill-opacity:1;stroke-width:0.4416274876944"
           id="rect3260-9-8-9-9-1"
           width="13.594296571200003"
           height="65.835669025"
           x="209.35016353332384"
           y="-0.6623181596999999"
           ry="1.5513994598513634" />
        <rect
           style="fill:#b3b3b3;fill-opacity:1;stroke-width:0.4030806669872586"
           id="rect3260-9-8-8-1-9"
           width="10.573341777600001"
           height="65.835669025"
           x="210.86064093012385"
           y="-0.6623181596999999"
           ry="1.5513994598513634" />
        <rect
           style="fill:#808080;fill-opacity:1;stroke-width:0.4030806669872586"
           id="gateN"
           width="10.573341777600001"
           height="65.835669025"
           x="210.86064093012385"
           y="-0.6623181596999999"
           ry="1.5513994598513634" />
      </g>
    </g>
    <g
       id="EnteringTL"
       transform="matrix(1.5104714,0,0,1.6057437,-2.1166665,-80.949728)">
      <g
         id="ETLN"
         transform="matrix(0.24868909,0,0,0.23393382,55.318033,36.626171)">
        <g
           transform="rotate(90,400.38685,309.43559)"
           id="ETLNW">
          <ellipse
             transform="rotate(90)"
             ry="4.591979"
             rx="5.7929583"
             cy="-493.85052"
             cx="225.27328"
             id="path4659-9-5"
             style="fill:#393b3b;fill-opacity:1;fill-rule:evenodd;stroke:none;stroke-width:0.8;stroke-linecap:butt;stroke-miterlimit:12;stroke-dasharray:none;stroke-dashoffset:0;stroke-opacity:1" />
          <ellipse
             transform="rotate(90)"
             ry="4.591979"
             rx="5.7430038"
             cy="-471.27835"
             cx="225.27328"
             id="path4659-4-05-8"
             style="fill:#393b3b;fill-opacity:1;fill-rule:evenodd;stroke:none;stroke-width:0.8;stroke-linecap:butt;stroke-miterlimit:12;stroke-dasharray:none;stroke-dashoffset:0;stroke-opacity:1" />
          <rect
             transform="rotate(90)"
             y="-494.25723"
             x="219.50357"
             height="23.378544"
             width="11.539409"
             id="rect4676-6-6"
             style="fill:#393b3b;fill-opacity:1;fill-rule:evenodd;stroke:none;stroke-width:0.8;stroke-linecap:butt;stroke-miterlimit:12;stroke-dasharray:none;stroke-dashoffset:0;stroke-opacity:1" />
          <ellipse
             transform="rotate(90)"
             ry="3.8265126"
             rx="3.8265128"
             cy="-482.56442"
             cx="225.27328"
             id="ETLNW2"
             style="fill:green;fill-opacity:1;fill-rule:evenodd;stroke:#000000;stroke-width:0.799266;stroke-linecap:butt;stroke-miterlimit:12;stroke-dasharray:none;stroke-dashoffset:0;stroke-opacity:1" />
          <ellipse
             transform="rotate(90)"
             ry="3.8265126"
             rx="3.8265128"
             cy="-492.15564"
             cx="225.27328"
             id="ETLNW3"
             style="fill:red;fill-opacity:1;fill-rule:evenodd;stroke:#000000;stroke-width:0.799266;stroke-linecap:butt;stroke-miterlimit:12;stroke-dasharray:none;stroke-dashoffset:0;stroke-opacity:1" />
          <ellipse
             transform="rotate(90)"
             ry="3.8265126"
             rx="3.8265128"
             cy="-472.97324"
             cx="225.27328"
             id="ETLNW1"
             style="fill:red;fill-opacity:1;fill-rule:evenodd;stroke:#000000;stroke-width:0.799266;stroke-linecap:butt;stroke-miterlimit:12;stroke-dasharray:none;stroke-dashoffset:0;stroke-opacity:1" />
        </g>
        <g
           transform="matrix(0.79926643,0,0,0.79926643,45.857315,-75.96031)"
           id="ETLNE">
          <ellipse
             ry="5.7452421"
             rx="7.2478437"
             cy="367.4917"
             cx="548.24988"
             id="path4659-8-4"
             style="fill:#393b3b;fill-opacity:1;fill-rule:evenodd;stroke:none;stroke-width:0.8;stroke-linecap:butt;stroke-miterlimit:12;stroke-dasharray:none;stroke-dashoffset:0;stroke-opacity:1" />
          <ellipse
             ry="5.7452421"
             rx="7.1853437"
             cy="395.73285"
             cx="548.24988"
             id="path4659-4-7-6"
             style="fill:#393b3b;fill-opacity:1;fill-rule:evenodd;stroke:none;stroke-width:0.8;stroke-linecap:butt;stroke-miterlimit:12;stroke-dasharray:none;stroke-dashoffset:0;stroke-opacity:1" />
          <rect
             y="366.98285"
             x="541.03113"
             height="29.25"
             width="14.4375"
             id="rect4676-62-7"
             style="fill:#393b3b;fill-opacity:1;fill-rule:evenodd;stroke:none;stroke-width:0.8;stroke-linecap:butt;stroke-miterlimit:12;stroke-dasharray:none;stroke-dashoffset:0;stroke-opacity:1" />
          <ellipse
             ry="4.7875328"
             rx="4.7875304"
             cy="381.61227"
             cx="548.24988"
             id="ETLNE2"
             style="fill:#008000;fill-opacity:1;fill-rule:evenodd;stroke:#000000;stroke-width:0.999996;stroke-linecap:butt;stroke-miterlimit:12;stroke-dasharray:none;stroke-dashoffset:0;stroke-opacity:1" />
          <ellipse
             ry="4.7875328"
             rx="4.7875304"
             cy="369.61227"
             cx="548.24988"
             id="ETLNE1"
             style="fill:#ff0000;fill-opacity:1;fill-rule:evenodd;stroke:#000000;stroke-width:0.999996;stroke-linecap:butt;stroke-miterlimit:12;stroke-dasharray:none;stroke-dashoffset:0;stroke-opacity:1" />
          <ellipse
             ry="4.7875328"
             rx="4.7875304"
             cy="393.61227"
             cx="548.24988"
             id="ETLNE3"
             style="fill:#ff0000;fill-opacity:1;fill-rule:evenodd;stroke:#000000;stroke-width:0.999996;stroke-linecap:butt;stroke-miterlimit:12;stroke-dasharray:none;stroke-dashoffset:0;stroke-opacity:1" />
        </g>
      </g>
      <g
         id="ETLS"
         transform="matrix(0.24868909,0,0,0.23393382,-86.243827,37.007937)">
        <g
           transform="rotate(90,400.38685,309.43559)"
           id="ETLSE">
          <ellipse
             transform="rotate(90)"
             ry="4.591979"
             rx="5.7929583"
             cy="-493.85052"
             cx="225.27328"
             id="path4659-9-5-1"
             style="fill:#393b3b;fill-opacity:1;fill-rule:evenodd;stroke:none;stroke-width:0.8;stroke-linecap:butt;stroke-miterlimit:12;stroke-dasharray:none;stroke-dashoffset:0;stroke-opacity:1" />
          <ellipse
             transform="rotate(90)"
             ry="4.591979"
             rx="5.7430038"
             cy="-471.27835"
             cx="225.27328"
             id="path4659-4-05-8-6"
             style="fill:#393b3b;fill-opacity:1;fill-rule:evenodd;stroke:none;stroke-width:0.8;stroke-linecap:butt;stroke-miterlimit:12;stroke-dasharray:none;stroke-dashoffset:0;stroke-opacity:1" />
          <rect
             transform="rotate(90)"
             y="-494.25723"
             x="219.50359"
             height="23.378544"
             width="11.539409"
             id="rect4676-6-6-5"
             style="fill:#393b3b;fill-opacity:1;fill-rule:evenodd;stroke:none;stroke-width:0.8;stroke-linecap:butt;stroke-miterlimit:12;stroke-dasharray:none;stroke-dashoffset:0;stroke-opacity:1" />
          <ellipse
             transform="rotate(90)"
             ry="3.8265126"
             rx="3.8265128"
             cy="-482.56442"
             cx="225.27328"
             id="ETLSE2"
             style="fill:green;fill-opacity:1;fill-rule:evenodd;stroke:#000000;stroke-width:0.799266;stroke-linecap:butt;stroke-miterlimit:12;stroke-dasharray:none;stroke-dashoffset:0;stroke-opacity:1" />
          <ellipse
             transform="rotate(90)"
             ry="3.8265126"
             rx="3.8265128"
             cy="-492.15564"
             cx="225.27328"
             id="ETLSE3"
             style="fill:red;fill-opacity:1;fill-rule:evenodd;stroke:#000000;stroke-width:0.799266;stroke-linecap:butt;stroke-miterlimit:12;stroke-dasharray:none;stroke-dashoffset:0;stroke-opacity:1" />
          <ellipse
             transform="rotate(90)"
             ry="3.8265126"
             rx="3.8265128"
             cy="-472.97324"
             cx="225.27328"
             id="ETLSE1"
             style="fill:red;fill-opacity:1;fill-rule:evenodd;stroke:#000000;stroke-width:0.799266;stroke-linecap:butt;stroke-miterlimit:12;stroke-dasharray:none;stroke-dashoffset:0;stroke-opacity:1" />
        </g>
        <g
           transform="matrix(0.79926643,0,0,0.79926643,45.857315,-75.96031)"
           id="ETLSW">
          <ellipse
             ry="5.7452421"
             rx="7.2478437"
             cy="367.4917"
             cx="548.24988"
             id="path4659-8-4-7"
             style="fill:#393b3b;fill-opacity:1;fill-rule:evenodd;stroke:none;stroke-width:0.8;stroke-linecap:butt;stroke-miterlimit:12;stroke-dasharray:none;stroke-dashoffset:0;stroke-opacity:1" />
          <ellipse
             ry="5.7452421"
             rx="7.1853437"
             cy="395.73285"
             cx="548.24988"
             id="path4659-4-7-6-2"
             style="fill:#393b3b;fill-opacity:1;fill-rule:evenodd;stroke:none;stroke-width:0.8;stroke-linecap:butt;stroke-miterlimit:12;stroke-dasharray:none;stroke-dashoffset:0;stroke-opacity:1" />
          <rect
             y="366.98285"
             x="541.03113"
             height="29.25"
             width="14.4375"
             id="rect4676-62-7-6"
             style="fill:#393b3b;fill-opacity:1;fill-rule:evenodd;stroke:none;stroke-width:0.8;stroke-linecap:butt;stroke-miterlimit:12;stroke-dasharray:none;stroke-dashoffset:0;stroke-opacity:1" />
          <ellipse
             ry="4.7875328"
             rx="4.7875304"
             cy="381.61227"
             cx="548.24988"
             id="ETLSW2"
             style="fill:#008000;fill-opacity:1;fill-rule:evenodd;stroke:#000000;stroke-width:0.999996;stroke-linecap:butt;stroke-miterlimit:12;stroke-dasharray:none;stroke-dashoffset:0;stroke-opacity:1" />
          <ellipse
             ry="4.7875328"
             rx="4.7875304"
             cy="369.61227"
             cx="548.24988"
             id="ETLSW1"
             style="fill:#ff0000;fill-opacity:1;fill-rule:evenodd;stroke:#000000;stroke-width:0.999996;stroke-linecap:butt;stroke-miterlimit:12;stroke-dasharray:none;stroke-dashoffset:0;stroke-opacity:1" />
          <ellipse
             ry="4.7875328"
             rx="4.7875304"
             cy="393.61227"
             cx="548.24988"
             id="ETLSW3"
             style="fill:#ff0000;fill-opacity:1;fill-rule:evenodd;stroke:#000000;stroke-width:0.999996;stroke-linecap:butt;stroke-miterlimit:12;stroke-dasharray:none;stroke-dashoffset:0;stroke-opacity:1" />
        </g>
      </g>
    </g>
    <g
       id="LeavingTLs"
       transform="translate(-2.1166665)">
      <g
         id="LTLN"
         transform="matrix(0.37563775,0,0,0.37563775,25.126547,-54.648411)">
        <g
           id="LTLNW"
           transform="matrix(-0.78023353,0,0,-0.89044147,849.83783,1007.8309)">
          <rect
             y="754.72583"
             x="468.3324"
             height="15.772711"
             width="14.335068"
             id="rect6175-3-8-9-6-0"
             style="fill:#393b3b;fill-opacity:1;fill-rule:evenodd;stroke:none;stroke-width:0.235;stroke-linecap:butt;stroke-miterlimit:12;stroke-dasharray:none;stroke-dashoffset:0;stroke-opacity:1" />
          <ellipse
             ry="5.5204487"
             rx="7.1675344"
             cy="754.36224"
             cx="475.49994"
             id="path6179-6-1-7-4-6"
             style="fill:#393b3b;fill-opacity:1;fill-rule:evenodd;stroke:none;stroke-width:0.235;stroke-linecap:butt;stroke-miterlimit:12;stroke-dasharray:none;stroke-dashoffset:0;stroke-opacity:1" />
          <ellipse
             ry="5.5204487"
             rx="7.1675344"
             cy="770.61224"
             cx="475.49994"
             id="path6179-2-1-9-3-8-5"
             style="fill:#393b3b;fill-opacity:1;fill-rule:evenodd;stroke:none;stroke-width:0.235;stroke-linecap:butt;stroke-miterlimit:12;stroke-dasharray:none;stroke-dashoffset:0;stroke-opacity:1" />
          <ellipse
             style="fill:green;fill-opacity:1;fill-rule:evenodd;stroke:#000000;stroke-width:1;stroke-linecap:butt;stroke-miterlimit:12;stroke-dasharray:none;stroke-dashoffset:0;stroke-opacity:1"
             id="LTLNW1"
             cx="475.49994"
             cy="756.73724"
             rx="4.9165139"
             ry="4.2461243" />
          <ellipse
             style="fill:red;fill-opacity:1;fill-rule:evenodd;stroke:#000000;stroke-width:1;stroke-linecap:butt;stroke-miterlimit:12;stroke-dasharray:none;stroke-dashoffset:0;stroke-opacity:1"
             id="LTLNW2"
             cx="475.49994"
             cy="768.23724"
             rx="4.9165139"
             ry="4.2461243" />
        </g>
        <g
           id="LTLNE"
           transform="matrix(-0.78023353,0,0,-0.89044147,849.43142,1148.5474)">
          <rect
             y="754.72583"
             x="468.3324"
             height="15.772711"
             width="14.335068"
             id="rect6175-3-8-2-8-4-7"
             style="fill:#393b3b;fill-opacity:1;fill-rule:evenodd;stroke:none;stroke-width:0.235;stroke-linecap:butt;stroke-miterlimit:12;stroke-dasharray:none;stroke-dashoffset:0;stroke-opacity:1" />
          <ellipse
             ry="5.5204487"
             rx="7.1675344"
             cy="754.36224"
             cx="475.49994"
             id="path6179-6-1-4-2-1-52"
             style="fill:#393b3b;fill-opacity:1;fill-rule:evenodd;stroke:none;stroke-width:0.235;stroke-linecap:butt;stroke-miterlimit:12;stroke-dasharray:none;stroke-dashoffset:0;stroke-opacity:1" />
          <ellipse
             ry="5.5204487"
             rx="7.1675344"
             cy="770.61224"
             cx="475.49994"
             id="path6179-2-1-9-0-9-2-1"
             style="fill:#393b3b;fill-opacity:1;fill-rule:evenodd;stroke:none;stroke-width:0.235;stroke-linecap:butt;stroke-miterlimit:12;stroke-dasharray:none;stroke-dashoffset:0;stroke-opacity:1" />
          <ellipse
             style="fill:green;fill-opacity:1;fill-rule:evenodd;stroke:#000000;stroke-width:1;stroke-linecap:butt;stroke-miterlimit:12;stroke-dasharray:none;stroke-dashoffset:0;stroke-opacity:1"
             id="LTLNE1"
             cx="475.49994"
             cy="756.73724"
             rx="4.9165139"
             ry="4.2461243" />
          <ellipse
             style="fill:red;fill-opacity:1;fill-rule:evenodd;stroke:#000000;stroke-width:1;stroke-linecap:butt;stroke-miterlimit:12;stroke-dasharray:none;stroke-dashoffset:0;stroke-opacity:1"
             id="LTLNE2"
             cx="475.49994"
             cy="768.23724"
             rx="4.9165139"
             ry="4.2461243" />
        </g>
      </g>
      <g
         id="LTLS"
         transform="matrix(0.37563775,0,0,0.37563775,-67.824238,-54.745971)">
        <g
           id="BTLSW">
          <rect
             y="-335.79172"
             x="-484.4292"
             height="14.044676"
             width="11.184701"
             id="rect6175-3-8-9-6-0-5"
             style="fill:#393b3b;fill-opacity:1;fill-rule:evenodd;stroke:none;stroke-width:0.195877;stroke-linecap:butt;stroke-miterlimit:12;stroke-dasharray:none;stroke-dashoffset:0;stroke-opacity:1"
             transform="scale(-1)" />
          <ellipse
             ry="4.9156365"
             rx="5.5923505"
             cy="-336.11548"
             cx="-478.83682"
             id="path6179-6-1-7-4-6-8"
             style="fill:#393b3b;fill-opacity:1;fill-rule:evenodd;stroke:none;stroke-width:0.195877;stroke-linecap:butt;stroke-miterlimit:12;stroke-dasharray:none;stroke-dashoffset:0;stroke-opacity:1"
             transform="scale(-1)" />
          <ellipse
             ry="4.9156365"
             rx="5.5923505"
             cy="-321.64581"
             cx="-478.83682"
             id="path6179-2-1-9-3-8-5-0"
             style="fill:#393b3b;fill-opacity:1;fill-rule:evenodd;stroke:none;stroke-width:0.195877;stroke-linecap:butt;stroke-miterlimit:12;stroke-dasharray:none;stroke-dashoffset:0;stroke-opacity:1"
             transform="scale(-1)" />
          <circle
             style="fill:green;fill-opacity:1;fill-rule:evenodd;stroke:#000000;stroke-width:0.833519;stroke-linecap:butt;stroke-miterlimit:12;stroke-dasharray:none;stroke-dashoffset:0;stroke-opacity:1"
             id="LTLSW1"
             cx="-478.83682"
             cy="-334.00067"
             transform="scale(-1)"
             r="3.8093867" />
          <ellipse
             style="fill:red;fill-opacity:1;fill-rule:evenodd;stroke:#000000;stroke-width:0.833519;stroke-linecap:butt;stroke-miterlimit:12;stroke-dasharray:none;stroke-dashoffset:0;stroke-opacity:1"
             id="LTLSW2"
             cx="-478.83682"
             cy="-323.76059"
             transform="scale(-1)"
             rx="3.8093867"
             ry="3.8093863" />
        </g>
        <g
           id="LTLSE"
           transform="matrix(-0.78023353,0,0,-0.89044147,849.43142,1148.5474)">
          <rect
             y="754.72583"
             x="468.3324"
             height="15.772711"
             width="14.335068"
             id="rect6175-3-8-2-8-4-7-6"
             style="fill:#393b3b;fill-opacity:1;fill-rule:evenodd;stroke:none;stroke-width:0.235;stroke-linecap:butt;stroke-miterlimit:12;stroke-dasharray:none;stroke-dashoffset:0;stroke-opacity:1" />
          <ellipse
             ry="5.5204487"
             rx="7.1675344"
             cy="754.36224"
             cx="475.49994"
             id="path6179-6-1-4-2-1-52-8"
             style="fill:#393b3b;fill-opacity:1;fill-rule:evenodd;stroke:none;stroke-width:0.235;stroke-linecap:butt;stroke-miterlimit:12;stroke-dasharray:none;stroke-dashoffset:0;stroke-opacity:1" />
          <ellipse
             ry="5.5204487"
             rx="7.1675344"
             cy="770.61224"
             cx="475.49994"
             id="path6179-2-1-9-0-9-2-1-5"
             style="fill:#393b3b;fill-opacity:1;fill-rule:evenodd;stroke:none;stroke-width:0.235;stroke-linecap:butt;stroke-miterlimit:12;stroke-dasharray:none;stroke-dashoffset:0;stroke-opacity:1" />
          <ellipse
             style="fill:green;fill-opacity:1;fill-rule:evenodd;stroke:#000000;stroke-width:1;stroke-linecap:butt;stroke-miterlimit:12;stroke-dasharray:none;stroke-dashoffset:0;stroke-opacity:1"
             id="LTLSE1"
             cx="475.49994"
             cy="756.73724"
             rx="4.9165139"
             ry="4.2461243" />
          <ellipse
             style="fill:red;fill-opacity:1;fill-rule:evenodd;stroke:#000000;stroke-width:1;stroke-linecap:butt;stroke-miterlimit:12;stroke-dasharray:none;stroke-dashoffset:0;stroke-opacity:1"
             id="LTLSE2"
             cx="475.49994"
             cy="768.23724"
             rx="4.9165139"
             ry="4.2461243" />
        </g>
      </g>
    </g>
    <g
       id="BridgeTL"
       transform="translate(-2.1166665)">
      <g
         id="BTLS"
         transform="matrix(0.37563775,0,0,0.37563775,-95.193638,-66.853452)">
        <g
           id="g4878"
           transform="translate(-5.3125983,-4.6485235)">
          <rect
             y="-485.74792"
             x="318.7821"
             height="14.044676"
             width="11.184701"
             id="rect6175-3-8-9-6-6"
             style="fill:#393b3b;fill-opacity:1;fill-rule:evenodd;stroke:none;stroke-width:0.195877;stroke-linecap:butt;stroke-miterlimit:12;stroke-dasharray:none;stroke-dashoffset:0;stroke-opacity:1"
             transform="rotate(90)" />
          <ellipse
             ry="4.9156365"
             rx="5.5923505"
             cy="-486.07169"
             cx="324.37448"
             id="path6179-6-1-7-4-9"
             style="fill:#393b3b;fill-opacity:1;fill-rule:evenodd;stroke:none;stroke-width:0.195877;stroke-linecap:butt;stroke-miterlimit:12;stroke-dasharray:none;stroke-dashoffset:0;stroke-opacity:1"
             transform="rotate(90)" />
          <ellipse
             ry="4.9156365"
             rx="5.5923505"
             cy="-471.60199"
             cx="324.37448"
             id="path6179-2-1-9-3-8-3"
             style="fill:#393b3b;fill-opacity:1;fill-rule:evenodd;stroke:none;stroke-width:0.195877;stroke-linecap:butt;stroke-miterlimit:12;stroke-dasharray:none;stroke-dashoffset:0;stroke-opacity:1"
             transform="rotate(90)" />
          <ellipse
             style="fill:#ff0000;fill-opacity:1;fill-rule:evenodd;stroke:#000000;stroke-width:0.833518;stroke-linecap:butt;stroke-miterlimit:12;stroke-dasharray:none;stroke-dashoffset:0;stroke-opacity:1"
             id="BTLSW1"
             cx="324.37448"
             cy="-483.95688"
             rx="3.8360291"
             ry="3.780925"
             transform="rotate(90)" />
          <ellipse
             style="fill:#ff0000;fill-opacity:1;fill-rule:evenodd;stroke:#000000;stroke-width:0.833518;stroke-linecap:butt;stroke-miterlimit:12;stroke-dasharray:none;stroke-dashoffset:0;stroke-opacity:1"
             id="BTLSW2"
             cx="324.37448"
             cy="-473.7168"
             rx="3.8360291"
             ry="3.780925"
             transform="rotate(90)" />
        </g>
        <g
           id="BTLSE"
           transform="matrix(0,0.78023353,-0.89044147,0,1152.4327,171.27776)">
          <rect
             y="754.72583"
             x="468.3324"
             height="15.772711"
             width="14.335068"
             id="rect6175-3-8-2-8-4-2"
             style="fill:#393b3b;fill-opacity:1;fill-rule:evenodd;stroke:none;stroke-width:0.235;stroke-linecap:butt;stroke-miterlimit:12;stroke-dasharray:none;stroke-dashoffset:0;stroke-opacity:1" />
          <ellipse
             ry="5.5204487"
             rx="7.1675344"
             cy="754.36224"
             cx="475.49994"
             id="path6179-6-1-4-2-1-5"
             style="fill:#393b3b;fill-opacity:1;fill-rule:evenodd;stroke:none;stroke-width:0.235;stroke-linecap:butt;stroke-miterlimit:12;stroke-dasharray:none;stroke-dashoffset:0;stroke-opacity:1" />
          <ellipse
             ry="5.5204487"
             rx="7.1675344"
             cy="770.61224"
             cx="475.49994"
             id="path6179-2-1-9-0-9-2-7"
             style="fill:#393b3b;fill-opacity:1;fill-rule:evenodd;stroke:none;stroke-width:0.235;stroke-linecap:butt;stroke-miterlimit:12;stroke-dasharray:none;stroke-dashoffset:0;stroke-opacity:1" />
          <ellipse
             style="fill:#ff0000;fill-opacity:1;fill-rule:evenodd;stroke:#000000;stroke-width:1;stroke-linecap:butt;stroke-miterlimit:12;stroke-dasharray:none;stroke-dashoffset:0;stroke-opacity:1"
             id="BTLSE1"
             cx="475.49994"
             cy="756.73724"
             rx="4.9165139"
             ry="4.2461243" />
          <ellipse
             style="fill:#ff0000;fill-opacity:1;fill-rule:evenodd;stroke:#000000;stroke-width:1;stroke-linecap:butt;stroke-miterlimit:12;stroke-dasharray:none;stroke-dashoffset:0;stroke-opacity:1"
             id="BTLSE2"
             cx="475.49994"
             cy="768.23724"
             rx="4.9165139"
             ry="4.2461243" />
        </g>
      </g>
      <g
         id="BTLN"
         transform="matrix(0.37563775,0,0,0.37563775,53.162804,-67.015187)">
        <g
           id="BTLNW"
           transform="matrix(0,0.78023353,-0.89044147,0,1160.4431,-50.570298)">
          <rect
             y="754.72583"
             x="468.3324"
             height="15.772711"
             width="14.335068"
             id="rect6175-3-8-9-6"
             style="fill:#393b3b;fill-opacity:1;fill-rule:evenodd;stroke:none;stroke-width:0.235;stroke-linecap:butt;stroke-miterlimit:12;stroke-dasharray:none;stroke-dashoffset:0;stroke-opacity:1" />
          <ellipse
             ry="5.5204487"
             rx="7.1675344"
             cy="754.36224"
             cx="475.49994"
             id="path6179-6-1-7-4"
             style="fill:#393b3b;fill-opacity:1;fill-rule:evenodd;stroke:none;stroke-width:0.235;stroke-linecap:butt;stroke-miterlimit:12;stroke-dasharray:none;stroke-dashoffset:0;stroke-opacity:1" />
          <ellipse
             ry="5.5204487"
             rx="7.1675344"
             cy="770.61224"
             cx="475.49994"
             id="path6179-2-1-9-3-8"
             style="fill:#393b3b;fill-opacity:1;fill-rule:evenodd;stroke:none;stroke-width:0.235;stroke-linecap:butt;stroke-miterlimit:12;stroke-dasharray:none;stroke-dashoffset:0;stroke-opacity:1" />
          <ellipse
             style="fill:#ff0000;fill-opacity:1;fill-rule:evenodd;stroke:#000000;stroke-width:1;stroke-linecap:butt;stroke-miterlimit:12;stroke-dasharray:none;stroke-dashoffset:0;stroke-opacity:1"
             id="BTLNW1"
             cx="475.49994"
             cy="756.73724"
             rx="4.9165139"
             ry="4.2461243" />
          <ellipse
             style="fill:#ff0000;fill-opacity:1;fill-rule:evenodd;stroke:#000000;stroke-width:1;stroke-linecap:butt;stroke-miterlimit:12;stroke-dasharray:none;stroke-dashoffset:0;stroke-opacity:1"
             id="BTLNW2"
             cx="475.49994"
             cy="768.23724"
             rx="4.9165139"
             ry="4.2461243" />
        </g>
        <g
           id="BTLNE"
           transform="matrix(0,0.78023353,-0.89044147,0,1160.8941,171.56912)">
          <rect
             y="754.72583"
             x="468.3324"
             height="15.772711"
             width="14.335068"
             id="rect6175-3-8-2-8-4"
             style="fill:#393b3b;fill-opacity:1;fill-rule:evenodd;stroke:none;stroke-width:0.235;stroke-linecap:butt;stroke-miterlimit:12;stroke-dasharray:none;stroke-dashoffset:0;stroke-opacity:1" />
          <ellipse
             ry="5.5204487"
             rx="7.1675344"
             cy="754.36224"
             cx="475.49994"
             id="path6179-6-1-4-2-1"
             style="fill:#393b3b;fill-opacity:1;fill-rule:evenodd;stroke:none;stroke-width:0.235;stroke-linecap:butt;stroke-miterlimit:12;stroke-dasharray:none;stroke-dashoffset:0;stroke-opacity:1" />
          <ellipse
             ry="5.5204487"
             rx="7.1675344"
             cy="770.61224"
             cx="475.49994"
             id="path6179-2-1-9-0-9-2"
             style="fill:#393b3b;fill-opacity:1;fill-rule:evenodd;stroke:none;stroke-width:0.235;stroke-linecap:butt;stroke-miterlimit:12;stroke-dasharray:none;stroke-dashoffset:0;stroke-opacity:1" />
          <ellipse
             style="fill:#ff0000;fill-opacity:1;fill-rule:evenodd;stroke:#000000;stroke-width:1;stroke-linecap:butt;stroke-miterlimit:12;stroke-dasharray:none;stroke-dashoffset:0;stroke-opacity:1"
             id="BTLNE1"
             cx="475.49994"
             cy="756.73724"
             rx="4.9165139"
             ry="4.2461243" />
          <ellipse
             style="fill:#ff0000;fill-opacity:1;fill-rule:evenodd;stroke:#000000;stroke-width:1;stroke-linecap:butt;stroke-miterlimit:12;stroke-dasharray:none;stroke-dashoffset:0;stroke-opacity:1"
             id="BTLNE2"
             cx="475.49994"
             cy="768.23724"
             rx="4.9165139"
             ry="4.2461243" />
        </g>
      </g>
    </g>
    <g
       id="Traffic barriers">
      <g
         id="trafficS">
        <g
           id="trafficSW">
          <rect
             style="fill:#e6e6e6;fill-opacity:1;stroke:#080808;stroke-opacity:1;stroke-width:0.26325116571408536"
             id="TBSWpole"
             width="3.134245490298"
             height="3.07904739637"
             x="58.7853595624"
             y="59.29413505031999"
             ry="0.5433604173619999" />
          <path
             style="fill:#ff0000;stroke:#ffffff;stroke-width:0.778688;stroke-linecap:butt;stroke-linejoin:miter;stroke-miterlimit:4;stroke-dasharray:1.05833, 1.05833;stroke-dashoffset:1.05833;stroke-opacity:1"
             d="m 59.659304,58.7153 20.2198,0"
             id="TBSWwhite" />
          <path
             style="fill:#ff0000;stroke:#ff0000;stroke-dasharray:1.05833,1.05833;stroke-dashoffset:0;stroke-linecap:butt;stroke-linejoin:miter;stroke-miterlimit:4;stroke-opacity:1;stroke-width:0.778688"
             d="m 59.659304,58.7153 20.2198,0"
             id="TBSWred" />
        </g>
        <g
           id="trafficSE">
          <rect
             style="fill:#e6e6e6;fill-opacity:1;stroke:#080808;stroke-opacity:1;stroke-width:0.26325116571408536"
             id="TBSEpole"
             width="3.134245490298"
             height="3.07904739637"
             x="77.01242248730198"
             y="130.08972312933997"
             ry="0.5433604173619999"
             transform="matrix(-1 1.22461e-16 -1.22461e-16 -1 157.159 263.258)" />
          <path
             style="fill:#ff0000;stroke:#ffffff;stroke-dasharray:1.05833,1.05833;stroke-dashoffset:1.05833;stroke-linecap:butt;stroke-linejoin:miter;stroke-miterlimit:4;stroke-opacity:1;stroke-width:0.778688"
             d="m 79.272679,129.511 -20.2198,0"
             id="TBSEwhite" />
          <path
             style="fill:#ff0000;stroke:#ff0000;stroke-width:0.778688;stroke-linecap:butt;stroke-linejoin:miter;stroke-miterlimit:4;stroke-dasharray:1.05833, 1.05833;stroke-dashoffset:0;stroke-opacity:1"
             d="m 79.272679,129.511 -20.2198,0"
             id="TBSEred" />
        </g>
      </g>
      <g
         id="trafficN">
        <g
           id="trafficNW">
          <rect
             style="fill:#e6e6e6;fill-opacity:1;stroke:#080808;stroke-opacity:1;stroke-width:0.26325116571408536"
             id="TBNWpole"
             width="3.134245490298"
             height="3.07904739637"
             x="232.63729968010003"
             y="59.20403216169999"
             ry="0.5433604173619999" />
          <path
             style="fill:#ff0000;stroke:#ffffff;stroke-dasharray:1.05833,1.05833;stroke-dashoffset:1.05833;stroke-linecap:butt;stroke-linejoin:miter;stroke-miterlimit:4;stroke-opacity:1;stroke-width:0.778688"
             d="m 233.511,58.6252 20.10695,0"
             id="TBNWwhite" />
          <path
             style="fill:#ff0000;stroke:#ff0000;stroke-dasharray:1.05833,1.05833;stroke-dashoffset:0;stroke-linecap:butt;stroke-linejoin:miter;stroke-miterlimit:4;stroke-opacity:1;stroke-width:0.778688"
             d="m 233.511,58.6252 20.10695,0"
             id="TBNWred" />
        </g>
        <g
           id="trafficNE">
          <rect
             style="fill:#e6e6e6;fill-opacity:1;stroke:#080808;stroke-opacity:1;stroke-width:0.263251"
             id="TBNEpole"
             width="3.1342454"
             height="3.0790474"
             x="251.1752676"
             y="130.16812960000004"
             ry="0.54336041"
             rx="0.54336041"
             transform="matrix(-1 1.22461e-16 -1.22461e-16 -1 505.485 263.415)" />
          <path
             style="fill:#ff0000;stroke:#ffffff;stroke-dasharray:1.05833, 1.05833;stroke-dashoffset:1.05833;stroke-linecap:butt;stroke-linejoin:miter;stroke-miterlimit:4;stroke-opacity:1;stroke-width:0.778688"
             d="M 253.436 129.589 L 233.436 129.661"
             id="TBNEwhite" />
          <path
             style="fill:#ff0000;stroke:#ff0000;stroke-dasharray:1.05833, 1.05833;stroke-dashoffset:0;stroke-linecap:butt;stroke-linejoin:miter;stroke-miterlimit:4;stroke-opacity:1;stroke-width:0.778688"
             d="M 253.436 129.589 L 233.436 129.661"
             id="TBNEred" />
        </g>
      </g>
    </g>
    <text
       xml:space="preserve"
       style="font-style:normal;font-weight:normal;font-size:12.7px;line-height:1.25;font-family:sans-serif;fill:#000000;fill-opacity:1;stroke:none;stroke-width:0.264583"
       x="282.18936"
       y="14.960641"
       id="text2198"><tspan
         sodipodi:role="line"
         id="tspan2196"
         style="font-size:12.7px;stroke-width:0.264583"
         x="282.18936"
         y="14.960641">N</tspan></text>
    <path
       id="path7224"
       style="color:#000000;fill:#000000;-inkscape-stroke:none"
       d="m 293.60108,11.739369 -0.24391,0.468705 11.05514,5.740734 c -0.24609,0.362028 -0.60076,0.655201 -1.04025,0.831991 l 4.29896,0.563273 -2.93315,-3.193087 c 0.1072,0.461597 0.0717,0.920529 -0.0822,1.329635 z" />
    <path
       id="path8044"
       style="color:#000000;fill:#000000;stroke-dasharray:2.11666, 1.05833;-inkscape-stroke:none"
       d="m 46.074704,66.80212 -4.11086,1.378727 c 1.119464,0.216633 1.887852,1.181561 1.845882,2.318204 z m -3.566707,2.502689 -1.65623,1.318266 0.329696,0.413928 1.654679,-1.318266 z m -2.484603,1.976624 -1.656229,1.318265 0.330212,0.413928 1.65623,-1.318265 z m -2.484086,1.978173 -1.656746,1.318266 0.330212,0.414445 1.65623,-1.318266 z m -2.484602,1.976624 -1.654163,1.320332 0.328145,0.412378 1.65623,-1.318782 z" />
    <path
       id="path8172"
       style="color:#000000;fill:#000000;stroke-dasharray:2.11666, 1.05833;-inkscape-stroke:none"
       d="m 61.118229,130.80441 -4.112927,1.37149 c 1.119073,0.21865 1.885758,1.18475 1.841748,2.32131 z m -3.610632,2.52543 -1.65778,1.31465 0.329696,0.41599 1.658297,-1.3162 z m -2.486153,1.973 -1.658296,1.3162 0.328145,0.41393 1.658297,-1.3162 z m -2.48822,1.97249 -1.658296,1.31672 0.330212,0.41393 1.658297,-1.31465 z m -2.486153,1.97456 -1.658296,1.31465 0.328145,0.41393 1.658296,-1.31465 z m -2.48822,1.97301 -1.658297,1.31413 0.329696,0.41599 1.658297,-1.3162 z m -2.48667,1.97248 -1.658296,1.3162 0.328145,0.41445 1.658297,-1.31672 z" />
    <path
       id="path7971"
       style="color:#000000;fill:#000000;stroke-dasharray:2.11667, 1.05833;-inkscape-stroke:none"
       d="m 119.08575,36.814288 -1.93942,0.845943 0.21084,0.484208 1.94148,-0.845426 z m -2.9099,1.267623 -1.93942,0.845943 0.21084,0.484208 1.93942,-0.843876 z m -2.91042,1.267623 -1.94097,0.845943 0.21084,0.486275 1.94149,-0.845943 z m -2.91197,1.269689 -1.93941,0.843877 0.21084,0.486275 1.94148,-0.845943 z m -2.9099,1.267623 -1.93941,0.845427 0.21084,0.484725 1.93941,-0.845944 z m -2.91041,1.267623 -1.94149,0.845426 0.21084,0.484725 1.94149,-0.845943 z m -2.91197,1.267623 -1.939416,0.845426 0.21084,0.484208 1.941486,-0.843359 z m -2.910416,1.267106 -1.941483,0.845943 0.212907,0.486275 1.939933,-0.845426 z m -2.909899,1.26969 -1.941484,0.843876 0.21084,0.486275 1.941483,-0.845426 z m -2.911967,1.267623 -1.939933,0.845943 0.211356,0.484208 1.941484,-0.845943 z m -3.894853,0.368969 -3.143994,2.985864 4.327385,-0.269234 C 89.751289,51.104804 89.417068,50.788536 89.1961,50.41139 l 0.993221,-0.433049 -0.21084,-0.484208 -0.993737,0.433566 c -0.126292,-0.41906 -0.129995,-0.879531 0.0093,-1.332219 z" />
    <path
       id="path8111"
       style="color:#000000;fill:#000000;stroke-dasharray:2.11666, 1.05833;-inkscape-stroke:none"
       d="m 56.309738,106.28498 c 0.740831,0.86677 0.740831,2.10007 0,2.96312 l 4.074169,-1.48156 z m -11.917102,1.21698 v 0.52916 h 2.117184 v -0.52916 z m 3.175517,0 v 0.52916 h 2.117183 v -0.52916 z m 3.176033,0 v 0.52916 h 1.654163 0.460953 v -0.52916 h -0.460953 z m 3.173966,0 v 0.52916 h 2.117184 v -0.52916 z" />
    <path
       id="path8227"
       style="color:#000000;fill:#000000;stroke-dasharray:2.11666, 1.05833;-inkscape-stroke:none"
       d="m 96.646808,138.24117 -1.481564,4.07468 c 0.866772,-0.74083 2.10006,-0.74083 2.963127,0 z m -0.264067,4.34082 v 2.11718 h 0.529167 v -2.11718 z m 0,3.17603 v 2.11718 h 0.529167 v -2.11718 z m 0,3.17345 v 2.11718 h 0.529167 v -2.11718 z" />
    <path
       id="path8276"
       style="color:#000000;fill:#000000;stroke-dasharray:2.11666, 1.05833;-inkscape-stroke:none"
       d="m 121.02516,107.68179 -1.49396,1.49965 0.37517,0.37311 1.49396,-1.4981 z m -2.24172,2.24793 -1.49448,1.50016 0.37517,0.37311 1.49396,-1.4981 z m -2.24224,2.24792 -1.49448,1.50017 0.37517,0.3731 1.49396,-1.4981 z m -2.59106,0.8754 -1.82831,3.93103 3.92638,-1.83865 c -1.13686,-0.0876 -2.01017,-0.95837 -2.09807,-2.09238 z" />
    <text
       xml:space="preserve"
       style="font-style:normal;font-weight:normal;font-size:7.05555px;line-height:1.25;font-family:sans-serif;text-align:end;text-anchor:end;fill:#000000;fill-opacity:1;stroke:none;stroke-width:0.264583"
       x="42.362915"
       y="109.71391"
       id="text6367"><tspan
         sodipodi:role="line"
         id="tspan6365"
         style="font-size:7.05555px;text-align:end;text-anchor:end;stroke-width:0.264583"
         x="42.362915"
         y="109.71391">Bridge</tspan></text>
    <text
       xml:space="preserve"
       style="font-style:normal;font-weight:normal;font-size:7.05555px;line-height:1.25;font-family:sans-serif;text-align:end;text-anchor:end;fill:#000000;fill-opacity:1;stroke:none;stroke-width:0.264583"
       x="109.26512"
       y="157.62454"
       id="text6367-6"><tspan
         sodipodi:role="line"
         id="tspan6365-7"
         style="font-size:7.05555px;text-align:end;text-anchor:end;stroke-width:0.264583"
         x="109.26512"
         y="157.62454">Culvert</tspan></text>
    <text
       xml:space="preserve"
       style="font-style:normal;font-weight:normal;font-size:7.05555px;line-height:1.25;font-family:sans-serif;text-align:end;text-anchor:end;fill:#000000;fill-opacity:1;stroke:none;stroke-width:0.264583"
       x="42.163094"
       y="83.784737"
       id="text6371"><tspan
         sodipodi:role="line"
         id="tspan6369"
         style="font-size:7.05555px;text-align:end;text-anchor:end;stroke-width:0.264583"
         x="42.163094"
         y="83.784737">Entering</tspan><tspan
         sodipodi:role="line"
         style="font-size:7.05555px;text-align:end;text-anchor:end;stroke-width:0.264583"
         x="42.163094"
         y="92.604172"
         id="tspan6373">traffic light</tspan></text>
    <text
       xml:space="preserve"
       style="font-style:normal;font-weight:normal;font-size:7.05555px;line-height:1.25;font-family:sans-serif;text-align:end;text-anchor:end;fill:#000000;fill-opacity:1;stroke:none;stroke-width:0.264583"
       x="120.63688"
       y="21.9618"
       id="text6371-6"><tspan
         sodipodi:role="line"
         style="font-size:7.05555px;text-align:start;text-anchor:start;stroke-width:0.264583"
         x="120.63688"
         y="21.9618"
         id="tspan6373-6">Gate</tspan></text>
    <text
       xml:space="preserve"
       style="font-style:normal;font-weight:normal;font-size:7.05555px;line-height:1.25;font-family:sans-serif;text-align:end;text-anchor:end;fill:#000000;fill-opacity:1;stroke:none;stroke-width:0.264583"
       x="120.81947"
       y="34.837139"
       id="text6371-6-5"><tspan
         sodipodi:role="line"
         style="font-size:7.05555px;text-align:start;text-anchor:start;stroke-width:0.264583"
         x="120.81947"
         y="34.837139"
         id="tspan6373-6-3">Bridge</tspan><tspan
         sodipodi:role="line"
         style="font-size:7.05555px;text-align:start;text-anchor:start;stroke-width:0.264583"
         x="120.81947"
         y="43.656578"
         id="tspan1355">traffic light</tspan></text>
    <text
       xml:space="preserve"
       style="font-style:normal;font-weight:normal;font-size:7.05555px;line-height:1.25;font-family:sans-serif;text-align:end;text-anchor:end;fill:#000000;fill-opacity:1;stroke:none;stroke-width:0.264583"
       x="41.990845"
       y="142.00439"
       id="text6371-6-5-9"><tspan
         sodipodi:role="line"
         style="font-size:7.05555px;text-align:end;text-anchor:end;stroke-width:0.264583"
         x="41.990845"
         y="142.00439"
         id="tspan1355-1">Traffic</tspan><tspan
         sodipodi:role="line"
         style="font-size:7.05555px;text-align:end;text-anchor:end;stroke-width:0.264583"
         x="41.990845"
         y="150.82384"
         id="tspan3312">barrier</tspan></text>
    <path
       id="path7890"
       style="color:#000000;fill:#000000;stroke-dasharray:2.11665, 1.05833;-inkscape-stroke:none"
       d="m 109.54628,17.760672 -4.07469,1.481563 4.07469,1.481563 c -0.30749,-0.359767 -0.48727,-0.782535 -0.5395,-1.215946 h 0.43459 v -0.529167 h -0.43511 c 0.0515,-0.434787 0.23142,-0.858494 0.54002,-1.218013 z m 0.95394,1.218013 v 0.529167 h 2.11719 v -0.529167 z m 3.17345,0 v 0.529167 h 2.11719 v -0.529167 z m 3.17604,0 v 0.529167 h 2.11718 v -0.529167 z" />
    <text
       xml:space="preserve"
       style="font-style:normal;font-weight:normal;font-size:7.05555px;line-height:1.25;font-family:sans-serif;text-align:start;text-anchor:start;fill:#000000;fill-opacity:1;stroke:none;stroke-width:0.264583"
       x="122.53951"
       y="105.36807"
       id="text6404"><tspan
         sodipodi:role="line"
         id="tspan6402"
         style="font-size:7.05555px;text-align:start;text-anchor:start;stroke-width:0.264583"
         x="122.53951"
         y="105.36807">Leaving</tspan><tspan
         sodipodi:role="line"
         style="font-size:7.05555px;text-align:start;text-anchor:start;stroke-width:0.264583"
         x="122.53951"
         y="114.18751"
         id="tspan6406">traffic light</tspan></text>
  </g>
</svg>
